##TITLE=1H_LR-717-C2-0
 CDCl3, 8 sc, 
 30.10.2020
##JCAMPDX= 6.0         $$ Bruker NMR JCAMP-DX V2.0
##DATA TYPE= NMR FID
##DATA CLASS= NTUPLES
##ORIGIN= UXNMR, Bruker Analytische Messtechnik GmbH
##OWNER= root
$$ XWIN-NMR		Version 3.5
$$ Fri Oct 30 12:57:54 2020 Russian Standard Time (UT+4h)  she@DPX200
##.OBSERVE FREQUENCY= 200.1315066352
##.OBSERVE NUCLEUS= ^1H
##.DELAY= (6, 6)
##.ACQUISITION MODE= SIMULTANEOUS
##.ACQUISITION SCHEME= undefined
##.AVERAGES= 8
##.DIGITISER RES= 18
##SPECTROMETER/DATA SYSTEM= spect
##.PULSE SEQUENCE= zg30
##.SOLVENT NAME= CDCl3
##.SHIFT REFERENCE= (INTERNAL, CDCl3, 0, 15.7039)
##AUDIT TRAIL= $$ (NUMBER, WHEN, WHO, WHERE, WHAT)
$$ ##TITLE= Audit trail, XWIN-NMR		Version 3.5
$$ ##JCAMPDX= 5.01
$$ ##ORIGIN= Bruker BioSpin GmbH
$$ ##OWNER= she
$$ F:/spectra/data/she/nmr/H-F/1/audita.txt
$$ ##AUDIT TRAIL=  $$ (NUMBER, WHEN, WHO, WHERE, WHAT)
(   1,<2020-10-30 12:56:54.12 +0400>,<she>,<DPX200>,
      <created by zg, POWCHK disabled, PULCHK disabled
       configuration hash MD5:
       00 E9 B6 7A A2 85 ED C7 34 08 36 98 17 FE 4E 26
       data hash MD5: 16K
       C6 37 C8 B8 FF 3A DF 95 C4 3F C5 4C 75 4B 49 D1>)
$$ ##END=
$$ 
$$ hash MD5
$$ 4F 2A EA 56 E9 0C 3B F9 E8 70 3E 13 93 D9 59 37
##$RELAX= 
##$RELAX= 
##$RELAX= 
##$RELAX= 
##$RELAX= 
##$RELAX= 
$$ Bruker specific parameters
$$ --------------------------
##$DU= <F:/spectra>
##$EXPNO= 1
##$NAME= <H-F>
##$PROCNO= 1
##$TYPE= <nmr>
##$USER= <she>
##$AMP= (0..31)
100 100 100 100 100 100 100 100 100 100 100 100 100 100 100 100 100 100 
100 100 100 100 100 100 100 100 100 100 100 100 100 100 
##$AQSEQ= 0
##$AQ_mod= 1
##$AUNM= <au_zg>
##$AUTOPOS= <>
##$BF1= 200.13
##$BF2= 200.13
##$BF3= 200.13
##$BF4= 200.13
##$BF5= 200.13
##$BF6= 200.13
##$BF7= 200.13
##$BF8= 200.13
##$BYTORDA= 1
##$CFDGTYP= 0
##$CFRGTYP= 5
##$CHEMSTR= <none>
##$CNST= (0..31)
1 1 145 1 1 1 1 1 1 1 1 1 1 1 1 1 1 1 1 1 1 1 1 1 1 1 1 1 1 1 1 1 
##$CPDPRG= <>
##$CPDPRG1= <>
##$CPDPRG2= <>
##$CPDPRG3= <>
##$CPDPRG4= <mlev>
##$CPDPRG5= <mlev>
##$CPDPRG6= <mlev>
##$CPDPRG7= <mlev>
##$CPDPRG8= <mlev>
##$CPDPRGB= <>
##$CPDPRGT= <>
##$D= (0..31)
0 1.2 0 0 0 0 0 0 0 0.06 0 0.03 0 0 0 0 0.0002 0 0 0 0 0 0 0 0 0 0 0 0 
0 0 0 
##$DATE= 1604048213
##$DBL= (0..7)
120 120 120 120 120 120 120 120 
##$DBP= (0..7)
150 150 150 150 150 150 150 150 
##$DBP07= 0
##$DBPNAM0= <>
##$DBPNAM1= <>
##$DBPNAM2= <>
##$DBPNAM3= <>
##$DBPNAM4= <>
##$DBPNAM5= <>
##$DBPNAM6= <>
##$DBPNAM7= <>
##$DBPOAL= (0..7)
0.5 0.5 0.5 0.5 0.5 0.5 0.5 0.5 
##$DBPOFFS= (0..7)
0 0 0 0 0 0 0 0 
##$DE= 6
##$DECBNUC= <off>
##$DECIM= 32
##$DECNUC= <off>
##$DECSTAT= 4
##$DIGMOD= 1
##$DIGTYP= 9
##$DL= (0..7)
0 120 120 120 120 120 120 120 
##$DP= (0..7)
150 150 150 150 150 150 150 150 
##$DP07= 0
##$DPNAME0= <>
##$DPNAME1= <>
##$DPNAME2= <>
##$DPNAME3= <>
##$DPNAME4= <>
##$DPNAME5= <>
##$DPNAME6= <>
##$DPNAME7= <>
##$DPOAL= (0..7)
0.5 0.5 0.5 0.5 0.5 0.5 0.5 0.5 
##$DPOFFS= (0..7)
0 0 0 0 0 0 0 0 
##$DQDMODE= 0
##$DR= 18
##$DS= 0
##$DSLIST= <SSSSSSSSSSSSSSS>
$$ [...]
##$SUBNAM2= <"">
##$SUBNAM3= <"">
##$SUBNAM4= <"">
##$SUBNAM5= <"">
##$SUBNAM6= <"">
##$SUBNAM7= <"">
##$SUBNAM8= <"">
##$SUBNAM9= <"">
##$SW= 16.9725356469052
##$SWIBOX= (0..15)
0 0 2 0 0 0 0 0 0 0 0 0 0 0 0 0 
##$SW_h= 3396.73913043478
##$TD= 16384
##$TD0= 1
##$TE= 0
##$TE2= 300
##$TE3= 300
##$TEG= 300
##$TL= (0..7)
0 120 120 120 120 120 120 120 
##$TP= (0..7)
150 150 150 150 150 150 150 150 
##$TP07= 0
##$TPNAME0= <>
##$TPNAME1= <>
##$TPNAME2= <>
##$TPNAME3= <>
##$TPNAME4= <>
##$TPNAME5= <>
##$TPNAME6= <>
##$TPNAME7= <>
##$TPOAL= (0..7)
0.5 0.5 0.5 0.5 0.5 0.5 0.5 0.5 
##$TPOFFS= (0..7)
0 0 0 0 0 0 0 0 
##$TUNHIN= 0
##$TUNHOUT= 0
##$TUNXOUT= 0
##$USERA1= <user>
##$USERA2= <user>
##$USERA3= <user>
##$USERA4= <user>
##$USERA5= <user>
##$V9= 5
##$VALIST= <valist>
##$VCLIST= <CCCCCCCCCCCCCCC>
##$VD= 0
##$VDLIST= <DDDDDDDDDDDDDDD>
##$VPLIST= <PPPPPPPPPPPPPPP>
##$VTLIST= <TTTTTTTTTTTTTTT>
##$WBST= 1024
##$WBSW= 4
##$XGAIN= (0..3)
0 0 0 0 
##$XL= 0
##$YL= 0
##$YMAX_a= 89685
##$YMIN_a= -79541
##$ZGOPTNS= <>
##$ZL1= 120
##$ZL2= 120
##$ZL3= 120
##$ZL4= 120
##$ABSF1= 10
##$ABSF2= 0
##$ABSG= 5
##$ABSL= 3
##$ALPHA= 0
##$AQORDER= 0
##$ASSFAC= 0
##$ASSFACI= 0
##$ASSFACX= 0
##$ASSWID= 0
##$AUNMP= <proc_1d>
##$AZFE= 0.1
##$AZFW= 0.1
##$BCFW= 1
##$BC_mod= 2
##$BYTORDP= 1
##$COROFFS= 0
##$CY= 11.3945322036743
##$DATMOD= 1
##$DC= 2
##$DFILT= <>
##$DTYPP= 0
##$F1P= 15.9154993809931
##$F2P= -4.1035820241983
##$FCOR= 0.5
##$FTSIZE= 0
##$FT_mod= 4
##$GAMMA= 1
##$GB= 0.15
##$INTBC= 1
##$INTSCL= 1
##$ISEN= 128
##$LB= 0.24
##$LEV0= 0
##$LPBIN= 0
##$MAXI= 10000
##$MC2= 0
##$MEAN= 0
##$ME_mod= 0
##$MI= 1.114404
##$NCOEF= 0
##$NC_proc= 0
##$NLEV= 6
##$NOISF1= 3.799351
##$NOISF2= 2.8
##$NSP= 1
##$NTH_PI= 0
##$NZP= 0
##$OFFSET= 15.70392
##$PC= 1
##$PHC0= -11053.91
##$PHC1= 17.60088
##$PH_mod= 1
##$PKNL= yes
##$PPARMOD= 0
##$PSCAL= 0
##$PSIGN= 0
##$REVERSE= no
##$SF= 200.130013532006
##$SI= 16384
##$SIGF1= 3
##$SIGF2= 2
##$SINO= 400
##$SIOLD= 16384
##$SREGLST= <1H.CDCl3>
##$SSB= 0
##$STSI= 0
##$STSR= 0
##$SW_p= 3612.71676300578
##$SYMM= 0
##$S_DEV= 0
##$TDeff= 0
##$TDoff= 0
##$TI= <>
##$TILT= no
##$TM1= 0
##$TM2= 0
##$TOPLEV= 0
##$USERP1= <user>
##$USERP2= <user>
##$USERP3= <user>
##$USERP4= <user>
##$USERP5= <user>
##$WDW= 1
##$XDIM= 8192
##$YMAX_p= 0
##$YMIN_p= 0
$$ End of Bruker specific parameters
$$ ---------------------------------
##NTUPLES= NMR FID
##VAR_NAME=  TIME,          FID/REAL,        FID/IMAG
##SYMBOL=    X,             R,               I
##VAR_TYPE=  INDEPENDENT,   DEPENDENT,       DEPENDENT
##VAR_FORM=  AFFN,          ASDF,            ASDF
##VAR_DIM=   8192,          8192,            8192
##UNITS=     SECONDS,       ARBITRARY UNITS, ARBITRARY UNITS
##FACTOR=    0.0002944,     1,               1
##FIRST=     0,             0,               0
##LAST=      2.4114304,     0,               0
##MIN=       0,             -79541,          0
##MAX=       2.4114304,     89685,           0
$$ Real data points
##PAGE= N=1
##DATA TABLE= (X++(R..R)), XYDATA
$$ [...]
1745c7K65l58M23K76o08P14l22m39L56Jk20O28n73K02j20l80P61m05J67J73n05
$$ -37 228 -130 293 569 -39 675 353 -86 270 271 51 679 106 308 188 -192 569 164 331 504 -1
1766aL37K06p05M02K5j37K16k81k22N06l15Q0r2m49O19j23m17N69n90M3N71o55
$$ -1 336 542 -163 239 264 127 343 62 -160 346 31 111 19 -430 189 66 -351 218 -372 -329 242 -413
1788d13K17o2M3M17p14J82J90m60J81K45m50M66J8l21O45k75k39L80k26j49L34
$$ -413 -196 -258 -215 202 -512 -330 -140 -600 -419 -174 -624 -158 -140 -461 184 -91 -330 50 -176 -325 9
1809Il16K04n0m2M49k67M3N34m91K03j11j35M76m36K20L02k92j83L04j22K25j38
$$ 9 -307 -103 -153 -195 254 -13 30 564 73 276 165 30 506 70 290 592 300 117 421 299 524 386
1831C86q6J99k33r6L59n62N21K2o04L85j40l33N69k80p6M83p47L03J27n19L83
$$ 386 300 499 266 170 529 -33 488 510 -94 291 151 -182 387 107 31 514 -233 70 197 -322 61
1852F1j90J26j09m3J59K53m29K21k06m59M04J98m85L54l23K89j75j11J13K42n32
$$ 61 -129 -3 -112 -155 4 257 -172 49 -157 -616 -212 -14 -499 -145 -468 -179 -354 -465 -352 -110 -642
1873f42N33M9l54K05N1r7K24k0o8J36m32L00J49O7O1l16Q2%N0L02k23m7M27k61
$$ -642 -109 -60 -414 -209 -158 -255 -31 -51 -119 17 -415 -115 34 101 162 -154 -72 -72 -22 280 57 10 437 176
1897A76L14k36j94J49j09pK76j76N3ol9K54m2k34K89k16j75K30k76K13mm08K71
$$ 176 490 254 60 209 100 93 369 193 246 240 201 455 413 179 468 252 77 307 31 244 240 -168 103
1920A03J07k50L46k83K1K17n06P4K68k22K6j79P0J13k49K86p1K02k97J35j4k3
$$ 103 210 -40 306 23 44 261 -245 -171 97 -125 -99 -278 -208 -95 -344 -58 -129 73 -224 -89 -103 -126
1942a26j57K7N2j53O8J29j71J20P2O8k04R3n1K03j33pJ01Q1Q3Q6o7J42m42O8K68
$$ -126 -283 -256 -204 -357 -289 -160 -331 -211 -139 -71 -275 -182 -233 -30 -163 -170 -69 12 95 181 114 256 -186 -118 150
1967A50k22K17Ok0Q3j25k00M76k28j06k47K49N22j71j29J38j13n5m2K6j16J79
$$ 150 -72 145 151 131 214 89 -111 365 137 31 -216 33 555 384 255 393 280 225 183 209 93 272
1989B72o2Q2k12j75J55J81k31J07r1k7K73l59J46j53J31k7k03k7L0l24L43L3l11
$$ 272 210 292 80 -95 60 241 10 117 26 -1 272 -87 59 -94 37 10 -193 -220 -190 -514 -171 -138 -449
2012d49K46k16L49j80K17n7o1k04M7J7J86Rk9j06K94m42Q4N3K5J71j76J61n5j35
$$ -449 -203 -419 -70 -250 -33 -90 -151 -355 -308 -291 -105 -96 -125 -231 63 -379 -295 -242 -217 -46 -222 -61 -116 -251
2036b51L42k08o1L55k11j07L31j10J9Q8j12N4j25J98K09k57J0l0J59p7n1R0J89
$$ -251 91 -117 -178 177 -34 -141 190 80 99 187 75 129 4 202 411 154 164 134 293 216 165 255 444
2059D44k61j24K37j81O9Q6l57L58q8J19j75k30K05j78J97k0o3o6P7L9j18R1j36
$$ 444 183 59 296 115 184 270 -87 271 183 302 127 -103 102 -76 121 101 38 -28 49 88 -30 61 -75
2082g5M0j13q6K19j89J54Lk16K35q6l49N07j51j92J31k2j27K23j52J01O0k90J37
$$ -75 -35 -148 -234 -15 -204 -50 -47 -263 -28 -114 -463 44 -107 -299 -168 -190 -317 -94 -246 -145 -85 -375 -238
2105b38P9R7J56j96p0n3J47m7l3J94j34O4K69k21J17n2ol15K77j22K98j35P9Q9
$$ -238 -159 -62 94 -102 -172 -225 -78 -125 -158 36 -98 -34 235 14 131 79 73 -242 35 -87 211 76 155 244
2129B44k04p3K97j41M9J21l32L20j52p4K56k41J75m9P6M9k64m9K61k0l50L66k31
$$ 244 40 -33 264 123 172 293 -39 281 129 55 311 70 245 196 272 321 57 8 269 249 -101 265 34
2152C4j00J9O1j75P4j01K66j69n3K17k31j22P5Lj9L09m54J79J51m16L24j62PK06
$$ 34 -66 -47 14 -161 -87 -188 78 -91 -144 73 -158 -280 -205 -202 -221 88 -366 -187 -36 -452 -128 -290 -283 -77
2176g7k00K32m14o7M10m0k24L61q9j08N06o29L93M2l83K15K58m44N38j56o1P0
$$ -77 -277 -45 -459 -526 -116 -156 -380 -19 -108 -216 290 -339 54 96 -287 -72 186 -258 280 124 63 133
2198A33k08N52j48n11M41j40L6K03k55M0J63m09L11k13ML60k22q3K29j80K16j35
$$ 133 -75 477 329 -182 259 119 155 358 103 143 306 -103 208 -5 -1 359 137 54 283 103 319 184
2220A84q3K9M61o81L32j60j20J79k43L28l08j89J71J87m32L10k49j8k3J50l0R2
$$ 184 101 130 591 -90 242 82 -38 141 -102 226 -82 -271 -100 87 -345 -35 -284 -302 -325 -175 -205 -113
2242a13l32M88k36j44L07k14J86R0j83L09l06n0K48j34j84J72j99J87K55l90J06
$$ -113 -445 43 -193 -337 -30 -244 -58 32 -151 158 -148 -198 50 -84 -268 -96 -295 -108 147 -243 -137
2263a37J35K5r5j6K16m2r6L96k31k75J40L05R6r7o0J57k33k87M15k39M8K8L8p6
$$ -137 -2 23 -72 -88 128 86 -10 386 155 -120 20 325 421 324 264 421 188 -99 316 77 125 153 191 115
2287A15J31o5j30K25l67K92P3k39M2R8p2J81k15N9n6j26L10k20j13O3p0l7Q8K7
$$ 115 246 181 51 276 -91 201 274 35 77 175 103 284 69 128 72 -54 256 36 -77 -14 -84 -121 -33 -6
2311fr8j93J88k04L92j52j44L7J50m59K52J73p3l5J29q3j8J65k21J68Lk21J29
$$ -6 -104 -297 -109 -313 79 -73 -217 -180 -30 -489 -237 -64 -137 -172 -43 -126 -144 21 -200 -32 -29 -250 -121
2334a21J4J64j82Q2l6K09k18Q6J85l43L35j36j16O1J92j10N3j44L83P3l18K77
$$ -121 -107 57 -125 -43 -79 130 -88 -2 183 -160 175 39 -77 -16 176 66 119 -25 358 431 113 390
2356C90j63j89K83j30J08oq3K01k08q0M69m62J67l87K24j44K7o2J05r8L2oJ2K00
$$ 390 227 38 321 191 299 293 210 411 203 123 592 130 297 -90 134 -10 17 -45 60 -38 -6 -12 0 200
2380B00m7m20j2L71k15Q5j89m7K32p5K3k81L40M4j88j52J74q0J63k59r6K42J23
$$ 200 153 -267 -279 92 -123 -38 -227 -274 -42 -117 -94 -375 -35 9 -179 -331 -157 -237 -74 -333 -429 -187 -64
2403f4o4j06O5l22K86k7K4J24J93k62N3j38K15N3Q1n2k77J63J57PQL4r8K20j73
$$ -64 -128 -234 -169 -491 -205 -232 -208 -84 109 -153 -100 -238 -23 30 111 59 -218 -55 102 109 117 151 53 273 100
2428A00n1j15J9K81j42J46L7k22RL81q5n6k00K38l49J25m0j40K3K30k39j36R0
$$ 100 49 -66 -47 234 92 238 275 53 62 443 358 302 102 340 -9 116 76 -64 -41 189 -50 -186 -96
2451i6L14l66K31k39m3K47l79J57jO4m5N8L0J3j59K44m99L22r3J33o9l3R9k17
$$ -96 218 -148 83 -156 -199 48 -331 -174 -175 -111 -156 -98 -68 -55 -214 30 -469 -147 -240 -107 -176 -209 -110 -327
2475c27O2K14j32K71k02j39N7o6K67k72L67k90K75o4j42j32L85j69P0J06R2j38
$$ -327 -265 -51 -183 88 -114 -253 -196 -262 5 -267 100 -190 85 21 -121 -253 132 -37 33 139 231 93
2497I3J28j74O1P4m0j40m1K72n2J24k2k45K44MJ45l58N6N1n5KJ25J28q5k31K01
$$ 93 221 47 108 182 142 2 -39 233 181 305 283 38 282 286 431 73 129 180 125 127 252 380 295 64 265
2522B65K2k85l9K14j6p4Q8j21k9j14K14k12o4J85l84L46l2p7j38J2Q4J96k52k21
$$ 265 287 2 -37 177 161 87 175 54 25 -89 125 -87 -151 34 -350 -4 -36 -113 -251 -239 -155 41 -211 -432
2546d32L32R4k02P5K0K51n29K17p8J51p5M1oJ4L1P1j43J39O1K7J5N2l1j10l6J63
$$ -432 -100 -6 -208 -133 -113 138 -391 -174 -252 -101 -176 -135 -141 -127 -96 -25 -168 -29 32 59 74 126 95 -15 -51 112
2572A12N8r5j51J39r1J17q3J18K23m59M14m0R7j49j4L9j03m6J23j65K07j89J17
$$ 112 170 75 -76 63 -28 89 6 124 347 -112 302 262 359 210 196 235 132 86 209 44 251 62 179
2595A79j43J56j42J46o4l8j74K03k51J44n8K53k13J32m1m29L34j16p6L0J63o1
$$ 179 36 192 50 196 132 94 -80 123 -128 16 -42 211 -2 130 89 -340 -6 -122 -198 -168 -5 -66
2617f6l1j50j44L37J29k88k98L72k9p4J9j65J27o9K81M4j10l3K34j72R7Q6j90
$$ -66 -97 -247 -391 -54 75 -213 -511 -139 -168 -242 -223 -388 -261 -330 -49 -5 -115 -148 86 -86 11 97 -93
2640i3J26k68M45k09J5N4j7P2l51N58k50j59J66J4l6J9j32J62K8M7K8n0J34m2
$$ -93 33 -235 210 1 16 70 53 125 -226 332 82 -77 89 103 67 86 -46 116 144 191 219 169 303 261
2664B61j92j4K09l63K74L5J68l19J0M3J32k09j92J82o6K49n7l03K93r4n3j85k4
$$ 261 69 55 264 -99 175 210 378 59 69 112 244 35 -157 25 -41 208 151 -152 141 47 -6 -191 -215
2687b15J64j75M7P3n6K2n2K11R2m70K00M6J34j71j10p9O45m41o3j68J90J63l45
$$ -215 -51 -226 -179 -106 -162 -140 -192 19 111 -359 -159 -113 21 -150 -260 -339 306 -135 -198 -366 -176 -13 -358
2710c58J28M82l07n1R9r0m8K76j17k8R6m0L1K0n9N9k70L69q0j6l5K00j47J6N9
$$ -358 -230 252 -55 -106 -7 -97 -145 131 14 -14 82 42 73 93 34 93 -177 192 112 96 61 261 114 130 189
2735A89l45L48Q8j13N6P9m97M71q1o6N3j7J21J4l62m1J61p4j55N1L56n18L66j40
$$ 189 -156 192 280 167 223 302 -195 276 195 129 182 165 286 300 -62 -103 58 -16 -171 -120 236 -282 84 -56
2759e6Lj77L15j07p6K8j05N7r1P8o0L9P0j23l2j1p3L5K62j3j67j10M2P1M8j07
$$ -56 -53 -230 85 -22 -98 -70 -175 -118 -209 -131 -191 -152 -82 -205 -237 -248 -321 -286 -24 -37 -204 -314 -272 -201 -153 -260
2785b60K72l54P7L48k05J55j5j56J86k30K33K6l3K40k84j04M31k34j4N4l36M95
$$ -260 12 -342 -265 83 -122 33 18 -138 48 -182 51 77 44 284 0 -104 327 93 79 133 -203 292
2807B92j69j39J10J10j85J64j8p1o0K33l9n2j14oj04J03J54k31l8L66n36J77J22
$$ 292 123 -16 94 204 19 183 165 94 34 267 228 176 62 56 -48 55 209 -22 -60 306 -230 -53 69
2830F9M0n1k08O1J5o5J8J97l28L04r2kj61k6K15M0k92L33M4l00p0lK64o7j28K60
$$ 69 109 58 -150 -89 -74 -139 -121 76 -252 52 -40 -42 -203 -229 -14 26 -266 67 111 -189 -259 -262 2 -65 -193 67
2856F7j66q6k43M26Lj36R4J23j04j69J92J37J15o2j71p0K54k25rJ24k00J41M2
$$ 67 -99 -185 -428 -2 1 -135 -41 82 -22 -191 1 138 253 191 20 -50 204 -21 -30 94 -106 35 77
2879G7J14j55N22n32P1J20o6J40k77L3J65p3r5L16k75J80l28k4L42k68J83m4q7
$$ 77 191 36 558 26 97 217 151 291 14 47 212 139 44 360 85 265 -63 -87 255 -13 170 126 39
2902C9L11k31k36q7K31m2J98l23Q8M5K74m66K0J09L6n0O0ol03J30K84l78m7L58
$$ 39 350 119 -117 -204 27 -15 183 -140 -52 -7 267 -199 -179 -70 -34 -84 -24 -30 -333 -203 81 -297 -344 14
2926A4j20jj79J65R5q7O0Q4k16R5Rl7K17k70J1O4R0j1L51l62p3K03j09O1R4j06
$$ 14 -106 -107 -286 -121 -26 -113 -53 31 -185 -90 -81 -118 99 -171 -160 -96 -6 -17 334 -28 -101 102 -7 54 148 42
2952D2K06n34O60K6l15Rl1J27K65m50K8Q4n8J83m1m3j92m2O7n3%P9j64J30r2R8
$$ 42 248 -286 374 400 85 94 63 190 455 5 33 117 59 242 201 158 -34 -76 -9 -62 -62 17 -147 -17 -109 -11
2978a1J60k15r2L44j99J2n5J48L7k22L00l64Q1r8J35l73L30j6qj09%P4j18O9l1
$$ -11 149 -66 -158 186 -13 -1 -56 92 129 -93 207 -157 -76 -174 -39 -412 -82 -98 -106 -215 -215 -141 -259 -190 -221
3003b21J00l6J53l44K42K78j69j63N4K09N3q4j20j21J34r0n5L16j27O5O1l01L93
$$ -221 -121 -157 -4 -348 -106 172 3 -160 -106 103 156 72 -48 -169 -35 -125 -180 136 9 74 135 -166 227
3026B27j30L2j16N2J04r2J17M2r8j65K66j64jj35J76P2m6p3K81m90L12j25M1M7
$$ 227 97 129 13 65 169 77 194 236 138 -27 239 75 74 -61 115 187 141 68 349 -141 171 46 87 134
3050A34n6O2M5j89O9R5l21J24M6j80K0K17n6k61K18r1K14k17j18L53j74k36P2
$$ 134 78 140 185 -4 65 160 -161 -37 9 -171 -151 66 10 -251 -33 -124 90 -127 -245 108 -66 -302 -230
3073b30L40l76M3jJ64l05M2J84Q5j56J53k78K09J24k5k11J94K4J45nJ19j55OJ83
$$ -230 110 -266 -223 -224 -60 -365 -323 -139 -54 -210 -57 -335 -126 -2 -27 -238 -44 -20 125 120 239 84 90 273
3097B73l87L2K94j49K3j85j4K45j70K14r2K43j52k05L18j21J94l63L2Q2K53j73
$$ 273 -114 -82 212 63 86 -99 -113 132 -38 176 84 327 175 -30 288 167 361 -2 30 112 365 192
3119A92P1j43J0R2r5j31J00k24K20j67O5r6L53o2r8p6j08J63j91J64k11j00J99
$$ 192 263 120 130 222 127 -4 96 -128 92 -75 -10 -106 247 185 87 11 -97 66 -125 39 -172 -272 -73
3142g3j9O5J24j06n2L03k16k31J70j26o8L8P1j6K7K0r6L9J38j95J31J39o0j13
$$ -73 -92 -27 97 -9 -61 242 26 -205 -35 -161 -229 -191 -120 -136 -109 -89 -185 -146 -8 -203 -72 67 7 -106
3166a06M1J1K49l01J30J42k49r0J84k0J55p9L05k77%j3L36j11j68J09j50q2K61
$$ -106 -65 -54 195 -106 24 166 -83 -173 11 -9 146 67 372 95 95 82 418 307 139 248 98 16 277
3189B77j65j08L27l54Q0rQ2J2m8P4j5j07K8p9K77j56o8P7j28k22K73p1j0l71N68
$$ 277 112 4 331 -23 57 48 130 142 94 168 153 46 74 -5 272 116 48 125 -3 -225 48 -23 -33 -404 164
3214A64j12j65J58k46Lp6K24M1j01l27L20K2j42q1L40j70k3l8L52l98J82j27K67
$$ 164 52 -113 45 -201 -198 -274 -50 -9 -110 -437 -117 -95 -237 -318 22 -148 -171 -209 143 -255 -73 -200 67
3237F7j44o3j9J82N9l81J65N60m23J81O5k63JJ44o4j33L8k15J55J24m8M70m70
$$ 67 -77 -140 -159 23 82 -299 -134 426 3 184 249 -14 -13 131 67 -66 -28 -243 -88 36 -12 458 -12
3260a2J33J4m11N74k79k5l0J55J86j06j08q0L71k44j49K56q7j16k6J17k6j83R
$$ -12 121 135 -276 298 19 -6 -36 119 305 199 91 11 382 138 -11 245 158 42 16 133 107 -76 -67
3283f7RK10m98L05j96L45j57J0rj79J8J16J15k49K01j96J20Mn9K8m5k4L55j53
$$ -67 -58 152 -346 -41 -237 108 -49 -39 -48 -227 -209 -93 22 -227 -26 -222 -102 -98 -157 -129 -174 -198 157 4
3307Dk9Q8j9j20p5K04r3J40q8K6j26j1J76k35L10K45o83M91k47J82j04k4J4K93
$$ 4 -25 63 44 -76 -151 53 -40 100 12 38 -88 -99 77 -158 152 397 -286 205 -42 140 36 12 26 319
3331C19p0j98O7j26K46k70K17l6k42K44l9j91L58j41M7j8k6J04j97K53n29J97
$$ 319 249 51 118 -8 238 -32 185 149 -93 151 112 -79 279 138 185 167 141 245 48 301 -228 -31
3353c1J50n0j22n2K49j55j17K19j44Q0l7j11N4Q7p3j69%J54o5pN5p1K29j34l18
$$ -31 119 69 -53 -105 144 -11 -128 91 -53 27 -10 -121 -67 20 -53 -222 -222 -68 -133 -140 -85 -156 73 -61 -379
3378c79N14k31m3k2J02k20K45j84J51pJ47l50K58L1p4J7K9K69k55J12j25O8m0
$$ -379 135 -96 -139 -161 -59 -279 -34 -218 -67 -74 73 -277 -19 12 -62 -45 -16 253 -2 110 -15 53 13
3401A3r5j17%L35l3j02k5Q2O1j68K49j97J25JJ72k77j18J94J2j12K64k39l9j32
$$ 13 -82 -199 -199 136 103 1 -24 58 119 -49 200 3 128 129 301 24 -94 100 112 0 264 25 -14 -146
3425a46J67o2kJ47O7j91J2m6O1j2K37l76n5K51k06oJ02J43m86N49l81M49p8m20
$$ -146 21 -41 -43 104 171 -20 -8 -54 7 -5 232 -144 -199 52 -154 -160 -58 85 -401 148 -233 216 138 -282
3449b82J24J5j34L39j20k6j66J90J3j12L55k17P8j37L8j41K37M7j66p9Q6j09M09
$$ -282 -158 -143 -277 62 -58 -84 -250 -60 -47 -159 196 -21 57 -80 -42 -183 54 101 -65 -144 -58 -167 242
3472B42j00k77L20k48P9J80P9l50K85l00K48J52j29M1k29K10k55J19J59k5j77
$$ 242 142 -135 185 -63 16 196 275 -75 210 -90 158 310 181 222 -7 203 -52 67 226 201 24
3493B4r4K48lj79J60n3k35O8J84P2r0q0K40m06p9M8J19R8j15R5k45J51j55J87
$$ 24 -70 178 175 -4 156 103 -132 -64 120 192 102 22 262 -144 -223 -175 -56 42 -73 22 -223 -72 -227 -40
3517d0j64J24p2K22j6k84Q0J89l7j46j51R5k0J65o3Lo9J10j53R9J94k21Q2K7j25
$$ -40 -204 -80 -152 70 54 -230 -150 39 2 -144 -295 -200 -220 -55 -118 -115 -184 -74 -227 -128 66 -155 -73 -46 -171
3542a71N8L88m19J49K3m%K43k35J50k29M0R8k47M92l04j40K95k04l54L74J88Q8
$$ -171 -113 275 -144 5 28 24 24 267 32 182 -47 -7 91 -156 336 32 -108 187 -17 -371 3 191 279
3565B79k99j58L4L63k01J61j96N6J30Q2k30K25k70n6J27j07rk6o1J78o2l5k2O1
$$ 279 -20 -178 -144 219 18 179 -17 39 169 251 21 246 -24 -80 47 -60 -69 -95 -156 22 -40 -75 -97 -36
3589c6j00k8O2oM1J09K35n46L33k78o8K65j61J07n7K25k24J6k9J37q2o1L24q1
$$ -36 -136 -164 -102 -108 -67 42 277 -269 64 -214 -282 -17 -178 -71 -128 97 -127 -111 -140 -3 -85 -146 178 97
3613I7j26L6j51k0J65q2J00P2L1%j31R5j83K1L08l43J53n8J28J42J3j80J3j36
$$ 97 -29 7 -144 -164 1 -81 19 91 122 122 -9 86 -97 -76 232 -111 42 -16 112 254 267 87 100 -36
3637c6J63j48J78or5R3J75l16m7M4Rp3K16M3j86kr6j09K25l4kM4K6L3j02j4J63
$$ -36 127 -21 157 151 56 149 324 8 -39 5 14 -59 157 200 14 12 -84 -193 32 -2 -4 40 66 99 -3 -17 146
3664A46k2k05jl5J34J1Nmj39mJ13Q4j95m3N8M1j63L6j56L47k84k7j30L27L35j94
$$ 146 124 -81 -82 -117 17 28 33 29 -110 -114 -1 83 -112 -155 -97 -56 -219 -183 -339 8 -276 -303 -433 -106 229 35
3690C5j59O4M7m3M2jJ47j62L1n3J09RM5j8J69j19L9M6j04Oj40J64J74k17j47R9
$$ 35 -124 -60 -13 -56 -14 -15 132 -30 1 -52 57 66 111 93 262 143 182 228 124 130 -10 154 328 111 -36 63
3716F3l7oQ6J40M5k59j12K1K4J91j36J97j14k7l0N3j02J7mk14L26lL1k24L5r1
$$ 63 26 20 106 246 291 32 -80 -59 -35 156 20 217 103 76 46 99 -3 14 10 -204 122 119 150 -74 -39 -130
3742a30R6K4Q8j11jj80MO8j7o9P2K87o1j64j13L19k36j82L09k10R5M30l04j0k5
$$ -130 -34 -10 78 -33 -34 -214 -210 -142 -159 -228 -156 131 70 -94 -207 112 -124 -306 3 -207 -112 318 14 4 -21
3767b1J0J04n8k78L41K9j93N7P2M8K02m56K25j04L09q4p9r7J4lJ09l3k23K95j15
$$ -21 -11 93 35 -243 98 127 -66 -9 63 111 313 -143 82 -22 287 203 124 27 41 38 147 114 -109 186 71
3792G1k10L46j61k21R6L0N1M7l3j1l7k3n2L15l77R9q4O1J83l20K46k39M6J53j0
$$ 71 -139 207 46 -175 -79 -49 2 49 16 5 -32 -55 -107 208 -169 -70 -154 -93 90 -230 16 -223 -177 -24 -34
3817c4K1k40O4q4K5K65J62m46J83k64K70K9k36K81J45J30k70oj05j74K28kQ3j82
$$ -34 -13 -253 -189 -273 -248 17 179 -267 -84 -348 -78 -49 -285 -4 141 271 1 -5 -110 -284 -56 -58 25 -157
3841a57J10L60l11K9l03L68j3j02N9o2L7J01OL09l94OR0J78l12l1j90K57J23M1
$$ -157 -47 313 2 31 -272 96 83 -19 40 -22 15 116 122 431 37 43 133 311 -1 -32 -222 35 158 199
3865A99p6N1j6J58k34Nj02J48j20q4L92l04l80M12k14N3K11r5j85K79m1l6j48
$$ 199 123 174 158 316 82 87 -15 133 13 -71 321 17 -363 49 -165 -112 99 4 -181 98 57 21 -127
3888a27J08J87o2k45n0K57j90Q1k8J0o8j26L0J6J55j25j01N40l79J33j01j25k0
$$ -127 -19 168 106 -139 -189 68 -122 -41 -69 -59 -127 -253 -223 -207 -52 -177 -278 262 -117 16 -85 -210 -230
3911b30K22j13J47m47M26l33K86k5p1J10N2k5J6k2j16J92Q1j27J30j07j58O8j06
$$ -230 -8 -121 26 -421 5 -328 -42 -67 -138 -28 24 -1 15 -7 -123 69 150 23 153 46 -112 -44 -150
3934a50K73l60M09p1j01n1Q3k65N11j12l23K69k87L65M8l2j42J21K7k04P9j18
$$ -150 123 -237 172 101 0 -51 32 -233 278 166 -157 112 -175 190 238 206 64 185 212 8 87 -31
3956c1QJ06l9j1n8k54K59k39K19J52m7j2j63k24L12k08J87j63P6J84j77O8oR2
$$ -31 -23 83 44 33 -25 -279 -20 -259 -40 112 65 53 -110 -334 -22 -230 -43 -206 -130 54 -123 -55 -61 31
3980C1n2k30O6K08J36j46J38k18o7O3N1q3J0J3K6p1o8L35q3J1R6l5k59J95k9j5
$$ 31 -21 -251 -185 23 159 13 151 -67 -134 -71 -20 -103 -93 -80 -54 -125 -193 142 59 70 166 131 -128 67 38 23
4006B3J34j0k4j23L82l44p8K18j28L03l69J30o1NRj78JP6R2N3r2L0j0j75O3K04
$$ 23 157 147 123 0 382 38 -40 178 50 353 -16 114 53 58 67 -111 -110 -34 58 111 19 49 39 -136 -73 131
4032A31j33J91l83O5O2KK14j39o6J47o5k01J39M1k3j90qK66m7r7J22m37L81l05
$$ 131 -2 189 -194 -129 -67 -65 149 10 -56 91 26 -175 -36 5 -18 -208 -216 50 3 -94 28 -409 -28 -333
4056c33L13l78L61k96L27K12j29m4k62K05P1k16N6K41l00J83m3j57J11k7L45Q0
$$ -333 -20 -398 -37 -333 -6 206 77 33 -229 -24 47 -169 -113 128 -172 11 -32 -189 -78 -105 240 320
4078C20m55K31k35J5K57M4k79K10o1j90K26j23k6L2Q9L4oj9q0Q3n8J12k1o4R3
$$ 320 -135 96 -139 -124 133 177 -102 108 47 -143 83 -40 -66 -34 55 89 83 64 -16 67 9 121 100 36 129
4103A29j46j42J83l5j7l0m7K58j45J13l90N24l74O0l5P9j51J02Nk15L81k46J96
$$ 129 -17 -159 24 -11 -28 -58 -105 153 8 121 -269 255 -119 -59 -94 -15 -166 -64 -59 -274 107 -139 57
4126E7j75L5o1J99o7j58N35l85o4K40m77K84jM9k03J94r9J49j12Q0M0K87l54n6
$$ 57 -118 -83 -144 55 -12 -170 365 -20 -84 156 -321 -37 -38 11 -192 2 -97 52 -60 20 60 347 -7 -63
4150f3L7P7L7M9l40M72k58J80j27L4l5k19L58m9j01K70q8m85N21j64jk61J8K79
$$ -63 -26 51 88 137 -203 269 11 191 64 98 63 -156 202 153 52 322 234 -251 270 106 105 -156 -138 141
4174A41k11m8L5K25J59l87J16j80L06j56k37N40k37J15o1Jj73J04j41P5K87m30
$$ 141 -70 -118 -83 142 301 -86 30 -150 156 0 -237 303 66 181 120 121 -52 52 -89 -14 273 -157
4196a57O2J00J63j93j83p1R1RQ8J10Qn9J01j53o5j39K69j1rJ43l53L25j85R0J71
$$ -157 -95 5 168 -25 -208 -279 -188 -179 -91 19 27 -32 69 -84 -149 -288 -19 -30 -39 104 -249 76 -109 -19 152
4221A52p6L6q9j28K17q8k4R0p7R2j37P1J70l88K53N4J02K2Ok90K4K54n9l45J28
$$ 152 76 112 23 -105 112 24 0 90 13 105 -32 39 209 -179 74 128 230 252 258 -32 -8 246 187 -158 -30
4246c0J78k66N4J7K8k7K24Q3j3J94o42K92j81Q9K4p6J99k23J89k39P2J21k23J44
$$ -30 148 -118 -64 -47 -19 -46 178 261 248 442 -200 92 -89 0 24 -52 147 -76 113 -126 -54 67 -156 -12
4270a2mk5j37LK52k77J20r6J69j04m1k9N1P1j7p1j61K99R6j53q0J42k72K12J27
$$ -12 -16 -41 -178 -175 77 -200 -80 -176 -7 -111 -152 -181 -130 -59 -76 -147 -308 -9 87 -66 -146 -4 -276 -64 63
4295F3k25K1N0J24J13j75l1R7r6N4K09j04N2j6J8J30J8l35Q5K0pl6j32K85mj81
$$ 63 -162 -141 -91 33 146 -29 -60 37 -59 -5 204 100 152 136 154 284 302 -33 52 72 65 29 -103 182 178 -3
4321cK48k13N3j21J45k0j46K0j3K95j73l2Q7k01J33p8M7l2k91L43N8r3J15m6j57
$$ -3 245 32 85 -36 109 89 -57 -37 -50 245 72 40 127 -74 59 -19 28 -4 -295 48 106 13 128 82 -75
4346g5J23q4J30On5j65k4K53p5k2q1j7K53k55L5Q6r9k02K03J1J16J1n9O6j48R
$$ -75 48 -36 94 100 45 -120 -144 109 34 12 -69 -86 167 -88 -53 33 -66 -268 -65 -54 62 73 14 80 -68 -59
4372e9m1K8M2K5k17K05j30L78K37j57j38J33l79j1m6L08r4j02P0j21R6K1n5J58
$$ -59 -100 -72 -30 -5 -222 -17 -147 231 468 311 173 306 -73 -84 -130 178 84 -18 52 -69 27 48 -7 151
4396A51P4k29J06k24J57J00k03K22j17k0K6L25l22J51j59j10J02j07m2n9R0j09
$$ 151 225 -4 102 -122 35 135 -68 154 37 17 43 368 46 197 38 -72 30 -77 -119 -178 -88 -197
4418a97M4J42j81J78j49R9Q2l1J69m09J57K1J63l12NM37k16k48K39m9k93K75J1
$$ -197 -153 -11 -192 -14 -163 -64 18 -13 156 -253 -96 -75 88 -224 -219 218 2 -246 -7 -56 -349 -74 -63
4441f3r1P6O7J9K83j27r7L6K1j04n7K18j22r4L6J60k06j37L65j06J25j35k49L50
$$ -63 -154 -78 -11 8 291 164 67 103 124 20 -37 181 59 -35 1 161 -45 -182 183 77 202 67 -182 168
4465A68j89J89k18j00K5M10l72L1J94j23R4j51K25k64J78O8l46O4L8J5k37L14
$$ 168 -21 168 -50 -150 -125 285 -87 -56 138 15 109 -42 183 -81 97 165 -181 -117 -79 -64 -301 13
4487A3q6K80k09L4n7j50J34p2K13k26K45j10N1N5m82J96J45r5Q7kO6Qp8P8j58
$$ 13 -73 207 -2 32 -25 -175 -41 -113 100 -126 119 9 60 115 -367 -171 -26 -121 -34 -36 30 38 -40 38 -120
4512a20J07k79J95K03j06k83M17j14j74N3J38Q2r5p1n1J73l65O30l17k5Q8J1p9
$$ -120 -13 -292 -97 106 0 -283 134 20 -154 -101 37 119 24 -47 -98 75 -290 340 23 -2 86 97 18
4535A8J43O0k89M9o3L8J06j11R3n5L16p4m23n3L90j17N7q5J47l45M12l82O6K45
$$ 18 161 221 -68 -19 -82 -44 62 -49 44 -11 305 231 -192 -245 145 28 85 0 147 -198 214 -168 -102 143
4559A43j08P1j97p5K09j13K27m1j19j20R8l6p7K31j41o2K07q3k07K66j69J16j14
$$ 143 35 106 -91 -166 43 -70 157 116 -3 -123 -25 -61 -138 93 -48 -110 97 14 -193 73 -96 20 -94
4582i4L1k2k04K60j0j7J4J93l5j41j04J85N0j67P7j23J11OoR0m2K56l25J57j20
$$ -94 -63 -85 -289 -29 -39 -56 -42 151 116 -25 -129 56 106 -61 16 -107 4 10 4 94 52 308 -17 140 20
4607B0J08j03K73m37L80l08j29M25o7O6k77j17J53k4J67P6N1j09l13K30Q1r6m
$$ 20 128 25 298 -139 241 -67 -196 229 162 228 -49 -166 -13 -37 130 206 257 148 -165 65 146 50 46
4630D6m8J84l11m1J3k02L59k45L28O7l31M6L23j43r3q8P0j4L1k96J22J23K54n15
$$ 46 -2 182 -129 -170 -157 -359 0 -245 83 150 -181 -135 188 45 -48 -136 -66 -80 -49 -345 -223 -100 154 -361
4654c61M25n6q9kJ43M2j52N7j37J1J52m8k04K16j00J77j81m8q1K89K02j89J29
$$ -361 64 8 -81 -83 60 102 -50 7 -130 -119 33 -15 -219 -3 -103 74 -107 -155 -236 53 255 66 195
4677A95n1n6k05J51j20K05P9m19K53j11L21l10K69j02KJ51J3j17p0L5j9k40K53
$$ 195 144 88 -117 34 -86 119 198 -221 32 -79 242 -68 201 99 101 252 265 148 78 113 94 -146 107
4700A07q2J91k47K03l0k35R2p2R8o4N4n0J01j91KJ88K9k46J99P8j39J95l10K04
$$ 107 25 216 -31 172 142 -93 -1 -73 25 -39 15 -35 66 -125 -123 65 94 -152 47 125 -14 181 -129 75
4724G5j36j51K5J97j2K3j61J63l59L81q6K3m0J33pl61K22K5j96L36p6M7J2mM1
$$ 75 -61 -212 -187 10 -2 21 -140 23 -336 45 -41 -18 -58 75 68 -293 -71 -46 -242 94 18 65 77 73 114
4749A14r0o8p5Q2k6o9j0K43k28K06p2K30q3j71J84J6j63l5J60j11J23k55K56k29
$$ 114 24 -44 -119 -37 -63 -132 -142 101 -127 79 7 237 154 -17 167 183 20 -15 145 34 157 -98 158 -71
4773g1J9l0M4J32K3R4l00J02r0J41m9j23N3K67k61K65K7k47m6k86L83j74q3K35
$$ -71 -52 -82 -38 94 117 211 -89 13 -77 64 15 -108 -55 212 -49 216 243 -4 -50 -336 47 -127 -210 25
4797B5k8M7P0k39j0r7K25j65j40K26J31l19L30O4j83j1L4J90J7l91P0J08J52k03
$$ 25 -3 44 114 -125 -135 -232 -7 -172 -312 -86 45 -274 56 120 -63 -74 -40 150 167 -224 -154 -46 106 -97
4821i7K35o2p0J41k36J13K9r8N6J33j18K84m03K64k32p1MQ7J7J91j32O2p2J37
$$ -97 138 76 6 147 -89 24 53 -45 11 144 26 310 -93 171 -61 -132 -128 -41 -24 167 35 97 25 162
4845A62j50J07n1J00j03R7l12J39K17l32K54j53M7jLr2J09j16j24N0n1L49j12
$$ 162 12 119 68 168 65 162 -150 -11 206 -126 128 -25 22 21 24 -68 41 -75 -199 -149 -200 149 37
4868C7l5j16R0j37Q2j30J54Ok05K02J77n7j77J44n3o4j07J43k3O9j18K35j51l0
$$ 37 2 -114 -24 -161 -79 -209 -55 -49 -254 -52 125 68 -109 35 -18 -82 -189 -46 -69 0 -118 117 -34 -64
4892f4r6K39n7r2L6J14l1l1J32j07m5J52K8k48J81n6r3J0Q4n6k49K81j5j87J53
$$ -64 -160 79 22 -70 -34 80 49 18 150 43 -2 150 178 -70 111 55 -38 -28 56 0 -249 32 17 -170 -17
4917a7j1L26m53L20k62J72J04j65O0j72J80j03J69j65n8J11L46l05k37N1NJ81
$$ -17 -28 298 -155 165 -97 75 179 14 74 -98 82 -21 148 -17 -75 36 382 77 -160 -109 -104 77
4939G7k05r1K55P7l5j34k20K28nJ0j20J48L9J04j28J0m00M23j65O6j39J00n9j40
$$ 77 -128 -219 36 113 78 -56 -276 -48 -53 -43 -163 -15 24 128 0 10 -390 33 -132 -66 -205 -105 -164 -304
4963c04K04j30J19j21K32j98L65l10N8j81L52p2k87L80k41J15J16M9k30L7K24
$$ -304 -100 -230 -111 -232 0 -198 167 -143 -85 -266 86 14 -273 107 -134 -19 97 146 -84 -47 177
4984A77j28j03J6m8O3j56J56P0O4o8Rj14P3l3j01L10m12K22M3K6M6k22O3Q4J61
$$ 177 49 -54 -38 -86 -23 -179 -23 47 111 43 52 -62 11 -22 -123 187 -225 -3 40 66 112 -110 -47 37 198
5009A98j53R3j63j36k3J99M8J39m50K92j23p3J84k11M6J43N8Jj75k8KJ08j75J56
$$ 198 45 138 -25 -161 -184 15 63 202 -248 44 -79 -152 32 -179 -133 10 68 69 -106 -134 -132 -24 -199 -43
5033d3j91J27p4Q1J58k8o3J51P8j26k37K2PQ8o9N9l3M3k57K99l3J14j20J36l64
$$ -43 -234 -107 -181 -100 58 30 -33 118 196 70 -167 -145 -138 -50 -119 -60 -93 -50 -307 -8 -41 73 -47 89 -275
5058b75R4K81k7j72K11k19K43k43J79r5n8k17K15J12J66j49O8j46r6J61j21K29
$$ -275 -181 100 73 -99 112 -107 136 -107 72 -23 -81 -298 -83 29 195 46 114 -32 -128 33 -88 141
5080A41j79Q9k09K83q4J36Rl28K47Jk45K16l29L23p4p6K09k98K42nk28k13L39
$$ 141 -38 51 -158 125 41 177 186 -142 105 106 -139 77 -252 71 -3 -79 130 -168 74 69 -159 -372 -33
5103c3l15M03n7j19%O7O5m1Q5j85J45n3J90j88O9j16J69l77L29j64K10L1j15O
$$ -33 -348 55 -2 -121 -121 -54 11 -30 55 -130 15 -38 152 -36 33 -83 86 -291 38 -126 84 115 0 6
5127Fj08K93k6j42k36L72q8J08j01k06l4L11j22k4J65J42k20O9l29L5j3K81R6
$$ 6 -102 191 165 23 -213 159 71 179 78 -128 -162 149 27 3 168 310 90 159 -170 -135 -148 133 229
5150B29j25J00j99K1K9J71k31N6j74J86r6m8J98l17M01j15j24k01K60o0n4M07
$$ 229 104 204 5 26 55 226 -5 51 -123 63 -33 -81 117 -200 201 86 -38 -239 21 -39 -93 314
5172C14k82oj13J88k25j9L4J67o4r4m2R4Q6M3j21n7K37Kl46K00J54k00J45J58
$$ 314 32 26 -87 101 -124 -143 -109 58 -6 -100 -142 -48 38 81 -40 -97 140 142 -204 -4 150 -50 95 253
5196B53j21n0k08q0K86l7q1K54k29N1K7r2J64J74k23p4jL0pJ61j70J10l8k72M07
$$ 253 132 82 -126 -206 80 43 -38 216 -13 38 65 -27 137 311 88 14 13 43 36 197 27 137 99 -173 234
5221B34l06J83k24Q3rm7J43p1j8o2J42Q1n1N0k56n6J68k6o9L68l58J91J03j94
$$ 234 -72 111 -113 -30 -39 -86 57 -14 -32 -94 48 129 78 128 -128 -184 -16 -42 -111 257 -101 90 193 -1
5245al18M00j94Q5j21K34L8l94J69m5K05l1J01l31K39j99R9k14M62j92J61k82
$$ -1 -319 81 -113 -28 -149 85 123 -271 -102 -147 58 27 128 -203 36 -163 -64 -278 184 -8 153 -129
5267a29K05j20O6Q8k14K90k88K9M05rk95K8M8l26J31J21l6J89j60L0j7L78n15
$$ -129 76 -44 22 110 -104 186 -102 -73 332 323 28 56 104 -222 -91 30 -6 183 23 53 36 414 -101
5290a01J9qN3J53m7N9k78K81k76M3N1J4J42r4p4J36N5m0J02l42K28Q2l8o6P6j22
$$ -101 -82 -90 -37 116 69 128 -150 131 -145 -102 -51 -37 105 11 -63 73 128 88 190 -152 76 158 120 54 130 8
5316HK5r6J11O0j22j12N8n1J72m2J05N8R8k04k09J13J90j76r4rJ31j64J20o7j91
$$ 8 33 -63 48 108 -14 -126 -68 -119 53 11 116 174 272 68 -141 -28 162 -14 -108 -117 14 -150 -30 -97 -288
5341b88L67J03rj33R7kk86J64o5J49j17l35M69r6k79L90j12R6j91N6l5L9J46J51
$$ -288 79 182 173 40 137 135 -151 13 -52 97 -20 -355 114 18 -261 129 17 113 -78 -22 -57 -18 128 279
5365B79l29N1l3Q8Q4k86K47j36J27j68J81O1j80J98k50m8J51M5K93j28k42l6O4
$$ 279 -50 1 -32 56 140 -146 101 -35 92 -76 105 166 -14 184 -66 -114 37 82 375 247 5 -31 33
5388C3P3o5j34L16l47M6K0K62k43J28J43n6l28j5K45q2M0k66K71p8M6j97M29l53
$$ 33 106 41 -93 223 -124 -78 -58 204 -39 89 232 176 -152 -167 78 -4 36 -230 41 -37 9 -188 241 -112
5412a12L06k25jk3p7K74o1q7N3j25r7L61k16R3j86j6k9N8M9K8R8o4r6K18j89K3
$$ -112 194 -31 -32 -55 -132 142 81 -6 47 -78 -175 186 -30 63 -123 -139 -168 -110 -61 -33 65 1 -95 123 -66 -43
5438d3j1K65J98l06O0K20m04rK05k66K44J07k72Q6k00J69J96k02J50l33L0j8Q4
$$ -43 -54 211 409 103 163 383 -21 -30 175 -91 153 260 -12 74 -126 43 239 37 187 -146 -116 -134 -50
5461e0Q3l88K38J14J40l69L27K6k33K41j46R6k71L7K23k62j1K92j55K47k99J24
$$ -50 33 -355 -117 -3 137 -232 95 121 -112 129 -17 79 -192 -155 68 -194 -205 87 -68 179 -120 4
5483Dj31K10O5J00k77j25K12l01K36j20K17j71J06j57M7J81q3o8J26J86j14p2
$$ 4 -127 83 148 248 -29 -154 58 -243 -7 -127 90 -81 25 -132 -85 96 13 -55 71 257 143 71
5505G1j54J13r7j0J13J09j49l4p4K46j28J16M2k64K26k96L05l13M5K15m9k56M81
$$ 71 -83 30 -67 -77 36 145 -4 -38 -112 134 6 122 164 -100 126 -170 135 -178 -133 82 33 -223 258
5528B58k5l55K76j04k52K90j1l28M26j16o7k8J25J58j76P2M5l50j52L19J0j23
$$ 258 233 -122 154 50 -202 88 77 -251 175 59 -8 -36 89 247 71 143 188 -162 -314 5 15 -108
5550a08J57r4O5P0Lk66K18J63l05J32j18J57J25l58M0K55j84j42J99J0j61P2M0
$$ -108 49 -45 20 90 93 -173 45 208 -97 35 -83 74 199 -159 -119 136 -48 -190 9 19 -142 -70 -30
5573c0m2J82m37L23qj07M2n0P2M3K33k05p6J9Q4j80m2M00k0j43O7j45j52K36k6
$$ -30 -72 110 -327 -4 -12 -119 -77 -127 -55 -12 221 16 -60 -41 43 -137 -179 221 201 58 125 -20 -172 64 38
5598C8J22k38K08l1l29L26P1k16j4K19j67j6J41n0R6J17l00J89p5n7M9j97j0n5
$$ 38 160 -78 130 99 -230 96 167 -49 -63 156 -11 -27 114 64 160 277 -23 166 91 34 83 -114 -124 -179
5622a79L10N3k41j3m6J57j4o3q5L75l83K09j41pNJ27rk31J52L9RJ53k49P9J75
$$ -179 131 184 -57 -70 -116 41 27 -36 -121 254 -129 80 -61 -68 -63 64 55 -176 -24 15 24 177 -72 7 182
5647A82k42Q5j03j85K13J03N5k09q8K28j84Q0O3K91k78j89K89o3j83L47j74J32
$$ 182 -60 25 -78 -263 -50 53 108 -101 -189 39 -145 -65 -2 289 11 -178 111 48 -135 212 38 170
5669A70J40j50k34K73R0kj91m91O38l16L18l98J53J67k03K20j07l00J73lk6J44
$$ 170 310 160 -74 199 289 287 96 -395 243 -73 245 -153 0 167 -36 184 77 -223 -50 -53 -79 65
5691F5j67q1N8P7O8j90L19n24O08kk41o8n1L21k46J28K56j99m3j85N2j32K8K58
$$ 65 -102 -183 -125 -48 20 -170 149 -375 233 231 -10 -78 -129 192 -54 74 330 131 88 -97 -45 -177 -149 109
5715A09l90K80J21r9l1j29P1K30j52j92J27J90j47k0j56M47j22J18m6j14J8k43
$$ 109 -281 -1 120 21 -10 -139 -68 162 10 -182 -55 135 -12 -32 -188 259 137 255 209 95 113 -130
5737a30R5J59J70k16k4l2J53J58n43K85r3O0J67l19J14n6J59j54K1J33k33Q8N
$$ -130 -35 124 294 78 54 22 175 333 -210 75 -18 42 209 -110 4 -52 107 -47 -26 107 -126 -38 -33
5760c3L4R9k27L15l55L13l8j46j01K58Mk92LoQ7m6j38K22M3j25O9J02K2m70M95
$$ -33 1 100 -127 188 -167 146 108 -38 -139 119 123 -169 -166 -172 -85 -131 -269 -47 -4 -129 -60 42 64 -406 89
5785H9k15K52j87j07M7J1K01l34J55k92L77o9j96J53J51K8J6l32K60l1j87K74
$$ 89 -126 126 -61 -168 -121 -110 91 -243 -88 -380 -3 -72 -268 -115 36 64 80 -252 8 -23 -210 64
5807F4K4j59P1%rO8k42L68q0N8k07kP3j11n7J38K2M6j4p9m3K94j40n1Q4J6q0q7
$$ 64 88 -71 0 0 -9 59 -183 185 105 163 -44 -46 27 -84 -141 -3 19 65 51 -28 -71 223 83 32 116 132 52 -35
5835c5OJ22j4j65J50k2N9r2l82M43J06j40O3j68j81J76K5J29N1R4j06k03J38j42
$$ -35 -29 93 79 -86 64 42 101 9 -373 70 176 36 99 -69 -250 -74 -49 80 131 225 119 -84 54 -88
5859h8k49J52J91l24L37l9K05j34Qr0J07o0O4q3P3o5L04j24j30k09R1K34p5L6
$$ -88 -337 -185 6 -318 19 -20 185 51 59 -31 76 16 80 -3 70 5 309 185 55 -154 -63 171 96 132
5883A32r9k91K23k1K83q9q5N9J0MN1l6l28N83o10J27N7L00k98j53L38k06J13j0
$$ 132 33 -258 -35 -56 227 138 53 112 122 126 177 141 -187 396 -214 -87 -30 270 -28 -181 157 -49 64 54
5907E4m8J13j54K43k66l0j07J20J19j03j00Q6l1M0M6J02l04QL18r3j6j07K73L7
$$ 54 6 119 -35 208 -58 -88 -195 -75 44 -59 -159 -73 -104 -64 -18 84 -220 -212 106 13 -3 -110 163 200
5931B00K52o10p0K39j51J23J9M2M5J4J40k16K28l6k72L32k89j58M0j86K18M3p0
$$ 200 452 -158 -228 11 -140 -17 2 44 89 103 243 27 255 219 -53 279 -10 -168 -128 -314 -96 -53 -123
5954a23K20j39j6J40j38N7J45j93K00j65m8K03j5j25N8R8k8j0L8j34j74J09L60
$$ -123 97 -42 -58 82 -56 1 146 -47 153 -12 -60 143 128 3 61 159 131 121 159 25 -149 -40 320
5977C20m50K05m3k74L43q5L03j70Q5l89K6J31P3j77J78m3j38R0J24o8J22j97Q8
$$ 320 -130 75 32 -242 101 16 319 149 234 -155 -129 2 75 -102 76 33 -105 -15 109 41 163 -34 54
6000E4R2Kk13J10J11l52K27K03k08K9k09l1K45K4q7k15K23J4m1k79L58j00j46
$$ 54 146 148 -65 45 156 -196 31 234 26 55 -154 -185 60 84 -3 -218 5 19 -22 -301 57 -43 -189
6023a89J17n6J42j07n3K72j52l4K75k93o7M4J86K31j03j71l4Q5j12K69l58J37
$$ -189 -72 -128 14 -93 -146 126 -26 -60 215 -78 -145 -101 85 316 213 42 8 93 -19 250 -108 29
6045B9K75l46K07k24J50J29q9l48J56P5L26l60l6j2J45N1j91M5k96P3K48J71j76
$$ 29 304 -42 165 -59 91 220 131 -217 -61 14 340 -20 -56 -68 77 128 -63 -18 -314 -241 7 178 2
6068BO1k1k71l4J17K41j06J04j94p3J69k29K41k03K78j7n1k5k6J30l72K82j88
$$ 2 63 42 -229 -263 -146 95 -11 93 -101 -174 -5 -234 7 -196 82 65 14 -11 -37 93 -279 3 -185
6091a85P0K10j84j07N1L29j39j12R7j51P9J04r1J68j05l09L98k12n0J96p0k11
$$ -185 -115 95 -89 -196 -145 184 45 -67 30 -121 -42 62 -29 139 34 -275 123 -89 -139 57 -13 -224
6113b24J54J71j80K85j62m6k30J66j04M28n87M92k15J6K48l72K19m3l0N0K26r1
$$ -224 -70 101 -79 206 44 -2 -232 -66 -170 258 -329 163 -52 -36 212 -160 59 16 -14 36 262 171
6135A71k45jM2P9J9j89j3K58j94K3K49n7j77J07J42j93J88m2k62P1J0j12J58k72
$$ 171 -74 -75 -33 46 65 -124 -137 121 -73 -50 199 142 -35 72 214 21 209 167 -95 -24 -14 -126 32 -240
6159b40J6L27o9p6K08k69K87j54j02k3K71k53K51n3k46j1K5J60Qk6rj52P7J23
$$ -240 -224 103 34 -42 166 -103 184 30 -72 -95 176 -77 174 121 -125 -136 -111 49 57 31 22 -130 -53 70
6183G0l8M8o1nJ29Qj10N9k65K92j93J75J63k96k29L32J05j35q5j50J63j49K32
$$ 70 32 80 19 14 143 151 41 100 -165 127 -66 109 272 -24 -253 79 184 49 -36 -186 -23 -172 60
6206F0K0p9j59K72l5m7n5J21K3oq8j99K19p5P5m5j0J01M5p3r1rQ3k01J48j7J00
$$ 60 80 1 -158 114 79 32 -23 98 121 115 27 -172 47 -28 47 2 -8 93 138 65 -26 -35 48 -153 -5 -22 78
6233G8r8n8K02r6j03K44j38K0p9J80q0j21p6J58j56Q2N2p9P6k07J73r6m1J57q1
$$ 78 -20 -78 124 28 -75 169 31 51 -28 152 72 -49 -125 33 -123 -41 11 -68 8 -199 -26 -122 -163 -6 -87
6258h7J12j60Q7J70rj37k17K79k7m8o7J30o0RJ51N4j72J87r2J45k85L2j41K53
$$ -87 25 -135 -48 122 113 -24 -241 38 11 -37 -104 26 -34 -25 126 180 8 195 103 248 -37 -5 -146 107
6282A07j5n2j51L5L32l88k3K71j27r4Q8l7k16M1K80k7j2j34M7K35l50K75R0j66
$$ 107 92 40 -111 -76 256 -132 -155 116 -11 -105 -17 -54 -270 -229 51 24 12 -122 -75 160 -190 85 175 9
6306Im1J27m46J56J19j74K96J56n7o2k24L4j56J90J10j92M10k32j64j81L46J64
$$ 9 -32 95 -351 -195 -76 -250 46 202 145 83 -141 -107 -263 -73 37 -155 255 23 -141 -322 24 188
6328A88k24oL65j21j09j64J37N9Qq0p7j27J18j53J87J15j18M5j42M5J46M1k68
$$ 188 -36 -42 323 202 93 -71 66 125 133 53 -24 -151 -33 -186 1 116 -2 43 -99 -54 92 133 -135
6351a35j75K22%J0R4Q1m9Q6M5O9l33J97J20j79p0j7j50J28J59r1J36j78j41K98
$$ -135 -310 -88 -88 -78 16 97 48 134 179 248 -85 112 232 53 -17 -34 -184 -56 103 12 148 -30 -171 127
6375A27j76J56J45l23J67P7m7l28J5L20lm39M36k66J53K3j59K2K33k37J59Rj05
$$ 127 -49 107 252 -71 96 173 126 -202 -187 133 130 -309 127 -139 14 37 -122 -100 133 -104 55 64 -41
6398d1J74r5J42j78j17J16k17J88J12j77J50J61j30N2j37j5J99m08K85o1j75M59
$$ -41 133 38 180 2 -115 1 -216 -28 84 -93 57 218 88 140 3 -12 187 -221 64 3 -172 287
6420B87l64k5K78o7j67L48q5j99K95j85nl40J09J27p9oO4o1p9L61l20J55%Oj52
$$ 287 -77 -102 176 109 -58 290 205 6 301 116 111 -229 -120 7 -72 -78 -14 -75 -154 207 -113 42 42 48 -104
6445a04L82k45J89o5l05J25j99L06j16J1J71l62LJ19j88K50j02J50j15j13J82
$$ -104 278 33 222 157 -148 -23 -222 84 -32 -21 150 -212 -209 -90 -278 -28 -130 20 -95 -208 -26
6466b6LP3Nj13K79k78J25N0j80M3J22q6O9k68N18m24K40J17n19K35O7l8j16J61
$$ -26 -23 50 55 -58 221 -57 68 118 -62 -19 103 17 86 -182 336 -88 152 269 -250 -15 52 14 -102 59
6490E9p7J05j26K9Lj25Q0K02R5m25K71r0K73j76L4p5M7%r7J85q4k91J31RL14j81
$$ 59 -18 87 -39 -10 -7 -132 -52 150 245 -180 91 1 274 98 132 57 104 104 7 192 108 -183 -52 -43 271 90
6516I0j32m3J22j37J86L7q9Q5J44p9l40J97J60l60J46o8p6J21O5k3l0qJ49k55
$$ 90 -42 -85 37 -100 86 123 34 119 263 184 -156 41 201 -159 -13 -81 -157 -36 29 6 -24 -32 117 -138
6540a38j28L67k64O4J16j66j00K56k52RJ29n7K95N0l06O8J31j04J64j56L03m09
$$ -138 -266 101 -163 -99 17 -149 -249 7 -245 -236 -107 -164 131 181 -125 -57 74 -30 134 -22 281 -128
6562a28K66j3j42Lm8J0P6K39Rm03K68j56%k50J47K3K11J54k13K2l6l3j20J83k67
$$ -128 138 125 -17 -14 -62 -52 24 263 272 -131 137 -19 -19 -269 -122 -99 112 266 53 75 39 6 -114 69 -198
6587a98K84j58R6n5J2J3rj55K11o9M3j31L37k40k06L79j51K77l03j84N50m21N0
$$ -198 86 -72 24 -31 -19 -6 -15 -170 41 -28 15 -116 221 -19 -225 154 3 280 -23 -207 343 -78 -28
6610b8j32O7K95k75J7j57K78L4l5O3k2o2j49K19k57O3J2L33J4l39m7N1Q5q4L3
$$ -28 -160 -93 202 -73 -56 -213 65 99 64 127 105 43 -106 113 -144 -81 -69 264 278 -61 -108 -57 28 -56 -23
6635b3O6k31K87j31k06K67l57J76K12K03k66R7J06k84K4J75k23M6m3K32k62J28
$$ -23 43 -188 99 -32 -238 29 -328 -152 60 263 -3 94 200 -84 -60 115 -108 -62 -105 127 -135 -7
6657glL4q0K94k86L3q3M1L08m51J96J56l18K5L5k9lM9L69m62J56q3j30M64j29
$$ -7 -10 24 -56 238 -48 -15 -98 -57 251 -200 -4 152 -166 -141 -106 -135 -138 -89 280 -182 -26 -109 -239 225 96
6682I6J8k10J90n4j43L42n6l01O1m3J84l3j19j53m1K63j16J85J32r3j4p4J4p9
$$ 96 114 -96 94 40 -103 239 183 -118 -57 -100 84 51 -68 -221 -262 1 -115 70 202 109 95 21 35 -44
6706d4n4Q0J5p7J6J60j61m2K2R6N0J22k04K74j62J5j08k41N94j32p4p9q0P4j71
$$ -44 -98 -18 -3 -80 -64 96 -65 -107 -85 11 61 183 -21 253 91 106 -2 -243 351 219 145 66 -14 60 -111
6731a11QP4K00j03j78K28j72Q6k92L4N08k94n4O9j5Q3k6K9Nr1j7j35K2L63l46
$$ -111 -103 -29 171 68 -110 118 -54 32 -260 -226 282 -12 -66 3 -12 71 45 74 79 -12 -29 -164 -142 221 -125
6756a25K59q2j47m2R9J68j03k69L33k27R8J67m4J0m61K85M6P6j06k26L52j27Q4
$$ -125 134 52 -95 -137 -38 130 27 -242 91 -136 -38 129 85 95 -366 -81 -35 41 -65 -291 61 -66 18
6779A8P0j00k3j54N06l35n7J18j86J52k74J44R5L1KJ32j45L2k52J61p4O3M5J66
$$ 18 88 -12 -35 -189 317 -18 -75 43 -143 9 -265 -121 -26 5 7 139 -6 26 -226 -65 -139 -76 -31 135
6803A35j91J38l9j83L03k32ML83n07K01N7o8o6p5J07J81J10k75q2J64j69p5P3
$$ 135 -56 82 43 -140 163 -69 -65 318 -189 12 69 1 -65 -140 -33 148 258 -17 -99 65 -104 -179 -106
6826a06J87j30J47j46L2%R6j46M29m39L72k91j7J64k90l9K22J00k12K19k24K44
$$ -106 81 -49 98 -48 -16 -16 80 -66 363 -76 296 5 -12 152 -138 -177 45 145 -67 152 -72 172
6848A72j55J71j59o7K6L5%P8k5r8M6Q8k75J63n7J40j44P7J61j49j39J85k21qJ61
$$ 172 17 188 29 -38 -12 23 23 101 76 -22 24 112 -163 0 -57 83 -61 16 177 28 -111 74 -147 -155 6
6873FL08n06M22m6k14P7N8p3KJ2q1K44J2k72J07q5p0J01l41K11L93k23K03k94
$$ 6 314 -192 230 184 -30 47 105 32 34 46 -35 209 221 -51 56 -29 -99 2 -339 -128 265 42 245 -49
6897d9O7j46Q4N4N5j74K28j09n5J74k89J70q1K29l82L35k20R6j65K34J2R8j70
$$ -49 18 -128 -44 10 65 -109 119 10 -45 129 -160 10 -71 158 -224 111 -109 -13 -178 56 68 166 -4
6920dj84J69K20l5K44k57j16J07j48Lm9p2K11k29J54L2q4Rj02K06j03m3L4J51
$$ -4 -188 -19 201 166 410 153 37 144 -4 -1 -50 -122 89 -140 14 46 -38 -29 -131 75 -28 -71 -37 114
6944A14k88K56j19M5l0j7K48J3j06m9r7j3Q0M4N5j16k51R5L0M4J85p0p7K09k03
$$ 114 -174 82 -37 8 -22 -39 209 222 116 67 -30 -43 37 81 136 20 -231 -136 -106 -62 123 53 -24 185 -18
6969a8r3O4K40k85j14L46j40O8k10J75p0M0J7M4j76K11j74K4k59K19l7L46k10
$$ -18 -111 -47 193 -92 -206 140 0 68 -142 33 -37 3 20 64 -112 99 -75 -51 -310 -91 -128 218 8
6992Hq4k50K43K84j87M3k26J16n1o7J51K01k28R3M3j87L9o3J92J45k61j49j03
$$ 8 -76 -326 -83 201 14 57 -169 -53 -104 -171 -20 181 -47 46 89 -98 -59 -122 70 215 -46 -195 -298
7015b98J98L52k16l2k13N8L16k03o1R9kJ67Lj08j0O5j80L8p1p2J5L52k57J44J7
$$ -298 -100 252 36 4 -209 -151 165 -38 -99 0 -2 165 168 60 50 115 -65 -27 -98 -170 -155 197 -60 84 101
7040A01J6q1L4k1k07n7K21l59L06J1j84L23j98J07J04l55K73n6J61l66L72j68
$$ 101 117 36 70 49 -158 -215 6 -353 -47 -36 -220 103 -95 12 116 -239 34 -22 139 -227 145 -23
7062b3j6J60N8k3Nk36K04L8j7j5k67l5L45J2m9k3J19l13R2N9Q4k83l8J95j15J05
$$ -23 -39 121 179 156 161 -75 129 167 150 135 -132 -167 178 190 141 118 237 -76 16 75 159 -124 -162 33 -82 23
7088B3KL02l36j14L26pj68j15J16J34j57M5J3l65P8J58K19M1q5J04j81o0L0J0
$$ 23 25 327 -9 -123 203 196 28 -87 29 163 6 51 64 -301 -223 -65 154 195 110 214 33 -27 3 13
7112A3K1j33j88L74J26k19M4j06j4J67j8m2J26p6j04P8n1j83J16j44k7O4K68l55
$$ 13 34 -99 -287 87 213 -6 38 -68 -82 85 67 25 151 75 -29 49 -2 -185 -69 -213 -240 -176 92 -263
7136b63K86j05J94o9ok65J10K78l36L60P3l58J99l12J34oM8j47K36j38L5Jm8n1
$$ -263 23 -82 112 43 37 -228 -118 160 -176 184 257 -101 98 -214 -80 -86 -38 -185 51 -87 -52 -51 -99 -150
7160a50P5J68j29K69j99L03l5p5k67J45q3k3j51J56L2R7l4o7n3N0j46J72K2k34
$$ -150 -75 93 -36 233 34 337 302 227 -40 105 22 -1 -152 4 36 133 99 32 -21 29 -117 55 77 -157
7184a57N6K79j10K46m54K49q8k05JJ36L6L0J64k17J4K4k7P0J2m2K60j01j08m36
$$ -157 -101 178 68 314 -140 109 21 -184 -183 -47 -11 19 183 -34 -20 4 -23 47 59 17 277 176 68 -368
7208c68M66j88m0J55J72k01r4j6J65r4n1q5p9K31j25L04l34L07j21k3J84j23J21
$$ -368 98 -90 -130 25 197 -4 -98 -114 51 -43 -94 -179 -258 -27 -152 152 -182 125 4 -19 165 42 163
7231A63k70j13K26OJ0M6J95k16P5o7j19mM7j13J85R0K7k66N3J14j8J56j48j03
$$ 163 -107 -220 6 12 22 68 263 47 122 55 -64 -68 -21 -134 51 141 168 -98 -45 69 51 207 59 -44
7255d4k4j50J20J38J98j44j11K82m55J39J83k13J27k58J00K71j80j88L9K32j17
$$ -44 -68 -218 -98 40 238 94 -17 265 -190 -51 132 -81 46 -212 -112 159 -21 -209 -170 62 -55
7276e5R2j3O6Mr8J60k34M2J71k43L99k61o5k9K7NJ3J53j40R1J30j29o0l58L87
$$ -55 37 24 90 94 -4 156 -78 -36 135 -108 291 30 -35 -64 -37 -32 -19 134 -6 85 215 86 26 -332 55
7301E5j67R8j35J17O8k43N06k85j1k05O2P2p9J20J77P0j47J15k68K01k37J69J05
$$ 55 -112 -14 -149 -32 36 -207 299 14 3 -202 -140 -68 -147 -27 150 220 73 188 -80 121 -116 53 158
7324A58j51j01K23k26N0Q7jJ8j51J22k10K61j67J20J64m09K67K5%l0j78M2J74
$$ 158 7 -94 129 -97 -47 40 39 57 -94 28 -182 79 -88 32 196 -213 54 79 79 49 -129 -87 87
7347H7p7j56J8j5J86M1l0q0K9P0l45L95m1lj71L11k74J00J15j70k37K25K17k10
$$ 87 10 -146 -128 -143 43 84 54 -26 3 73 -272 123 82 79 -92 219 -55 45 160 -10 -247 -22 195 -15
7371a5m7j50L94Q7l01j05K01J99j81m15J75n3K53l9j22K83k45J86k81L14Rj33
$$ -15 -62 -212 182 269 -32 -137 64 263 82 -333 -158 -211 42 3 -119 164 -81 105 -176 138 147 14
7393A4J73j39k7n9J20J32o2k09R0k26L04j70j08R6P0n1K67p4n5j10R9j31K71m18
$$ 14 187 48 21 -38 82 214 152 -57 33 -193 111 -59 -167 -71 -1 -52 215 141 86 -24 75 -56 215 -203
7417b03L53j27J24k51K25j4k20J47K94l96J3O6o0J11j82K06k80J1O6J90j92r3
$$ -203 150 23 147 -104 121 107 -113 34 328 -68 -55 11 -49 62 -120 86 -194 -183 -117 73 -119 -212
7439b12L64j92MQ3j15j4J72J40k94m2M6k0k10L56k35j4K63j68o1N9J46O2k49M1
$$ -212 152 -40 -36 47 -68 -82 90 230 -64 -106 -60 -80 -290 66 -169 -183 80 -88 -149 -90 56 118 -131 -90
7463i0%p9L74k13J10k39J74n4K2J08K1J73k00Q8j60J28k89J49K8mk06J14j01K50
$$ -90 -90 -169 205 -8 102 -137 37 -17 5 113 134 307 107 195 35 163 -126 23 51 47 -159 -45 -146 104
7487A04l19J53J08J07j48Oo7J42O1j28p9k79L15j43K94l28L10M8q6j45K10l9j36
$$ 104 -215 -62 46 153 5 11 -56 86 147 19 -60 -339 -24 -167 127 -201 109 157 71 -74 136 97 -39
7510c9j32K85k12m9R2K2K75k34j21j06L31j02p8j0o3N5J84N1m67K27J34j65O9
$$ -39 -171 114 -98 -147 -55 -33 242 8 -113 -219 112 10 -68 -78 -141 -86 98 149 -318 -91 43 -122 -53
7533e3J17j55J63l33K60J87j58p5J52o1J46k94N4j8Q6n3J12O1N6j12j50K12J87
$$ -53 64 -91 72 -261 -1 186 28 -47 105 44 190 -104 -50 -68 18 -35 77 138 194 82 -68 144 331
7556C31l13k47J28m2K66J2J29k08K34j68J70k91p1K28j94k43L4K73m9P9k06K10
$$ 331 18 -229 -101 -143 123 135 264 56 290 122 292 1 -70 158 -36 -279 -245 28 -21 58 -148 62
7578F2j09J31j78J59j17l12M12LN9j67j03J64j4j07J71mj17P3L0j10J18R2j93
$$ 62 -47 84 -94 65 -52 -364 48 51 110 -57 -160 4 -10 -117 54 50 -67 6 36 -74 44 136 -57
7601e7K34l33L86k76n2K43r1k51J92j55Q3R5O5q4r4J39l9J54j57O0k66N49j94
$$ -57 177 -156 230 -46 -98 145 54 -197 -5 -160 -77 18 83 -1 -95 44 5 159 2 62 -204 345 151
7624A51l70N64n6j43k8j0j03j86K14P7K7j47j2L32k54N5r1j47J36m7J04j91J35
$$ 151 -219 345 289 146 118 108 5 -181 33 110 137 -10 -22 310 56 111 20 -127 9 -38 66 -125 10
7647A0R3j89L0O4K03j83n9n9K04k8j93o1n5J79Rl0J66q9k06J2K58m3P3J2l50K57
$$ 10 103 -86 -56 8 211 28 -31 -90 114 86 -107 -168 -223 -44 -35 -65 101 12 -194 -182 76 33 106 118 -232 25
7673B5q6J14R1k71K82l16K99j58K47j83k18J20j5J19k01j4p7J09J55j81K80p0
$$ 25 -61 53 144 -127 155 -161 138 -20 227 44 -174 -54 -69 50 -151 -165 -242 -133 22 -159 121 51
7695E1J24m10O3J55J85j22J21P4k45J42l15J66r7R3Oj51J63J7M2k04L3P4M9K1
$$ 51 175 -235 -172 -17 168 46 167 241 -4 138 -177 -11 -108 -15 -9 -160 3 20 62 -142 -109 -35 14 35
7719C5r8J35k24K30m06L75K55k64m2j59J64K9L1k22K41n12M73k19J98R7j6k42
$$ 35 -63 72 -152 78 -328 47 302 38 -4 -163 1 30 61 -161 80 -432 41 -178 20 117 101 -141
7741a41N7K41j43J83k46m31N23j32Qj56L29k24K01J27l44rJ07J13r5K48j61r5
$$ -141 -84 157 14 197 -49 -480 43 -89 -81 -237 92 -132 69 196 -148 -157 -50 63 -32 216 55 -40
7763d0R3q1J27j03j00OM0J78j4l36J82j71J87l4J46L6q3J8J51j73p9J67o7j04
$$ -40 53 -28 99 -4 -104 -98 -58 120 106 -230 -48 -219 -32 -66 80 116 33 51 202 29 -50 117 50 -54
7787e4J63j45M8k64K78l1K39J2k73K81l58j8j08J85n6m3K58r3l2K93k89K1LL3
$$ -54 109 -36 12 -252 26 -5 234 246 -27 254 -104 -122 -230 -45 -101 -144 114 21 -11 282 -7 14 17 50
7811E0K13k67L0N9j82J27k54L98l70Q6Q7k53L41N8j43r1j59K2K52O1k0j30J38
$$ 50 263 -4 26 85 -97 30 -224 174 -196 -110 -23 -276 65 123 -20 -111 -270 -248 4 65 45 -85 53
7834E3J04j79J50Rr3r5J11K49m05K07J27j80j3r5J91l42N0r5K02J02j06M7K5N
$$ 53 157 -22 128 137 44 -51 60 309 -96 111 238 58 45 -50 141 -201 -151 -246 -44 58 -48 -1 24 29
7858B9J38j71j08L8J38P3R1k57J03P4M1k06j19J64J37l55R7K08j72J64k09L00
$$ 29 167 -4 -112 -74 64 137 228 -29 74 148 189 -17 -136 28 165 -190 -93 115 -57 107 -102 198
7880A98k91P8k7n5L29k52L3l12K42j03J23J59P8r8J6j8J18l04k8M2O6J83k91k7
$$ 198 -93 -15 -42 -97 232 -20 13 -299 -57 -160 -37 122 200 102 118 100 218 -86 -114 -72 -6 177 -114 -141
7904a41M0j21K28l3j9J40rk77J74K45j11l30K26M8J0K5k43O5J54j34J46j39k0
$$ -141 -101 -222 6 -27 -46 94 85 -192 -18 227 116 -214 12 60 70 95 -148 -83 71 -63 83 -56 -76
7927g6j09M5J22Nr6K85J27l31n3o4K24q4K85l81KL50j09l44K19q8J39k71K41J77
$$ -76 -185 -140 -18 -13 -109 176 303 -28 -81 -145 79 -5 280 -101 -99 251 142 -202 17 -71 68 -203 38 215
7951B15k17K2jo2k3lj46J61l0K29j37j1j01j4K35j97J44q0r3N08l89O7O1k44O3
$$ 215 -2 20 19 -43 -66 -69 -215 -54 -84 145 8 -3 -104 -118 117 -80 64 -16 -109 399 10 77 138 -106 -43
7976d3k12M72j04l19Q6J08P5j34K01n53J84J24J52j79J70j14K03j21N2l4l3J12
$$ -43 -255 217 113 -206 -120 -12 63 -71 130 -423 -239 -115 37 -142 28 -86 117 -4 48 14 -19 93
7998I3j52m2L96k14p0k77K29O8qR8j1k73P5J56k28K0J67J10r8J41k1j24k33K55
$$ 93 -59 -101 295 81 11 -266 -37 31 23 121 110 -163 -88 68 -160 -140 27 137 39 180 159 35 -198 57
8022E7q1J6P2k58O7P4j57J10Q5o4O5j58M7J19k0m2L1P0j43J78J0j34nK49k22O2
$$ 57 -24 -8 64 -194 -127 -53 -210 -100 -15 -79 -14 -172 -125 -6 -26 -68 -37 33 -110 68 78 -56 -61 188 -34 28
8048B8Q7k79L35j26J40j82J36O6k24r3o2J51M2n8K18q0l54Q8J27j67J21j09K36
$$ 28 115 -164 171 45 185 3 139 205 -19 -112 -174 -23 19 -39 179 99 -255 -167 -40 -207 -86 -195 41
8071D1j3j1j50L39j62q0p2O8JJ5P8j90J66nj01l6J15j70p7L67j4q8j57K13j42
$$ 41 28 17 -133 206 44 -36 -108 -40 -39 -24 54 -136 30 25 -76 -112 3 -167 -244 123 109 21 -136 77 -65
8096f5Kj17J44J82j32k1k9Rj67K67J6j54J0l9K91p9r0M9j95L77k85j08J89oj50
$$ -65 -63 -180 -36 146 14 -7 -36 -27 -194 73 89 -65 -55 -94 197 118 28 77 -118 259 -26 -134 55 49 -101
8121a01j31J74J78jk35m4K29m5k60L00J69m41L22j60l8J19j49J4K49J40j47j41
$$ -101 -232 -58 120 119 -116 -160 69 24 -236 64 233 -208 114 -46 -84 35 -114 -100 149 289 142 1
8143AP7k63J29Q3q2n5J93m3j4m9R9m7l04K81q1N5l9K15l06O2J36k66J98qMJ33
$$ 1 78 -185 -56 27 -55 -110 83 40 26 -23 76 29 -275 6 -75 -20 -59 156 -150 -88 48 -218 -20 -28 -24 109
8169A09r7J63j95Q4j01j59K31L5M5O5j39n6j80L44J66k89p3K22q8o0j06p8
$$ 109 12 175 -20 64 -37 -196 35 70 115 180 41 -15 -195 149 315 26 -47 175 87 27 -79 -157
8191a57
$$ Imaginary data points
##PAGE= N=2
##DATA TABLE= (X++(I..I)), XYDATA
0@%%%%%%%%%%%%%Qj6J6j6J6k4L2l2M0m8N6o6P4q8J04j20J36j54J78k03K29k59
$$ 0 0 0 0 0 0 0 0 0 0 0 0 0 0 8 -8 8 -8 8 -16 16 -16 24 -24 32 -34 40 -48 56 -64 72 -82 96 -107 122 -137
35a37K91l28L68m11M58n09N65o26O94p67Q48r37J031j136J253j380J520j674J848
$$ -137 154 -174 194 -217 241 -268 297 -329 365 -402 446 -491 540 -596 657 -723 797 -877 971
54I71k042K257k502K785l114L499l959M519n219O121p329R039j1662J6196k6126
$$ 971 -1071 1186 -1316 1469 -1645 1854 -2105 2414 -2805 3316 -4013 5026 -6636 9560 -16566
69a6566Q4275k6326q2498J30800j27213N7052M8356r7990Q2803k9294m3692P9726
$$ -16566 67709 41383 -41115 89685 -37528 19524 67880 -30110 52693 23399 -20293 59433
81E9433p4464K5490L5246o1542M1186o146l6764M6274k3955j1212L3254l0109
$$ 59433 -15031 10459 45705 -15837 25349 19203 -17561 28713 4758 -6454 26800 -3309
93c309j382K9567m0033J4626J7901l8228L8258j0848l2423N0039m1697O818L9150
$$ -3309 -4691 24876 -15157 -531 17370 -20858 17400 6552 -25871 24168 -17529 -10711 28439
106B8439o1313M3037R6m6898O1743m0610l260M7556o0246L4912O341m4530N2981
$$ 28439 -32874 10163 10259 -36639 25104 -15506 -18766 28790 -31456 3456 9797 -34733 18248
119A8248k6884j0063L8149m1181J8528J0790l2019L2053r075j4439K6411k1509
$$ 18248 -8636 -18699 19450 -21731 -3203 7587 -24432 7621 -1454 -15893 10518 -10991
131a0991o67K0614k1168Q103J1610k3260J6597K755k1254K6560j2490r378K7998
$$ -10991 -11658 8956 -12212 -4109 7501 -15759 838 3593 -17661 8899 -3591 -12969 15029
144A5029k8968R901J5712l2536L0484p131k0022L5727l0156N297K2681l5613K8004
$$ 15029 -13939 -4038 11674 -20862 9622 2491 -17531 18196 -11960 -6663 16018 -19595 8409
157H409j848k3638L2541k3634K03K3366k8769J7600K734k1124K4737j2319o664
$$ 8409 6561 -17077 15464 -8170 -7967 15399 -13370 4230 6964 -14160 10577 -1742 -8406
170h406K0324j9096N849R843j8888J3303J493j3785J6985p631p863J7601j5703
$$ -8406 11918 -7178 -1329 8514 -10374 2929 4422 -9363 7622 -9 -7872 9729 -5974
183e974K303J3109j9341J3804J506j7211K0906j1625m394K0157k2568J0064Q058
$$ -5974 -3671 9438 -9903 3901 5407 -11804 9102 -2523 -6917 13240 -9328 736 8794
196H794k1309K1692p419j0495K1554j8853N036J1569k0453J6246j160j2872J8886
$$ 8794 -12515 9177 1758 -8737 12817 -6036 -1000 10569 -9884 6362 5202 -7670 11216
209A1216j2834j660J4250j6325Q767M951j4915J4691m938q502J5831j1098l21
$$ 11216 -1618 -3278 10972 -5353 3414 8365 -6550 8141 3203 -5299 10532 -566 -887
222h87J1697j5805Q222M579j3872J5349o653p424J5404j4142L143J0067j6835
$$ -887 10810 -4995 3227 7806 -6066 9283 2630 -4794 10610 -3532 -389 9678 -7157
235g157J2823m90j2982J7208j1378k327J3968j6249Q112M214j5045J4264m608
$$ -7157 5666 5176 -7806 9402 -1976 -4303 9665 -6584 1528 5742 -9303 4961 353
248C53p732J4920j2749J619R025j4975J0730Q41j1341J3974q257m222J3123j2832
$$ 353 -7379 7541 -5208 -3589 5436 -9539 1191 2032 -9309 4665 -3592 -7814 5309 -7523
262g523M498P348j4189J1111j495r755J4767r677j052J1482j3972P283L592j2281
$$ -7523 -3025 4323 -9866 1245 -250 -10005 4762 -4915 -5967 5515 -8457 -1174 2418 -9863
276i863J3311m072o530J3413j1768J821R027j2855R527P79j0245J3008p066l358
$$ -9863 3448 -624 -7154 6259 -5509 -3688 5339 -7516 2011 2790 -7455 5553 -1513 -4871
290d871J1877j1440M695N823j2248J0477j589p880J2769q563m05R396j2456O483
$$ -4871 7006 -4434 261 6084 -6164 4313 2724 -5156 7613 -950 -1355 8041 -4415 2068
304B068L616j0739J1595m172n826J1528j0653K020P477j1407Q580j00q737J0830
$$ 2068 5684 -5055 6540 2368 -3458 8070 -2583 -563 6914 -4493 4087 3987 -4750 6080
318F080o807j975R774j0517M222M111j0435R269k220o603J0660p528k38P672j0601
$$ 6080 -727 -2702 7072 -3445 777 4888 -5547 3722 1502 -5101 5559 -1969 -2207 5465 -5136
333e136N350K428q047R117l850m892R521q492K071O430j0276P772n43p448R942
$$ -5136 214 2642 -5405 3712 -138 -5030 4491 -4001 -1930 4500 -5776 1996 1453 -5995 3947
348C947o020j445Q390r317M228L341r035Q992k922m185R197p714J117N614q848
$$ 3947 -2073 -3518 4872 -4445 -217 3124 -5911 3081 159 -4026 5171 -2543 -1426 4188 -4660
363d660O463J307o823Q492m808l301Q367p341K817M266q608O765j047n569Q719
$$ -4660 1803 3110 -3713 4779 -29 -3330 5037 -2304 513 4779 -3829 2936 1889 -3680 5039
378E039n533p23O704q693M406K239p609Q016l147l497P449p208J632M464p901
$$ 5039 -494 -1217 5487 -3206 1200 3439 -4170 3846 699 -2798 4651 -2557 -925 3539 -4362
393d362O302j76o030P470n104j196O913p693L619K000p037O578k188l641P688
$$ -4362 1940 1764 -4266 3204 -1900 -3096 3817 -3876 -257 1743 -5294 1284 -904 -4545 3143
408C143o101J84N055p573M962Q68n640P047m058j561O435o992K568L329o273O026
$$ 3143 -2958 -2774 2281 -5292 -330 538 -5102 1945 -2113 -3674 2761 -4231 -1663 1666 -4607 1419
424A419j292m644P363n308L68N627p652M831J198o042P343l229k497O984o356
$$ 1419 127 -4517 2846 -2462 -2094 3533 -4119 712 1910 -4132 3211 -18 -2515 4469 -1887
439a887J822M050p263O135p34m938P300m464l73N304o854L737K051o411O840k597
$$ -1887 -65 3985 -3278 2857 2123 -2815 4485 21 -352 4952 -1902 1835 3886 -2525 4315 1718
455A718l872P315n737O18M648o999M343R57n696O609l479k045O552o975K172L664
$$ 1718 -2154 5161 -576 42 4690 -2309 2034 2991 -2705 3904 425 -1620 4932 -2043 129 3793
471C793p295N991j117m997P616n344p53O112p807M095K173o974O757k918k872
$$ 3793 -3502 2489 1372 -3625 3991 -1353 -2106 4006 -3801 294 2467 -4507 2250 -668 -3540
486c540P088o810J999L754p196N509j98m966O840m381r34N659o339K913K378n897
$$ -3540 3548 -3262 -1263 2491 -4705 804 606 -4360 2480 -1901 -2835 2824 -3515 -602 1776 -4121
502d121N469r58l970O107m102l59M919n989L399J529n715O057j727l180O608n848
$$ -4121 1348 390 -3580 2527 -1575 -1934 2985 -3004 395 1924 -3791 2266 539 -2641 3967 -1881
518a881R16M826p177M853Q65n759P365m032j750O340o863L154K692o923O384k208
$$ -1881 -965 3861 -3316 1537 2402 -3357 4008 -24 -1774 4566 -2297 857 3549 -3374 3010 802
534H02l094O665n760J174L923o494M350K73m912O244l235j316M185n214K323K191
$$ 802 -2292 4373 -1387 -213 3710 -2784 1566 1839 -3073 3171 -64 -1380 2805 -2409 -86 2105
550B105m948L961m73l813N294l244j299M503m769J943K473n837M819q69l537O294
$$ 2105 -2843 1118 645 -3168 2126 -1118 -2417 2086 -2683 -740 1733 -4104 715 -154 -3691 2603
566B603m788k68M878o289M111O01n255O620l511j781N663n842K688K504n500N238
$$ 2603 -2185 -2453 2425 -3864 247 848 -4407 2213 -1298 -3079 2584 -3258 -570 1934 -3566 1672
582A672j637k677N079l803N44L307m525L010O26l399L810j430j580L912l111M25
$$ 1672 35 -2642 2437 -1366 -822 2485 -2040 970 1596 -1803 2007 577 -1003 2909 -202 223
598B23K844m474L002P85l781M389j756k570N119m622J370L244n887M978j234l556
$$ 223 3067 -1407 1595 2380 -1401 2988 1232 -1338 3781 -841 529 3773 -2114 2864 1630 -1926
614a926N648m696N69L902n714L802l89l487N324l659m66L844m987K512J039l889
$$ -1926 3722 -974 -405 3497 -2217 1585 1196 -2291 3033 -626 -1092 2752 -2235 277 1316 -2573
630b573L750j346j766L356l115K53K364k960J707J024l419K813m95k538M076k728
$$ -2573 1177 -169 -1935 1421 -1694 -1441 923 -2037 -330 694 -2725 88 -407 -2945 1131 -1597
646a597j39L582m785K452R27m115N346k323j755M895n007J942K484n281M979j090
$$ -1597 -1736 1846 -2939 -487 440 -3675 1671 -652 -2407 2488 -2519 -577 1907 -3374 1605 515
662E15k800N036m537J347K850m569L731o3l434M230k299l62K878l135J435J169
$$ 515 -2285 2751 -1786 -439 2411 -2158 1573 1510 -1924 2306 7 -355 2523 -612 823 1992
678A992l233K684k61k297L643j843j414L387l419J135K199m172L167k79k944M209
$$ 1992 -1241 1443 1182 -1115 2528 685 -729 2658 -761 374 2573 -1599 1568 1289 -1655 2554
694B554k834o94L902m932K626Q73m084M442k446j255M270m517J604J961m560L887
$$ 2554 -280 -974 2928 -2004 622 1495 -2589 1853 -593 -1848 2422 -2095 -491 1470 -3090 797
710G97r30k514M243l369K19K765l647K069Q01k954K732q10j396L007k450L8K522
$$ 797 -133 -2647 1596 -1773 -1554 1211 -2436 -367 434 -2520 212 -598 -1994 1013 -1437 -1399 1123
727A123l248K162P68l412L554p88k115L809k901M68K251l871K914M38l123M299
$$ 1123 -2125 37 805 -2607 947 159 -1956 1853 -1048 -580 1671 -2200 714 1152 -1971 2328
743B328k335o98L382m056K182R26l224L594j274j633L415k957O22J828l110K341
$$ 2328 -7 -705 2677 -1379 803 1729 -1495 2099 825 -808 2607 -350 272 2100 -1010 1331
759A331J59k560L253j586r88K663k645P22J134k502K084J02k425K829k008o40
$$ 1331 1490 -1070 2183 597 -391 2272 -373 349 1483 -1019 1065 1167 -1258 1571 -437 -1077
775a077K557k382O64J571l073K480o45j916L278k697K66J984l076J914J78k129
$$ -1077 1480 -902 -238 1333 -1740 740 95 -1821 1457 -1240 -974 1010 -2066 -152 26 -2103
791b103K911j591q44K341k346J050J337k560J780j22j781K690j784K69J741k404
$$ -2103 808 -783 -1627 714 -1632 -582 755 -1805 -25 -147 -1928 762 -1022 -753 988 -1416
807a416J459L51j888K497r61r85K233j946M80J327k171J959p2j619K411j613l07
$$ -1416 43 394 -1494 1003 42 -943 1290 -656 -176 1151 -1020 939 867 -752 1659 46 -261
824b61J791j908J165Q69k291J989p39j049K122j512J45J378k339J453L00j635
$$ -261 1530 -378 787 1656 -635 1354 615 -434 1688 176 321 1699 -640 813 1113 -522
840e22K267j351r24K086k216J131K09j568J781n05j255K018j945K71J212j827
$$ -522 1745 394 -530 1556 -660 471 680 -888 893 388 -867 1151 -794 -523 689 -1138
856a138J378J64j858J845j050l67J802j950L54R63j697J336j1j151J615j220j78
$$ -1138 240 404 -1454 391 -659 -1026 776 -1174 -820 143 -1554 -218 -229 -1380 235 -985 -1163
873a163J554j843J223M13j860K098p19r01J827j632M75J499k202J659n3j835K531
$$ -1163 391 -1452 -229 184 -1676 422 -297 -1198 629 -1003 -528 971 -1231 428 375 -1460 1071
890A071j485o1J671k063J030O20j606K342j001q05J585j614L13J167j518J062
$$ 1071 -414 -475 1196 -867 163 783 -823 1519 518 -287 1298 -316 -3 1164 -354 708
906G08K99j397J874j266m48J872j605O07P78j833J332n77p68J612j049j0J082
$$ 708 1007 -390 1484 218 -230 1642 37 644 1422 -411 921 344 -424 1188 139 129 1211
923A211j915Q44O35j945K057q14r79J721j744L95R05k074K207l22j594J591j243
$$ 1211 -704 140 775 -1170 887 73 -906 815 -929 -534 371 -1703 504 182 -1412 179 -1064
940a064j10K025j939J024J16k031K074o11o05J633j527K21Q48j240R04L12j099
$$ -1064 -1174 851 -1088 -64 52 -1979 95 -516 -1121 512 -1015 -794 54 -1186 -282 30 -1069
957a069J550p84n52J444j310N57J092j790J137j4p82J317m73q08J993j889P83
$$ -1069 481 -303 -855 589 -721 -164 928 -862 275 261 -521 796 323 -485 1508 -381 402
974D02R36k068J785l21q04J570j403r4J539k025J636j27j461J737j021m07J385
$$ 402 1338 -730 1055 734 -70 1500 97 3 1542 -483 1153 1026 -435 1302 281 -126 1259
991A259j645Q82M33j227R57m39n70J085n80o1P12j492O77J89r35J085k97o78J034
$$ 1259 -386 496 929 -298 659 220 -350 735 155 94 806 -686 -9 180 -755 330 33 -645 389
1010C89r05j3P09j052P89q7j138J488q90k32J337j704J098M58j503J179k87p69
$$ 389 -516 -529 180 -872 -83 -170 -1308 180 -710 -942 395 -1309 -211 247 -1256 -77 -364 -1133
1028a133J579j173L00M54j342J575k80p28J300j007J64P69o74M51O03r66O35k69
$$ -1133 446 -727 -427 27 -1315 260 -20 -748 552 -455 -291 478 -196 255 858 -108 527 258
1046B58o47J257q06J27R62j162L79O02j212J286l77p95J344j260M82M65j551J271
$$ 258 -389 868 62 189 1151 -11 368 970 -242 1044 667 -128 1216 -44 438 903 -648 623
1064F23j69o15J457j206l21J173j369J020j23j181J437r04j28R42j413Q22M86
$$ 623 454 -161 1296 90 -231 942 -427 593 470 -711 726 -178 -306 636 -777 45 531
1081E31j496J176p12m48J037o73m2R55j397O78L08j291J436m86m64P80o54k52
$$ 531 -965 211 -501 -949 88 -585 -627 328 -1069 -391 -83 -1374 62 -424 -888 -108 -762 -1014
1099a014J254j498J104J25j583J666o61k67J206j091L02R11j653J619j16j292
$$ -1014 240 -1258 -154 -29 -1612 54 -607 -874 332 -759 -457 454 -1199 420 304 -988
1115i88J830j211j99J709j988J465Oj220J469q33l66J606j539N20Q91j456Q72
$$ -988 842 -369 -568 1141 -847 618 624 -596 873 40 -326 1280 -259 261 1152 -304 568
1132E68M0q05J341q18j13Q72j026j56J002j111J142j29j197J454j004k79J148
$$ 568 608 -197 1144 326 213 1085 59 -97 905 -206 936 807 -390 1064 60 -219 929
1149I29j334N58O98j813J492k35r65J517j101M9Q14j793J101J35j136J281p67
$$ 929 -405 153 851 -962 530 295 -670 847 -254 -205 609 -1184 -83 52 -1084 197 -570
1166e70l00J228j526Q62M50j585J422k94o87J196r42L6J258j416P62J27q79P73
$$ -570 -870 358 -1168 -306 144 -1441 -19 -313 -1000 196 -746 -710 548 -868 -106 21 -858 -85
1184h5p2n92J543j319P0J184j439P78M91j092J078l52p88J621r69j24J130j351
$$ -85 -157 -749 794 -525 -455 729 -710 68 559 -533 545 193 -595 1026 57 -67 1063 -288
1202b88J042j00q58J357q13j23R05j114N07L23j337J327n84k82J325j361J60N17
$$ -288 754 654 -204 1153 340 217 1122 8 515 838 -499 828 244 -38 1287 -74 86 603
1220F03q40N49L14r79Q94o98k05Q62q54K60N22j185R49l11q41J008o83J33P02
$$ 603 -237 312 626 -353 541 -157 -362 500 -354 -94 428 -757 192 -119 -960 48 -635 -502 200
1239B00q54N11L09j050R68n56m15J143j281M54O08j187R54N0q46J312q86J08M89
$$ 200 -654 -143 166 -884 84 -472 -887 256 -1025 -571 37 -1150 -196 -146 -992 320 -566 -458 31
1258C1p39P88j29m81N12l59j4Q22p24K00P65p84J77K32m58P53l05l85J006p66
$$ 31 -708 80 -49 -530 -18 -377 -391 431 -293 -93 672 -112 65 297 -161 592 287 -98 908 142
1278A42M5O28o32K70K10q96J140n22k42P14r78M63K07n18O77l46m92J061j103
$$ 142 187 815 183 453 663 -233 907 385 143 857 -121 342 549 31 708 362 -130 931 -172
1297a72L92K53j161R43J3o95R66r00L08N40r85K90K78p33P47l17n93R65o09j50
$$ -172 220 473 -688 255 268 -427 539 -361 -53 487 -498 -208 70 -663 84 -233 -826 139 -470 -620
1317f20O38q39L76M08q61J010o77m99J132q37K09O42j007Q83Jr12J241o30o6Q99
$$ -620 18 -821 -445 -37 -898 112 -565 -1064 68 -769 -560 82 -925 -42 -41 -953 288 -342 -408 491
1337D91j108O76J09n20Q41m34k82R36p96R5N83q37M69J32n96P57j57k98Q77r47
$$ 491 -617 59 168 -352 489 55 -227 709 -87 8 591 -246 223 355 -241 516 359 61 938 -9
1357iM52J37p68R97k63l86P81n76m95R93p77J84M45q05N86p6o84O50m58Q6N96
$$ -9 443 580 -188 809 546 160 941 365 -130 863 86 270 715 -90 496 420 -264 386 -72 14 610
1378F10j145N86J44p70Q01l47o43Q77n02L67K69q35O03j37n96P99o30K32M74p83
$$ 610 -535 51 195 -575 226 -121 -764 113 -389 -22 247 -588 15 -122 -718 81 -549 -317 157 -626
1398f26L52n9k49J12N1j47P88n86N5K48m16J91M15l76J64J8m52N54j93J95L51
$$ -626 -274 -333 -582 -470 -419 -566 222 -364 -309 -61 -477 -286 129 -247 -83 -65 -517 37 -156 39 390
1419C90o98N51j33l39P05k72l08Q91p38K83J24m42N26m18J2L35k50j71M45k80
$$ 390 -308 243 110 -229 476 204 -104 787 49 332 456 14 540 122 134 469 219 48 493 213
1439B13J05l6k72L67r6q9L59l01j55K42n91M03Q3l34L28l29j2pj69L21l0m95K30
$$ 213 318 282 10 377 281 192 551 250 95 337 -254 149 232 -102 226 -103 -115 -122 -291 30 0 -495 -265
1462b65J99l80J18n5j37Q0j24K12J79k39L07m37Q5M38o35N51k56j58L53k67R8
$$ -265 -66 -446 -328 -383 -520 -440 -564 -352 -173 -412 -105 -542 -457 -19 -654 -103 -359 -517 -164 -431 -333
1483c33K73l78K69K6m55M07l1J48J86r4kN3m2J23j50J91Q8k4J61m2k54K68k6j84
$$ -333 -60 -438 -169 -143 -598 -191 -222 -74 112 18 16 69 27 150 0 191 279 255 416 374 120 388 362 178
1507A78L12k81N4M9p0J20L37p40N96o7m95L78R1k57M02n64P8J3j82M42j95k08
$$ 178 490 209 263 312 242 362 699 -41 555 488 -7 371 462 205 607 43 121 134 -48 394 199 -9
1529iL67p07L43K89p33J39l7l2M21l24j67K78j33m4J24l50K46J8j77L25l41j0
$$ -9 358 -349 -6 283 -450 -311 -348 -380 41 -283 -450 -172 -305 -349 -225 -575 -329 -311 -488 -163 -504 -514
1551e14J24n3J40O7k45M84m37k07O13l01J39M59m53J02J58l10N36l66j22M82m86
$$ -514 -390 -443 -303 -236 -481 3 -434 -641 -28 -329 -190 269 -184 -82 76 -234 302 -64 -186 296 -190
1572a90J80N90p28N99k27l16N18m88N48j26k41M80k57k88M15m17L3M60j83J74
$$ -190 -10 580 -148 451 224 -92 426 -62 486 360 119 599 342 54 469 52 85 545 362 536
1592E36q2n66M02J27n15N75k33k33L71n91L12J67o37M91o6n14O01j76l26O73p58
$$ 536 454 -112 290 417 -98 477 244 11 382 -209 103 270 -367 124 58 -456 145 -31 -357 316 -442
1613d42N73j43m41O62m55r6N45p54K14L68o76K71O7k01K70r8J91j03l65L67J42
$$ -442 131 -12 -453 209 -246 -342 203 -551 -337 31 -645 -374 -307 -508 -238 -336 -145 -248 -613 -246 -104
1634a04k41K85n6k29O44l83j10L41j16J8K86n51L97n5k51M46m08M81N9m16M63
$$ -104 -345 -60 -116 -345 299 -84 -194 147 31 49 335 -216 181 126 -125 321 -87 394 453 37 500
1655E00J22p44M79k23J47P5l06P78m32k14N3l46J48M80m30K2K06j95Q3k5K9J63
$$ 500 622 -122 357 134 281 356 50 828 396 182 235 -111 37 517 87 109 315 120 203 178 207 370
1677C70m16Q8J5m18M20N3l87K99n4k37L28l35L7L04n68K65J44l82M94n89j6O58
$$ 370 -46 42 57 -361 59 112 -275 24 -30 -267 61 -274 -237 67 -501 -236 -92 -474 20 -569 -585 73
1699G3m45L30K0o90M85j05k17K50k61L13J92l07M03o0j90K96k28k2R9p1K23N5
$$ 73 -372 -42 -22 -712 -227 -332 -549 -299 -560 -247 -55 -362 41 -19 -209 87 -141 -163 -64 -135 88 143
1721A43k27jQ0m8O55l85j86M13l00O5K00m77M98q3j83K63l20K52M7m20L77Pm60
$$ 143 -84 -85 -5 -53 602 217 31 444 144 209 409 -68 430 347 164 427 107 359 406 -14 363 370 -90
1744i0O90m88j75N25n89R4K36m98M63N0m1l3j74j20N31q19N17k7n11Q79n95j53
$$ -90 600 112 -63 462 -127 -33 203 -295 168 218 177 144 -30 -150 381 -438 79 52 -459 420 -175 -328
1766c28J90k00L9P3j42K09Rl11M33k08k81N33m09P2L67n99M31p5k15O28m64Q1
$$ -328 -138 -338 -299 -226 -368 -159 -150 -461 -28 -236 -517 16 -393 -321 46 -553 -122 -197 -412 216 -248 -167
1788a67N64n91N6O8k79M55k51L3L63n15J39N69n76M49j91R4J23j90j39J70j24
$$ -167 397 -194 -138 -70 -349 106 -145 -112 251 -264 -125 444 -132 317 126 220 343 153 14 184 60
1809F0M57l04n5L7J91j90M07l60oj00J68p9N6l99K71J51o33O86l93j92M88n32
$$ 60 517 213 158 195 386 196 603 243 237 137 305 226 282 -117 154 305 -328 358 -35 -227 261 -271
1831b71K88K98p89L78R2k27L78m04r3K78k55J43Q3k09K18j60r8K40R3k05J59l06
$$ -271 17 315 -474 -96 -4 -231 147 -257 -350 -72 -327 -184 -101 -310 -92 -252 -350 -110 -17 -222 -63 -369
1853c69L40k60r7L01k68K18P1k09J07N3l17N46k10j60M43l53J37L20p7j33k73
$$ -369 -29 -289 -386 -85 -353 -135 -64 -273 -166 -113 -430 116 -94 -254 189 -164 -27 293 216 83 -190
1874a90K19L29l2j18K81m49J81N5k19K43p0k42O16m67j30M41l35K49J34k88J49
$$ -190 29 358 326 208 489 40 221 276 57 300 230 -12 604 137 7 448 113 362 496 208 357
1895C57o9j87n4J17L6O8k04J22J89l18j45J04P0L04k15l14k17P5j80L66j40J36
$$ 357 288 101 47 164 200 268 64 186 375 57 -88 16 86 390 175 -139 -356 -281 -461 -95 -235 -99
1917i9m5k28K94q3P1J09n16K11J7k60L50l37L36RRp9Q9j16J09L2j16J84j33j03
$$ -99 -144 -372 -78 -161 -90 19 -497 -286 -269 -529 -179 -516 -180 -171 -162 -241 -152 -268 -159 -127 -243 -59 -192 -295
1941b95P9J94j41J43L3K07k06J05jQ8j24j09J51j56N0O5K95K9Qj27m5K8p7J23
$$ -295 -216 -22 -163 -20 13 220 14 119 118 206 82 -27 124 -32 18 83 378 407 415 288 243 271 194 317
1965C17M0j34K57m40J9J32J86p3p2k28J56k8ql5J41k27J20k42p5J15k9o6R8o7
$$ 317 357 223 480 40 59 191 377 304 232 4 160 132 124 89 230 3 123 -119 -194 -79 -108 -174 -76 -143
1989a43Q1j27l5Lq9J30K1l42J2J10j23L44Q7q7J29m29qL55j88K24m9k48K18j16
$$ -143 -62 -189 -224 -221 -310 -180 -159 -501 -489 -379 -502 -158 -71 -158 -29 -458 -466 -111 -299 -75 -124 -372 -154 -270
2013b70J66K65j75ol28K78K12J15m22J65J73j15k8j46K12L0L8o6M8O1J11j13j42
$$ -270 -104 161 -14 -20 -348 -70 142 257 -165 0 173 58 30 -116 96 126 164 98 146 207 318 205 63
2036F3K08O4k47j2J45Rj10K43o9j24r9K05j80K9m1k21J55J2R3J43l37l8J63k2
$$ 63 271 335 88 76 221 230 120 363 294 170 71 276 96 125 84 -137 18 30 123 266 -71 -109 54 32
2060C2l01J18J4J79O3j49P5j71P3k32J11m9j7M0r2K02j02O1L3K8J06m76J79j20
$$ 32 -269 -151 -137 42 105 -44 31 -140 -67 -299 -188 -237 -254 -214 -306 -104 -206 -145 -112 -84 22 -454 -275 -395
2084c95q7K41J39M9n8j18MJ27K00j42j69J75j80K96J54k44M1pnK08J0o5J35k25
$$ -395 -482 -241 -102 -53 -111 -229 -225 -98 102 -40 -209 -34 -214 82 236 -8 33 26 21 229 239 174 309 84
2108H4L63k33j6P0L5k08Q2J66j72J42j28OJO4j2k2j58J06k02N4J8l2j38K51m44
$$ 84 447 214 198 268 303 95 177 343 171 313 185 191 192 256 244 222 64 170 -32 22 40 8 -130 121 -323
2133c23L44l9j59K67k57K48k42l10K56L01l46K57k06l29M47l02J4K50O6j3J13
$$ -323 21 -18 -177 90 -167 81 -161 -471 -215 86 -260 -3 -209 -538 -91 -393 -379 -129 -63 -76 37
2154C7l35J47l75L06R7j46L2L01m39M17J78p24M86j87r0J66J23J56J62j79j63
$$ 37 -298 -151 -526 -220 -123 -269 -237 64 -375 42 220 -504 -18 -205 -295 -129 -6 150 312 133 -30
2175c0J27m8K75o95O75j76j65K21Q9n1P8K8k65K56K5k45L04p2j90O4N9j12LN9
$$ -30 97 49 324 -371 304 128 -37 184 273 222 300 328 63 319 344 99 403 331 141 205 264 152 155 214
2199B14n3k32R4R7l30M03j41j12K45j37J51k06J28j47j2k49J36l4j87K97O7l28
$$ 214 161 -71 23 120 -210 193 52 -60 185 48 199 -7 121 -26 -38 -287 -151 -185 -372 -75 -8 -336
2221c36K22l32M82m04m5M48m58J75K90k96R7J18l85K72J45j52m2J15o5J02j38
$$ -336 -114 -446 36 -368 -413 35 -423 -248 42 -254 -157 -39 -424 -152 -7 -159 -201 -86 -151 -49 -187
2242a87j0L98k75K59m28J75L03l18j33K99pJ31J78j85j19q4J27J68l13J12K85
$$ -187 -197 201 -74 185 -243 -68 235 -83 -216 83 76 207 385 200 81 -3 124 292 -21 91 376
2263C76k59M4K11k58J43k75L85j39j36J72J81n13L40l2m19M26j64J58m31K48M4
$$ 376 117 161 372 114 257 -18 367 228 92 264 445 -68 272 240 -179 247 83 241 -190 58 102
2284A02o8p3O8j08j0K36n10J33m5K06J24k77q4L1P8J03r9k22K75j4j64J49j52
$$ 102 34 -39 29 -79 -89 147 -363 -230 -275 -69 55 -222 -306 -275 -197 -94 -193 -415 -140 -154 -318 -169 -321
2307c21J88K9k15J2L61l38K32j03k32M81k44J40J43l80K30J70l56L81R3j44q1
$$ -321 -133 -104 -319 -307 54 -284 -52 -155 -387 94 -150 -10 133 -247 -17 153 -203 178 271 127 46
2328D6N2M7J11j87k2l2q6K81L0j48K35k07J48Qn1J2J58l61L90k28L7p6p7K2K11
$$ 46 98 145 256 69 47 15 -71 210 240 92 327 120 268 276 225 237 395 34 424 196 233 157 80 102 313
2353C13k71L31l24m2K73m15J56J7k50n9K78j9j54j88J91K10m93M21K7m02J59J31
$$ 313 42 373 49 7 280 -135 21 38 -212 -271 7 -12 -166 -354 -163 47 -446 -25 2 -400 -241 -110
2375a10m13O15k21j16J30r9j44K92j31l5L11m50M41m66J55K66l76M64l39O3L50
$$ -110 -523 92 -129 -245 -115 -214 -358 -66 -197 -232 79 -371 70 -396 -241 25 -351 113 -226 -163 187
2396A87l21J37k6M21k26j00OJ45J3N3j8l96K37J24j39p5l0K5J40Q2l64M53k95
$$ 187 -134 3 -23 398 172 72 78 223 236 289 271 -125 112 236 97 22 -8 17 157 239 -125 328 33
2419C3K25j07j4J70J92k59J22k32P0k36J1P7K22m61J54j30J01J59j55j47r4J70
$$ 33 258 151 137 307 499 240 362 130 200 -36 -25 52 274 -187 -33 -163 -62 97 -58 -205 -299 -129
2441a29K04K0j16P5k92J00J11k70RJ84j45j04R0K46q5j24M1p4J70O5O1k06N3J11
$$ -129 75 95 -21 54 -238 -138 -27 -297 -288 -104 -249 -353 -263 -17 -102 -226 -185 -259 -89 -24 37 -169 -116 -5
2465ej62L49l63l0K14R3q6On3l6K16j28j51L51Qj14o1r0K8R5R8j48M6K36j0j72
$$ -5 -167 182 -181 -211 3 96 10 16 -37 -73 143 15 -136 215 223 109 48 -42 -14 81 179 31 77 313 303 131
2491A31K48k26J37k24K29l21J04L22j74k99J65k51J78r1L37j95r4p1jJ82l86K75
$$ 131 379 153 290 66 295 -26 78 400 226 -73 92 -159 19 -72 265 70 -24 -95 -96 86 -300 -25
2513b5j11J50j9L3k30P0L33k59k91K51p3j46ML87j15R1o0p1k00K3K9M8m4J10R6
$$ -25 -136 14 -5 28 -202 -132 201 -58 -349 -98 -171 -317 -313 74 -41 50 -10 -81 -281 -258 -229 -181 -225 -115 -19
2538a9j98K38j63k3R4k91K65J72km15K51NR8J16j88K76k26J6L48k46j18q1J69
$$ -19 -217 21 -142 -165 -71 -362 -97 75 73 -342 -91 -86 12 128 -60 216 -10 6 354 108 -10 -91 78
2561G8j87M28k30J62l53K76J60m5j7m2m2Q4l22J15k4K44m04L51p8pj08P8L7k13
$$ 78 -109 319 89 251 -102 174 334 289 272 230 188 272 -50 65 41 285 -119 232 154 147 39 117 154 -59
2585e9L2j07R8j39J35O0rk7o0j38J18J03k90J11J2r3J00J8N9r6r7l6R7p0m0JK04
$$ -59 -27 -134 -36 -175 -40 20 11 -16 -76 -214 -96 7 -283 -172 -160 -253 -153 -135 -76 -172 -269 -305 -208 -278 -318 -317 -113
2612a13J00J7j29L7J68l04J36J5k8N2L8O5k99J72N2J79k47K29j08j8j11K25M6
$$ -113 -13 4 -125 -88 80 -224 -88 -73 -101 -49 -11 54 -245 -73 -21 158 -89 140 32 14 -97 128 174
2635A74L3j00J93j92k9j9R7J7j59j05J48k57R9J91j14L60j86O2j72J82j42J0K2
$$ 174 207 107 300 108 79 60 157 174 15 -90 58 -199 -100 91 -23 337 151 213 41 223 81 91 113
2658A13p3K24m32J24j10K22p3l02M34j83k1j47L1K18q9l9k00K18L0k40K31M8o2
$$ 113 40 264 -168 -44 -154 68 -5 -307 127 -56 -77 -224 -193 25 -64 -103 -303 -85 -55 -295 -64 -16 -78
2681g8l13L06j46L26m20m9K84l04J47L07j17j2q3j33O5j74M18n5k84M23N5ql70
$$ -78 -391 -85 -231 95 -325 -374 -90 -394 -247 60 -57 -69 -152 -285 -220 -394 24 -31 -315 108 163 155 -215
2704b15M9K98j75Q9K9N7n3n8m7J67j04L7J79k2%m35L80k28J78K50l47j6L5R9l07
$$ -215 -166 132 -43 46 75 132 79 21 -26 141 37 74 253 231 231 -204 176 -52 126 376 29 13 48 147 -160
2729a60J49J67q5O1j46N6p4K54k19J08j00j44J14k13J51J55j72P5qk84N7mP8j46
$$ -160 -11 156 71 132 -14 42 -32 222 3 111 11 -133 -19 -232 -81 74 -98 -23 -31 -315 -258 -262 -184 -330
2753c30j43M39j03j18j0J98j10L07k78K03j22K00j46Q8j29J07m2Q5q2k62L70k28
$$ -330 -473 -34 -137 -255 -265 -67 -177 130 -148 55 -67 133 -13 75 -54 53 11 96 14 -248 122 -106
2775a06N3J02M4k57N27m57K82j87J26j07P3k75M22K1j31j2N4J15j92N0n9q8L50
$$ -106 -53 49 93 -164 363 -94 188 1 127 20 93 -182 240 261 130 118 172 287 95 145 86 -2 348
2798C48j88j02J24J79j26k86m6K6L98k31K4p3J3M7l73J93Pj94M33l67J32j06K1
$$ 348 160 58 182 361 235 -51 -97 -71 327 96 120 47 60 107 -266 -73 -66 -260 173 -194 -62 -168 -147
2821a47L4L8l2J0j49J43L49k75M4N7j08M6j34m6M3p2J96j01K73j76K0j2k81L16
$$ -147 -113 -75 -107 -97 -246 -103 246 -29 15 72 -36 10 -124 -170 -127 -199 -3 -104 169 -7 13 1 -280 36
2845C6l29L99L5K5n13K12L9K67r3p0J71j48L18k22j26n8K19L1J28n1q3l36M23
$$ 36 -293 106 141 166 -347 -135 -96 171 78 8 179 31 349 127 1 -57 162 193 321 270 187 -149 274
2868B74j75K11k32K13j48j54J29N5o6K02j12j11O5j28J24L4j76N1j46j63M17k45
$$ 274 99 310 78 291 143 -11 118 173 107 309 197 86 151 23 147 181 5 56 -90 -253 164 -81
2890h1K8J00m0j50Q5l26L53k50r5L04o2k0p6K98l66K1Q1L61o7j99K35m73p7J04
$$ -81 -53 47 7 -143 -58 -384 -31 -281 -376 -72 -134 -154 -230 68 -298 -277 -196 165 98 -101 134 -339 -416 -312
2914c12M11p8L8k04n3L1J30J54j01J96m40J16L76m07o8L51r8J98J06k10j9K04
$$ -312 99 21 59 -145 -198 -167 -37 117 16 212 -228 -112 264 -143 -211 140 42 240 346 136 117 321
2936C21k32m9pj0J33O9Nj85k04j4L46l06P6J33p4N4N8p9r5J07j58QJ55J03l24
$$ 321 89 40 33 23 156 225 230 45 -159 -173 173 -133 -57 76 2 56 114 35 -60 47 -111 -103 52 155 -169
2961a69P4J21n9J46Pj30k27K6j00K49P6q5r8j32M24j10m6j99J50m5J68k73L9O6
$$ -169 -95 26 -33 113 120 -10 -237 -211 -311 -62 14 -71 -169 -301 123 13 -33 -232 -82 -127 41 -232 -193 -127
2985a27j77K07J03L9k09lj21L78k57O2q9M4L7K44k42K47o5P6o2k1l4K38R7l55
$$ -127 -304 -97 6 45 -164 -167 -288 90 -167 -105 -194 -150 -113 131 -111 136 71 147 85 64 30 268 365 10
3009A0K41N9j58q3J4q1K34k7j23Q4J90l09N5k50J47K48l96J12Q5N3o0J93j45O4
$$ 10 251 310 152 69 83 2 236 209 86 170 360 51 106 -144 3 251 -145 -33 52 105 45 238 93 157
3033A57l73K72q1j43K75j61j0L73l21o2J92j30j04j74K00J05j58J9J44p2j2j29
$$ 157 -216 56 -25 -168 107 -54 -64 309 -12 -74 118 -12 -116 -290 -90 15 -143 -124 20 -52 -64 -193
3055a93O8j93O9k9J70r9J7K07k91J91j1j07Nj8QK94j77j0J48k01J15P7o8K24k82
$$ -193 -125 -318 -249 -278 -108 -207 -190 17 -274 -83 -94 -201 -196 -214 -206 88 -89 -99 49 -152 -37 40 -28 196 -86
3080h6L79P3l64R5p0K21j16j27N7K5J97k19J84k40K21j34j12L8o9M7Q4j51P5M7
$$ -86 293 366 2 97 27 248 132 5 62 87 284 65 249 9 230 96 -16 22 -47 0 84 -67 8 55
3104E5P8N0k58J13L3j15J7K61l63L4J99j41j75l9K01M3l17K31N5j1K04k91J30
$$ 55 133 183 -75 38 71 -44 -27 234 -129 -95 104 -37 -212 -251 -50 -7 -324 -93 -38 -49 155 -136 -6
3127fj38K2K34j41j95Q1K5j22K00j85M50l03r5k6K8M4j07K50l21M6K06M5K7j81
$$ -6 -144 -122 112 -29 -224 -143 -118 -240 -40 -225 225 -78 -173 -199 -171 -127 -234 16 -305 -259 -53 -8 19 -162
3151a62J80M2j8l9J86q2N6P7k57K1J04J29jj9j32j74J27R6j37L11j76k32L96k13
$$ -162 18 60 42 3 189 107 163 240 -17 4 108 237 236 217 85 -89 38 134 -3 308 132 -100 296 83
3175H3Lj33P8L0J20j83R5K28m3j46j46J14q2m7r1Q4k75J3N2j44J57j68J93K34
$$ 83 86 -47 31 61 181 -2 93 321 278 132 -14 100 18 -29 -120 -36 -311 -298 -246 -390 -233 -401 -208 26
3199B6p5J19l16o2L41j40J13l9j14j53L83j99K15l47K39k17n8J35J93q3J26j0
$$ 26 -49 70 -246 -308 33 -107 6 -33 -147 -300 83 -116 99 -248 -9 -226 -284 -149 44 -39 87 77
3221G7o6nj65J01J65k47K74j67j38O4O1j01M02j81m8M4J53j80P7q9L12j57l60
$$ 77 11 6 -159 -58 107 -140 134 -33 -171 -107 -46 -147 255 74 26 70 223 43 120 31 343 186 -174
3244a74K49Ql9j2J2J02j29m9M40l64K4j18L02l08K64k70k15M73j36R4k30K9j17
$$ -174 75 83 44 32 44 146 17 -32 408 44 68 -50 252 -56 208 -62 -277 196 60 154 -76 -47 -164
3267a64K17m6k8j59PjK81j44j15j62K47j38R6M0l1M6n7M7r4j51K47Jj47M6L0j0
$$ -164 53 7 -21 -180 -173 -174 107 -37 -152 -314 -67 -205 -109 -69 -100 -54 -111 -64 -158 -309 -62 -61 -208 -162 -132 -142
3293a42l2J10O4k19K32o6K27J3k27J64P0k92J41n1J13J5j63L26j43q3J66j38o3
$$ -142 -174 -64 0 -219 13 -53 174 187 -40 124 194 -98 43 -8 105 120 -43 283 140 57 223 85 22
3316B2K04j56q1K7j50L17m2j44J39k98M39j80j30J22q8K30j14k04K69j94J40j05
$$ 22 226 70 -11 16 -134 183 141 -3 136 -162 277 97 -33 89 1 231 117 -87 182 -12 128 23
3338B3m8J15p9j47L10j74k49L58k39k26K60r8K84R9k90l4Q5Jo4n4p6J61j2J26
$$ 23 -25 90 11 -136 174 0 -249 109 -130 -356 -96 -194 90 189 -101 -135 -50 -49 -113 -167 -243 -82 -94 32
3362C2l5J33k54P0J41l83J04J62J90p9Lo4m8j23K97j87K6K73m68N01l28j17Q7
$$ 32 -3 130 -124 -54 87 -296 -192 -30 160 81 84 20 -28 -151 146 -41 -15 258 -210 291 -37 -154 -67
3385f7K40L0q2O6N4j89m4L37l16J43P1Q0j5k81J05q4r0n9J51K4j14J69j92J23
$$ -67 173 203 121 187 241 52 8 345 29 172 243 323 308 27 132 48 -42 -101 50 74 -40 129 -63 60
3409F0K3k3j42J74j37Q9qJ03j51j45J01n0P1L4j31J27J23k07K78j65j14j94K17
$$ 60 83 60 -82 92 -45 44 36 139 -12 -157 -56 -106 -35 -1 -132 -5 118 -89 189 24 -90 -284 -67
3432f7k55M14k19J4R9j79K41k50J88j33N7j91J76N4K29k10j11J43L1q0P8j47L33
$$ -67 -322 92 -127 -113 -14 -193 48 -202 -14 -147 -90 -281 -105 -51 178 -32 -143 0 31 -49 29 -118 215
3455B15j12K41n15M13j81K75l15n3L16j49J13N7l09L80m96K7J67N9k73K63k3O7
$$ 215 103 344 -171 242 61 336 21 -32 284 135 248 305 -4 376 -120 -93 74 133 -140 123 100 167
3477A67j88L3Q0nJ3ml5LQ5k10K48O2l11J06O1m9Mk52J69M9jj04o1k4nK08p1k44
$$ 167 -21 12 92 87 100 96 61 64 149 -61 187 249 -62 44 105 56 60 -192 -23 26 25 -79 -140 -164 -169 39 -32 -276
3505b76K71r8J39o0J88m23Q1J36N9P4j93L4Ln0K2j0O6R2j85J02J15p6k5M0J30
$$ -276 -5 -103 36 -24 164 -259 -178 -42 17 91 -102 -68 -65 -115 -93 -103 -37 55 -130 -28 87 11 -14 26 156
3530A56j12P5k0J7j13J91k12J20P7j47K34n16L82j16MJ60p6N8j75K30j60L7k07
$$ 156 44 119 99 116 3 194 -18 102 179 32 266 -250 132 16 20 180 104 162 -13 217 57 94 -113
3553a13K58k82J71r7L9J88m69M25k91K0K60k3Q4K7l40L4Q0Q2l25J47K21n18M59
$$ -113 145 -137 34 -63 -24 164 -305 120 -171 -151 109 86 170 197 -143 -109 -29 53 -272 -125 96 -422 37
3576C7l26L29k19J17P8k01mK20r7j98J75j38J30l3J16rl65Q2J36K41l13K82l46
$$ 37 -289 40 -179 -62 16 -185 -189 31 -66 -264 -89 -227 -97 -130 -14 -23 -388 -306 -170 71 -242 40 -306
3599c06J45q7N41l49O4J64p0k7k12M8J71L0kJ29n6k07n4L42k97K81j38M6j17N9
$$ -306 -161 -248 293 -56 8 172 102 75 -137 -89 82 112 110 239 183 -24 -78 264 -33 248 110 156 39 98
3623I8j13j47P9J00M9P4K08l29qK12P0l51K00j12q4R2m9J5k00J89j29J18J43k17
$$ 98 -15 -162 -83 17 66 140 348 19 11 223 293 -58 142 30 -54 38 -11 4 -196 -7 -136 -18 125 -92
3647i2R0k31L38k35O8K41n3k65K16j10j1k1K66k46j63K59j72j8J48o1J26N1K32
$$ -92 -2 -233 105 -130 -62 179 126 -139 77 -33 -44 -65 201 -45 -208 51 -121 -139 9 -52 74 125 357
3670C57l46k76J63PP0n3j43R4M53n04L59j84J2L15q0k46k15L74j72J02Jr4K32
$$ 357 11 -265 -102 -95 -25 -78 -221 -127 326 -178 181 -3 9 324 244 -2 -217 157 -15 87 88 -6 226
3693B26k3j45J50j02j01p6N2j12J06K69L2r8q2N7k13J55Q2j33Q4m11K88l31K49
$$ 226 203 58 208 106 5 -71 -19 -131 -25 244 276 178 96 153 -60 95 177 44 128 -283 5 -326 -77
3716g7o9J34j8r1L04l16L4jJ38j69Q2j31J06j90k9K96N5p7k4J29l52J87N7l6j69
$$ -77 -146 -12 -30 -121 183 -133 -99 -100 38 -131 -49 -180 -74 -264 -293 3 58 -19 -43 86 -266 -79 -22 -58 -227
3741b27L77k84M8N8j71M31l07j6%K98k39n5J4J30p3j8j7J48j46J01J66ro6r2j62
$$ -227 150 -134 -86 -28 -199 232 -75 -91 -91 207 -32 -87 -73 57 -16 -34 -51 97 -49 52 218 209 143 51 -111
3766a11M4L77j31p3M4m3k7J47k6j89J13j15L7J50k93K25L3L8q6j08j18K47k26
$$ -111 -67 310 179 106 150 107 80 227 201 12 125 10 47 197 -96 129 162 200 114 6 -112 135 -91
3789i1j7Q9M6j82M12m54K27j95J77mj01j84p1L89k53J59J9J57Kk39P2j58j39N34
$$ -91 -108 -19 27 -155 257 -197 30 -165 12 8 -93 -277 -348 41 -212 -53 -34 123 125 -114 -42 -200 -339 195
3813A95k26N0k52L37j83k58K74j15N1J79k42J20J65m9q0j21l9L05m9m0k14Q7K45
$$ 195 -31 19 -233 104 -79 -337 -63 -178 -127 52 -190 -70 95 46 -34 -155 -194 111 62 22 -192 -105 140
3836A40l78M63j20j56L3J4J12O2J04j78k9J82k48Q2j19J35M3N2m0j45l9L7J03
$$ 140 -238 225 105 -51 -18 -4 108 170 274 96 67 249 1 83 -36 99 142 194 154 9 -30 7 110
3859A10mJ4L5m19J8L22k0j75M1J86J50j24j57L6J37l41L19l56j9K77p9j20j84
$$ 110 106 120 155 -264 -246 76 56 -119 -78 108 258 134 -23 13 150 -191 128 -228 -247 30 -49 -169 -353
3882c53L69j68J31j91k3P8M6L32k11O0l5K33n02N1L1P0J44p7K7n8J35Q0l43J45
$$ -353 16 -152 -21 -212 -235 -157 -111 221 10 70 35 268 -234 -183 -152 -82 62 -15 12 -46 89 169 -174 -29
3906b9K14O6o9l18J52k55J47J69N0j17j7j20O4K75%j63r9O0r3L35k49J7P6k25
$$ -29 185 251 182 -136 16 -239 -92 77 127 10 -7 -127 -63 212 212 49 -50 10 -83 252 3 20 96 -129
3930a29q6J35O8J07K4k48j22J35M1O3p1R1k0k93J31P1p3K15j71K36K9j03P7l34
$$ -129 -215 -80 -12 95 119 -129 -251 -116 -75 -12 -83 8 -12 -305 -174 -103 -176 39 -132 104 133 30 107 -227
3954b27mK24o9J1Qj7K20j75O7l29K97%p4k88K12j4K2K19k45L04R2l76J09P1j50
$$ -227 -231 -7 -76 -65 -57 -74 146 -29 38 -291 6 6 -68 -356 -144 -158 -136 83 -162 142 234 -142 -33 38 -112
3979a12L25mj44j43J39k55M58k65K7O2j76J65L7J04r6k30J30J51o3j29N5J57k00
$$ -112 213 209 65 -78 61 -194 264 -1 26 88 -88 77 114 218 122 -108 22 173 110 -19 36 193 -7
4002gK1m2J51j64J58l54J75K57k04q8J52N5J45l66L05j75L7O8l40J92j14P5k47
$$ -7 14 -28 123 -41 117 -237 -62 195 -9 -97 55 110 255 -111 194 19 56 124 -216 -24 -138 -63 -310
4025c10P4K27R3l11M04p5j01P9j41j20P0J17M7j13J19j57J77pk54M18l61J89l8
$$ -310 -236 -9 84 -227 177 102 1 80 -61 -181 -111 6 53 -60 59 -98 79 72 -182 236 -125 64 26
4048B6p0k5L03k78ql11K53J11J56m16J65J58J18k95k6J82j11K46k37K38j62R3
$$ 26 -44 -69 234 -44 -52 -363 -110 1 157 -259 -94 64 182 -113 -139 43 -68 178 -59 179 17 110
4070A10n5P3k25N3O9j81J61K5j03O6J86j47m5K17j21M8K4j34r8J44p3O2j62p1
$$ 110 55 128 -97 -44 25 -156 5 30 -73 -7 179 32 -13 204 83 131 155 21 -77 67 -6 56 -106 -177
4094a77QJ90K30l83K30j21j37pN6K29r6p9J63l69J72j30K44o8j79J79mk32Q5J34
$$ -177 -169 21 251 -132 98 -23 -160 -167 -111 118 22 -57 106 -263 -91 -221 23 -45 -224 -45 -49 -281 -196 -62
4118f2p2p0L17J8r9l66NM03j0M7j97j43J8J60j21L69j62lN6Q2j22j51P8K9j4q9
$$ -62 -134 -204 113 131 32 -334 -329 74 64 111 -86 -229 -211 -51 -172 197 35 32 88 170 48 -103 -25 4 -10 -99
4144i9r0K39J60J55j94l96L04J30k95l0J29j46J04K00k97K5M02n05J38k3K58k08
$$ -99 -189 50 210 365 171 -225 79 209 -86 -116 13 -133 -29 171 -126 -101 301 -204 -66 -89 169 -39
4166c9m9J48k5Rn8j20K00j51K41R5k16N1l7Pk53J05J56l11J61j19J36l2p6M2J03
$$ -39 -88 60 35 44 -14 -134 66 -85 156 251 35 86 49 56 -197 -92 64 -247 -86 -205 -69 -101 -177 -135 -32
4191c2O6k50N3Q9j87L18k20o1L56j5k14k27K87J83j04R9k47M76m93K89P4o0j51
$$ -32 34 -216 -163 -74 -261 57 -163 -224 132 117 -97 -324 -37 146 42 141 -106 370 -123 166 240 180 29
4214B9k07M55k30J42j05m9J65m8j23J30J22k60j9J57O6l91J34j06J62k5J48m25
$$ 29 -178 277 47 189 84 35 200 152 29 159 281 21 2 159 225 -166 -32 -138 24 -1 147 -278
4236b78M12j30J56l16K35l71J81J78j70J49j20K9K6n7O5j8Q2j08Q8j64J56k87
$$ -278 134 4 160 -156 79 -292 -111 67 -103 46 -74 -45 -19 -76 -11 -29 53 -55 33 -131 25 -262
4258b62L23j97J74Mp4j66O0J2LL40m0k96L2O0j2J54j45r6q8K23l3Q7k19O5K42
$$ -262 61 -136 38 42 -32 -198 -138 -126 -123 217 177 -119 -87 -27 -39 115 -30 -126 -214 9 -24 63 -156 -91 151
4283A51j07J10r7j6Oj50L08k06P1p8n1O3mL0J05R5j20J2o5j45J15J06j95O3J76
$$ 151 44 154 57 41 47 -103 205 -1 70 -8 -59 4 0 30 135 230 110 122 57 -88 27 133 -62 1 177
4308A77l11Q1j36L40k59L8Q6k40O0L3K78k78k4J56K09k65J33n4j35L39k82j30
$$ 177 -134 -53 -189 151 -108 -70 16 -224 -164 -131 147 -131 -155 1 210 -55 78 24 -111 228 -54 -184
4330a84K4L46l12j5L15p6m0j64J00l6O6j59p7J08R8j66P6K15q0J24l06J75M1l2
$$ -184 -160 186 -126 -141 174 98 58 -106 -6 -42 24 -135 -212 -104 -6 -172 -96 119 39 163 -143 32 73 41
4354D1m25M77N7j02pk29J62R4j38J28r9K3J02o1j83J04M6O5M0k3P7j09JL7J6J47
$$ 41 -384 93 150 48 41 -188 -26 68 -70 58 -41 -18 84 23 -160 -56 -10 55 95 72 149 40 41 78 94 241
4380B41l12j18L37j62j00J92p5j5R7k16J96O3Nj79K90m03K12k91K30o5J17J01
$$ 241 -71 -189 148 -14 -114 78 3 -12 85 -131 65 128 133 -46 244 -159 53 -238 -8 -73 44 145
4402A45l28m2J79j65K95k30K22J44l04J20j12J78j14k53K24k30M23j60R4po1r
$$ 145 -183 -225 -46 -211 84 -146 76 220 -84 36 -76 102 -12 -265 -41 -271 152 -8 86 79 18 9
4424IM1q2j4M7j79N7J14r4J01n7p7J95j23K87k26q3L44j20k38k9K05R0j90R9k1
$$ 9 50 -32 -46 1 -178 -121 -7 -101 0 -57 -134 61 -62 225 -1 -84 260 140 -98 -127 78 168 -22 77 56
4449E6r2J72j56J00J2K97j16j83R0m17J72K77Jn6j09j20J78O8r9m3K07j26l21
$$ 56 -36 136 -20 80 92 389 273 90 180 -237 -65 212 213 157 48 -72 106 174 75 32 239 113 -208
4472b08K55k37p2J16J72k45K0J48p6L90l08N3j31L3J12m3p7r1l2K73J31k45m2
$$ -208 47 -190 -262 -146 26 -219 -199 -51 -127 263 -45 8 -123 -90 22 -21 -98 -189 -221 52 183 -62 -104
4495a04J34N4O7k99N8N4Q1R0j08k0K16j72r0j4R3K6Q2j72K13j82nO5o7L3L1j46
$$ -104 30 84 151 -148 -90 -36 45 135 27 7 223 51 -39 -53 40 66 148 -24 189 7 2 67 0 33 64 -82
4521h2J50K7r7q8K06L1N3n8j85K93q9k08J14q5J09o1QJ43o7j25o8j8J06o4K26
$$ -82 68 95 -2 -90 116 147 200 142 -43 250 161 -47 67 -18 91 30 38 181 114 -11 -79 -97 9 -55 171
4546A71j54o0Q2j46Pr5J25N5k10J11J10j77J9M64l88p0J07k01K76L3l24M5R1J56
$$ 171 17 -43 39 -107 -100 -195 -70 -15 -225 -114 -4 -181 -162 302 -86 -156 -49 -250 26 59 -265 -220 -129 27
4570B7L5p5o0j7K8r5J05L13l01J65oj78K7k9P4OR3q0j22J33L5j47N4M4m7M2N7
$$ 27 62 -13 -73 -90 -62 -157 -52 261 -40 125 119 -59 -32 -61 13 19 112 32 -90 43 78 -69 -15 29 -18 24 81
4597H1k28L42k23j32K44K9j88J17j08J47M9k76J96Q0j92j09J11m1o8J45j40J54
$$ 81 -147 195 -28 -160 84 113 -75 42 -66 81 130 -146 50 130 -62 -171 -60 -101 -169 -24 -164 -10
4619a0j22J7j73K6K4K99j1k06J49r6K5RK2K20k21J75M3q3k07J45K9k8j15j24L47
$$ -10 -132 -115 -288 -262 -238 61 50 -156 -7 -103 -78 -69 -47 173 -48 127 170 87 -120 25 54 26 -89 -213 134
4644A34j14l90L80k71J85J6J54l0j1J0O3k34J98O3J50m69P2K24m5j38j22K69l3
$$ 134 20 -370 10 -261 -76 -60 94 64 53 63 126 -108 90 153 303 -166 -94 130 85 -53 -175 94 61
4667F1j01k1J01k2J85r5q6O9ol7q3J98o6j66J67l49M87p2r3r5K19j83J29j80n
$$ 61 -40 -61 40 18 203 108 22 91 85 48 -35 163 97 -69 98 -251 236 164 71 -24 195 12 141 -39 -44
4692d4K0k10J79J02m4R0J55m57K36J90l28K7jK84m3j24k73J56J46k11M4M8J62
$$ -44 -24 -234 -55 47 3 93 248 -209 27 217 -111 -84 -85 199 156 32 -241 -85 61 -150 -106 -58 104
4715A04j22J00j08k91M12k24q3K12K4k46J31n0J74l2Q4p1O2J07l37J95R8k0k28
$$ 104 -18 82 -26 -317 95 -129 -212 0 24 -222 -91 -141 33 1 85 14 76 183 -154 41 139 119 -109
4738a09K52j17L8J60l47R4K21k36K90l34K4J32p3J54o5Q2j61N9j31n9J72j73L60
$$ -109 143 26 64 224 -123 -29 192 -44 246 -88 -64 68 -5 149 84 166 5 64 -67 -126 46 -127 233
4761B33j68P5j93K08j86L9l3J0J38l60M42l30L24N8k75L6j58J59j04r4K39l30
$$ 233 65 140 -53 155 -31 8 -25 -15 123 -237 205 -125 199 257 -18 18 -140 19 -85 -179 60 -270
4783b70K08o8K12O3k81L99l08J64k38k30L76J07k62K11Pm2j73J39j10J87n1j63
$$ -270 -62 -130 82 145 -136 263 -45 119 -119 -349 27 134 -128 83 90 48 -125 14 -96 91 40 -123
4805a23r8J82O9J08oj99k6J81K5O2j33%j82j81N74k95j50K92P6j29j09n1N5O5
$$ -123 -221 -39 30 138 132 -67 -93 88 113 175 42 42 -140 -321 253 -42 -192 100 176 47 -62 -113 -58 7
4829Gn0Q6K39j53j30M0mk49L54k18K17j8l73L35q9kK72j87j42j29L18k14m0J15
$$ 7 -43 43 282 129 -1 39 35 -214 140 -78 139 121 -252 83 -6 -8 264 77 -65 -194 124 -90 -130 -15
4853a5jr6J32q2J49q0P8j36J35k09r5L41O2j83o6J44M6k75o7Q5J57j00R2M3l3
$$ -15 -16 -112 20 -62 87 7 85 -51 84 -125 -220 121 183 0 -66 78 124 -151 -218 -133 24 -76 16 59 26
4878B6j75J91j32P5j84J60J15L8J31l28J75p2k98J13K43l29J50J52J08J8j13j13
$$ 26 -149 42 -90 -15 -199 -39 76 114 245 -83 92 20 -278 -165 78 -251 -101 51 159 177 64 -49
4900d9J39p9n5R7l98O95k73k07J74J1k36K87L5On9o8J51q0l24J09J57J5k66K58
$$ -49 90 11 -44 53 -345 350 77 -130 44 55 -181 106 141 147 88 20 171 91 -233 -124 33 48 -218 40
4924D0j14r1J94k20n3L56k06J9J42j99N8K08l03J71M7p9K4k26m7L54n3k49J69
$$ 40 -74 -165 29 -191 -244 112 -94 -75 67 -132 -74 134 -169 2 49 -30 -6 -232 -279 75 22 -227 -58
4947e8QP0q7M5q8L29l64J83L6m2J24j47J47O9q2l95K50k9Q6J09J09pl41Q5n8l8
$$ -58 -50 20 -67 -22 -110 219 -145 38 74 32 156 9 156 225 143 -252 -2 -31 55 164 273 266 -75 10 -48 -86
4973h6L75j19l6j93J79j4j30K0J50l14L88K7k40LQ6k5p7m6K8J15r3q2J38k58P1
$$ -86 289 170 134 -59 120 106 -24 -4 146 -168 220 247 7 10 96 71 -6 -52 -24 91 -2 -84 54 -204 -133
4998a33L2L14j77j63r6K52j10J14J52%j73o4J46j78M8j6J32k10J33J76k51R4M2
$$ -133 -101 213 36 -127 -223 29 -81 33 185 185 12 -52 94 -84 -36 -52 80 -130 3 179 -72 22 64
5021F4n0P8k90J07R2Q1L4k90j43K22j00J5K6l9K1L04j23k60j1K69m9j44J85j44
$$ 64 14 92 -198 -91 1 82 116 -174 -317 -95 -195 -180 -154 -193 -172 132 9 -251 -262 7 -42 -186 -1 -145
5045a45M21m38L30j51j14j56L32M1Q7j56k8j56M7K44k52P1O7J66j11M2j75K8k7
$$ -145 276 -162 168 17 -97 -253 79 120 207 51 23 -133 -86 158 -94 -23 44 210 99 141 -34 -6 -33
5068c3J08L8j30M0r6L7J17k92K07k35M07k74K2M3p2N1M0M2j18K0Q4L04k60J04
$$ -33 75 113 -17 23 -73 -36 81 -211 -4 -239 168 -106 -84 -41 -113 -62 -22 20 -98 -78 6 310 50 154
5092A54j59J94k76j0l15K69P8j59K57Q5k2k61J0J96j73K42j23R9J46j74Q0M9l78
$$ 154 -5 189 -87 -97 -412 -143 -65 -224 33 118 96 -165 -155 41 -132 110 -13 86 232 58 138 187 -191
5115a91P5L56j26J10K9k22j29O4J69k5N6j42p4L41j31o3k01L43k38J71m1Q7n3
$$ -191 -116 240 114 224 253 31 -98 -34 135 110 166 24 -50 291 160 97 -104 239 1 172 131 218 165
5138A65m03O63n27J00o4r1J66j54K42q1pR8k48j5J72j87R5p9L05j50k08L83k69
$$ 165 -238 425 -102 -2 -66 -157 9 -145 97 16 9 107 -141 -156 16 -171 -76 -155 150 0 -208 175 -94
5161i4J22J75j43q0j6K25l34k3J37Q3l58J95J57j71O7p4K66k6rJ11j27l94L31
$$ -94 28 203 60 -20 -36 189 -145 -168 -31 52 -306 -111 46 -125 -58 -132 134 108 99 210 83 -311 20
5184B0j80L29k45J44m0r3M7P8lm6j84K12j83L90k41o7J53oo1K3J37j49K6o4M3
$$ 20 -160 169 -76 68 28 -65 -18 60 57 11 -173 39 -144 246 5 -62 91 85 24 47 184 35 61 -3 40
5209D0q1P5l9K03n9p5N8j58L09m93M41k53L1K1M5q9q2O0q2J48Ql5J03k28j01K04
$$ 40 -41 34 -5 198 139 64 122 -36 273 -220 221 -32 -1 20 65 -24 -106 -46 -128 20 28 -7 96 -132 -233 -29
5235b9p8j54n7J56J76Pn1j92J79J40j75L8q4QJ32L1Q0j58J54J0k18J30o2k6k95
$$ -29 -107 -261 -318 -162 14 21 -30 -222 -43 97 -78 -40 -124 -116 16 47 127 -31 123 133 -85 45 -17 -43 -338
5260c38K61J60p7j18K86j42m4L09j48j89J67j1k56K82k81J81J28j91L32j56o6
$$ -338 -77 83 6 -112 174 32 -12 297 149 -40 127 116 -140 142 -139 42 170 -21 311 155 89
5281H9p0k37J25Q8J1K4K00k48k36K70J55n7m3r8j53QK63j0p8l16M89q3n6J0J00
$$ 89 19 -218 -93 -5 6 30 230 -18 -254 16 171 114 71 -27 -180 -172 91 81 3 -313 176 93 37 47 147
5306A47j1J26k39k5K9j36l9K65k10j44j2j6J91j10N66l85L4O6m6k38K68n2j42
$$ 147 136 262 23 -2 27 -109 -148 117 -93 -237 -249 -265 -74 -184 382 -3 31 97 51 -187 81 29 -113
5329a13K10j39K4k13K04j24J2K89j34P3j08L3r6K3m2K17%j03L9j39K49j85K33
$$ -113 97 -42 -18 -231 -27 -151 -139 150 16 89 -19 14 -82 -59 -101 116 116 13 52 -87 162 -23 210
5352B10j31k52L58j23mN0k42J51p1J78j25j24J43m1k8J71k31J36k12K28j24N5
$$ 210 79 -173 185 62 58 108 -134 17 -54 124 -1 -125 18 -23 -51 120 -111 25 -187 41 -83 -28
5374b8PJ55Jo8k65J9n1j82N55k92n2K48k34J24j55J46J72k13j9j22L08j51j7Q4
$$ -28 -21 134 135 67 -198 -179 -230 -412 143 -149 -201 47 -187 -63 -218 -72 100 -113 -132 -254 54 -97 -114 -30
5398c0n2J25p3O7p3J30j18nm14M15j0K13l7K4k46l0J59r7J24j09NJ2nj41N2K13
$$ -30 -82 43 -30 37 -36 94 -24 -29 -443 -28 -38 175 138 162 -84 -114 45 -52 72 -37 -32 -20 -25 -166 -114 99
5424I9q8O8j23K9K01k8k12J33J45l59K24o9p2j09R4K0K02j28M4r9qK6M0J09j04
$$ 99 11 79 -44 -15 186 158 -54 79 224 -135 89 20 -52 -161 -67 -47 155 27 71 -28 -36 -10 30 139 35
5449C5qj36j8J29J77k9P2j04k4l25J38q3P1j80N88l17J62k57P9J50k09J3J56j39
$$ 35 27 -109 -127 2 179 150 222 118 94 -231 -93 -176 -105 -285 303 -14 148 -109 -30 120 -89 -76 80 -59
5473e9K58j16k31O3N4M32o52M05m4l32M14l21J34n9J1j22J19O3J39j25O4j16K88
$$ -59 199 83 -148 -85 -31 401 -251 154 110 -222 192 -129 5 -54 -43 -165 -46 17 156 31 95 -21 267
5496B67q7j20k93K39j34K9K30k36Q7K42j07m3q0L0J38j76M6j06l8K16q3L67l12
$$ 267 180 60 -233 6 -128 -99 131 -105 -18 224 117 74 -6 24 162 -14 32 -74 -112 104 21 388 76
5519G6k10K96J3j37k5r1j26J79k3J02l05Q1M07m55K20J28j33k32j4L15j50jL9
$$ 76 -134 162 175 38 13 -78 -204 -25 -48 54 -251 -170 237 -218 2 130 -3 -235 -249 66 -84 -85 -46
5542d6p4L83l55J09j22mK78l07J4K55l42L08k69o4M01j93k8J4K67l35K5kk3pJ83
$$ -46 -120 263 -92 17 -105 -109 169 -138 -124 131 -211 97 -172 -236 165 -28 -56 -42 225 -110 -85 -87 -110 -117 66
5567F6j17p5lK26k69K03l4j83K21O5k29K4J6M8j62L79r2q5l5j20j7L17j01M4n5
$$ 66 -51 -126 -129 97 -172 31 -3 -186 35 100 -129 -105 -89 -41 -203 176 84 -1 -36 -156 -173 144 43 87 32
5592C2j28M2L2L4l6on5K22k78J44o2N6R6k39J73j21R5k00J00K03r1pJ28o4j48
$$ 32 -96 -54 -22 12 -24 -30 -85 137 -141 3 -59 -3 93 -146 27 -94 1 -199 -99 104 13 6 134 70 -78
5617g8J59k3j81r2K83j12o2m1N2J0J03j83K89J11n13J56M6K99k91j02J00l0K52
$$ -78 81 58 -123 -215 68 -44 -106 -147 -95 -85 18 -165 124 235 -278 -122 -76 223 -68 -170 -70 -100 152
5640A52j20p0L00j20n9J18J47l38J06j09k1J84j10j88n4L04k39J95n7K45r1j45
$$ 152 32 -38 262 142 83 201 348 10 116 7 -14 170 60 -128 -182 122 -117 78 21 266 175 30
5662C0j90J20K28k59o1J4J62P7k06j8K1k11P4K57j26J03J37k18m1J23LQ0k20J35
$$ 30 -160 -40 188 -71 -132 -118 44 121 -85 -103 -82 -293 -219 38 -88 15 152 -66 -107 16 19 99 -121 14
5686A4L0Oj33P4R5j60P2l0j08N5Q9J93j38K5j03j84K49l66M64r1K0k23K41j03
$$ 14 44 50 -83 -9 86 -74 -2 -32 -140 -85 4 197 59 84 -19 -203 46 -320 144 53 73 -150 91 -12
5710a2j61Q9J00n4M7l6J58P6Q0j11j3j07j87J46n4l34P01k35p4M8j56P8mL4r4
$$ -12 -173 -84 16 -38 9 -27 131 207 287 176 163 56 -131 15 -39 -373 328 93 19 67 -89 -11 -15 19 -75
5735g5K38j21N0Q4qj43J69l63j1L56j34P7j10P9N2k36J37k7R0Qm2m8n1J26k38
$$ -75 163 42 92 176 168 25 194 -169 -180 176 42 119 9 88 140 -96 41 14 104 112 70 22 -29 97 -141
5760a41k1K43k49P8k6j42J82P8K7Q4M1k04P8l9K7k13J50Q3K36j36p4j46j71L27
$$ -141 -162 81 -168 -90 -116 -258 -76 2 29 113 154 -50 28 -11 16 -197 -47 36 272 136 62 -84 -255 72
5784G2j03J54k29J54o9j42K36j80L31k53L79l50J1k16K77j49L12r1J2j65O7p6
$$ 72 -31 123 -106 48 -21 -163 73 -107 224 -29 350 0 11 -205 72 -77 235 144 156 -9 58 -18
5806a8K6L9J17l82L66k1j29j5P9k6J36j87L6K35j61R5m0j42P9J16k39J92j38K60
$$ -18 8 47 164 -218 148 127 -2 -17 62 36 172 -15 21 256 95 190 150 8 87 203 -36 156 18 278
5830B78k45K29k69k01J18l1J70rk02L12k72j30M37J0k25l01J71K66k70J66k08
$$ 278 33 262 -7 -208 -90 -121 49 40 -162 150 -122 -252 185 195 -30 -331 -160 106 -164 2 -206
5851b06K71Q2k87J77R0m3k84K92m2j59O9k2J5j6K60m9l72L15j28M1j55J57J16
$$ -206 65 147 -140 37 127 84 -200 92 50 -109 -40 -62 -47 -63 197 148 -224 91 -37 4 -151 6 122
5874A22j49N09m39k91M60k33K95l70J75l4J15j73k6K09k72K26j59P8j88K87k73
$$ 122 -27 482 43 -248 212 -21 274 -96 79 45 160 -13 -39 170 -102 124 -35 43 -145 142 -131
5895a31p1o0J77J24j32J40p1j03L7q6J80k44R4K16K9l11K48j24J04q8jr0M10k24
$$ -131 -202 -262 -85 39 -93 47 -24 -127 -90 -176 4 -240 -146 70 99 -212 36 -88 16 -72 -73 -163 247 23
5919B3k02n3J46O2j01J74k17J40j51Q6J16L5j98J33j28J52N8l7n6J4J49j01M4
$$ 23 -179 -232 -86 -24 -125 49 -168 -28 -179 -93 23 58 -140 -7 -135 17 75 38 -18 -4 145 44 88
5942H8L48l16O9r5q7R0N1j76k1K71p2k99K18p7M8n7o3N2L04l06o7P0Om2J76j66
$$ 88 436 120 189 94 7 97 148 -28 -49 222 150 -149 69 -8 40 -17 -80 -28 276 -30 -97 -27 -21 -63 113 -53
5968e3p8K14k61J65J77j41k7M9l5j41K61j33l6O1k53J67K5j6J74n7m6J78k25J44
$$ -53 -131 83 -178 -13 164 23 -4 45 10 -131 130 -3 -39 22 -231 -64 -39 -55 119 62 16 194 -31 113
5992A13k48N8J82n8n1L9J64k0j33q9K68k45K9k1M6K03j38n1j87n9K83Q8j42o9
$$ 113 -135 -77 105 47 -4 35 199 179 46 -43 225 -20 9 -12 34 237 99 48 -139 -198 85 173 31 -38
6016c8k76K62O3l05N89k72J12r9k21K45j58J21j53J30K3l7J88k26j69K98M1J1
$$ -38 -314 -52 11 -294 295 23 135 36 -185 60 -98 23 -130 0 23 -14 174 -52 -221 77 118 129
6038A29J1j91j8R5k68M13j64m3j38P5K17j06jq0P8l01L83p7j27N5P0l8J41m3j80
$$ 129 140 -51 -69 26 -242 171 7 -36 -174 -99 118 12 11 -69 9 -292 91 14 -113 -58 12 -26 115 72 -108
$$ [...]
8191D0
##END NTUPLES=NMR FID
##END=
