##TITLE=1H_LR-717-C1
 CD3OD, 8 sc, 
 3.7.2020
##JCAMPDX= 6.0         $$ Bruker NMR JCAMP-DX V2.0
##DATA TYPE= NMR FID
##DATA CLASS= NTUPLES
##ORIGIN= UXNMR, Bruker Analytische Messtechnik GmbH
##OWNER= root
$$ XWIN-NMR		Version 3.5
$$ Fri Jul  3 13:17:37 2020 Russian Standard Time (UT+4h)  she@DPX200
##.OBSERVE FREQUENCY= 200.1315
##.OBSERVE NUCLEUS= ^1H
##.DELAY= (6, 6)
##.ACQUISITION MODE= SIMULTANEOUS
##.ACQUISITION SCHEME= undefined
##.AVERAGES= 8
##.DIGITISER RES= 18
##SPECTROMETER/DATA SYSTEM= spect
##.PULSE SEQUENCE= zg30
##.SOLVENT NAME= MeOD
##.SHIFT REFERENCE= (INTERNAL, MeOD, 0, 15.7039)
##AUDIT TRAIL= $$ (NUMBER, WHEN, WHO, WHERE, WHAT)
$$ ##TITLE= Audit trail, XWIN-NMR		Version 3.5
$$ ##JCAMPDX= 5.01
$$ ##ORIGIN= Bruker BioSpin GmbH
$$ ##OWNER= she
$$ F:/spectra/data/she/nmr/H-F/1/audita.txt
$$ ##AUDIT TRAIL=  $$ (NUMBER, WHEN, WHO, WHERE, WHAT)
(   1,<2020-07-03 13:16:07.71 +0400>,<she>,<DPX200>,
      <created by zg, POWCHK disabled, PULCHK disabled
       configuration hash MD5:
       00 E9 B6 7A A2 85 ED C7 34 08 36 98 17 FE 4E 26
       data hash MD5: 16K
       96 44 42 85 1E 52 0D C7 C3 D4 79 E8 8C 69 27 0A>)
$$ ##END=
$$ 
$$ hash MD5
$$ E6 81 90 D6 41 E6 F5 5A FF CA 79 2A B3 7F 35 35
##$RELAX= 
##$RELAX= 
##$RELAX= 
##$RELAX= 
##$RELAX= 
##$RELAX= 
$$ Bruker specific parameters
$$ --------------------------
##$DU= <F:/spectra>
##$EXPNO= 1
##$NAME= <H-F>
##$PROCNO= 1
##$TYPE= <nmr>
##$USER= <she>
##$AMP= (0..31)
100 100 100 100 100 100 100 100 100 100 100 100 100 100 100 100 100 100 
100 100 100 100 100 100 100 100 100 100 100 100 100 100 
##$AQSEQ= 0
##$AQ_mod= 1
##$AUNM= <au_zg>
##$AUTOPOS= <>
##$BF1= 200.13
##$BF2= 200.13
##$BF3= 200.13
##$BF4= 200.13
##$BF5= 200.13
##$BF6= 200.13
##$BF7= 200.13
##$BF8= 200.13
##$BYTORDA= 1
##$CFDGTYP= 0
##$CFRGTYP= 5
##$CHEMSTR= <none>
##$CNST= (0..31)
1 1 145 1 1 1 1 1 1 1 1 1 1 1 1 1 1 1 1 1 1 1 1 1 1 1 1 1 1 1 1 1 
##$CPDPRG= <>
##$CPDPRG1= <>
##$CPDPRG2= <>
##$CPDPRG3= <>
##$CPDPRG4= <mlev>
##$CPDPRG5= <mlev>
##$CPDPRG6= <mlev>
##$CPDPRG7= <mlev>
##$CPDPRG8= <mlev>
##$CPDPRGB= <>
##$CPDPRGT= <>
##$D= (0..31)
0 1.2 0 0 0 0 0 0 0 0.06 0 0.03 0 0 0 0 0.0002 0 0 0 0 0 0 0 0 0 0 0 0 
0 0 0 
##$DATE= 1593767767
##$DBL= (0..7)
120 120 120 120 120 120 120 120 
##$DBP= (0..7)
150 150 150 150 150 150 150 150 
##$DBP07= 0
##$DBPNAM0= <>
##$DBPNAM1= <>
##$DBPNAM2= <>
##$DBPNAM3= <>
##$DBPNAM4= <>
##$DBPNAM5= <>
##$DBPNAM6= <>
##$DBPNAM7= <>
##$DBPOAL= (0..7)
0.5 0.5 0.5 0.5 0.5 0.5 0.5 0.5 
##$DBPOFFS= (0..7)
0 0 0 0 0 0 0 0 
##$DE= 6
##$DECBNUC= <off>
##$DECIM= 24
##$DECNUC= <off>
##$DECSTAT= 4
##$DIGMOD= 1
##$DIGTYP= 9
##$DL= (0..7)
0 120 120 120 120 120 120 120 
##$DP= (0..7)
150 150 150 150 150 150 150 150 
##$DP07= 0
##$DPNAME0= <>
##$DPNAME1= <>
##$DPNAME2= <>
##$DPNAME3= <>
##$DPNAME4= <>
##$DPNAME5= <>
##$DPNAME6= <>
##$DPNAME7= <>
##$DPOAL= (0..7)
0.5 0.5 0.5 0.5 0.5 0.5 0.5 0.5 
##$DPOFFS= (0..7)
0 0 0 0 0 0 0 0 
##$DQDMODE= 0
##$DR= 18
##$DS= 0
##$DSLIST= <SSSSSSSSSSSSSSS>
$$ [...]
##$SUBNAM2= <"">
##$SUBNAM3= <"">
##$SUBNAM4= <"">
##$SUBNAM5= <"">
##$SUBNAM6= <"">
##$SUBNAM7= <"">
##$SUBNAM8= <"">
##$SUBNAM9= <"">
##$SW= 24.9337058887773
##$SWIBOX= (0..15)
0 0 2 0 0 0 0 0 0 0 0 0 0 0 0 0 
##$SW_h= 4990.01996007984
##$TD= 16384
##$TD0= 1
##$TE= 0
##$TE2= 300
##$TE3= 300
##$TEG= 300
##$TL= (0..7)
0 120 120 120 120 120 120 120 
##$TP= (0..7)
150 150 150 150 150 150 150 150 
##$TP07= 0
##$TPNAME0= <>
##$TPNAME1= <>
##$TPNAME2= <>
##$TPNAME3= <>
##$TPNAME4= <>
##$TPNAME5= <>
##$TPNAME6= <>
##$TPNAME7= <>
##$TPOAL= (0..7)
0.5 0.5 0.5 0.5 0.5 0.5 0.5 0.5 
##$TPOFFS= (0..7)
0 0 0 0 0 0 0 0 
##$TUNHIN= 0
##$TUNHOUT= 0
##$TUNXOUT= 0
##$USERA1= <user>
##$USERA2= <user>
##$USERA3= <user>
##$USERA4= <user>
##$USERA5= <user>
##$V9= 5
##$VALIST= <valist>
##$VCLIST= <CCCCCCCCCCCCCCC>
##$VD= 0
##$VDLIST= <DDDDDDDDDDDDDDD>
##$VPLIST= <PPPPPPPPPPPPPPP>
##$VTLIST= <TTTTTTTTTTTTTTT>
##$WBST= 1024
##$WBSW= 4
##$XGAIN= (0..3)
0 0 0 0 
##$XL= 0
##$YL= 0
##$YMAX_a= 686048
##$YMIN_a= -447660
##$ZGOPTNS= <>
##$ZL1= 120
##$ZL2= 120
##$ZL3= 120
##$ZL4= 120
##$ABSF1= 10
##$ABSF2= 0
##$ABSG= 5
##$ABSL= 3
##$ALPHA= 0
##$AQORDER= 0
##$ASSFAC= 0
##$ASSFACI= 0
##$ASSFACX= 0
##$ASSWID= 0
##$AUNMP= <proc_1d>
##$AZFE= 0.1
##$AZFW= 0.1
##$BCFW= 1
##$BC_mod= 2
##$BYTORDP= 1
##$COROFFS= 0
##$CY= 11.3945322036743
##$DATMOD= 1
##$DC= 2
##$DFILT= <>
##$DTYPP= 0
##$F1P= 16.9975609425685
##$F2P= -3.02152046262296
##$FCOR= 0.5
##$FTSIZE= 0
##$FT_mod= 4
##$GAMMA= 1
##$GB= 0.15
##$INTBC= 1
##$INTSCL= 1
##$ISEN= 128
##$LB= 0.24
##$LEV0= 0
##$LPBIN= 0
##$MAXI= 10000
##$MC2= 0
##$MEAN= 0
##$ME_mod= 0
##$MI= 1.114404
##$NCOEF= 0
##$NC_proc= 0
##$NLEV= 6
##$NOISF1= 3.799351
##$NOISF2= 2.8
##$NSP= 1
##$NTH_PI= 0
##$NZP= 0
##$OFFSET= 15.70392
##$PC= 1
##$PHC0= -9794.821
##$PHC1= 15.40087
##$PH_mod= 1
##$PKNL= yes
##$PPARMOD= 0
##$PSCAL= 0
##$PSIGN= 0
##$REVERSE= no
##$SF= 200.130013532006
##$SI= 16384
##$SIGF1= 3
##$SIGF2= 2
##$SINO= 400
##$SIOLD= 16384
##$SREGLST= <1H.CDCl3>
##$SSB= 0
##$STSI= 0
##$STSR= 0
##$SW_p= 3612.71676300578
##$SYMM= 0
##$S_DEV= 0
##$TDeff= 0
##$TDoff= 0
##$TI= <>
##$TILT= no
##$TM1= 0
##$TM2= 0
##$TOPLEV= 0
##$USERP1= <user>
##$USERP2= <user>
##$USERP3= <user>
##$USERP4= <user>
##$USERP5= <user>
##$WDW= 1
##$XDIM= 8192
##$YMAX_p= 0
##$YMIN_p= 0
$$ End of Bruker specific parameters
$$ ---------------------------------
##NTUPLES= NMR FID
##VAR_NAME=  TIME,          FID/REAL,        FID/IMAG
##SYMBOL=    X,             R,               I
##VAR_TYPE=  INDEPENDENT,   DEPENDENT,       DEPENDENT
##VAR_FORM=  AFFN,          ASDF,            ASDF
##VAR_DIM=   8192,          8192,            8192
##UNITS=     SECONDS,       ARBITRARY UNITS, ARBITRARY UNITS
##FACTOR=    0.0002004,     1,               1
##FIRST=     0,             0,               0
##LAST=      1.6414764,     0,               0
##MIN=       0,             -447660,         0
##MAX=       1.6414764,     686048,          0
$$ Real data points
##PAGE= N=1
##DATA TABLE= (X++(R..R)), XYDATA
0 0 0 0 0 0 0 0 0 8 -8 8 -12 16 -24 24 -32 35 -43 55 -59 75 -84 99 -116 131 -155 175 -200 230 -257 294
30 294 -330 370 -417 464 -522 580 -644 719 -794 884 -977 1080 -1199 1326 -1470 1629 -1810
47 -1810 2017 -2247 2521 -2841 3220 -3689 4268 -5026 6048 -7511 9813 -13954 23767 -96844
61 -96844 68891 431202 470878 368554 128252 -126691 -366207 -447660 -370053 -151401 105652
72 105652 347609 462746 399566 158428 -143113 -383721 -445778 -308783 -33540 233793
82 233793 395593 417715 321003 116895 -140111 -349585 -397234 -257054 7999 282079 455145
93 455145 448895 262495 -13067 -240119 -327891 -275732 -133504 56794 254058 393313 397083
104 397083 241561 -13252 -254904 -372306 -310019 -99133 154921 337360 385743 299699
114 299699 118786 -91559 -254762 -315777 -256403 -88927 140556 340859 402474 283825
124 283825 50505 -178891 -313876 -314715 -191547 3948 191308 305741 320948 229204 40869
135 40869 -183132 -339223 -340313 -183085 56283 266380 356163 293903 123441 -71527 -219312
146 -219312 -284076 -251718 -126572 58206 235919 331668 295773 131118 -95323 -277326 -327564
157 -327564 -230780 -45156 140962 261503 285664 214627 68852 -106712 -249477 -298246 -222416
168 -222416 -45071 160448 298658 301863 174037 -14545 -175754 -254683 -240525 -146601 -4415
179 -4415 143696 246715 262433 170802 -4459 -190928 -296069 -267750 -125300 59867 205425
190 205425 256825 204914 82329 -61645 -183245 -249064 -230553 -117402 55306 210644 271601
201 271601 209194 53548 -121730 -238401 -251806 -169496 -37628 93902 188186 219292 170136
212 170136 45235 -114615 -240498 -268639 -178626 -10328 154774 239455 213058 101943 -37785
223 -37785 -154127 -214394 -204579 -126557 118 133664 220382 215463 109682 -54216 -197872
234 -197872 -250745 -194712 -67964 68213 164561 194814 154664 58451 -63340 -171867 -224669
245 -224669 -190098 -70594 83611 197846 217622 140031 8214 -118402 -189003 -187523 -124261
256 -124261 -25724 81207 166938 195008 141308 18000 -121539 -211024 -207871 -113829 24349
267 24349 141452 188966 159452 77708 -23894 -117370 -175505 -172677 -100493 20208 139702
278 139702 202848 175816 68891 -65106 -162721 -185241 -135419 -42408 59293 137737 169891
289 169891 141800 56912 -59575 -160711 -197809 -144131 -23442 104253 177791 171897 98773
300 98773 -3817 -96368 -149404 -150600 -100843 -12568 89985 166768 176718 106481 -14956 -127455
312 -127455 -179950 -151338 -61219 45996 125331 153214 129350 65331 -23590 -110711 -160420 -144223
324 -144223 -61830 52695 147172 177130 128911 29177 -72080 -133048 -138835 -97567 -24982 59216
336 59216 128435 154265 121315 34682 -71828 -149597 -158837 -94045 8771 100919 145137 133145
348 133145 77594 -439 -76420 -126810 -133111 -87281 1533 99397 159153 148016 70345 -33512
360 -33512 -115085 -141587 -110353 -40274 39061 101234 130108 116350 59190 -27541 -110213 -147186
372 -147186 -117328 -33279 64794 131599 140622 91605 12676 -61891 -108818 -117553 -86536 -20780
384 -20780 61054 124377 137859 91581 2810 -86802 -135613 -120762 -55992 23959 86290 113435
396 113435 102408 57324 -10227 -78119 -120784 -117438 -61971 25346 104258 134460 102160 27869
408 27869 -50883 -102435 -112441 -83369 -27714 35839 88257 112662 93975 32526 -49762 -114031
420 -114031 -126973 -83794 -7300 67002 108817 105414 63466 2106 -57510 -99181 -109030 -76069
432 -76069 -7601 69193 118441 115132 60550 -19030 -86382 -113321 -92673 -40326 19997 70729
444 70729 99255 94073 52320 -14990 -81870 -117179 -102500 -40981 38521 98636 112027 77207
456 77207 16767 -44999 -87484 -99825 -76640 -25607 37554 89101 106109 76225 9539 -63140
468 -63140 -105846 -101067 -56471 4403 56989 85046 81601 49713 -629 -54352 -93293 -97514 -59243
481 -59243 8057 72248 101767 84614 32359 -30569 -76215 -88972 -69138 -28310 20274 64249
493 64249 87224 76590 31300 -30439 -80851 -95942 -69010 -13010 45908 80670 81648 52703
505 52703 9206 -36773 -72457 -83284 -61271 -12273 45741 87060 90953 53633 -7875 -62629
517 -62629 -87078 -75233 -37345 10347 52848 76342 72629 41638 -7836 -59189 -89877 -81977
529 -81977 -36712 24510 72311 86401 64777 19682 -30688 -66750 -77341 -61562 -23564 25655
541 25655 69048 85809 64843 14806 -40957 -77665 -79746 -48878 -265 45159 70178 70150 47582
554 47582 8687 -36347 -70163 -76435 -47601 3712 55559 84213 75845 35380 -16046 -54337
566 -54337 -67382 -55017 -24688 14700 50915 70482 64466 33008 -13340 -55804 -73997 -58376
578 -58376 -16638 29596 61557 68621 51112 16324 -23076 -54034 -65602 -52171 -16003 31247
590 31247 67616 74355 47844 1829 -41786 -65401 -61402 -34060 3831 37609 57797 58894 38900
603 38900 1821 -39330 -66369 -65162 -35104 10253 50725 68328 56389 23084 -17012 -48050
615 -48050 -60887 -52441 -24472 14568 50092 66121 54237 18357 -25613 -58866 -65348 -44450
627 -44450 -7902 28700 51523 55577 39823 8695 -26994 -54168 -60844 -43448 -5862 35640
639 35640 60719 58499 30697 -7355 -39131 -54523 -49327 -26700 4550 33905 52287 51371 29383
652 29383 -7107 -41804 -58542 -50475 -20384 16688 45395 54256 42212 15525 -15376 -40315
664 -40315 -51345 -42684 -15716 19437 48114 56262 40073 7590 -26613 -48046 -49080 -31090 -3102
677 -3102 24638 43194 47063 33646 4990 -27533 -50644 -53445 -32805 2152 35497 51874 45516
690 45516 20428 -11067 -37177 -50238 -44713 -23005 7189 34875 48054 42066 16519 -17585
702 -17585 -45410 -53409 -39857 -12960 16531 38250 44428 32669 9017 -19019 -42286 -50797 -38787
715 -38787 -9110 23911 46046 47937 29453 -805 -29418 -45054 -42239 -24118 690 25718
727 25718 42539 43251 26037 -1599 -28951 -44407 -40966 -20327 9307 33584 43806 37381 18206
740 18206 -6871 -29260 -40990 -35621 -15739 11648 35069 45410 36322 12354 -15775 -35065
752 -35065 -39049 -27906 -6580 16965 34202 38977 29284 8486 -16499 -36228 -41132 -27787 -2065
765 -2065 23750 39079 38033 22094 -2413 -24679 -36372 -33986 -19885 2589 25358 39065 35875
778 35875 17875 -7441 -29354 -38634 -32192 -11970 11893 30257 36338 29477 11674 -11725 -30827
791 -30827 -37773 -29388 -9026 15522 34318 38294 25259 2320 -20015 -33594 -34400 -22460 -1813
804 -1813 18952 32021 33031 21149 461 -21892 -35736 -34658 -19008 3079 22715 33669 30283
817 30283 14830 -5579 -24193 -33560 -30748 -16048 6027 25544 34572 28934 12067 -9623 -27176
830 -27176 -33076 -25477 -8042 11426 26658 32484 26011 9679 -10514 -26791 -31793 -23304 -4872
843 -4872 16208 30783 32745 22060 3833 -15002 -27627 -28719 -17998 445 19044 30942 30893
856 30893 19237 -1084 -20142 -29796 -26318 -12530 6306 22330 29807 25445 11956 -6102 -21700
869 -21700 -28815 -24734 -10228 8635 24120 29160 22395 6526 -11823 -25174 -28677 -20271 -4538
882 -4538 12389 24404 26501 18306 1947 -15038 -26295 -26861 -16617 -190 16177 25314 23847
895 23847 12986 -2286 -17422 -25807 -24492 -13789 2773 17751 25679 23019 10929 -5614 -20415
908 -20415 -26708 -22476 -9180 6831 19863 25108 19984 7405 -8841 -21694 -26188 -20398 -6370
921 -6370 9678 21637 24419 17491 3408 -12088 -23004 -25311 -17187 -2889 12330 22728 23890
934 23890 14923 -106 -15366 -24177 -22911 -13115 1266 15649 23816 21964 11172 -3560 -16335
947 -16335 -23445 -20567 -9487 5146 18313 23674 19854 8016 -6713 -18513 -22516 -17382 -5748
960 -5748 8676 19772 22821 16758 4110 -9549 -18761 -21192 -14599 -1645 11627 19904 20264 13179
974 13179 951 -12180 -20123 -20099 -12400 -160 12403 19972 19057 10727 -2789 -14861 -21222 -19171
988 -19171 -9972 3277 14522 19745 16444 6863 -5692 -15962 -20390 -16301 -6493 5567 14924 18970
1002 18970 15760 5450 -7268 -16442 -19530 -14731 -4389 8232 17560 19749 13765 2304 -9926
1015 -9926 -18069 -18711 -11924 335 11843 18461 18143 10794 -918 -11777 -17841 -16055 -8565 2570
1029 2570 12600 18096 16743 7648 -3213 -13169 -18274 -15467 -6532 4963 14494 17522 13648 4177
1043 4177 -7028 -15257 -17247 -12476 -2742 7387 14196 16024 11177 1637 -8330 -15236 -16055 -10536 -229
1058 -229 9622 16026 15613 9090 -850 -10265 -15378 -14142 -6943 2860 11756 16063 14359 7881 -1914
1073 -1914 -10684 -14378 -12256 -5316 3861 12882 17026 14470 6346 -3812 -12139 -15730 -12359 -3306 6982
1088 6982 14811 16100 12150 2833 -7075 -14025 -14753 -9806 -1195 7906 14135 14978 9360 514 -8441
1103 -8441 -14063 -14530 -9323 73 9286 14517 13907 7958 -1652 -10381 -15402 -13866 -6702 2437 10926
1118 10926 14355 12053 4909 -4442 -11785 -13633 -10607 -4228 4759 11289 13298 9906 2996 -4819 -10990
1133 -10990 -12659 -9347 -1738 6588 11892 12574 8735 1428 -6660 -11808 -11490 -7017 -99 7042 11459
1148 11459 11413 6398 -1124 -7638 -11580 -10863 -6113 1854 8042 11539 10007 4259 -3105 -9542 -12535
1163 -12535 -10286 -4332 3019 9179 11467 9018 2164 -5519 -10524 -12441 -9133 -2607 4539 9966 10889
1178 10889 7306 864 -6127 -11259 -12118 -7960 -674 6754 11097 11021 6380 -1002 -8359 -12369 -11164
1193 -11164 -5928 1636 8319 11685 10073 4190 -2898 -9212 -11318 -9340 -3865 3246 8868 10230 8214
1208 8214 3249 -3591 -9245 -10906 -8529 -2727 4044 9591 11109 7890 1293 -5621 -9978 -10344 -6395
1223 -6395 -573 6134 9390 9373 5696 319 -5413 -8964 -8866 -4880 645 6366 9512 9450 5502 -522
1239 -522 -5714 -9073 -7869 -3764 1789 7416 10594 8915 4004 -2573 -7230 -9459 -7109 -1969 4045
1254 4045 8081 8896 6701 2316 -3433 -7630 -9021 -6421 -1216 4649 8628 9229 6239 241 -5388
1269 -5388 -8823 -8902 -5209 546 6042 8547 8050 4043 -1453 -6558 -9135 -7566 -3496 1953 6470 8397
1285 8397 7165 2843 -2577 -6587 -8527 -6888 -2605 3339 7665 8792 6506 1425 -3652 -7161 -7382
1300 -7382 -4399 -197 4288 7025 7807 5555 1534 -3520 -6762 -7445 -4717 82 5295 8280 7828 4240
1316 4240 -339 -4603 -7175 -6563 -3613 925 4946 7050 6590 3108 -1730 -6086 -7679 -6478 -2749
1331 -2749 2008 5314 6693 5341 1769 -2838 -6642 -7942 -6679 -2639 2658 6408 7219 4846 -2
1346 -2 -4323 -7423 -7400 -4755 -596 3631 6379 6486 4312 -454 -4918 -7534 -6975 -3400 1130 5216 7079
1363 7079 5859 2280 -1658 -5144 -6716 -5887 -2767 1465 5314 7007 5499 1583 -2791 -6067 -6412
1378 -6412 -4846 -1304 2369 5117 6035 4051 878 -3042 -6109 -6483 -4845 -831 3441 5808 5188 2920
1394 2920 -461 -3429 -5005 -5368 -3723 -139 3063 5403 6115 3576 -10 -4338 -5706 -5161 -2256 1514
1410 1514 4669 5593 5133 2491 -479 -3424 -5310 -4498 -1983 2157 5508 6673 5112 1932 -2143 -4575
1426 -4575 -4755 -3152 215 2961 5446 6261 4052 326 -2894 -5486 -5289 -2814 1113 4314 5579 4698
1442 4698 2316 -1053 -3881 -5668 -5082 -2441 844 4108 5565 4522 1148 -2756 -5576 -5907 -4293
1457 -4293 -1200 2112 3945 4168 2874 943 -1996 -4920 -5617 -4336 -989 2399 4480 4679 3173 -81
1473 -81 -2845 -4093 -3995 -3097 -634 2445 5024 5121 3535 273 -2940 -5181 -4841 -2226 1327 3416 4565
1490 4565 4429 2558 -12 -2935 -4270 -4148 -2386 689 3759 5627 4742 1511 -1653 -3807 -4661 -3473
1506 -3473 -1111 1416 3744 4237 3676 1365 -1806 -4638 -4743 -2906 473 2660 4534 4348 2298 -443
1522 -443 -2909 -3538 -3669 -2125 368 2840 4206 3791 1780 -757 -3098 -3899 -3137 -743 1236 2870
1538 2870 3478 3307 1466 -1112 -3530 -4233 -3070 -696 2079 4053 3658 2105 -144 -1879 -3065 -3102
1554 -3102 -2037 -744 1496 2789 3617 2504 173 -2574 -4422 -3847 -2151 585 2136 3195 2930 1475
1570 1475 -332 -2459 -3469 -3688 -2387 283 3161 4227 3619 1453 -1355 -3107 -3736 -2961 -1061 1372
1586 1372 2960 4235 3234 1162 -1301 -3749 -3800 -2687 222 2660 3895 3491 1923 -127 -1842 -3082
1602 -3082 -3432 -2377 -9 2048 3531 3505 2208 -373 -2797 -3715 -3307 -1209 792 2181 3093 2648 797
1619 797 -983 -2746 -3498 -2869 -1003 1003 2512 2847 1577 522 -1200 -2221 -2765 -2188 -893 695
1635 695 2277 3402 2644 585 -1844 -2909 -3038 -1835 197 2011 3079 2594 1823 292 -1140 -2890
1651 -2890 -2799 -1456 131 2292 3536 2977 1641 -726 -2293 -3001 -2124 -1199 538 2033 3068 2667 1044
1668 1044 -892 -2750 -3666 -2672 -699 1552 2776 2609 1702 38 -1522 -2555 -2840 -1944 -587 1460
1684 1460 2587 2745 1249 -721 -2537 -2762 -2125 -1337 501 1608 2168 2210 1234 -258 -1561 -2415 -2396 -797
1702 -797 1506 2656 2651 2110 611 -620 -1472 -1445 -1436 -502 863 2237 3015 2272 1035 -839 -1882 -2248 -1123
1721 -1123 254 1383 2397 1903 1610 358 -693 -1766 -2403 -1754 -187 1461 2407 2400 1229 145 -1555
1738 -1555 -2406 -2431 -1099 312 1565 2492 2143 1377 -591 -2256 -3066 -2531 -462 1072 2465 2299 1443
1755 1443 94 -1124 -1546 -2268 -1664 -574 1349 2264 2699 1738 285 -1513 -2268 -2138 -1151 284 1465
1772 1465 2021 2109 1442 -29 -1118 -2023 -1782 -923 457 1458 1840 1135 495 -643 -1285 -2107 -1681 -907
1790 -907 -155 1149 2062 1517 329 -1244 -1903 -1933 -1544 -498 534 988 1318 757 -42 -614 -1732 -2064
1808 -2064 -1524 -478 659 1927 1762 930 52 -1268 -2060 -1709 -897 40 1015 1956 1868 820 -404 -1693
1826 -1693 -1949 -1720 -492 977 1637 1870 1225 305 -692 -1164 -2008 -1736 -265 880 1924 2297 1491 68
1844 68 -982 -1931 -1959 -944 -79 1241 1674 1429 869 -13 -880 -1696 -1931 -797 232 1092 1611 1417 1143
1863 1143 -292 -1385 -1839 -1419 -863 334 1083 1754 1706 897 -275 -1013 -1469 -1158 96 527 1478 1459 1231
1882 1231 961 -137 -786 -1583 -1025 -260 666 1807 1883 1734 271 -618 -1343 -1578 -1395 -114 661 1307 1825
1901 1825 1004 405 -996 -1550 -1621 -655 146 1014 1453 960 479 -511 -1332 -1310 -1396 -661 404 1071 1502 1164
1921 1164 -75 -863 -1390 -1337 -942 -109 1102 1279 1291 678 -37 -776 -1054 -1160 -544 164 793 1348 1283 660
1941 660 -275 -653 -1124 -620 -437 256 1236 1341 794 561 -192 -1109 -1351 -1006 -333 317 647 796 796 314 -611
1962 -611 -1099 -1388 -1282 -718 315 977 1196 1103 215 -787 -1247 -1286 -1068 -77 629 1248 1264 716 -214 -861
1982 -861 -1223 -1195 -784 -198 1157 1433 1295 335 115 -791 -1197 -813 -499 516 1165 1568 1004 779 -137 -1385
2002 -1385 -987 -377 150 660 1087 1306 1017 240 -367 -944 -970 -902 114 458 746 765 521 206 -1050 -1358
2022 -1358 -1135 -725 -33 346 987 686 447 -214 -994 -1167 -735 -547 123 589 741 915 492 -143 -569 -1021
2042 -1021 -944 -532 21 987 1323 878 632 -565 -744 -707 -857 -162 170 1034 1084 1137 613 -299 -704 -774 -362
2063 -362 308 761 1072 1135 825 147 -521 -584 -864 -353 440 782 963 1000 502 -364 -455 -738 -528 63 243
2084 243 619 692 688 123 -367 -771 -589 -744 -106 621 849 646 247 -66 -337 -657 -789 -440 73 437 476
2105 476 337 500 -145 -651 -649 -585 -383 194 639 909 658 261 130 -475 -947 -937 83 455 554 1030 538
2126 538 232 -285 -907 -1101 -1054 -280 365 790 1060 691 18 -558 -930 -836 -743 -365 398 761 708 660 -98 -668
2148 -668 -771 -1135 -781 150 355 448 851 435 42 -467 -790 -577 -534 357 688 845 773 483 109 -678 -553
2169 -553 -366 -134 131 567 754 480 -227 -770 -334 -656 -607 -216 95 548 164 159 89 -529 -740 -706 -302 -62
2191 -62 355 544 68 216 -139 -270 -791 -521 -238 -175 229 605 252 64 -61 -537 -941 -440 -208 117 411
2212 411 485 754 51 -357 -470 -831 -383 140 481 895 738 705 13 97 -485 -351 -297 242 512 749 821 439
2234 439 328 -412 -435 -406 -292 257 748 761 618 219 -41 -360 -617 -794 -288 291 424 626 632 -5 -266 -310
2256 -310 -209 -542 -446 19 94 503 220 85 -362 -582 -710 -926 1 282 889 365 -73 225 -187 -543 -235
2277 -235 -144 -21 211 329 577 470 157 -222 -578 -629 -232 -296 187 334 532 500 -104 -259 -610 -638 6 412
2299 412 454 402 246 -46 3 -591 -136 -354 -150 247 338 528 166 -102 -532 -632 -564 -144 -134 402 100 13
2321 13 -32 -129 -199 -625 -722 -133 102 281 438 125 3 -245 -531 -414 -180 66 192 551 657 699 -65 -174
2343 -174 -527 -172 -108 250 496 501 428 110 305 -191 -401 -655 -521 -93 505 444 373 -106 -102 -212 -683 -155 1
2366 1 -227 -209 179 93 206 319 -174 -771 -301 -481 237 389 305 4 -343 -257 -275 -600 -418 -549 -195 347
2388 347 972 409 102 -223 -588 -166 -124 318 116 217 74 178 401 149 -355 -520 -427 299 757 695 173
2409 173 157 -266 -67 57 65 -108 2 142 184 501 342 -98 -817 -672 -540 346 374 162 114 56 234 155 143
2432 143 -307 -542 -546 46 86 393 346 -172 -450 -663 208 176 21 -82 -171 244 547 512 -27 -571 -543 -48 258
2455 258 724 273 35 -375 -35 -55 -5 -335 -557 136 564 646 692 455 -473 -545 -259 204 262 -36 -43 -10 45
2478 45 52 -179 -349 -710 -805 -192 498 229 323 -342 -868 -346 -21 -355 -376 -341 -337 480 548 206 -38 -940 -819
2501 -819 -132 308 449 -11 -157 -242 -101 276 315 -395 -300 -523 146 615 802 183 -203 -690 -403 346 27
2522 27 48 -326 -178 448 689 497 -168 -546 -935 -368 202 396 219 -84 -145 157 -241 90 -461 -527 -374
2543 -374 109 674 727 68 -388 -566 -174 216 344 -18 -12 -499 47 332 615 -25 -548 -569 -198 428 575
2564 575 442 -8 -313 -210 394 411 84 -220 -89 182 706 337 -190 -284 -493 -326 346 786 538 -382 -62
2585 -62 147 565 392 125 -444 -185 277 686 669 161 -353 -574 -412 358 233 299 -356 -299 -67 487 524 -203
2607 -203 -796 -913 -196 378 796 123 -191 -432 -11 235 451 184 -387 -711 -160 562 941 396 -327 -757
2627 -757 -319 129 648 338 -410 -446 -27 401 429 44 -400 -541 -350 298 1041 306 -383 -500 -195 18 412
2648 412 137 -599 -499 -146 649 703 264 -277 -1013 -453 460 572 10 -287 -354 -363 225 358 152 -391 -810
2669 -810 -456 454 826 569 -46 -949 -350 319 550 621 -451 -474 161 610 556 268 -341 -396 -393 441 837 394
2691 394 -112 -513 -451 238 387 336 -320 -587 90 450 816 261 -280 -745 -407 325 441 425 -429 -641 2
2712 2 81 704 295 -599 -776 -332 545 774 490 -13 -790 -580 195 494 559 -139 -501 -182 725 606 484
2733 484 -395 -683 -521 367 854 148 -4 -301 -318 397 752 383 -753 -778 -349 555 993 529 -71 -780
2753 -780 -175 -16 885 401 -481 -272 -332 249 925 248 -329 -1063 -317 335 579 448 -67 -769 -585 241
2773 241 611 77 -87 -396 -142 379 620 360 -593 -791 -534 473 734 311 -282 -760 -456 546 607 258
2793 258 -460 -580 -571 407 1130 208 -238 -401 -421 207 367 438 41 -700 -184 425 1151 473 -263 -712 -324
2814 -324 384 741 730 -595 -630 -529 244 782 466 -376 -883 -125 672 699 623 -294 -849 -606 332 799 195
2835 195 -327 -728 -351 525 799 257 -547 -605 -321 421 869 387 7 -718 -689 349 729 453 -289 -625
2855 -625 -543 226 1063 474 -311 -716 -568 123 975 661 -159 -666 -213 46 525 432 -389 -721 -538 105 724
2876 724 547 -414 -855 -837 363 506 284 -363 -778 -552 332 674 595 -286 -1064 -630 -29 893 463 -234
2896 -234 -658 -632 161 646 261 -373 -885 -746 427 754 375 -183 -660 -485 163 523 500 -273 -509 -732
2916 -732 306 823 423 -3 -674 -592 198 1031 356 72 -626 -422 275 767 448 -279 -608 -324 267 780
2936 780 698 -80 -936 -859 129 671 658 -144 -792 -455 65 554 507 -88 -701 -800 -173 463 486 60 -904 -762
2958 -762 263 432 591 271 -414 -616 539 896 622 -120 -770 -748 459 635 665 -32 -444 -602 180 492
2978 492 696 -48 -362 -353 216 859 878 -113 -538 -155 -48 544 305 -224 -627 -397 106 531 357 -319 -580
2999 -580 -800 8 950 677 -98 -402 -870 11 520 514 109 -590 -426 -220 675 513 70 -376 -229 279 216
3020 216 696 229 -791 -408 -49 689 652 33 -607 -651 102 630 830 13 -533 -507 39 637 656 123 -1002
3041 -1002 -696 112 707 388 77 -784 -565 -46 360 846 541 -726 -598 37 837 552 -198 -674 -804
3060 -804 30 841 537 -251 -730 -722 -209 631 639 61 -631 -696 -236 375 633 -27 -669 -944 -37 402 630 315
3082 315 -607 -535 -203 466 712 302 -416 -621 -201 734 572 201 -529 -831 -166 620 674 244 -417 -807 -47
3103 -47 443 351 288 -374 -355 -130 376 905 -258 -260 -841 -138 312 640 157 -704 -648 -63 422 674 -170 -450
3125 -450 -743 -280 328 503 26 -412 -561 -128 460 626 185 -528 -637 -181 763 671 188 -445 -719 97
3145 97 423 616 256 -370 -297 43 760 628 232 -611 -549 -354 659 590 283 -551 -441 -280 344 462 189
3166 189 -474 -238 -165 437 566 42 -354 -685 -376 412 331 -351 -321 -1078 -179 488 410 612 -338 -692 -211
3187 -211 477 436 532 -559 -431 -239 339 702 127 -527 -764 -61 479 374 168 -379 -692 -16 743 714 -67
3208 -67 -320 -350 -94 519 498 190 -323 -651 -145 271 598 -17 -645 -536 -240 270 627 -41 -497 -544 -401
3229 -401 183 754 46 -576 -478 -183 414 605 367 -587 -842 -540 475 387 233 -389 -586 26 154 637
3249 637 136 -268 -649 -123 368 679 378 -408 -323 -270 180 541 165 -449 -816 -272 455 562 281 -16 -482
3270 -482 -228 80 395 147 -276 -628 -126 74 524 45 -473 -457 -178 277 634 272 -295 -563 -387 370
3290 370 353 -172 -208 -675 37 -57 523 523 -28 -577 -472 174 443 239 -257 -411 -166 47 337 463 -225 -530
3312 -530 -355 39 562 188 -33 -398 -49 366 169 146 -68 -567 -78 419 734 28 -182 -262 121 660 436
3333 436 137 -66 -628 -431 156 365 350 -448 -663 -298 -57 221 100 -161 -526 -253 70 243 197 -233 -173
3354 -173 -463 -77 339 156 -173 -531 -427 249 460 310 -158 -71 -234 373 394 264 -2 -363 -373 352 162
3375 162 186 -96 -411 -422 189 280 313 -72 -573 -328 305 628 166 -19 -345 -53 111 307 321 16 -370 -400
3397 -400 67 -82 170 -79 -574 -381 26 353 505 -384 -397 20 366 583 -23 -156 -304 9 95 352 95
3418 95 1 -305 -209 11 131 85 -84 -304 -17 37 143 105 -54 -390 -104 14 73 194 -296 15 -252 11
3440 11 422 395 -245 -108 -160 324 241 122 -168 -342 37 168 365 85 209 -342 -202 26 -20 -18 32 -267 -232
3463 -232 110 310 85 -22 30 -242 42 292 114 21 -5 -393 -120 273 274 6 -203 -529 49 285 282 59
3485 59 -389 -300 218 244 -3 -338 -62 -457 60 -93 275 178 -453 113 104 467 145 -12 -349 -404 -21 245
3507 245 -40 261 55 -371 129 125 144 -83 -195 -179 -108 186 192 -284 -479 -136 -302 -45 319 -213 -115 -309 121
3530 121 161 291 -62 -357 -144 -89 208 225 -60 -297 -284 70 117 300 -179 -172 -229 250 395 307 41 -536 -32
3553 -32 191 327 67 -283 -18 -180 282 301 178 -36 24 -57 -57 254 323 62 -369 50 -174 189 161 -315 -214
3576 -214 -128 -114 -44 185 -9 -31 -150 89 260 325 -127 20 -241 -239 -158 71 -15 -190 -118 -185 225 275 -108 -233
3600 -233 -320 -378 218 244 409 -291 181 -131 153 178 -5 -1 -91 175 50 -5 -199 -119 -57 -291 109 203 -15 -67
3624 -67 -401 327 239 448 -45 -260 80 -239 167 128 130 -104 -79 -108 286 160 -54 -326 -102 -306 -205 12
3646 12 -176 -104 -252 169 -50 251 -131 -167 -227 2 117 -24 74 230 13 -5 259 0 257 -5 160 -107
3668 -107 -1 263 160 224 -27 82 113 -207 51 97 -37 56 -49 143 -8 -132 -106 -66 231 107 -85 -376
3690 -376 -273 -220 -50 -68 -374 210 -176 -6 -10 317 240 -34 73 -15 276 352 153 -106 9 -27 236 -21 216
3713 216 -62 88 -24 161 28 145 137 16 222 231 112 215 -117 36 -187 -79 -283 146 -122 31 11 109
3735 109 261 -127 -267 136 -99 -42 26 -11 -373 -215 -162 183 -115 -67 62 -174 -151 128 135 -116 -235 -330 -196
3758 -196 170 -103 -315 67 -62 127 326 -415 -177 -59 -190 -138 -206 -21 144 -75 18 -169 46 -40 -182
3779 -182 -57 -15 34 331 -52 -96 123 -83 -317 -40 86 -100 -36 28 -49 102 142 -308 -115 -229 -132 -302 246
3802 246 56 27 46 -318 58 51 -25 130 266 -40 -116 55 -180 -45 156 116 -264 372 94 -18 140 78 -189
3825 -189 -91 -101 271 -127 12 327 57 -44 94 -217 48 300 150 461 -104 89 117 -18 -34 216 38
3846 38 -180 477 -19 -468 17 -103 343 -177 -80 149 185 -72 -185 -56 118 -255 150 -34 -276 356 -83
3867 -83 120 -58 36 -101 -73 6 202 33 72 76 -128 -70 38 -14 -241 -248 -65 167 142 -326 99 -100 -75 205
3891 205 21 23 134 27 204 16 -249 -33 102 -61 62 -79 55 57 186 143 280 -73 80 282 197 -313
3913 -313 -171 65 137 -120 192 -20 -23 -16 -53 316 144 -160 -5 -160 -289 -58 57 -232 -45 301 126 -100
3935 -100 -33 -184 -147 149 270 -306 -215 78 111 174 60 -63 -138 -151 -6 -6 -211 -55 95 112 171 -28 -163 296
3959 296 133 -116 146 -74 40 27 -166 -37 -143 -65 120 -13 -111 -68 -82 145 -41 -82 -218 130 82 137 -81
3982 -81 207 3 -134 40 11 -120 -22 252 -18 -27 23 -338 -81 236 -94 -320 -69 -51 -144 69 114 150 -10
4005 -10 47 -130 -2 44 93 -145 152 -74 -45 -57 64 47 -98 -239 102 124 -26 -44 12 86 -221 37 33 -55 -84
4030 -84 -96 -124 296 -541 -92 -99 116 38 36 -192 -4 -55 162 40 -107 140 -85 -212 -179 62 -120 -274 -203 -70
4054 -70 149 -170 -235 97 103 215 -18 100 218 94 -5 79 31 -114 75 -336 16 251 76 429 167 -45
4076 -45 -129 166 -128 5 240 63 -8 -64 94 383 -173 -187 56 267 169 -243 81 37 129 -62 -104 -303 -230
4099 -230 229 -158 -56 99 367 -69 28 -158 -20 14 197 368 99 112 -18 -69 -35 40 17 -281 -70 -216
4121 -216 -200 224 -70 -21 56 -109 32 -205 53 -167 154 209 298 117 -143 126 74 197 88 168 333 40
4143 40 100 270 169 -127 173 265 118 52 135 244 101 253 -365 -16 16 -59 -130 171 33 -400 -6 -192 147
4166 147 27 112 76 -184 20 -10 -328 -10 143 222 57 22 -59 118 33 -202 179 -139 188 179 -27 91 139
4189 139 61 -12 142 -70 107 182 16 -56 -12 143 186 -50 95 91 -64 382 -26 109 10 -241 -130 -269 153
4212 153 -101 -11 125 144 160 0 -77 -131 -59 -147 -223 -65 -25 65 -80 -168 10 -327 120 -9 -70 -115 98 148 40
4237 40 11 264 26 -13 -131 -219 114 92 97 99 172 11 -138 -217 45 -62 183 -58 -102 244 264 93 -47 352
4261 352 144 -6 -293 108 -195 90 91 -316 275 257 92 -116 35 -162 59 296 45 46 -199 77 191 101
4283 101 -55 -349 -41 -28 -43 -128 -32 -37 -91 106 10 -49 210 192 -63 97 -203 34 122 -61 361 178 70 89
4307 89 182 -29 19 -231 47 -292 105 14 -190 115 -63 -13 120 173 -175 15 163 104 -94 -51 80 -327 -15
4330 -15 124 -25 42 -48 78 -155 -73 -39 117 103 -25 -146 127 -169 231 -189 34 170 262 132 148 -161 35
4353 35 200 -114 -45 -7 98 3 -17 159 287 111 246 -32 4 -18 39 -53 92 -140 -59 339 16 138 -171
4376 -171 -139 282 56 177 -17 -129 -47 -35 106 -72 168 -72 72 -197 39 -58 -209 61 -91 129 -274
4397 -274 -75 -120 -67 107 -193 -285 -153 257 278 -58 -66 50 -55 23 74 -223 -252 -18 -36 4 276 157 126 127 29
4422 29 -16 -142 -111 39 -34 125 221 113 -40 -33 42 -105 -178 -76 174 252 44 83 -222 -123 114 -169 -10 -151
4446 -151 -304 53 19 77 95 3 144 -120 67 -18 135 108 -220 -143 85 87 -17 -200 -189 -147 74 -224 -45 -32
4470 -32 29 256 7 6 87 -171 -97 238 -34 -110 25 89 287 389 33 69 -296 -104 147 136 209 26 -107 -25
4494 -25 160 -194 -286 -124 324 -125 98 217 -35 -192 168 101 -297 121 256 223 49 -478 62 -297 -267 276
4516 276 -204 86 -203 -286 148 -201 140 94 -191 227 145 -43 81 210 76 115 -21 138 -5 13 88 -146
4538 -146 -189 107 -1 -190 -215 116 -111 -280 -88 180 152 -70 35 -31 -180 330 49 -168 61 -100 12
4559 12 -61 90 -20 -15 123 -48 19 210 -82 -287 -60 85 69 -108 231 -72 56 142 -328 72 180 153 -157
4582 -157 144 195 -304 85 -5 64 -39 -68 91 -40 -143 123 -214 84 -112 -44 13 -30 10 -76 279 29 -262
4605 -262 -72 -35 -287 130 -32 -103 76 -94 -51 256 80 17 -21 2 34 177 -80 -160 239 -203 128 311 -235
4628 -235 220 -133 -33 471 207 34 53 -18 20 -55 -97 138 9 53 77 -41 -180 -327 -195 -79 -83 -157 -91 51
4652 51 45 59 49 -99 -223 -147 69 99 118 181 -178 -90 -7 -279 44 39 145 18 -269 50 11 -41 75 -80 98
4677 98 -268 -46 177 -56 183 -240 -19 -62 -55 -98 -94 261 35 -105 -22 -91 178 336 -80 -262 -102 13 89
4700 89 147 -139 20 -36 52 76 -125 145 -304 -67 -27 195 135 -174 273 -22 60 133 -283 -164 47 198 -277
4723 -277 119 -46 -292 81 60 175 -88 151 105 -342 -4 -46 -170 6 -103 213 -149 90 -103 -119 -96 -81
4745 -81 59 -217 -72 -102 -51 -52 -180 -32 -4 -130 39 3 61 -29 -183 -184 -32 347 209 42 -62 -475 -276 -68
4769 -68 10 -185 209 45 -17 -138 -43 47 158 -218 52 85 152 -99 217 152 -150 109 190 84 -119 -91 66
4792 66 27 64 -144 341 194 -152 135 71 -217 103 -156 -60 -431 133 -272 -147 162 99 196 -36 -65 119 -126
4815 -126 -171 24 -198 -66 -12 -71 -66 153 107 -295 223 120 275 99 49 13 -103 -85 19 8 -17 176 17 -79
4839 -79 350 -286 -50 188 -85 -112 -76 124 215 169 -3 176 -220 -14 -30 9 -179 267 4 148 28 6 -232
4862 -232 49 106 31 -126 -2 -71 -153 98 95 -215 -40 38 50 -31 137 66 365 17 224 -36 179 250 105 -144
4886 -144 -222 68 -193 182 268 186 131 103 -113 6 154 -239 -210 33 -296 403 190 326 -120 -93 27 -110
4908 -110 33 -79 -157 149 230 -49 123 77 42 -215 -8 -1 8 83 105 -159 39 28 -423 255 105 326 281 -100
4932 -100 -126 349 249 -257 -101 86 -49 137 237 193 114 62 217 146 -144 249 -106 -52 263 38 -151 -37
4954 -37 -249 -55 172 -98 -61 -97 -30 175 56 3 43 26 111 -225 83 110 -343 38 50 77 -38 -258 -41 61
4978 61 227 -87 -151 -114 -56 -448 -390 -107 -207 -35 130 -171 -31 -74 -301 -10 -436 19 -125 -394 -20 -11 -90
5001 -90 268 45 -14 216 -58 211 -30 -105 64 -82 -25 -149 99 171 -12 117 114 157 -164 57 127 -167 -259
5024 -259 116 194 -254 -132 -148 19 130 318 -48 -293 130 -231 111 37 142 65 -55 -209 68 -96 -117 -75
5046 -75 76 83 196 94 -44 -35 142 -145 138 -217 121 186 172 27 -39 38 117 31 155 -59 34 -97 160 87
5070 87 -263 14 57 84 -7 168 138 -36 76 -278 57 -40 241 -8 -25 73 -154 152 55 63 14 154 74 -561
5094 -561 38 -67 148 68 -152 -4 -212 89 -21 252 -124 -273 250 23 -36 227 1 174 -40 -37 -49 -88
5116 -88 65 49 174 -27 -10 165 59 84 74 15 -79 223 -106 -39 -179 -211 -94 -14 114 11 23 -35 57 220
5140 220 -137 80 -381 -117 -83 129 -34 -230 8 -15 66 57 25 -116 -44 -36 -11 -30 -273 1 -179 243 -28 150
5164 150 151 262 242 -71 219 -53 249 113 177 99 -328 51 20 -68 189 -318 201 196 -12 -74 -216 239 530
5187 530 -115 9 201 -30 -10 4 -76 -136 162 105 24 95 45 -121 131 -63 11 290 73 -89 64 133 99 -87
5211 -87 159 -245 -227 -82 -170 53 -38 -128 -96 -108 64 246 93 151 91 -34 -67 45 -2 -50 45 -23 -138 128 -269
5236 -269 91 -125 106 25 -102 173 -273 195 81 -207 146 -74 -266 55 22 -96 -340 -181 36 47 -328
5257 -328 -138 -351 46 31 42 -161 84 36 125 9 -43 140 -83 143 78 142 -230 -120 -136 155 -83 -74 169
5280 169 145 -26 -127 59 -39 29 -139 -282 256 -97 -127 -313 -180 171 -92 13 7 35 161 443 -53 17 318
5303 318 -382 42 268 314 -167 209 122 184 -42 94 -266 2 -48 -132 -32 -3 -46 -193 115 -199 -143 -51 38
5326 38 -200 180 -278 -130 -174 73 69 321 -7 291 156 55 91 -81 366 -441 289 194 2 -30 59 -6 -284
5349 -284 30 49 39 100 -94 7 50 -131 -66 -66 -379 364 -241 -157 94 -128 -114 191 -77 23 -130 20 -232
5372 -232 -183 26 195 -106 109 -14 49 -31 11 -15 -32 96 -263 19 28 -149 163 111 68 -77 126 101 -9 82
5396 82 -129 -227 -258 135 214 131 -55 -84 -254 -287 -264 8 195 38 -250 -93 -248 121 -125 -184 -58 -75 -61 -56
5420 -56 -31 -196 -56 73 -40 29 -114 -49 237 -131 119 -194 7 122 263 -124 -185 9 116 -36 -114 -38
5442 -38 -13 -95 -89 -150 -136 336 -31 124 -155 -64 -67 8 146 322 289 -103 153 160 254 -136 -309 -136 -194 89 -44
5467 -44 64 -79 -145 -154 154 -78 -167 176 -55 -204 46 -23 -80 6 -64 -183 236 24 -468 168 200 86 -149
5490 -149 157 44 -52 256 -89 230 -265 46 -52 159 139 79 9 147 -120 282 -212 -33 2 -70 186 -276
5512 -276 -291 -102 24 -585 -133 -23 -89 185 -158 154 126 -89 183 -8 -139 4 -42 174 131 -96 77 75
5534 75 -21 316 -60 323 17 -169 121 302 -207 159 135 -9 52 -15 -100 151 -54 240 128 66 216 87
5556 87 -22 -247 -353 222 -1 -12 57 -6 -130 -76 198 129 331 215 61 -5 -286 303 -10 223 -193 -180 200
5579 200 6 -58 59 130 -141 -150 -150 -159 135 -145 -96 -362 130 -248 140 -248 -16 -225 -80 157 -51 60 -427
5602 -427 -124 53 94 244 -21 -173 23 34 -43 89 247 57 -69 -20 117 -407 172 -16 313 -33 -36 273
5624 273 37 38 -148 14 -119 53 -466 -193 161 -24 -7 -56 -60 -225 97 -44 159 1 -36 -152 223 85
5646 85 107 167 -94 118 40 -75 15 -259 43 33 0 136 158 249 341 133 -81 24 -313 49 9 137 23 136
5670 136 198 -72 204 42 252 -15 23 -3 218 -75 21 110 58 191 -81 118 -98 111 -111 -128 129 71 -286
5693 -286 -256 -86 -188 -80 220 -23 31 77 -120 -101 -136 -70 -119 127 -39 -275 30 -21 167 -270 -327 176 161
5716 161 -49 110 135 -121 -86 -333 23 -23 86 -80 80 -203 6 -64 -115 217 88 95 264 58 -32 -110 -67
5739 -67 -70 -272 172 -300 78 201 -27 -86 -23 -80 108 -122 -55 -252 -227 -65 -35 62 -115 110 137 -177 -81 165
5763 165 -128 -132 292 -150 -73 -80 -68 127 -197 24 146 26 -113 -257 -94 111 -287 -298 -159 70 164 -308 219
5786 219 -124 105 -43 -286 70 -169 199 111 -152 125 99 -83 -125 -111 -3 -199 153 201 6 210 36 -23
5808 -23 -229 59 -37 88 -120 -310 158 89 23 -243 -385 156 -147 43 86 -256 -32 -163 306 -23 -386 -33
5830 -33 -11 -124 -114 -91 22 178 38 -86 124 -72 17 52 -28 104 89 -79 241 129 -62 38 379 336 -2
5853 -2 81 -74 -135 122 125 -51 -6 -102 253 85 233 -161 -171 82 -22 313 133 -134 -169 -88 100 293 -165 123
5877 123 -38 -72 -60 -115 129 -141 114 -139 163 -65 -171 -190 93 252 -90 102 -114 80 162 105 -73 -221
5899 -221 -4 115 28 -62 177 71 260 26 202 76 4 248 -83 65 -67 -18 41 157 156 97 -219 209 -134
5922 -134 -158 38 -50 227 -61 6 -248 -34 -133 -151 -125 88 -139 23 197 -55 113 146 -36 287 -238 284
5944 284 64 -228 -125 -14 -44 -70 -134 -13 256 -35 -196 -28 261 104 118 31 235 -76 166 -5 -175 -148
5966 -148 -16 -73 154 -4 81 -44 200 -123 -5 125 204 95 23 71 227 108 -5 135 52 56 87 -24 217
5989 217 -83 127 256 -4 -190 30 180 -246 -47 7 148 -22 279 -290 -44 -218 9 3 95 209 110 -171
6011 -171 163 74 -248 175 43 242 10 181 58 34 50 -193 -317 318 75 164 -113 146 90 -285 50 191
6033 191 -113 -162 -37 -351 377 46 -128 -10 -55 -210 -61 112 -172 -95 -189 -27 244 298 80 94 -28 157
6055 157 109 -42 65 -292 -159 142 90 -40 -323 188 140 77 -82 -197 -185 -89 214 183 -146 87 -194 97
6077 97 4 69 254 58 114 -125 208 -74 225 39 -219 277 -176 7 223 -93 -57 201 3 7 249 -102
6099 -102 -166 -42 73 -406 -252 -10 116 -117 -53 -118 76 39 -175 -106 -88 -342 -19 183 -2 1 0 39 -115 105
6123 105 110 138 -224 173 88 248 -82 27 -63 -56 -51 -99 -164 -180 88 191 365 -18 -49 -136 7 157 -257 -129 129
6148 129 -117 95 -80 -96 -158 84 180 61 212 11 -10 118 83 -288 -31 -107 147 118 137 -4 -99 178 -91
6171 -91 -361 51 180 -235 -39 -42 -186 -166 -23 82 200 168 -136 -51 101 -84 66 -16 124 -185 -26 46 131
6194 131 313 253 -411 -191 124 222 -98 77 -171 25 -193 -201 9 -71 -214 170 142 46 167 -116 174 236 6
6217 6 8 -105 -93 237 147 66 -196 45 -3 -39 -65 -120 39 61 236 57 80 -165 -8 -10 179 -221 73 -67 197
6242 197 158 -181 -46 -312 -109 6 207 -141 177 -233 116 -289 -156 -82 80 241 -173 287 51 90 -12
6263 -12 35 245 12 185 131 -313 -96 26 -146 -45 -136 -19 -25 69 91 192 -68 44 -156 18 -6 -108 -117 6
6287 6 179 15 -3 -123 -2 266 183 99 -240 73 20 96 -121 -433 177 74 137 -72 407 72 13 264 39
6310 39 8 -100 -76 234 -78 -22 -44 110 159 33 355 0 231 114 -40 11 -36 -387 149 -167 16 89 250
6333 250 -83 -153 202 -30 385 185 61 -46 22 -266 160 -79 120 -82 -70 165 38 -32 26 -39 -80 104
6355 104 56 -90 -175 88 45 -28 232 -59 -197 92 -116 -77 221 -103 24 118 -304 306 -41 -188 -2 -277
6377 -277 18 48 -11 265 316 -64 285 306 -40 275 -260 219 -100 34 -105 195 28 33 101 174 -91 -182 26
6400 26 12 -186 88 -64 154 12 28 18 94 155 180 187 41 -128 186 -49 -84 276 -36 -61 125 -195 -286 37
6424 37 216 63 -45 -12 318 -59 -130 62 179 84 -29 27 -85 9 320 175 -87 97 -140 174 185 110 -9
6447 -9 6 34 56 -89 52 271 106 29 4 222 83 254 -18 141 -4 -64 -132 253 170 -137 125 112 198 112
6471 112 -93 74 -237 47 111 -357 -351 124 -166 172 170 98 144 -155 -21 104 24 34 -48 47 54 63 -36 7 -30 -85
6497 -85 -109 -343 -25 132 -54 -218 8 -114 46 71 -188 10 44 299 -226 36 -14 298 146 16 183 21
6519 21 -109 48 -180 -34 136 108 76 103 122 39 209 8 -39 -134 50 -74 11 -36 168 -241 -74 331 -19
6542 -19 -39 182 222 -111 102 -270 64 -143 128 -30 -67 195 5 -44 -363 91 -172 246 113 8 -230 82
6564 82 -268 -277 114 -102 -5 30 11 193 -255 -45 -145 315 -101 107 206 80 199 152 -253 38 -30 70 88
6587 88 277 -212 -48 51 -65 211 -32 4 -60 -159 265 10 129 -110 -260 104 -11 -115 -8 -107 -55 -154 -47
6610 -47 0 31 -294 -137 304 50 -32 -104 -64 -46 247 229 92 -93 -22 63 -8 -113 64 -154 171 102 94 -90 -210
6635 -210 157 -137 10 -66 152 -200 268 177 36 -15 6 -98 -203 -259 17 -277 -42 -260 141 12 -3 -97
6657 -97 234 -88 -352 -100 -214 -157 421 23 -38 119 -35 226 -157 65 -4 10 -280 -207 -153 46 117 198 104
6680 104 22 284 420 -140 167 5 50 138 123 98 -64 -41 81 -82 -148 -121 -97 -341 -213 -127 -7 -41 -32 98
6704 98 11 91 -8 -114 112 -65 370 -144 301 -179 -297 -41 -27 -92 93 -90 31 183 -148 240 55 126
6726 126 -83 215 211 -114 -87 -237 -299 -350 368 -427 -34 -89 26 -34 53 -118 -167 58 22 69 -223 -36 -142 123
6750 123 45 -88 30 -248 -231 -136 243 -111 -129 174 -88 147 3 53 107 -284 132 -172 147 -266 -186 -276 -282
6773 -282 64 49 -12 -135 -152 -153 73 -48 23 -10 342 58 -120 -87 -18 172 152 260 249 101 -192 314 -112 156
6797 156 430 -370 135 -396 387 -151 187 229 146 -172 182 -236 -94 -18 48 -36 169 96 -54 54 -283 -330
6819 -330 50 -69 240 36 -22 -61 172 -98 -238 -54 13 -22 -217 -132 140 68 -68 103 47 -4 366 148 20
6842 20 85 198 -76 119 -328 -83 -76 -387 259 -84 -91 133 -149 28 41 -391 -170 -207 120 43 -317 -56 47
6865 47 8 -14 -45 30 -84 -47 171 -35 -252 -67 152 -262 -59 43 69 -304 -290 -151 328 -29 -82 -33 57 44
6889 44 35 -28 82 -196 52 125 161 70 326 -5 -226 -77 276 -60 109 166 313 -140 -47 136 95 132 -162 -43
6913 -43 96 168 74 170 346 -167 10 21 36 55 130 118 155 42 207 -20 16 148 -355 -69 -179 -96 -175 -257 -194
6938 -194 57 292 -166 -86 -374 81 -56 132 152 302 161 -34 109 99 245 193 83 272 -57 -181 266
6959 266 143 -66 -236 -140 108 153 -239 166 -119 231 15 -23 -90 66 87 -36 32 -236 -9 -20 149 -1
6981 -1 -111 250 15 -172 -124 -147 -132 82 -50 -93 44 -112 -252 133 153 20 -168 -255 -256 -173 94 207 -29 -271
7005 -271 135 -261 -249 118 -318 -48 -65 -19 7 -19 -132 115 -204 -82 -73 -53 -165 132 100 -138 209 118 -53
7028 -53 209 -104 -18 112 172 26 -25 54 194 18 145 -147 -232 79 -448 124 -60 95 -235 130 265 -87
7050 -87 -67 -147 -192 85 74 -55 -6 243 -268 217 -146 54 320 -55 127 -249 102 106 149 238 21 -209 -234 -284
7074 -284 -314 113 110 37 -62 0 199 -39 3 -48 11 71 57 -90 44 219 -141 26 -407 32 -31 147 -148 -238
7098 -238 -279 -33 -136 -12 -47 -133 46 -6 64 -45 162 96 70 170 51 78 178 90 -140 169 117 156 -142 -76
7122 -76 87 172 162 50 -16 55 -242 42 52 37 55 -119 -317 -11 117 -107 -25 267 -87 139 58 65 236 -166
7146 -166 -263 -91 -76 -254 54 184 -155 -47 265 121 -31 -243 374 167 -38 103 68 1 -421 -25 -42 -187
7168 -187 -367 -145 -98 -198 105 145 59 56 -200 11 -306 152 95 -115 59 186 -223 -63 -140 127 179 77 8
7191 8 49 2 -48 63 -287 -167 116 97 -114 -102 -36 -160 -148 128 -103 62 -123 129 96 183 73 150 76 -256
7215 -256 -19 -98 -186 -190 -336 22 -117 -59 61 -152 -216 -37 -216 107 -231 -54 102 -31 78 -228 -33 -65
7237 -65 165 23 -38 -147 87 -190 -144 -88 183 0 -7 38 94 85 15 61 280 -222 178 -9 159 -107 -170 9
7261 9 256 -32 179 -219 -155 266 60 -87 57 155 -9 65 62 -66 25 497 -274 -144 -104 -77 109 429 115
7284 115 -86 34 154 -249 -253 -87 -178 -132 87 -108 -39 89 -127 -68 -34 -23 -159 146 -56 -18 -62 2 86 -10
7308 -10 -268 -75 -64 19 140 175 -37 -60 208 5 106 24 98 81 26 57 -151 -156 -169 23 334 8 16 165 150
7333 150 -81 -162 58 44 226 59 105 226 -34 -355 27 -30 -396 116 5 -7 -36 -238 41 -17 -180 -282
7355 -282 -320 -18 123 -116 -347 190 -138 144 52 212 133 -233 26 -433 -53 62 103 -212 128 -57 278
7376 278 -179 88 151 -51 -67 -18 108 -68 -332 -130 215 -20 -288 -188 111 13 84 78 102 150 247 -201 362
7399 362 77 -11 -133 55 -97 -73 -112 170 -46 197 49 95 59 143 84 126 -18 -304 298 313 -259 -141 175
7422 175 132 295 377 179 -97 312 74 -104 -216 16 490 121 12 187 -62 142 162 -122 -244 -106 76
7443 76 -249 -115 176 -183 173 59 252 119 -39 22 -8 101 -20 81 -180 48 114 -22 -12 -72 114 258
7465 258 193 -120 306 -67 -44 -420 -233 -99 51 -2 206 248 -140 -67 88 62 18 2 163 81 -143 57 343
7488 343 -238 -42 5 97 166 -104 40 -174 -142 -192 54 -262 -162 -193 17 112 102 33 79 72 18 -144 -439 122
7512 122 -90 -156 99 120 47 -146 169 155 -260 -207 -75 -227 -55 174 -104 31 -52 0 -256 -82 -84 96 132
7535 132 413 5 90 -64 40 359 -81 -231 55 104 -59 -71 226 -97 -72 -29 -137 -141 318 131 57 214 132
7558 132 101 254 97 -242 -34 51 -359 47 -181 -362 -106 145 212 79 89 2 46 25 74 -184 74 121 42
7581 42 75 142 -192 177 -163 229 -114 148 -200 -365 -85 197 296 0 -180 -155 53 -11 -76 154 -80 10 -68
7604 -68 44 100 -44 -153 -148 -176 163 -222 122 174 98 177 13 -139 80 54 -60 6 17 -9 -75 -121 51 -201 171
7629 171 335 115 165 112 142 -219 -66 -149 -161 48 -203 222 146 9 -41 114 174 -6 91 -190 -96 18 33 -206
7653 -206 100 143 31 -271 -2 5 -33 -181 -40 -98 -201 -85 61 123 63 -50 -62 -153 21 -43 296 -73 -152 -138
7677 -138 -249 -206 52 -310 -42 55 48 -16 -72 -32 22 90 311 139 -40 146 -121 162 76 104 61 238 192 68
7701 68 1 160 -151 174 -364 266 186 271 -73 -85 4 -94 -26 32 123 252 290 -117 7 -186 -281 214 -142 -40
7725 -40 235 -92 -112 -141 100 -19 124 -14 -90 136 -16 151 253 160 241 97 134 130 -66 108 -208 180 -147
7748 -147 -93 -29 -206 -414 24 246 11 -215 76 2 158 42 135 -167 310 -2 19 48 -72 -43 -88 -119 5
7771 5 -44 24 88 4 -225 -477 0 94 94 245 -151 -169 162 14 -326 -234 154 -190 -175 -77 -104 62 275 56 95
7796 95 -216 158 186 115 -164 -183 49 87 272 181 -219 -202 -126 -79 -15 -27 -162 63 73 166 0 89 42 -46 -38 185
7822 185 -96 -35 13 -124 4 239 -12 -97 165 83 4 -400 25 37 70 -159 98 30 217 270 366 15 44 -10
7846 -10 -71 46 194 110 72 -36 -306 -51 -100 -25 155 18 18 112 -101 15 -261 214 -55 -85 327 110 -139
7869 -139 -116 -140 301 -119 -25 -106 283 -168 -79 83 -44 -15 -49 -46 32 -81 -16 -111 -94 -76 -12 157 250 230 38 -192
7895 -192 -92 -208 27 -38 133 -86 125 152 41 -117 337 264 -261 192 159 350 -270 -4 -85 75 -12 10
7917 10 -38 -188 161 89 -171 -236 81 -105 -97 56 135 117 67 -15 219 285 -73 157 -275 -96 -50 2 -119 -126 -97
7942 -97 -10 -99 -73 192 67 46 -172 -37 -107 52 -38 155 -56 99 44 -109 8 -58 -154 -121 396 125 -82 -29
7966 -29 218 -38 96 -125 89 -13 -242 -47 -269 -105 -48 -130 56 77 209 -5 -194 -197 -78 -139 -71 196 -152
7989 -152 14 187 126 121 4 21 22 -235 189 19 -10 56 -52 -40 25 42 121 -289 98 -21 148 91 194 -47
8013 -47 -116 -21 -50 14 24 300 -317 152 -153 -76 -80 -172 101 -132 -34 298 -84 251 -86 157 -62 264 65 -151
8037 -151 59 -268 59 121 -42 -312 183 -21 224 -305 -15 -177 -259 -284 -17 41 158 89 -70 30 -42 -326
8059 -326 104 -115 254 -213 150 239 185 -11 -252 -13 -78 -83 324 -32 45 83 -35 4 -248 -116 -111 350 92
8082 92 -31 -187 105 93 -98 -88 -198 -49 -86 -275 56 88 158 -18 115 143 -72 -257 -204 14 285 -146 -195
8105 -195 284 174 -55 -186 -106 -125 -22 52 -121 314 -57 -102 -225 -83 139 92 27 109 22 30 -18 -120 -122 145
8129 145 -102 -248 132 -74 59 54 -361 -180 -61 17 -119 -298 96 51 52 -313 32 -134 -86 109 24 -149 75
8152 75 7 -95 84 -15 -231 145 400 -128 -107 -202 -7 -112 -364 200 23 113 -9 -108 15 29 161 -30 115
8175 115 59 103 -68 192 -86 202 94 173 -309 137 -8 -137 -179 -50 54 -76
8191g6
$$ Imaginary data points
##PAGE= N=2
##DATA TABLE= (X++(I..I)), XYDATA
0 0 0 0 0 -8 8 -3 8 -8 16 -24 24 -32 40 -48 64 -72 88 -104 123 -146 168 -200 229 -265 306 -347 399 -451
28 -451 512 -580 650 -732 818 -916 1025 -1139 1268 -1407 1562 -1733 1917 -2125 2350 -2601
44 -2601 2885 -3198 3558 -3961 4429 -4976 5614 -6390 7341 -8544 10126 -12302 15512 -20732
58 -20732 30712 -56894 274866 686048 361890 73584 -230899 -352557 -381484 -210101 38653
69 38653 311635 459387 486585 341905 89063 -208736 -390723 -395171 -197769 96749 372517
80 372517 485639 416113 212408 -20291 -232399 -360850 -351835 -170158 107713 358129 464228
91 464228 389594 158804 -128958 -348860 -395291 -264145 -41147 166725 304331 350768 288496
102 288496 110428 -132876 -336038 -399029 -286572 -45769 214308 371998 360055 201273
112 201273 -22717 -223816 -337176 -326720 -199521 -3649 193896 328321 339212 195108
122 195108 -55673 -287340 -384032 -316441 -134845 81972 252934 315210 252925 101760 -85905
133 -85905 -258743 -355146 -314094 -131142 115565 305655 351688 238410 24037 -189796 -311894
144 -311894 -308941 -203331 -41575 129992 259348 294860 210943 29550 -180622 -328020 -338323
155 -338323 -200717 17986 211515 297211 256405 124280 -45136 -197772 -287157 -277883 -163079
166 -163079 20977 203368 302860 267902 107871 -102222 -260520 -300196 -222821 -77038 77829
177 77829 195485 243196 203107 82222 -84669 -237092 -304330 -243540 -74292 121682 251495
188 251495 262047 161071 538 -150902 -239161 -243971 -172161 -43053 109491 229765 255442
199 255442 162716 -10461 -182928 -275561 -249616 -124333 38231 167012 220124 193469 101960
210 101960 -28104 -160204 -244060 -234928 -122893 49518 203780 264027 202922 55686 -103777
221 -103777 -206230 -221613 -158730 -46742 78742 180439 221644 180262 60796 -94589 -216955
232 -216955 -244117 -158269 -3356 143052 217809 203002 117502 -2184 -115755 -187637 -193988
243 -193988 -128318 -4509 133571 224354 217575 112720 -38363 -163049 -210120 -168321 -65503
254 -65503 51778 142454 184349 168136 92051 -27738 -147526 -210837 -180159 -66316 78983
265 78983 188214 211472 145749 29169 -83456 -153556 -167658 -126333 -37364 74190 168412
276 168412 201096 150444 32142 -102028 -187104 -183858 -99978 19188 120667 172040 163219
287 163219 101107 5004 -96174 -166295 -172387 -102832 21383 143617 202168 169098 66234
298 66234 -53457 -139298 -163308 -126107 -46779 46412 125670 166396 148359 67283 -51325 -152759
310 -152759 -184950 -132589 -21917 92967 161469 160112 99310 10012 -74890 -133754 -149018 -109283
322 -109283 -19848 86600 162801 170338 102462 -9769 -113657 -161098 -136854 -62092 27389
333 27389 100923 140088 133801 79443 -9140 -100804 -156219 -145632 -66671 44747 134523 161062
345 161062 119206 36366 -50959 -112943 -133627 -108348 -44577 40102 116953 153064 125006 37149
357 37149 -70491 -144835 -151468 -94333 -4047 79149 124916 122594 78733 8727 -66961 -126099
369 -126099 -141199 -96212 -6145 88689 142911 131541 62131 -30319 -105146 -132903 -110206 -53716
381 -53716 17420 83669 123400 115486 56569 -32232 -112338 -144832 -113781 -32540 57058 114158
393 114158 119503 79482 15797 -49844 -99824 -117250 -91936 -28882 51492 116182 131956 86134
405 86134 -84 -83481 -124583 -111725 -58317 11125 70618 102977 100462 62502 -1430 -71882
417 -71882 -119818 -118595 -62835 21527 93294 121662 96691 34765 -36234 -88741 -107542 -90659
429 -90659 -43476 21863 85586 117251 99189 33915 -48190 -108700 -121426 -81771 -12078 55451
441 55451 94340 97305 68460 16939 -44627 -94818 -111360 -81620 -14487 62052 112803 112578 61552
454 61552 -12614 -75477 -102649 -91008 -49110 9331 64752 98131 95497 54457 -12622 -78916
466 -78916 -111474 -92940 -33456 35985 85224 96709 72078 24000 -29867 -71637 -90038 -77062
478 -77062 -31885 31386 86308 105116 75123 12119 -53994 -93034 -90754 -52126 2228 50317
490 50317 78157 80287 55114 7352 -48412 -87519 -89661 -51987 9612 66819 93824 79909
502 79909 34488 -18977 -60147 -77481 -69416 -36415 13568 62770 90069 81202 36929 -26179
514 -26179 -77336 -92335 -64973 -12787 40083 73828 79877 59258 17907 -29944 -68231 -82702
526 -82702 -63973 -14782 45160 86931 89616 53310 -1969 -52279 -78702 -73017 -40813 4689
538 4689 48133 76027 77330 48238 -3998 -57039 -85427 -75250 -32478 22004 65089 79394
550 79394 62607 25043 -18133 -53347 -71525 -64206 -28941 22135 66922 84672 65574 18217
562 18217 -36220 -72057 -73627 -45109 -2865 36373 61844 66274 47776 10534 -32147 -64745
574 -64745 -71888 -47710 -1374 46262 71646 65510 34818 -6820 -43896 -64193 -61295 -35894 2907
587 2907 42454 68187 65865 32460 -17320 -59337 -74808 -58501 -20612 21597 52032 59668 45496
600 45496 16041 -20062 -52060 -67461 -56917 -21597 24086 59247 68052 46194 4669 -37428
612 -37428 -62666 -61980 -40265 -5346 30822 56501 61180 40647 1715 -39847 -65118 -62783 -33321
625 -33321 9944 46437 61626 51789 24752 -9217 -39941 -56394 -51879 -26836 11125 46581
637 46581 64269 54215 20030 -22189 -52148 -58202 -41538 -10324 22612 45843 52235 40406
649 40406 12960 -20919 -49550 -58420 -42313 -7498 29967 53128 53308 31600 -2121 -32916 -50547
662 -50547 -49466 -31186 -2245 29320 50699 50264 28129 -7932 -40661 -56051 -47820 -21175 11454
675 11454 36918 46860 39598 18261 -10231 -37404 -51683 -46244 -20418 14575 44650 55035 40874
688 40874 9306 -24489 -46296 -49081 -33884 -6514 23300 44433 48976 34498 5517 -26541
700 -26541 -48723 -49966 -29143 3356 32716 47476 44328 24658 -3318 -29500 -44246 -42848 -24823
713 -24823 4823 35030 51636 45795 20993 -12162 -38108 -47507 -36616 -11305 16915 37142
725 37142 44426 36462 15060 -13192 -36095 -44400 -33913 -8704 20893 42385 46082 31285 5645
738 5645 -19782 -36235 -39105 -26728 -3407 22394 40476 43148 28704 2232 -25470 -41375 -38386
751 -38386 -19666 5520 27555 38658 35505 19113 -4326 -26164 -38577 -36683 -19642 7050
763 7050 31421 41367 33261 11645 -14084 -33918 -39596 -30214 -9641 13341 30483 36762 28386
776 28386 6810 -18533 -36574 -39788 -27041 -3954 20705 35409 34928 20387 -1033 -21958 -35339
789 -35339 -35705 -21484 1745 24180 37088 35275 18571 -6514 -28402 -37044 -30208 -12501 9348
802 9348 27777 35267 29629 12801 -8656 -26864 -35306 -28650 -9642 14162 30951 35964 26665
815 26665 7155 -14165 -29437 -32629 -23286 -4943 15250 31385 34662 24079 3330 -17979 -31856
828 -31856 -32415 -19591 774 20427 31522 30072 17840 -944 -19530 -30911 -29968 -17132 3300
841 3300 22439 32552 29414 14275 -6625 -23968 -31139 -26566 -11393 8067 24345 31419 25592
854 25592 9811 -9967 -26398 -31833 -23407 -5613 13402 26706 29356 19691 2855 -14901 -27064
867 -27064 -28329 -19388 -2742 15350 26828 27469 16402 -2157 -19353 -29428 -27330 -14897 2605
880 2605 18665 26091 23281 10877 -6806 -21942 -28850 -24802 -10924 6572 20887 26239 20310
893 20310 6034 -10734 -23031 -26479 -20738 -6506 9826 21985 25878 18768 4379 -12345 -24094
906 -24094 -25983 -17095 -1801 14124 24325 25016 15757 870 -14151 -23919 -23783 -13411 1739 17024
920 17024 25429 24003 13183 -2751 -17063 -23807 -21369 -10101 5110 19057 25221 21614 9985
933 9985 -5842 -19650 -24650 -19782 -7182 8674 20413 24259 18315 4961 -10232 -21138 -23635
946 -23635 -17214 -3827 10528 21436 22973 14891 1061 -13575 -22804 -22522 -13272 567 14384
959 14384 21728 20835 11507 -2916 -15662 -22002 -19791 -9661 4276 16538 21952 18262 7835 -5361
973 -5361 -16188 -20535 -17385 -6594 6946 17363 21078 16687 6079 -7448 -17985 -20823 -15240
986 -15240 -3493 9773 19080 20660 14007 1702 -10618 -18471 -19092 -12628 -520 11514 18480 18202
1000 18202 11129 93 -11673 -18966 -18974 -10309 1483 12596 19124 18043 9560 -3555 -14403 -19438
1014 -19438 -16908 -7744 5038 15870 19705 15426 5389 -6115 -15702 -18624 -13969 -3363 8269
1027 8269 16283 18341 13593 3369 -7905 -15780 -17228 -11166 -1400 10080 17433 17862 10719 -51
1041 -51 -10142 -16581 -15772 -8617 2403 12360 16800 15011 7834 -2511 -11833 -16438 -14149 -6125 4360
1056 4360 13008 16778 13907 5134 -5725 -13692 -16393 -12267 -3786 6854 14134 15336 10942 2442
1070 2442 -7223 -13941 -15277 -10459 -1259 7466 13950 15054 10476 1248 -8715 -15081 -15152 -9710 201
1085 201 10448 16246 15381 8015 -1832 -11460 -15908 -14068 -6679 3111 11015 14822 13007 5690 -3728
1100 -3728 -12167 -15435 -12936 -5460 3637 11614 15024 12115 3355 -6300 -13624 -15856 -12252 -3071 6029
1115 6029 12873 14159 9234 692 -8581 -14004 -14082 -8730 -488 7761 12229 12386 7051 -1208 -8961 -12656
1131 -12656 -12379 -6842 1138 8776 12929 11199 5555 -2730 -9824 -12704 -10572 -4093 3873 9843 12090
1146 12090 9965 3759 -4131 -10333 -11959 -8910 -2417 4779 10700 11780 8150 1262 -6077 -11066 -12161
1161 -12161 -8250 -1062 6638 10798 10708 6441 -659 -8253 -12336 -11517 -6138 834 7497 11410 10465 4857
1177 4857 -2832 -9017 -12238 -10722 -5132 2694 9202 11860 9780 3441 -3986 -10050 -12388 -8993 -2448
1192 -2448 5071 10841 12185 8808 1925 -5769 -10465 -10302 -6328 -127 7152 11240 11334 6854 844 -5097
1208 -5097 -9187 -9283 -5496 805 7704 11591 11095 6625 -367 -7547 -10234 -8763 -3473 3044 8462 10612
1224 10612 8741 3358 -2757 -7603 -9448 -7933 -2642 3288 7692 8881 6873 2380 -3745 -8112 -9537
1239 -9537 -6855 -2245 3653 8248 9593 6707 826 -5326 -9340 -9361 -6012 59 6089 8913 8356 4553
1255 4553 -491 -5590 -8634 -8105 -4401 1442 6838 9283 8416 4167 -2311 -7255 -9019 -7136 -2134
1270 -2134 3247 7989 9477 7266 2086 -3126 -7673 -8979 -6556 -1014 4924 8001 8330 5441 619
1285 619 -4763 -8030 -8025 -5522 -279 4651 8045 8189 4491 -1280 -6351 -8337 -7999 -3965 1430 5490
1301 5490 7109 6185 2955 -1523 -6234 -7878 -6965 -3178 1587 6069 8415 6374 2025 -3130 -6924
1316 -6924 -7590 -5503 -1846 2821 6127 7102 5153 1207 -3069 -7017 -7456 -5053 -654 3769 6521 6746
1332 6746 4310 -284 -4348 -7059 -6932 -4504 -190 4071 7468 6835 3392 -1906 -5960 -7801 -6889 -2757
1348 -2757 1568 5140 6495 5214 1992 -2479 -6124 -7763 -6196 -2096 2945 6680 7465 4909 726
1363 726 -3749 -6026 -6424 -4153 -346 3823 6424 7100 4751 560 -3903 -6443 -5868 -2445 1157 4687
1379 4687 6651 5925 3673 -63 -3707 -5597 -5241 -2757 1471 5558 7110 5536 2416 -1851 -4209
1394 -4209 -4868 -3839 -1507 1657 4395 5455 4831 2312 -1359 -4839 -5983 -4548 -989 3118 5539
1409 5539 5617 3357 440 -2881 -4459 -5053 -3909 -819 3134 5471 5683 3412 -305 -3878 -5838 -5547
1425 -5547 -2401 1038 4126 5386 5015 2485 -1180 -4270 -5985 -4564 -1997 1956 5149 5777 3633
1440 3633 470 -2614 -4756 -5176 -3999 -693 2674 4530 5143 3639 132 -3825 -5963 -5475 -2871 418
1456 418 3267 5017 4102 1783 -1230 -3560 -5033 -4695 -2918 754 3491 4990 4371 1892 -1267 -3888
1472 -3888 -4621 -3935 -1366 823 3128 4926 4821 2353 -1293 -3742 -4720 -4079 -908 2695 5134 4984
1488 4984 3486 1376 -1208 -3305 -4299 -3303 -545 2212 4412 5580 4257 964 -2806 -4686 -4241 -2149
1504 -2149 201 2892 4500 4300 2369 -103 -2866 -4630 -4838 -2791 914 3518 4615 3572 990
1519 990 -2099 -4367 -4353 -3271 -1300 810 2854 3533 2591 464 -2416 -4357 -4370 -3250 -465 2149 3611
1536 3611 3195 2067 212 -2337 -3644 -3543 -2580 306 2746 4114 3903 1422 -933 -2989 -3278 -2470
1552 -2470 -876 1070 2750 3447 3033 1863 -174 -2754 -3760 -3119 -937 1767 3567 3512 2589 637
1568 637 -1507 -2715 -3531 -2907 -1265 1319 3433 3818 2780 -190 -2588 -4062 -3893 -2516 -2 2242
1584 2242 3107 3027 2048 73 -2894 -4022 -4157 -2349 687 2980 3994 2910 992 -1492 -2817 -3085
1600 -3085 -2504 -756 836 2626 3586 3379 980 -974 -3252 -3785 -2616 -268 1916 3239 3525 1871
1616 1871 513 -1538 -2717 -2979 -2052 354 1944 3444 3315 1677 -605 -1867 -2161 -2488 -1645 174
1632 174 1325 2676 2655 1433 64 -2184 -3253 -3265 -1456 993 2344 3178 2562 643 -1009 -2169 -2807
1649 -2807 -2452 -1201 813 2568 3145 2598 639 -1453 -2526 -2977 -1956 157 1634 2554 2798 2316 399
1666 399 -1279 -2871 -2766 -1874 64 2506 3507 3140 1217 -366 -2138 -2726 -2267 -999 558 2129
1682 2129 3266 2540 1390 -1037 -2323 -2885 -1867 -458 1388 2385 2508 1620 177 -994 -2154 -2356
1698 -2356 -1783 -606 1128 2585 2410 1564 67 -1483 -2375 -2029 -991 189 1115 2172 2310 1700 -45
1715 -45 -1557 -2431 -2555 -1123 487 2178 2846 2038 932 -440 -1512 -2098 -1712 -773 520 1745 2549
1732 2549 2066 778 -1093 -2346 -2691 -1646 -313 801 1958 2532 1758 386 -1316 -2792 -3506 -2141
1748 -2141 -287 1601 2631 1971 1002 -893 -2019 -2698 -2022 -1501 -58 956 2190 1707 1291 -894 -2096
1765 -2096 -2797 -2235 -832 663 1921 1794 1401 448 -712 -1873 -2134 -1246 -373 901 1777 2162 1751 112
1783 112 -902 -1470 -1279 -1329 -399 728 1683 1860 1462 353 -900 -1787 -2048 -1258 384 1238 1711 1128 875
1802 875 -122 -1139 -1332 -1541 -997 111 1180 1916 1871 511 -722 -1675 -1887 -1509 -590 754 1495 1531 1623
1821 1623 626 -600 -1852 -2119 -1492 144 1248 2288 1865 1174 78 -672 -1357 -1427 -1008 384 1510
1838 1510 2038 2058 962 51 -1627 -2029 -1383 -87 1297 1902 2113 1672 259 -450 -1288 -1607 -1522 -372
1856 -372 739 1370 2049 1399 186 -665 -1168 -1603 -1229 -508 457 1237 1634 1294 150 -1111 -1768 -1608 -1282
1875 -1282 -289 806 1408 1276 1016 33 -799 -1094 -1342 -1165 -10 668 1328 1563 919 -14 -973 -1447 -1383
1894 -1383 -520 306 966 1302 1437 801 -250 -851 -1494 -1247 -210 546 1322 1514 1041 217 -997 -1711 -748
1913 -748 -762 -27 693 1097 1310 427 -345 -1402 -1597 -1277 -796 20 914 1080 843 30 -686 -1465 -1662 -1111
1933 -1111 -682 226 1274 885 666 241 -809 -1265 -1291 -864 -166 529 1007 1396 598 115 -576 -1099 -1145 -510
1953 -510 56 968 1107 1114 694 -74 -519 -746 -967 -603 -153 870 1247 1490 1360 -164 -819 -1136 -1284 -738
1973 -738 98 817 1557 911 551 125 -1066 -1220 -1030 -853 276 1029 980 1120 152 -355 -1357 -1460 -736
1992 -736 -304 604 1072 1337 818 -213 -664 -1269 -724 -879 107 1084 1134 959 728 -45 -771 -836 -966 -147
2012 -147 436 754 1254 885 354 -386 -605 -1053 -431 -273 708 1000 1170 477 420 -295 -733 -902 -750 -262
2032 -262 158 720 961 651 163 -357 -772 -1017 -890 -339 519 866 760 482 -39 -752 -859 -851 -450 -34 540
2053 540 968 826 573 55 -279 -758 -622 -334 337 1158 1179 1029 546 -166 -779 -1318 -594 -252 752 988
2073 988 1147 925 310 -316 -515 -888 -630 89 659 1084 466 566 -214 -509 -833 -1028 -586 1 497 860
2093 860 852 123 -514 -1090 -916 -915 -114 43 538 399 119 -135 -411 -676 -907 -800 -430 431 660 525 480 145
2115 145 -456 -917 -597 -609 -140 646 1022 842 474 89 52 -714 -823 -320 153 490 645 1219 630 179 -576
2136 -576 -674 -644 -291 -95 647 1067 796 454 -185 -732 -1075 -812 -311 280 428 721 702 354 -483 -612 -580
2157 -580 -685 -465 294 638 610 626 -68 -147 -789 -1119 -397 -17 665 466 450 197 261 -603 -1009 -510 -93 -20
2179 -20 236 382 309 477 -230 -69 -541 -628 193 174 1035 496 562 405 297 -506 -472 -42 -135 -119 413 653 589
2202 589 120 -61 -779 -765 -28 -161 316 548 519 371 -120 -113 -659 -542 -564 123 460 886 514 184 -354 -672
2224 -672 -659 -633 -131 337 830 639 647 233 35 -701 -644 -389 -76 383 502 826 539 365 -360 -363 -423 -304 184
2247 184 550 835 692 495 162 -521 -246 -494 -176 37 398 266 608 360 -130 122 -547 -764 -380 -214
2267 -214 293 417 119 -115 -246 -65 -370 -694 -535 119 335 510 315 108 -547 -535 -320 -629 -148 -247 206
2288 206 637 309 40 -323 -241 -586 -576 26 421 560 456 39 -131 -732 -481 -156 -167 125 37 552 528 373
2310 373 -207 -341 -496 -559 155 156 624 59 183 23 -425 -346 -560 -777 -113 231 602 615 37 -352 -462 -644
2332 -644 -422 257 -16 113 75 304 253 -119 -337 -547 -656 -321 390 859 243 99 212 106 -17 -116 -295
2353 -295 -258 321 414 608 896 314 -252 -381 -327 -203 350 71 249 117 268 375 145 -16 -624 -394 -126
2374 -126 516 783 547 277 -19 -476 -671 -292 -123 -131 -57 463 958 336 45 -445 -660 -634 -301 456 293
2395 293 -53 45 -43 -358 113 -374 -660 -251 -42 656 640 427 -282 -355 -127 -17 408 10 -105 31 596
2416 596 460 245 -291 -618 -508 -119 175 631 511 158 -260 -138 -271 -119 -188 -710 -285 -55 382 497
2436 497 68 -481 -694 -704 -680 -66 107 -234 45 -47 220 121 -250 -796 -709 -308 279 652 635 -96 -572 -453
2458 -453 -3 -82 109 -250 -59 186 229 470 132 -346 -867 -225 255 660 328 234 23 158 194 670 -105
2479 -105 -422 -551 44 539 892 407 -336 -338 -538 56 -217 382 78 -212 249 679 375 20 -748 -701 -74
2500 -74 215 691 702 -69 -480 -440 -181 434 -10 -397 -265 -137 341 504 393 -174 -763 -659 -269 449 32
2521 32 164 -57 222 282 506 94 -246 -530 -171 764 643 471 37 -177 -35 147 414 89 -301 -168 6
2542 6 518 629 434 12 -392 -379 61 440 466 15 -481 34 334 806 317 -408 -597 -28 280 747 248
2563 248 -115 -651 -308 155 212 254 -114 -465 -291 329 438 163 -424 -852 -377 -86 596 681 -17 -143 -341
2584 -341 -110 436 253 -228 -742 -19 503 383 441 -73 -487 -537 113 605 337 -140 -362 -743 312 233 -156
2605 -156 -802 -764 -616 406 576 362 -121 -501 -532 -43 572 270 -518 -508 -337 209 656 235 -355 -700 -955
2626 -955 -236 654 403 298 -366 -276 257 574 519 -293 -768 -377 142 892 740 138 -541 -833 132 193 696
2647 696 -46 -389 -144 119 794 605 -334 -950 -578 180 731 586 201 -736 -650 14 280 305 -216 -439 -166
2668 -166 70 674 316 -85 -736 -532 207 538 371 152 -658 -337 85 748 484 -146 -877 -477 162 716
2688 716 1097 342 -470 -681 125 657 591 -139 -488 -137 291 751 553 -81 -693 -620 252 591 622 -92 -230
2709 -230 -406 63 439 948 149 -533 -616 368 841 560 136 -545 -817 -149 215 530 151 -414 -465 90 669
2730 669 613 -330 -770 -694 -166 546 690 49 -606 -702 137 540 521 -82 -628 -488 74 715 663 23 -522 -365
2752 -365 -23 390 660 70 -203 -392 -156 580 520 148 -728 -578 361 518 884 223 -396 -605 -6 399
2772 399 357 250 -877 -794 183 690 583 -27 -733 -630 -411 510 723 94 -449 -479 70 387 619 -104 -729
2793 -729 -924 -179 772 833 367 -700 -796 -381 458 624 306 -329 -248 -164 616 765 -120 -494 -792 -309 762
2814 762 749 433 -561 -646 -126 480 488 -309 -655 -649 -2 725 932 -95 -290 -964 -32 702 804 3 -685 -895
2836 -895 -74 699 389 103 -767 -581 -92 678 776 302 -312 -1023 -321 608 586 280 -406 -783 210 797 617
2857 617 173 -499 -534 -523 605 1015 151 -355 -525 -253 276 534 110 -495 -589 155 691 847 445 -663
2877 -663 -779 -195 432 711 -37 -354 -693 -67 636 711 321 -503 -801 -352 547 897 315 -267 -635 -333
2897 -333 355 398 520 -670 -889 -175 481 610 79 -565 -1052 -253 601 701 401 -153 -760 -198 734 658
2917 658 50 -586 -801 -217 213 1115 170 -438 -319 -268 555 578 300 -265 -605 -479 283 840 278 -214 -794
2938 -794 -305 730 859 400 -195 -321 -545 434 605 369 -654 -782 -20 406 726 559 -403 -798 -324
2957 -324 208 551 263 -433 -799 -290 569 828 266 -361 -1000 -465 725 1053 313 -430 -901 -366 319 687
2977 687 248 -589 -732 -208 707 622 498 -467 -780 -47 555 761 490 -120 -367 -314 594 380 259 -531 -711
2998 -711 -215 359 865 590 -572 -961 -509 264 719 175 -418 -694 -167 694 668 259 -396 -1268 -455 186
3018 186 909 719 -330 -582 -82 331 672 159 -506 -988 -537 466 666 258 -555 -771 -123 -14 323
3037 323 555 -387 -427 -403 698 826 219 -278 -749 -182 350 714 506 -308 -807 -326 280 545 304 -311
3057 -311 -628 0 255 727 275 -575 -848 -406 552 647 460 -300 -593 -345 265 598 104 -114 -859 -354
3077 -354 67 655 483 -556 -797 -536 468 495 540 -146 -612 -309 222 572 -81 -537 -503 -653 320 686
3097 686 387 -35 -401 -392 573 691 269 -63 -475 -325 382 824 644 -147 -600 -203 66 753 150 -160 -740
3118 -740 -370 120 437 640 66 -972 -296 207 498 416 -317 -556 -259 194 423 438 -222 -678 19 605
3138 605 545 245 -152 -770 -603 325 503 365 -45 -455 -451 106 491 212 -265 -492 -441 151 916 686 -121
3159 -121 -577 -431 181 510 463 -185 -387 -398 286 706 353 -255 -571 -496 -65 490 483 -408 -586 -255 -92 717
3181 717 77 -237 -579 -194 380 567 413 38 -370 -562 294 548 453 57 -217 -563 475 893 653 -143
3201 -143 -970 -505 105 653 440 -9 -605 -498 -56 216 546 97 -398 -563 20 622 350 -65 -468 -37
3221 -37 179 374 593 -112 -374 -390 78 421 517 -131 -324 -760 62 639 519 -30 -533 -333 37 299 485
3242 485 -81 -442 -587 -179 504 167 87 -224 -416 131 233 166 -296 -621 -553 -165 721 -134 -16 -220 -478
3263 -478 151 479 388 -28 -624 -446 116 364 514 53 -538 -469 357 452 247 38 -443 -278 162 458 498
3284 498 -145 -608 -251 215 174 324 -70 -479 -420 150 804 207 32 -375 -236 45 485 160 -46 -497 -605
3305 -605 121 502 513 -219 -458 -446 -79 411 282 -34 -660 -289 24 631 552 -2 -209 -135 44 698 374
3326 374 173 -561 -657 361 523 -87 263 -228 -381 59 379 371 42 -343 -224 36 414 659 -156 -353 -457
3347 -457 230 402 232 143 -468 -264 -331 421 424 -202 -422 -460 27 593 738 9 -457 -267 74 413 123 -444
3369 -444 -483 -363 -81 266 462 -146 -660 -365 -196 340 632 -57 -264 -475 -62 624 202 97 -293 -444
3389 -444 -45 80 727 -9 -154 -455 88 297 195 -40 -448 -416 268 513 357 70 -321 -728 -228 383
3409 383 73 84 -513 -453 90 142 288 30 -252 -365 -315 -7 48 -130 -426 -525 -40 74 245 -175 -181 -407 -236
3432 -236 455 171 -63 -214 -540 -10 192 190 -54 -229 -213 -189 8 325 147 -470 -516 -137 66 215 15 -396
3454 -396 -202 -144 313 521 147 -53 -65 -279 367 250 -82 -532 -146 12 246 278 357 -110 -415 -28 95
3475 95 165 -18 14 -488 -185 -256 302 114 87 -291 -419 170 32 180 -53 -277 -28 245 440 -148 -169 -291
3497 -291 -219 -118 152 189 -389 -188 -247 457 281 -1 -146 -643 13 201 385 -17 -266 -342 -206 187 208 -233
3519 -233 -119 -221 89 187 -18 71 -286 -259 335 373 198 327 -191 -419 -26 107 146 -100 -317 -73 -308 111
3541 111 256 24 164 -51 -194 125 211 8 25 2 -216 126 231 289 -100 -280 -71 389 186 211 -364 51
3563 51 -133 48 464 -215 34 -90 157 50 291 244 167 -131 -99 -33 -3 48 -207 -195 -95 218 -5 40 -108
3586 -108 -283 -135 -7 93 220 -51 -466 -262 342 -29 24 -221 -169 16 -49 141 132 -66 -203 43 74 63
3608 63 -2 -200 -80 -353 72 151 148 -70 -400 -154 339 -47 371 195 -160 -185 -60 413 208 192 -93 95
3630 95 185 172 237 30 -90 288 9 16 109 101 30 -98 22 200 -18 -21 -28 -118 -87 97 -79 -22 13 -143 -97 131
3656 131 71 -88 -42 -219 -189 -156 101 -138 -311 -220 -55 133 128 54 -64 82 -91 -52 -93 -172 -132 -39 30 285 360
3681 360 134 81 -494 68 424 43 26 141 110 116 14 -106 -216 -21 -41 -240 177 133 -165 214 -113 104
3703 104 238 -84 -69 -365 410 485 74 -46 -81 97 -178 58 253 205 229 -76 -133 -14 207 68 -40 -71
3725 -71 -148 56 122 114 -153 -223 -97 125 192 -140 -293 -99 3 14 266 80 11 35 -148 67 8 157 -277 25
3749 25 -29 103 166 -125 -184 -129 -71 140 414 276 36 -186 -53 -38 215 174 -119 46 -22 -46 -96 -80 -317 -38
3773 -38 -60 293 141 -126 -82 -126 57 -22 244 28 92 -3 -81 -134 386 222 -176 -72 89 -212 248 39 107
3796 107 -85 -154 250 84 237 54 -32 223 -116 -133 -116 155 16 297 199 375 278 -24 -155 171 -21 55
3818 55 137 -68 -82 -142 -189 329 11 -117 -117 134 -332 104 -235 -41 211 19 267 82 -177 -107 -111 -117 -65 148
3842 148 68 -55 68 -152 -83 93 -66 201 119 -320 -31 -104 -126 92 195 -206 -131 275 381 93 -145 -40
3864 -40 35 147 86 -372 91 130 -196 -173 106 70 109 218 98 -75 147 98 -204 -189 -310 252 157 -76 -154 -68
3888 -68 -153 25 -46 -90 198 106 -76 277 275 -16 -92 216 253 210 -135 -298 -12 -35 84 107 21 82 14 -208 116
3913 116 170 -14 -52 -174 -345 -106 -345 24 50 -168 201 161 -177 -37 226 -243 -166 127 110 191 -203 -302 4
3936 4 -73 -215 -394 -233 -453 -93 -33 -105 -77 -145 -345 -138 149 227 -86 -25 -167 -163 78 30 132 -176 -64 109
3960 109 -13 23 -35 -344 97 278 35 5 -87 69 161 147 181 42 -76 83 -90 68 163 154 -9 6 174 82
3984 82 -135 39 79 32 143 76 158 7 75 -17 87 30 -112 -54 -35 69 -65 -34 -157 -121 -48 -203 -291 -82 -172
4009 -172 82 116 -222 -125 -362 -36 -54 -120 -297 -173 -64 97 87 138 74 263 46 16 -20 -43 -146 47 246
4032 246 -1 -198 -34 23 -5 -111 -55 86 75 155 167 -113 -49 -32 -2 -32 -43 258 124 -79 16 -296 186 -1
4056 -1 58 85 100 -47 -62 139 5 -39 164 111 -423 -262 -160 363 81 -124 253 46 314 -3 202 -70 -82
4079 -82 -14 -213 -223 66 197 275 71 298 127 -362 138 44 -244 280 -76 -219 316 -180 329 177 114 -319
4101 -319 -26 65 -112 -155 123 199 -16 -147 83 49 23 13 163 29 99 -101 -158 -97 30 -71 96 -17 -83
4124 -83 148 -65 -95 138 -189 -137 103 -123 -67 75 15 -128 75 218 36 -449 50 35 -292 -402 6 80
4146 80 177 -2 76 -40 -93 251 26 38 93 151 -2 330 47 -76 75 -120 -148 239 -123 -92 -221 -183 156
4169 156 4 72 51 163 27 167 -34 16 -8 -245 231 -207 79 204 318 -42 -46 -296 -15 -91 221 -319
4191 -319 5 166 -37 -75 87 89 -65 -14 397 124 -17 -131 -6 53 -102 396 112 -4 -19 -47 -46 -43 -90 -104
4215 -104 -186 -105 81 -183 61 306 -112 -153 -44 -325 32 -189 123 -75 -91 -159 92 229 -104 36 202 80
4237 80 -334 -146 -288 -47 94 -44 25 184 80 -108 472 -36 -19 109 33 -194 93 -225 76 237 176 -215
4259 -215 -127 -253 -100 144 165 -26 84 93 -50 143 -108 210 81 41 107 7 128 20 -170 232 113 330
4281 330 -36 47 -143 -77 -15 102 8 1 8 95 25 378 -184 -126 -98 20 -2 -150 613 -238 103 222 -15 181
4305 181 -42 -96 76 139 -38 53 56 23 94 -119 -98 122 -221 -437 252 -121 -80 -85 67 -98 -169 -215 45 -148
4329 -148 -12 -135 -336 90 60 250 -26 146 2 182 -144 -109 148 -125 299 -106 -91 -84 -27 -56 39 255 228
4352 228 -116 105 -52 133 56 -37 -266 -156 92 -119 -82 204 133 -42 -265 -207 -297 -69 -30 -128 151 139 -63
4375 -63 -205 -11 -102 124 -9 -174 270 -128 -276 481 44 -73 -219 -139 107 -150 262 173 2 10 -156 -283
4397 -283 -125 -248 -118 48 112 43 -164 108 334 -5 -140 -148 -94 -70 -261 -149 34 248 -96 -162 -178 19 -245
4420 -245 -53 -209 -190 308 -18 -259 155 89 -95 -38 241 129 -208 152 82 -14 332 99 208 -154 -190 -140
4442 -140 -42 -100 91 -82 -8 92 75 -42 -114 107 14 -141 -60 -28 -52 -7 -65 -37 60 183 -58 -160 49 -378
4466 -378 -126 58 -25 -14 -242 107 155 148 -1 -214 -107 253 65 -115 274 -153 56 223 -113 -28 -90 -60 -5
4489 -5 208 -239 1 -222 -6 -132 -1 -2 19 137 269 208 -272 126 -133 -254 77 -25 14 261 -140 163
4511 163 90 -402 -42 -107 193 -232 -69 1 -242 57 -47 -78 95 -312 112 127 -117 71 62 -118 152 -229
4533 -229 80 18 36 22 38 55 211 -132 -72 -106 -138 80 385 -64 78 4 30 -216 -83 344 -176 13 134
4556 134 178 194 58 -53 -8 86 118 -18 71 -43 -427 36 -159 0 158 -106 0 -179 98 160 -154 -166 321
4579 321 53 119 351 -134 59 -183 260 -202 199 -14 111 -16 -81 127 287 25 37 66 -104 -165 -392 223
4601 223 -14 -166 -217 162 -104 209 -123 -164 126 -229 -10 -90 -79 -13 58 -94 175 -104 -265 -37 -73 227
4623 227 280 188 55 -271 250 -68 47 65 -207 -2 319 -233 20 122 -181 166 86 131 -23 266 35 -39
4645 -39 32 48 -152 144 29 -70 -157 159 -12 58 -39 -224 88 -109 -121 189 60 -81 -325 -257 126 80 14 -196
4669 -196 266 2 -301 -30 -228 217 107 -55 93 -166 -65 85 -49 -147 -143 11 79 -108 -317 -106 72
4690 72 -157 -276 -77 -190 -63 -68 115 55 80 -240 -89 131 -215 51 -217 -103 160 121 90 -44 -225 344
4712 344 29 67 32 63 96 245 89 -77 264 226 123 15 215 40 100 54 23 127 75 22 249 -16 -119
4735 -119 411 -12 289 -30 -141 -227 257 -125 28 284 -26 -182 281 185 -42 52 44 105 -72 -150 -285 53
4757 53 172 -33 124 67 -54 -62 102 188 153 -120 56 35 151 -106 -110 -145 -4 257 57 -100 -182 162 226 205
4781 205 -20 88 41 -204 79 102 55 101 199 155 66 43 -116 -148 -223 -184 -223 -319 -39 0 -57 -282 70 -91 -147
4806 -147 135 134 -17 220 210 206 -99 -86 155 -138 380 -122 208 -140 490 177 -48 -52 -207 172 62 -31 114
4829 114 -129 59 146 170 64 145 -76 -167 -86 48 191 75 27 -112 180 -165 100 -62 -87 -27 -74 148 -175
4852 -175 -106 180 139 24 30 56 -21 77 -40 -21 -213 43 -22 -170 -61 -135 65 89 -96 -203 70 263 -33 -58
4876 -58 3 96 78 228 233 87 -282 -68 204 109 -212 -45 -20 28 39 191 -394 -93 57 -346 47 40 -68 193
4900 193 123 217 -121 49 -16 250 243 -214 -120 -80 -225 128 -47 19 -44 123 -28 145 -16 41 -31 -121 10 -340
4924 -340 153 43 -79 236 -124 -193 -95 10 0 -264 -166 -102 47 57 -61 -10 -5 -59 15 -52 -170 -114 17 140
4948 140 -161 -98 -126 28 -332 368 80 -56 173 159 -143 -165 -273 420 371 -185 -55 155 137 84 176 -312 48
4971 48 -103 -71 -83 -164 111 -106 -213 -151 -407 160 124 -327 218 -210 -381 -129 -250 -179 41 -239 -224 9 164
4994 164 7 -94 120 132 -233 172 -218 251 204 61 -62 18 207 -229 -131 68 -90 89 93 225 -57 -146
5016 -146 149 259 -24 124 71 -137 -57 159 126 208 -140 -46 -456 -106 -154 78 121 -291 -140 11 88 27 363
5039 363 -77 -46 -151 75 -45 46 -260 -42 -86 -71 -124 -6 -166 63 -194 -72 257 -127 270 -20 251 -441
5061 -441 19 75 -39 -69 285 -106 -388 161 -97 183 -165 -230 -137 113 77 -18 -129 242 2 26 160 93 -40
5084 -40 -114 -35 -11 -125 -48 9 -159 476 -152 -152 15 -65 42 -125 19 73 -65 -219 -123 -24 -29 -134 290 66 -47
5109 -47 144 153 103 -212 -208 193 66 110 42 6 -216 37 -187 169 158 235 -139 -142 -201 43 176 -140 177 68 131
5134 131 180 -181 28 148 -77 2 -8 -7 -366 107 97 228 48 -104 -14 -201 -8 -77 400 -273 -63 147 279
5157 279 210 58 -54 -58 65 31 -153 -185 2 -41 117 363 -195 230 331 -244 174 -108 136 4 78 1 57
5180 57 -19 -44 187 221 -85 -65 -113 136 124 154 109 -145 137 -47 -13 35 -94 -266 -126 24 216 -179 -218 26
5204 26 29 47 -25 242 -161 361 -128 36 89 217 24 -97 -193 -125 196 148 -195 -218 -213 -224 -305 -200 -41 193 -15
5229 -15 -275 84 0 -148 -52 -340 135 48 -245 182 -119 89 18 94 41 100 -238 -168 -247 -159 7 97 -3 -133
5253 -133 15 -218 -72 -207 -110 56 -388 286 -146 -67 -39 -18 -114 187 -187 98 69 -103 -44 142 272 84
5275 84 55 128 73 -100 95 12 -61 -106 -325 -46 294 193 290 162 -61 -130 -13 183 -64 -62 253 -156 188 120
5299 120 157 108 273 -103 123 257 -170 -45 -209 -122 437 -118 -151 -35 -23 208 182 243 22 -84 -4 -179 -236
5322 -236 -30 -34 -117 63 152 202 36 -96 83 0 -38 56 -352 -394 -26 -30 -285 -25 226 -332 39 -159 145 -167
5346 -167 91 11 51 -107 -23 -104 -237 19 60 40 -156 -3 124 106 52 -164 -34 -103 -73 -219 -36 -94 197 160
5370 160 -131 91 143 238 24 33 169 120 113 -6 -103 -82 -86 -309 228 69 72 81 -180 183 74 -200 -109 51 102 5
5396 5 -59 8 -124 97 -147 229 -385 -200 156 186 64 243 -335 98 -8 92 40 176 -50 -210 -70 197
5418 197 -205 169 35 74 -315 135 130 -258 81 -134 -256 165 50 119 -3 133 -165 114 96 -436 67 89
5440 89 -94 -419 51 -109 -8 57 -111 -103 2 -20 73 -2 -115 -15 35 -72 -38 169 161 133 527 -20 -111 -91 228
5465 228 -65 -105 168 376 230 -220 -122 93 185 165 74 -154 16 -32 49 -86 -39 -108 277 -47 59 -163 -23
5488 -23 -49 193 -59 -51 143 -98 257 4 -63 36 0 -174 381 -49 -46 -151 -132 21 -40 -98 -315 -246 -170 234 147
5513 147 263 206 -11 125 474 164 272 245 -141 -265 -196 -1 157 -81 -115 -201 13 -226 -24 -11 -31 144
5535 144 -267 -251 -22 -48 -216 216 -93 110 62 57 257 5 47 -168 280 -173 245 -35 255 247 -144 -220 -50
5558 -50 97 -291 111 141 -178 -25 -319 -48 140 174 -213 25 -91 216 -418 -197 117 20 -33 313 13 -71
5580 -71 -54 57 -2 -50 -43 -51 331 280 -98 225 214 -252 81 116 -108 -131 5 68 139 79 88 -152 -91 -241 -83 -35
5606 -35 -106 120 -219 -3 -176 -140 -104 109 213 -149 -217 -117 -22 -2 142 -206 84 91 39 -114 219 64 106 -196
5630 -196 103 -77 -90 19 23 -11 -180 129 127 -12 -149 -65 64 -124 50 104 24 -107 -42 50 78 35 32 35 -249 62
5656 62 386 -158 169 130 -232 93 -42 -81 -138 -174 -439 -128 255 -27 -90 -122 77 -76 29 18 245 140 91
5679 91 245 -12 -9 -34 -145 -232 234 95 47 127 140 -172 287 -327 76 -87 -322 -21 56 66 106 35 -24 -13 -233
5704 -233 -74 -79 80 -160 174 -289 -38 -54 266 -164 -161 215 72 -8 233 -18 -70 279 201 87 -15 208 -240
5727 -240 91 -80 -150 -46 108 -148 -192 12 -54 -111 -109 260 224 -41 436 6 177 -33 -49 -41 -39 428 -95 -310
5751 -310 31 192 -140 -118 -139 18 -23 92 138 -148 -155 -92 -94 -63 14 266 55 86 -90 31 -239 85 -269 -161
5775 -161 -171 -83 47 25 30 310 -145 16 -59 -65 159 -99 -89 -129 -84 -10 -245 97 98 -155 52 304 111 -11 83
5800 83 -40 -81 224 245 -118 44 -127 -41 193 -82 -205 220 -291 -74 194 132 98 -153 169 -21 -122 -242
5822 -242 106 -119 -313 -4 -74 79 -19 -87 263 75 208 286 12 58 -92 -150 -145 -169 90 -126 147 -84 101
5845 101 -63 10 129 -355 -118 119 7 231 -183 110 -203 49 2 -20 -229 140 174 66 -121 -38 -8 23
5867 23 216 -251 204 -6 -93 91 290 -49 -255 67 30 -37 -50 162 33 -69 184 -39 157 48 50 71 13
5890 13 -126 30 167 26 -82 71 -175 118 54 144 -87 -175 -9 278 22 44 373 -278 190 236 19 45
5912 45 135 -138 149 -212 218 -139 48 -228 180 26 217 -21 -165 39 18 271 -72 17 -65 130 -269 333
5934 333 80 20 -223 19 -192 22 -203 -42 10 -87 163 6 -211 -198 -113 124 152 63 252 21 39 -35 29
5957 29 -84 -122 -206 -46 72 -223 186 64 169 81 -32 296 248 14 -106 65 14 25 53 154 -58 -16 -109
5980 -109 169 200 -52 -47 24 104 -164 -149 -37 26 231 100 227 101 -190 137 34 115 -4 28 -82 50 133
6003 133 -148 263 159 102 184 -156 66 -140 161 196 108 -32 74 12 -192 -167 172 -106 -275 166 -90 -153
6025 -153 133 -68 83 82 -232 21 2 -114 -17 -251 223 -71 43 137 67 80 111 -126 46 -147 23 6 136
6048 136 -62 177 -124 -401 105 238 165 125 -325 57 -24 33 93 36 -52 -111 -47 7 -62 81 -4 -63 -19 89 311
6073 311 169 81 -22 -283 88 -8 -198 -54 5 127 -139 92 161 180 -17 81 -74 -35 269 -221 300 -117
6095 -117 -97 11 -6 -26 -173 231 159 -25 -106 -271 277 -86 -147 503 52 0 156 17 11 179 -294 5 -56
6118 -56 205 -41 402 -228 111 -77 -39 -176 -24 21 6 220 -123 -155 62 -249 29 242 16 -260 86 185
6140 185 75 -48 54 -155 -104 -204 -38 -79 100 -116 102 165 -87 64 -120 5 -97 54 237 -14 87
6161 87 103 -203 291 -52 74 188 15 191 219 266 -24 -355 -17 -180 47 -81 -308 -92 -91 6 84 1 -101
6184 -101 -104 -117 -141 -230 -139 329 -214 -118 133 168 29 -118 79 221 55 71 -13 228 -262 35 -153 119 99 -382
6208 -382 -47 250 44 7 -80 -283 -70 97 378 -47 -43 203 -71 -40 -1 -110 -103 -165 106 -267 57 182 -23
6231 -23 -88 -347 228 5 158 318 0 -139 -215 116 -74 20 30 34 167 -192 79 -165 -90 23 37 19 -124
6254 -124 -30 -110 -201 62 -22 34 -60 -112 -64 -231 -161 -47 -39 169 -80 -45 -11 -41 -23 -205 -244 44 -124 4 -364
6279 -364 -179 -181 132 156 140 -169 -57 95 138 -181 -317 158 25 118 135 1 -18 26 12 -186 320 69 93 97
6303 97 -213 -246 26 54 345 3 -6 42 135 127 84 -68 -144 -170 -33 76 179 -88 44 -47 -49 -88 41 232 -7
6328 -7 63 -100 19 -30 375 -58 -51 78 -62 -319 -172 -205 13 171 338 -63 -12 -25 25 115 48 69 -245 52
6352 52 -142 282 306 124 -120 -85 -32 15 -338 -160 112 -75 152 350 183 -292 133 -31 263 -55 14 165
6374 165 83 -67 106 165 167 165 121 204 -286 -131 83 -5 196 -267 -78 -205 -28 363 -3 -229 40 -185 139
6397 139 123 234 -136 44 104 -59 14 -44 8 -232 -231 197 -51 -228 81 104 70 -103 2 -204 -118 61 66 -50
6421 -50 -46 -76 -353 -157 -397 -27 23 59 -75 -207 21 -184 -170 -128 63 171 285 197 52 74 329 -178 25
6444 25 -61 -226 23 -73 -137 86 -160 156 67 243 184 -93 68 94 80 -28 -135 60 -435 4 -116 319 -68
6467 -68 201 -278 -257 -151 437 22 -47 104 321 -104 282 -158 -71 -17 -8 -72 93 -54 85 294 -38 265 -204
6490 -204 72 -31 -73 -77 51 -265 27 114 -101 161 30 83 -171 159 210 -161 330 104 -59 -19 -59 -152 -31
6513 -31 26 55 186 249 -160 184 137 128 296 373 -205 -38 -171 -7 -65 -40 177 -37 151 -12 152 -75 -103 -126
6537 -126 -114 292 -33 -16 -198 -182 65 498 -165 103 225 11 64 -27 273 -241 -128 -137 -3 -141 -153 61 76
6560 76 -120 82 -4 76 -201 -63 10 35 66 219 117 -39 288 -276 40 -35 138 372 -82 106 190 65 62
6583 62 -1 101 39 -52 36 97 264 1 294 116 -121 89 384 71 -125 -22 45 50 110 -132 -224 133 -119 -49
6607 -49 145 235 -40 25 -2 248 -82 0 -174 -363 -17 -32 51 -204 -272 46 127 130 -166 -103 120 -59 -68 175 159
6632 159 -236 -22 -8 -187 -107 -9 9 -17 -138 249 -36 125 61 -99 44 -83 -371 -12 108 468 97 55
6654 55 -74 -295 20 88 90 88 -95 3 151 -26 -180 -24 63 21 -56 -127 35 68 14 -94 121 -237 -118 -10
6678 -10 -135 164 -48 -28 -248 -10 100 48 127 87 168 -100 -116 -43 21 54 -3 -48 18 -223 -79 124 -198 205
6702 205 -22 -42 198 58 74 -211 144 298 -219 257 -86 23 -57 -21 -146 -96 60 108 -187 25 -210 -329
6724 -329 274 -500 45 341 -240 118 225 -239 31 65 188 -35 -71 200 -222 69 -307 149 -333 -140 65
6745 65 240 162 40 193 -181 43 -12 -234 -5 234 164 -43 -112 176 -5 187 -202 -294 -102 -206 -100 25
6767 25 -84 -100 -89 -291 -238 -33 243 8 49 95 -32 -52 -71 -194 52 -154 -13 320 -136 22 -42 -75 300
6790 300 -77 -46 51 246 38 -197 -34 301 -58 -8 -172 -212 215 -14 70 -94 45 -143 107 -116 -328 -100
6812 -100 -45 51 315 -94 204 -21 -68 119 -44 223 -279 -37 -135 -167 199 152 -307 -366 152 83 263 -46 37
6835 37 144 -7 10 -116 183 43 -338 -93 -5 81 176 241 188 233 -104 -138 97 -97 248 -42 40 213 -48
6858 -48 57 263 371 188 33 -75 169 -39 133 225 -30 -53 49 -323 153 -18 -144 195 -266 163 221
6879 221 -510 -20 -122 74 -25 -358 -59 -163 -151 192 -88 -204 -137 -110 -51 -102 267 -247 -69 -141 -100 -56 -102
6902 -102 118 84 38 -354 123 -110 -1 90 5 -279 -228 -272 62 99 -315 -69 315 17 -106 197 476 114
6924 114 -253 -123 -245 -110 104 -218 -109 280 317 295 -28 90 -4 36 -201 305 109 49 -146 -105 313 60
6946 60 -115 109 61 -123 34 42 150 154 347 -339 -84 8 -34 -15 -148 -31 82 53 102 -17 -67 147 -263 -161
6970 -161 -57 42 57 -250 -277 -23 -175 -269 21 -63 -71 250 -214 98 288 -228 -85 329 207 63 251 -199
6992 -199 133 238 -6 331 361 -69 211 -154 51 496 14 127 -320 241 72 191 15 63 132 20 51
7013 51 232 -324 186 64 -153 -283 -234 0 105 -145 12 5 219 87 36 -69 66 213 -25 328 -122 -171
7035 -171 -73 -85 43 45 -27 59 -152 -234 -291 -79 126 174 38 218 -59 49 -72 -103 94 -182 103 -145 218
7058 218 -11 -184 -213 166 66 272 -99 -44 150 50 -47 -19 -142 -155 -8 78 23 -86 42 -130 96 -320
7080 -320 171 138 -102 -229 417 159 -8 80 31 99 -26 -267 -73 -86 -153 190 338 -25 -241 -83 97 -81
7102 -81 92 -36 94 138 133 73 196 245 -148 23 323 140 -156 8 67 -87 270 -14 48 -77 201 -18 -31
7125 -31 267 -395 -41 246 75 -13 48 -36 -78 -113 -16 298 -319 21 169 -54 261 -184 138 -171 145 110 -270
7148 -270 52 90 -97 142 -118 -40 40 7 184 -109 -104 -45 18 -126 229 132 -33 -161 -306 127 140 -6 -94 9
7172 9 127 33 93 -95 -114 83 -81 -107 -318 73 -63 -106 114 -35 -36 -135 105 108 123 -73 -79 21 271 65 -101
7197 -101 73 236 -88 -264 51 -19 -493 -358 126 -225 136 25 175 -90 8 60 258 -290 357 -128 -149
7218 -149 -129 -137 2 95 66 139 15 14 -118 137 246 10 159 42 -7 -111 -11 -21 -116 -20 -181 -202 -65 -286
7242 -286 -122 32 242 -70 -30 -71 409 -4 -159 311 -196 127 99 -226 241 -97 -80 -154 158 -63 80 133
7264 133 -221 125 264 -51 -136 -85 141 -183 249 -90 -49 390 222 -52 -12 -27 -168 134 85 175 222 -37 20
7287 20 -148 61 201 -323 -80 139 -197 -85 181 -13 -85 -34 -260 271 97 -16 -128 -335 -145 205 19
7308 19 142 11 -92 -103 -54 25 38 -109 -202 -53 -29 -202 -104 58 -153 -70 -11 300 73 -154 34 -27 -101 168
7332 168 72 108 -118 -114 88 31 -225 233 73 6 -314 250 2 250 318 -82 -117 -107 -390 59 145 183 -278 113
7356 113 13 93 105 -143 290 126 -19 -240 301 -163 -2 -75 -232 52 -236 -195 89 97 46 -37 201 -100 -82
7379 -82 59 13 -93 -137 157 -22 170 3 235 -299 -21 15 132 9 -36 -202 -217 -353 85 -225 108 95
7401 95 -59 120 -265 113 70 299 -18 90 37 216 451 71 141 -83 202 22 128 -209 -348 -380 177 -37
7423 -37 -162 11 -100 -96 274 142 11 7 95 -229 55 -46 -202 36 -130 26 -335 -136 204 58 -256 -27
7445 -27 -104 -113 119 14 218 -90 85 -338 132 136 -244 -122 -52 40 -180 163 -424 225 121 -68 20 25 300 183
7469 183 93 89 26 236 67 -153 -104 137 -60 -2 -70 90 28 35 176 1 73 -229 110 326 -134 -140 -37 261
7493 261 -175 160 35 381 59 152 45 84 -6 -183 -214 -304 -180 59 66 254 153 -112 -169 151 36 -36 -202
7516 -202 15 97 -102 -32 25 216 42 173 -38 21 -67 -45 -100 87 -3 -217 151 130 -26 -314 227 344 132
7539 132 -267 234 -199 304 -169 145 90 134 -187 -251 -96 16 -149 -308 -151 93 -121 -44 -68 -129 66 -81
7561 -81 -63 -52 42 116 -94 -83 458 -21 -75 89 -136 -211 213 -19 113 261 -161 261 71 119 124 -218 124 -55
7585 -55 -23 -243 96 74 158 -156 105 313 208 -367 -156 -264 -108 230 83 -133 -183 -50 -200 -224 -54 30
7607 30 104 -16 -197 134 -23 76 -27 193 78 -142 22 116 191 290 -68 144 -14 -53 -43 -6 -71 -50 73 -100
7631 -100 -210 109 13 -240 -113 167 159 -141 28 -95 76 -106 -14 -83 -58 -219 87 19 -50 -85 -104 -150 30 287
7655 287 -101 9 -123 54 138 34 55 -14 293 -135 -175 -105 -94 -47 -86 -26 248 -54 -82 -96 60 114 -81 118
7679 118 256 -186 -207 659 -101 -84 -131 18 202 -59 140 53 28 117 -163 -143 -64 -224 -63 197 -173 -16 -43
7702 -43 9 30 247 102 25 -81 -81 46 91 99 -136 169 203 90 190 211 84 -218 -142 -49 75 108 47 127 -14
7727 -14 114 223 -30 74 -242 -93 -85 168 -136 -11 170 20 -71 96 -181 -188 -127 21 19 5 -34 20 22 -151 -93
7752 -93 -148 94 49 180 -272 17 -97 365 97 -134 291 74 -161 -60 -127 -142 -237 216 149 102 -144 140 71
7775 71 -287 -64 -54 -217 -143 -212 -4 71 137 -283 1 47 41 -86 -4 233 -137 193 -140 -95 -322 135 -151 19
7799 19 73 144 -112 -266 -48 -169 -78 -157 103 -105 -66 -3 12 -149 43 -11 -180 122 -299 -16 248 20 -254
7822 -254 -88 -108 80 121 42 122 -128 -64 33 213 27 -138 -101 214 -136 271 75 342 -190 134 366 -17
7844 -17 24 -53 -16 -77 99 -155 -66 30 124 -81 -132 190 -3 -206 -19 38 -130 -252 65 70 -38 77 169 -91
7868 -91 285 131 166 54 76 124 107 -50 -79 125 26 -19 -141 -5 -120 -33 240 26 -83 -197 23 -44 -327
7891 -327 104 -27 -24 -143 1 -221 -79 -306 -98 211 -28 8 -144 113 60 -168 14 -136 -146 -301 10 197
7913 197 175 -5 60 13 29 -131 85 5 193 -79 106 167 -244 84 233 164 -101 -189 146 204 -139 287 190
7936 190 -186 181 63 233 107 166 -101 -64 -3 -82 -109 -528 21 0 -21 -142 128 -55 -32 65 -96 -185 -15
7959 -15 229 -250 -154 -202 -80 138 40 -119 88 -86 -92 -166 -60 -378 30 -96 -394 -164 272 -115 140 53 71
7982 71 -26 -217 -23 129 -174 279 165 -179 37 -151 -3 151 -9 -37 -155 -181 -94 -43 -9 377 84 38 207
8005 207 513 120 171 265 177 287 163 30 -51 132 -147 56 260 98 -213 57 188 9 170 173 -327 48
8027 48 -162 -38 229 -177 -153 -110 265 44 150 -159 217 52 108 -29 -456 -17 60 219 -23 37 -196 135
8049 135 166 59 -67 82 141 -130 -192 -1 87 171 -99 118 -35 22 11 282 -136 120 -88 299 161 -32
8071 -32 -491 89 -170 89 7 -68 313 -87 77 -171 -213 51 -128 -132 33 -36 -55 59 -154 -131 278 -82 96
8094 96 -129 301 180 329 107 163 109 -79 46 -35 -172 124 -143 284 1 190 -109 7 -16 139 -56 245
8116 245 97 246 9 -96 288 -123 -11 -151 -165 -89 -36 32 -347 -46 134 -160 47 -105 54 271 -282
8137 -282 -328 263 5 204 -167 -112 118 71 -137 232 -164 114 54 106 161 37 174 -92 195 -48 266 116
8159 116 104 75 107 -225 76 -166 -193 -105 -314 -134 212 -60 14 -310 -142 74 141 -126 -216 273 -93 153 111
8182 111 11 -102 -29 -148 -48 -34 60 115 -179
8191a79
##END NTUPLES=NMR FID
##END=
