##TITLE=1H_LR-717-B2
 D2O, 8 sc, 
 29.10.2020
##JCAMPDX= 6.0         $$ Bruker NMR JCAMP-DX V2.0
##DATA TYPE= NMR FID
##DATA CLASS= NTUPLES
##ORIGIN= UXNMR, Bruker Analytische Messtechnik GmbH
##OWNER= root
$$ XWIN-NMR		Version 3.5
$$ Thu Oct 29 09:52:19 2020 Russian Standard Time (UT+4h)  she@DPX200
##.OBSERVE FREQUENCY= 200.1315066352
##.OBSERVE NUCLEUS= ^1H
##.DELAY= (6, 6)
##.ACQUISITION MODE= SIMULTANEOUS
##.ACQUISITION SCHEME= undefined
##.AVERAGES= 8
##.DIGITISER RES= 18
##SPECTROMETER/DATA SYSTEM= spect
##.PULSE SEQUENCE= zg30
##.SOLVENT NAME= CDCl3
##.SHIFT REFERENCE= (INTERNAL, CDCl3, 0, 15.7039)
##AUDIT TRAIL= $$ (NUMBER, WHEN, WHO, WHERE, WHAT)
$$ ##TITLE= Audit trail, XWIN-NMR		Version 3.5
$$ ##JCAMPDX= 5.01
$$ ##ORIGIN= Bruker BioSpin GmbH
$$ ##OWNER= she
$$ F:/spectra/data/she/nmr/H-F/1/audita.txt
$$ ##AUDIT TRAIL=  $$ (NUMBER, WHEN, WHO, WHERE, WHAT)
(   1,<2020-10-29 09:51:20.90 +0400>,<she>,<DPX200>,
      <created by zg, POWCHK disabled, PULCHK disabled
       configuration hash MD5:
       00 E9 B6 7A A2 85 ED C7 34 08 36 98 17 FE 4E 26
       data hash MD5: 16K
       F9 88 54 39 5E 8D 69 09 E8 AA D1 F7 82 6C E3 46>)
$$ ##END=
$$ 
$$ hash MD5
$$ C9 C4 F2 D4 02 96 0B E9 3F E1 94 EB CB 0D 73 34
##$RELAX= 
##$RELAX= 
##$RELAX= 
##$RELAX= 
##$RELAX= 
##$RELAX= 
$$ Bruker specific parameters
$$ --------------------------
##$DU= <F:/spectra>
##$EXPNO= 1
##$NAME= <H-F>
##$PROCNO= 1
##$TYPE= <nmr>
##$USER= <she>
##$AMP= (0..31)
100 100 100 100 100 100 100 100 100 100 100 100 100 100 100 100 100 100 
100 100 100 100 100 100 100 100 100 100 100 100 100 100 
##$AQSEQ= 0
##$AQ_mod= 1
##$AUNM= <au_zg>
##$AUTOPOS= <>
##$BF1= 200.13
##$BF2= 200.13
##$BF3= 200.13
##$BF4= 200.13
##$BF5= 200.13
##$BF6= 200.13
##$BF7= 200.13
##$BF8= 200.13
##$BYTORDA= 1
##$CFDGTYP= 0
##$CFRGTYP= 5
##$CHEMSTR= <none>
##$CNST= (0..31)
1 1 145 1 1 1 1 1 1 1 1 1 1 1 1 1 1 1 1 1 1 1 1 1 1 1 1 1 1 1 1 1 
##$CPDPRG= <>
##$CPDPRG1= <>
##$CPDPRG2= <>
##$CPDPRG3= <>
##$CPDPRG4= <mlev>
##$CPDPRG5= <mlev>
##$CPDPRG6= <mlev>
##$CPDPRG7= <mlev>
##$CPDPRG8= <mlev>
##$CPDPRGB= <>
##$CPDPRGT= <>
##$D= (0..31)
0 1.2 0 0 0 0 0 0 0 0.06 0 0.03 0 0 0 0 0.0002 0 0 0 0 0 0 0 0 0 0 0 0 
0 0 0 
##$DATE= 1603950680
##$DBL= (0..7)
120 120 120 120 120 120 120 120 
##$DBP= (0..7)
150 150 150 150 150 150 150 150 
##$DBP07= 0
##$DBPNAM0= <>
##$DBPNAM1= <>
##$DBPNAM2= <>
##$DBPNAM3= <>
##$DBPNAM4= <>
##$DBPNAM5= <>
##$DBPNAM6= <>
##$DBPNAM7= <>
##$DBPOAL= (0..7)
0.5 0.5 0.5 0.5 0.5 0.5 0.5 0.5 
##$DBPOFFS= (0..7)
0 0 0 0 0 0 0 0 
##$DE= 6
##$DECBNUC= <off>
##$DECIM= 32
##$DECNUC= <off>
##$DECSTAT= 4
##$DIGMOD= 1
##$DIGTYP= 9
##$DL= (0..7)
0 120 120 120 120 120 120 120 
##$DP= (0..7)
150 150 150 150 150 150 150 150 
##$DP07= 0
##$DPNAME0= <>
##$DPNAME1= <>
##$DPNAME2= <>
##$DPNAME3= <>
##$DPNAME4= <>
##$DPNAME5= <>
##$DPNAME6= <>
##$DPNAME7= <>
##$DPOAL= (0..7)
0.5 0.5 0.5 0.5 0.5 0.5 0.5 0.5 
##$DPOFFS= (0..7)
0 0 0 0 0 0 0 0 
##$DQDMODE= 0
##$DR= 18
##$DS= 0
##$DSLIST= <SSSSSSSSSSSSSSS>
$$ [...]
##$SUBNAM2= <"">
##$SUBNAM3= <"">
##$SUBNAM4= <"">
##$SUBNAM5= <"">
##$SUBNAM6= <"">
##$SUBNAM7= <"">
##$SUBNAM8= <"">
##$SUBNAM9= <"">
##$SW= 16.880792210976
##$SWIBOX= (0..15)
0 0 2 0 0 0 0 0 0 0 0 0 0 0 0 0 
##$SW_h= 3378.37837837838
##$TD= 16384
##$TD0= 1
##$TE= 0
##$TE2= 300
##$TE3= 300
##$TEG= 300
##$TL= (0..7)
0 120 120 120 120 120 120 120 
##$TP= (0..7)
150 150 150 150 150 150 150 150 
##$TP07= 0
##$TPNAME0= <>
##$TPNAME1= <>
##$TPNAME2= <>
##$TPNAME3= <>
##$TPNAME4= <>
##$TPNAME5= <>
##$TPNAME6= <>
##$TPNAME7= <>
##$TPOAL= (0..7)
0.5 0.5 0.5 0.5 0.5 0.5 0.5 0.5 
##$TPOFFS= (0..7)
0 0 0 0 0 0 0 0 
##$TUNHIN= 0
##$TUNHOUT= 0
##$TUNXOUT= 0
##$USERA1= <user>
##$USERA2= <user>
##$USERA3= <user>
##$USERA4= <user>
##$USERA5= <user>
##$V9= 5
##$VALIST= <valist>
##$VCLIST= <CCCCCCCCCCCCCCC>
##$VD= 0
##$VDLIST= <DDDDDDDDDDDDDDD>
##$VPLIST= <PPPPPPPPPPPPPPP>
##$VTLIST= <TTTTTTTTTTTTTTT>
##$WBST= 1024
##$WBSW= 4
##$XGAIN= (0..3)
0 0 0 0 
##$XL= 0
##$YL= 0
##$YMAX_a= 224005
##$YMIN_a= -233591
##$ZGOPTNS= <>
##$ZL1= 120
##$ZL2= 120
##$ZL3= 120
##$ZL4= 120
##$ABSF1= 10
##$ABSF2= 0
##$ABSG= 5
##$ABSL= 3
##$ALPHA= 0
##$AQORDER= 0
##$ASSFAC= 0
##$ASSFACI= 0
##$ASSFACX= 0
##$ASSWID= 0
##$AUNMP= <proc_1d>
##$AZFE= 0.1
##$AZFW= 0.1
##$BCFW= 1
##$BC_mod= 2
##$BYTORDP= 1
##$COROFFS= 0
##$CY= 11.3945322036743
##$DATMOD= 1
##$DC= 2
##$DFILT= <>
##$DTYPP= 0
##$F1P= 15.9154993809931
##$F2P= -4.1035820241983
##$FCOR= 0.5
##$FTSIZE= 0
##$FT_mod= 4
##$GAMMA= 1
##$GB= 0.15
##$INTBC= 1
##$INTSCL= 1
##$ISEN= 128
##$LB= 0.24
##$LEV0= 0
##$LPBIN= 0
##$MAXI= 10000
##$MC2= 0
##$MEAN= 0
##$ME_mod= 0
##$MI= 1.114404
##$NCOEF= 0
##$NC_proc= 0
##$NLEV= 6
##$NOISF1= 3.799351
##$NOISF2= 2.8
##$NSP= 1
##$NTH_PI= 0
##$NZP= 0
##$OFFSET= 15.70392
##$PC= 1
##$PHC0= -10691.03
##$PHC1= 7.40088
##$PH_mod= 1
##$PKNL= yes
##$PPARMOD= 0
##$PSCAL= 0
##$PSIGN= 0
##$REVERSE= no
##$SF= 200.130013532006
##$SI= 16384
##$SIGF1= 3
##$SIGF2= 2
##$SINO= 400
##$SIOLD= 16384
##$SREGLST= <1H.CDCl3>
##$SSB= 0
##$STSI= 0
##$STSR= 0
##$SW_p= 3612.71676300578
##$SYMM= 0
##$S_DEV= 0
##$TDeff= 0
##$TDoff= 0
##$TI= <>
##$TILT= no
##$TM1= 0
##$TM2= 0
##$TOPLEV= 0
##$USERP1= <user>
##$USERP2= <user>
##$USERP3= <user>
##$USERP4= <user>
##$USERP5= <user>
##$WDW= 1
##$XDIM= 8192
##$YMAX_p= 0
##$YMIN_p= 0
$$ End of Bruker specific parameters
$$ ---------------------------------
##NTUPLES= NMR FID
##VAR_NAME=  TIME,          FID/REAL,        FID/IMAG
##SYMBOL=    X,             R,               I
##VAR_TYPE=  INDEPENDENT,   DEPENDENT,       DEPENDENT
##VAR_FORM=  AFFN,          ASDF,            ASDF
##VAR_DIM=   8192,          8192,            8192
##UNITS=     SECONDS,       ARBITRARY UNITS, ARBITRARY UNITS
##FACTOR=    0.000296,      1,               1
##FIRST=     0,             0,               0
##LAST=      2.424536,      0,               0
##MIN=       0,             -233591,         0
##MAX=       2.424536,      224005,          0
$$ Real data points
##PAGE= N=1
##DATA TABLE= (X++(R..R)), XYDATA
0@%%%%%%%%%%%%%%%qJ6j6J6j6K4l2L3m1M8n6O9p7Q8j04J20j36J56j79K04k28K54
37A35k88L26l64M05m51N01n57O17o83P55q33R18j013J115j227J353j489J642j814
56i52K007k225K474k765L107l513M005m619N411o472P977j0295J4420l5691J94121
71A66990J5396j35736q9162j91079J26719K67346j0471q4247r8012j95058J10008
82a17306K68285P414q6520j16376j79590J20929K51842o745o9955j07682j81384
93b17088J17714K37634m532n2622j18109j80850J29415K21726r966m0529j19927
104c7134j71939J27672K03035m006l1558j21887j66683J24280J92716k624k5821
115H6051j19169j63618J22423J81266j094j4238j24840j63277J28788J69915q77
$$ plain form
0 0 0 0 0 0 0 0 0 0 0 0 0 0 0 0 0 -8 8 -8 8 -8 16 -16 17 -24 24 -32 37 -40 48 -56 64 -72 84 -95 109 -119 135
37 135 -153 173 -191 214 -237 264 -293 324 -359 396 -437 481 -532 583 -644 709 -780 862 -952
56 -952 1055 -1170 1304 -1461 1646 -1867 2138 -2481 2930 -3542 4435 -5860 8560 -27131 166990
71 166990 182386 46650 -42512 -233591 -106872 160474 150003 65756 -32256 -227314 -117306
82 -117306 150979 158393 71873 -44503 -224093 -103164 148678 141933 71978 -35704 -217088
93 -217088 -99374 138260 133728 81106 -37003 -217853 -88438 133288 123322 82793 -37134
104 -37134 -209073 -81401 121634 117628 86070 -35817 -202500 -78220 114496 111872 86051
115 86051 -33118 -196736 -74313 106953 105859 91621 -33219 -196496 -67708 102207 101330
126A01330q906j31092j49807J31380J48683L12K454j28304j45983J20739J40090
137H0896J3589M393j36374j41353J25202J34283Q318M626j29951j32293J18793
148d9871J18808J5078J6234j36084j31605J19795J12516J9828J4823j40267j18563
159a59308J17886R7937K3769K0473j39771j13969J12203R0996K8994K2257j40207
170c8740j10361J10062Q4509L1994K5348j42987j05660J10193P7211L4481K4979
181A01029j43242r5389J05096O5926M0681K7976j43117r0452R7087O2932M8443
192G6970K3786j44211q3179R4345N8282M8774K2908j40603p6934Q8987N0013N4958
204G4096K5371j42783p2834Q4790M7031O0643K1408j43992o3607Q1392M0514O2304
$$ plain form
126 101330 92424 -38668 -188475 -57095 91588 91900 94354 -33950 -179933 -59194 80896
137 80896 94485 98878 -37496 -178849 -53647 80636 88954 93580 -36371 -168664 -49871
148 -49871 68937 84015 100249 -35835 -167440 -47645 64871 84699 99522 -40745 -159308
159 -159308 -41422 56515 80284 100757 -39014 -152983 -40780 50216 79210 101467 -38740
170 -38740 -149101 -39039 45470 77464 102812 -40175 -145835 -35642 41569 76050 101029
181 101029 -42213 -137602 -32506 33420 74101 102077 -41040 -131492 -34405 28527 76970
192 76970 100756 -43455 -126634 -32289 25993 74767 97675 -42928 -119862 -30875 19138 74096
204 74096 99467 -43316 -116150 -31360 15671 76314 97722 -46270 -109877 -28485 12029 74333
216G4333K0704j40169n8009P3099L6657O9148J9641j41089n4689P0379L5617P0930
228G6552J6044j39839m7384O5775L0748P4445J3620j36902m1736N9089K7859P8726
240G6997J1025j34430l7829N2591K8223Q1854O825j32354l3149M8284K7157Q2816
252G8010L364j27464k7753M0871K4558Q7128J647j25548k5869L5912K6257Q9538
264H0651l830j22982j9821L1384K4070R0162o061j17732j6713K3516K4031R4533
276H1208q742j16084j5104K0535K5502R4443j3292j11706j0443J4965K4811R4693
288H0786j5450j05803r631Q789K6838R6178j8817j02264q593N154K9491R4687
300H1365k2094r6826o752M19L0303R4104k4351r0916o530m739L2055R4751k6579
$$ plain form
216 74333 95037 -45132 -103141 -30042 6615 75763 95404 -45685 -100374 -29995 5622 76552
228 76552 92596 -47243 -94627 -28852 1896 76341 89961 -46941 -88677 -29588 -1729 76997
240 76997 88022 -46408 -84237 -31646 -3423 78431 85256 -47098 -80247 -31963 -4806 78010
252 78010 81374 -46090 -73843 -32972 -8414 78714 80361 -45187 -71056 -35144 -8887 80651
264 80651 76821 -46161 -65982 -34598 -10528 79634 73573 -44159 -60872 -37356 -13325 81208
276 81208 72466 -43618 -58722 -38187 -12685 81758 68466 -43240 -53683 -38718 -13907 80786
288 80786 65336 -40467 -50098 -41309 -14471 81707 62890 -39374 -47967 -42813 -13322 81365
300 81365 59271 -37555 -44307 -43888 -13585 80519 56168 -34748 -41278 -46017 -13962 80789 54210
313E4210q7155o540q347L5243R3673l0994q2062m488j2392L6690R1729l2281p5975
326b8689m809j7744L8658R2321l4346p2301n634j9902M1883Q9571l7512o6545
338b5049m624k3309M2647Q7064l7161o1250o863k6639M5784Q5945l9247n7169
350a9871q237k7605M8497Q1801m0158n1535r329l0128M9593P8804l8998m6860
362a4026j2002l2029N2263P7096m0258m2948j3995l3112N5068P3287m1011l8082
374i749j4721l4599N6575O9701m0812l2780j7779l6645N9441O6848m0242k9648
386d410k0409l5997O1406O3051m0557k5330k1751l6532O1881N9243l8918k0767
398I10k5224l7169O4383N6042l8266j8361k7660l5032O5084N1069l6324j4784
$$ plain form
313 54210 -32945 -39485 -47832 -12589 81084 50090 -31972 -36460 -48852 -12162 79567 47286 -28689
326 -28689 -33498 -51242 -12584 79737 45391 -26910 -32544 -52446 -10563 79008 41496 -25049
338 -25049 -29673 -52982 -10335 76729 39568 -21682 -28545 -55184 -9400 76545 37298 -19871
350 -19871 -28108 -55713 -7216 74585 34427 -17108 -26437 -56565 -6972 71832 32834 -14026
362 -14026 -26028 -58057 -5794 71302 31044 -11904 -25899 -59011 -3943 69344 28333 -9749
374 -9749 -24470 -59069 -2494 67207 26395 -6385 -24164 -60809 -1368 65480 25238 -4410
386 -4410 -24819 -60816 590 63641 23084 -2246 -23997 -60529 1352 60595 21677 910
398 910 -24314 -61483 2900 58942 20676 2315 -25345 -60377 4707 55776 19452 4668
410D668k9946l4023O4770M7469l3343j2588l3425l2926O6035M4345l1924j1050
422H062l4989l1815O7450M0057l1347o784l7546l1537O7883L5967k7916m435m1164
435b8114k9491O8341L2372k4894l970m3937k6365O7875K8909k2761l021m4010
447b9066k5782O6558K6890k0906q41m7007k3936O7035K2858j8007L94m9345k0504
460e1659O5479J8342j3235M32n1496j7948O2998J7362j0198l10n2935j5766O2425
473A3491J5873r240m62n3317j3196O1175J1827o776K052n5464j1417N9680Q514
486B2740j267J239n8451q103N7754P461J616j185n8324n031N5067O254L337j946
500B1161n7478l649N3082M832N573j710n8176k035N1223K810Q622k434n9004J127
$$ plain form
410 4668 -25278 -59301 5469 52938 19595 7007 -26418 -59344 6691 51036 19112 8062
422 8062 -26927 -58742 8708 48765 17418 10634 -26912 -58449 9434 45401 17485 13050 -28114
435 -28114 -57605 10736 43108 18214 14244 -29693 -56058 11817 40726 17965 14944 -29066
447 -29066 -54848 11710 38600 17694 16853 -30154 -54090 12945 35803 17796 18190 -31155 -51659
460 -51659 13820 32162 18927 19359 -32137 -50085 12913 30275 20077 19767 -33168 -48934 13491
473 13491 29364 20124 19662 -33655 -46851 14324 26151 19375 21427 -34037 -45454 14226 22740
486 22740 21473 22712 -35739 -43842 13912 21373 22989 21804 -36520 -41551 13516 19770 23107 21161
500 21161 -36317 -39966 13116 17948 23521 21811 -36365 -38400 12823 15633 24255 21821 -37183 -36056
514c6056M7779J633J3106n067n8802L657M3688K771J5199q021n7721N812M1797
527I775K580J5050q411n6204P086L9641K74J8275q063n7467R449L5714K38K2796
541C0733j1169n8231J2238L3018J202K4147j5129n4950J4134K9321J642K4665
553C1621j5569n2572J3634K7047K249K5770j6271n2401J4975K5228J396K8110
565C3217j8586n0888J7000K0964K819L0276k1226m9162J7653J7653N471L0368
577C5559k4034m5801J7433J5768O661K9138k3940m4139J7999J3390N837L1376
589C5247k4468m3506J8670R971Q059L3426k8671m1190J9759P241J0322L2390l0730
602F520l7091J9289M330J2345L1126l0157l4995J7232L824J2805L1029l0624l3515
$$ plain form
514 -36056 11723 13356 26462 21395 -37407 -33750 9938 12709 27908 19887 -37834 -32022 9775
527 9775 12355 27405 18994 -37210 -30124 9517 9791 28066 20003 -37464 -28015 7699 7937 30733
541 30733 19564 -38667 -26429 6589 7791 31938 16809 -38141 -24007 5314 6956 31621
553 31621 16052 -36520 -22886 4161 6410 32180 15909 -36492 -21517 3711 5107 33217
565 33217 14631 -36257 -19257 1707 4526 34802 13576 -35586 -17933 -280 5191 35559
577 35559 11525 -34276 -16843 -1075 5586 34724 10784 -33355 -15356 -1966 3871 35247
589 35247 10779 -32727 -14057 -4086 3973 37399 8728 -32462 -12703 -5462 4860 37250 6520
602 6520 -30571 -11282 -6952 5393 36519 6362 -28633 -11401 -7577 5228 36257 5633 -27882
615b7882J7696J393J4176L0987l2001l1057J7551j363J6352L0866l3819k7573
627b4674J5306k685J9714K8503l4376k5214J4422l236K0327K6856l3994k2473
639b1524J3318n142K1053K7136l4328k0905J1859o424K4042K6186l6509j7682
651a8920J0817p560K5856K3864l6232j5098R091q426K6985K2312l5055j3047O700
664h713q519K8591K1016l5452j1553O043q892K9337J9470l4548r587M224j0014
677a8597L1321J7932l4394p735J877r186L2983J4934l3644n664N25r076L3058
690A4334J3500l2165l932k109q986L4093J2425l1480l087l612q409L5487R781
703B5840l1100p61n338p901L5761P461k8890N67p597p626L6266O515k7589N41
$$ plain form
615 -27882 -10186 -8793 5383 36370 4369 -26688 -9137 -10500 5852 36718 2899 -24674
627 -24674 -9368 -12053 7661 36164 1788 -23426 -9004 -12240 8087 34943 949 -21524
639 -21524 -8206 -13348 7705 34841 513 -20392 -8533 -14957 9085 35271 -1238 -18920
651 -18920 -8103 -15663 10193 34057 -2175 -17273 -8182 -16608 10377 32689 -2366 -15413 -8713
664 -8713 -17232 11359 32375 -3077 -14630 -8587 -17479 11858 31328 -3220 -12807 -8583 -18597
677 -18597 12724 30656 -3738 -11473 -9596 -18782 14201 29135 -4509 -10173 -9648 -18724 14334
690 14334 27834 -4331 -8263 -10372 -19358 14735 27160 -4320 -7407 -11019 -19428 16059 25840
703 25840 -5260 -6021 -11359 -19260 16501 23962 -4928 -4361 -11958 -19584 16682 23197 -4392 -3851
717c851r399n645L6188M698k6434J923j0890m969L6004K569k4080K447j2623m275
731a8337L6060J466k2609K462j4228k494L6388j138k0568K693j5391j557L5545
744A8292k102j8558L418j7767l26L5824l319j7345L216j8916J525L5063n203j5418
758a616L785j9895K423L3823n948j2919L114k1446L762L3531o792j1518K384k1827
772a9139N601L2460q444r506J912k2071O460L0657q494p334J290k3094P565L0021
786A7884r177n870K81k3686R880K8059r966l862m99k3508J0545K6551j0143j630
800D859j489k4687J2206K5561j0334m81k754k4643J3810K3727j0837J210l401
813B747k4371J4162K2064j0477L189m883k4535J5839K0429j0045L917o002k4013
$$ plain form
717 -3851 -13250 -18895 17293 21991 -4443 -2520 -13410 -18379 17625 20194 -3886 -1439 -14062 -18337
731 -18337 17723 19189 -3420 -958 -15186 -17680 18708 17570 -2998 -305 -15696 -17253 18292
744 18292 16190 -2368 1050 -16717 -17043 18781 15462 -1883 1333 -17583 -16058 19005 13802 -1616
758 -1616 2169 -17726 -15303 18520 12572 -347 2767 -18679 -14917 18614 11822 304 2688 -19139
772 -19139 -13538 18922 10478 972 2884 -19187 -12727 17930 9436 2102 3392 -19702 -12137 17884
786 17884 8707 2837 3118 -20568 -10688 17371 7405 3543 3044 -20464 -9919 16632 6489 4859
800 4859 3370 -21317 -9111 16450 6116 5635 2881 -21762 -7952 15775 4938 6148 2747
813 2747 -21624 -7462 14602 4125 7314 2431 -22104 -6265 14164 4119 8036 2034 -21979
826b1979J6724J8538r921N309p053k3181J6926J6959r196O438q195k3247J8162
839c716J5384q791P368r635k2341J9170J3145p949Q028j0845k1229J9179J1354
852I122o922R560j2652k0240J9682J0186o494R851j3570j9128J9549R021n733
865B232J0555j4500j8773K0190O993m689J1594j6254j7495K0596N301l248J1269
878A3771j7255j5633J9806L798j816J1214j7622j4366J9063L050j122J1383j8624
891d353j3602J9339J912L1J1137j9824j1917J9235K18J311J1160k0591j0261J8300
905B095r29L113J0328k1030q841J7473j828M088R872k1033p720J6450k595N483
919D926R959k2059o788J6366l440O542R577k2988n259J5778m603Q261P922k2739
$$ plain form
826 -21979 -5255 13283 3362 8671 1618 -21563 -4637 12322 3126 9564 1369 -21878 -3716
839 -3716 11668 2877 10245 610 -21731 -2561 10584 2635 10663 -182 -21411 -2232 9122
852 9122 2200 11760 -892 -21132 -1450 8736 2242 12093 -1477 -20605 -1056 7965 2232
865 2232 12787 -1713 -20486 -296 6697 2008 13602 -2652 -20147 449 5750 2502 13771
878 13771 -3484 -19117 689 4487 2671 13885 -3737 -18103 960 4010 2888 14271 -4353
891 -4353 -17955 1384 3296 3327 14464 -5360 -17277 1958 2176 3487 14647 -5944 -16205 2095
905 2095 1166 4279 14607 -6423 -15264 2209 381 4469 14341 -6692 -14412 2038 -557 4926
919 4926 14885 -7174 -13962 2404 -1036 5506 15083 -7905 -13164 2614 -1989 6272 14194 -8545
933h545k991J3786m995R576P057k2406k314J2237m347J0320O324k2342k093J1994
947A261m688J1208N612k2642j65J1005n623J2470M575k2840J833R065n789J3688
961H970L150k2028K439P670m964J4343K092k1200K794O571m782J4734J544k1247
975i914L669O087n114J5817M82k1252N384M230m991J6749j402j9697N987K280
989a685m010J6864j726j8634N553J035k760J6998k578j8067N471P26k256J7006
1003A1937m101j7217O767m32k528J8085n258j6199P713k885j128J8159o771j4362
1017h220O895l654J78J7786p496j3327O709l970L36J7754p843j2830P014m887
1031e555J178J7703q936j2075P774o288J837J7636r815r864P050p843L424J6785
$$ plain form
933 -8545 -11536 2250 -2745 6831 13888 -8518 -10832 1405 -2942 7378 13702 -8640 -10733 1261
947 1261 -3427 7781 13393 -9249 -9414 1591 -4032 8438 13013 -9827 -7994 1071 -4718 8970
961 8970 12120 -9908 -7469 201 -4763 9580 11672 -9528 -6734 -163 -4945 9789 11333 -9914
975 -9914 -6245 -158 -5272 10545 11027 -10225 -4841 -611 -5602 11147 9745 -9952 -3965 -1685
989 -1685 -5695 11169 9443 -9191 -3638 -2603 -5363 11635 9057 -9010 -3539 -2813 -5069 11937
1003 11937 7836 -9381 -2614 -3046 -5574 12511 7253 -8946 -1233 -4118 -5246 12913 6142 -8220
1017 -8220 -1325 -4979 -4801 12985 5489 -7838 -1129 -5099 -4763 12991 5148 -7682 -668 -5555
1031 -5555 -4377 13326 4390 -7685 89 -6199 -4362 13274 3459 -6405 645 -7198 -3774 13011
1045A3011j0044q720N616p328M455J6112j0268q337N591p656M994J5410j0807
1058B029p211O210r089N421J5576j1593n527N483j0313P219J4521j2050m137M314
1072H53j0384Q506J3483j2117k994K895r475Q785J2413j1992k238K694r969R304
1086b36J2321j2318j681K750j1036J0503J1253j2537L2J549j1168J1618R738j1705
1100i17J037n20j0086J2001Q809j1250R54n17r674J2009Q018j1534K209o22j0333
1115a0416J2690P117j1254L324k344r965J3850N849j0443L921l848r230J4445
1128C696M326r827M482m529q375J3838M084r354M703n065q415J4516L098r070
1142a892N161n557q020J4743J866q153N973p370o804J4613Q06o687N847p936o195
$$ plain form
1045 13011 2967 -5753 -137 -7465 -3010 13102 2834 -5503 88 -7568 -2574 12836 2029
1058 2029 -5182 1028 -8061 -2640 12936 1343 -4184 1299 -9014 -1795 12726 676 -3461 853
1072 853 -9531 -1025 12458 341 -2653 242 -9233 -448 11965 -27 -2265 429 -9540 -236
1086 -236 12085 -233 -1914 836 -10200 303 11556 -981 -949 600 -10568 1050 10788 -917
1100 -917 120 -400 -10486 1515 10324 -926 28 -489 -10163 1846 9864 -1670 539 -83 -10416
1115 -10416 2274 9391 -1863 1461 -883 -10848 3002 8851 -1592 2329 -1519 -10749 3696
1128 3696 8022 -1805 2677 -1852 -10227 3611 7695 -1659 3044 -2021 -10436 4080 7178 -1892
1142 -1892 3269 -2288 -10308 4435 6301 -1852 4121 -3249 -10053 4560 5366 -1321 4526 -3410 -9605
1157i605J4494K24o071N283q418n016J3940n25n399N779q951m869J4305j466m609
1172i04O162j0128l782J4549l051l471N978j0763k834J3932l159k772N622j1127
1186e748k138J3331l196j840M987j1327j433J2607l646j023M861j1622p02J2376
1200E487m588%M581j2079L11J1576m653R99L775j2286J113J0897m938J607L677
1215E479j2758K157J0240n294K670K916j2870K733R618n156L114K239j2850L599
1229d163R094n658L896J687j2723M376Q018o013M946J234j2488M640P412n850
1243a592N639L93j2491N636O217n584O341l78j2289O235N323n231O397q39j1708
1258g931N974N161n026P121j914j1314O450M150m613P347k336j0854O683L065
$$ plain form
1157 -9605 4889 5113 -958 4325 -4093 -9109 4831 4306 -1093 4686 -4265 -9134 5171 3705 -904
1172 -904 5258 -4870 -8652 5897 2846 -625 5353 -5410 -8244 5688 2529 -243 5379 -5748
1186 -5748 -7886 5445 2249 409 5396 -5931 -7364 5243 1597 574 5435 -6187 -6889 5487
1200 5487 899 899 5480 -6599 -6288 5288 635 1634 5409 -6877 -5764 5133 195 1802 5479
1215 5479 -7279 -5122 5118 -176 2494 5410 -7460 -4727 4891 -265 2849 5088 -7762 -4163
1229 -4163 4931 -727 3169 4856 -7867 -3491 4527 -1486 3460 4694 -7794 -3154 4258 -1592
1243 -1592 4047 4440 -8051 -2415 3802 -1782 4559 4181 -8108 -1873 3450 -1781 4616 3777 -7931
1258 -7931 -1957 3204 -1822 5299 3385 -7929 -1479 2671 -1942 5405 3069 -7785 -1102 1963
1272A963l793P919l365j0657P556K069l478Q097m072r772P493J384l259Q370m760
1287A695r057P748K59k861Q982n247q649P580k10j963Q795o021p974Q298j626
1302b51j233Q564o533p096P634j737q61Q755p143o429P458j893m41Q336p216o053
1318f139P515k738N76Q022p862m953O971l208J063Q237q417m332O686l538J858
1333b59P478q657l459O740m310K375P443r213k630O313n114L395P136r466j870
1348d098N556m717M018O185r374j179M986m664M164O026r485n87M441m899M744
1363A117N642r445j56M210n532N691M946r462O21L485n134O096M258r413J408
1378a668K496n132O702L413q774J464K507n238O770L139q909K251J633n116P160
$$ plain form
1272 1963 -1830 6089 2724 -7933 -377 1692 -1786 6311 2239 -7533 -40 1344 -1915 6455 1695
1287 1695 -7362 386 645 -2216 6766 1519 -7130 450 240 -1723 7072 1051 -6923 1375 -251
1302 -251 -1484 7080 547 -6549 1085 -652 -1513 7242 99 -6330 1128 -765 -1206 7130 -86 -6139
1318 -6139 1376 -1362 -786 7236 -626 -5579 1392 -1816 -753 7484 -933 -5265 1421 -2117 -259
1333 -259 7219 -1438 -4897 1843 -2467 -92 7351 -1862 -4492 1821 -3293 102 7238 -2228 -4098
1348 -4098 1458 -3259 759 6944 -2430 -3609 1377 -3287 877 6903 -2582 -3169 1272 -3627 1117
1363 1117 6759 -2686 -2842 1368 -4164 1527 6473 -2989 -2368 1117 -4017 2079 6337 -3076 -1668
1378 -1668 828 -4304 2398 5811 -2963 -1499 1008 -4230 2540 5679 -3230 -979 654 -4462 2698
1393B698K851r008L048Q95n359Q147K019q797L416K9m412P946J028p762L390j81
1409e2m379P913Q83p622L738q61m100Q472P6p307L980j387m173Q953k75o982M294
1426A171k558l014R070j444o141M388k954k587Q729k000n475M257l111k241Q478
1441D568k152n212M699l939k084Q791k351n062M568m507j482R270l363l900M268
1456B112n149m26Q708m160k966M213n431pQ020l889k772M042n358pP823l745k590
1473a582L770n506K93P966m365j851L751o499J319P873n419q16L140o273K425
1488a774O407n085K6K593o432K526N950m503O6K314o163K170O536n414L74K530
1504B121o901L396O082n809J423J577o654M168M978n672K124J021o553M296M115
$$ plain form
1393 2698 5549 -3459 -411 484 -4875 3272 5291 -3506 -90 -61 -4473 3473 4501 -3261 129 -52
1409 -52 -4431 3482 4365 -3257 481 -380 -4480 3992 4068 -3239 741 -646 -4819 4134 3859 -3123 1171
1426 1171 -1387 -4401 4669 3225 -2916 1472 -1482 -4069 4660 2660 -2815 1442 -1669 -3910 4568
1441 4568 2416 -2796 1903 -2036 -4120 4671 2320 -2742 1826 -2681 -4163 5107 1744 -2156 2112
1456 2112 -3037 -3463 5245 1085 -1881 2332 -3099 -3106 4914 1025 -1747 2295 -3063 -3070 4753 1008 -1582
1473 -1582 2188 -3318 -3025 4941 576 -1275 2476 -4023 -2704 5169 -250 -1066 2074 -4199 -1774
1488 -1774 4633 -452 -426 2167 -4265 -1739 4211 -292 -226 2088 -4075 -1905 4631 -783 -409 2121
1504 2121 -4780 -1384 4698 -1111 312 1889 -4765 -597 4381 -1291 833 1854 -4699 -403 3712
1519C712m976K366N42o425M252M211m666J915M04o582N022L961n135K785P3o377
1535d918N262L164n204L564o00o380N910J992m413L765j206n590N376J825l991
1550a444L971j845n650N751J892m210M013k012n414O311Q66l824M470k649n054
1565d828O613r9l386M914l342m388O109k26k606M519l663l852N857l27k560M359
1581C094l489l850O100p32k099M423m357l365O488j570j444M437m883k533O059
1596B279k090q80M213m840k330N764k025o64M176n125j870N608k498j31M172n606
1612a847j524N612k643K42L808n859p61N296l274J100L665o166k15M887l129R45
1628A37L376o044L3M857l484J262L024n693M16M152l346K158K574o178Q75L675
$$ plain form
1519 3712 -1264 1102 1644 -4781 -529 3682 -984 931 1335 -5247 -225 3736 -1399 1386 1459 -4918
1535 -4918 344 3508 -1696 1868 1268 -5112 798 2790 -1623 2142 936 -4654 722 2547 -1444
1550 -1444 2527 682 -4968 783 2675 -1535 2478 466 -4948 1363 2229 -1595 2875 226 -4828
1565 -4828 1785 1686 -1700 3214 -128 -4516 1593 1367 -1239 3280 -383 -4235 1622 1295 -1265 3094
1581 3094 -395 -4245 1855 1123 -976 3447 -910 -4275 2213 643 -801 3636 -1247 -3780 2279
1596 2279 189 -691 3522 -1318 -3648 2116 91 -573 3603 -1522 -3392 2216 -282 -413 3759 -1847
1612 -1847 -3371 2241 -402 -160 3648 -2211 -2972 2324 -950 150 3815 -2351 -2566 2321 -808 137
1628 137 3513 -2531 -2498 2359 -1125 137 3161 -2532 -2116 2036 -1310 848 3422 -2756 -1881 1794
1644A794l284K627K087o299J401L624l654K775J840n879J822K764l742L227J895
1659B998o242K271K569l477L383J539o343K482K234l314L725P29n940K699J911
1674A224l194M104L30n543K771J343l336M530J98n655L099J150l333M714k55n237
1690c090L326L72k725M624o51m629L039J82k386M856j034m674L535o46k121M749
1706B727j374m281L716q24k117N185j943m191L955j138j687N152k433l477L839
1721A109j424j476N130k694l152L747j995r89N176l146k986M130k472n02M951
1736C407l101k553L722k755pM696l218k407L416k791N75M400l590j692L485l222
1752a635N12M386l556j232K682l006R11M455m109q20L147l931J523M115m430k14
$$ plain form
1644 1794 -1490 1137 3224 -3075 -1674 1950 -1704 1071 2911 -2968 -1146 1618 -2124 1103 2998
1659 2998 -3244 -973 1596 -1881 1502 3041 -3302 -820 1414 -1900 1825 2554 -3386 -687 1224
1674 1224 -1970 2134 2464 -3079 -308 1035 -2301 2229 2427 -3228 -129 1021 -2312 2402 2147 -3090
1690 -3090 236 608 -2117 2507 1856 -2773 266 448 -1938 2918 1884 -2790 745 99 -2022 2727
1706 2727 1353 -2928 788 -36 -2153 3032 1089 -3102 853 -285 -1972 3180 747 -2730 1109
1721 1109 -315 -1791 3339 645 -2507 1240 -755 -1744 3432 286 -2700 1430 -1042 -1544 3407
1736 3407 306 -2247 1475 -1280 -1287 3409 191 -2216 1200 -1591 -1016 3384 -206 -1898 1587 -1635
1752 -1635 -1123 3263 -293 -1525 1157 -1849 -938 3517 -592 -1412 1735 -2196 -673 3442 -988 -1202
1768a202K448l366J670L826m363O9K374l720K291L196m489O27J993l867K743K980
1784C210m385L86K213l931K593K932m184O24J552l597K979K453m180J238J206
1799A109l653K834K430m371J474J055l602L418K057m235J657N01l563L650J717
1814B478m236K222K66l613M098J144l965K278j39l409M135M39l205K435m91l129
1830b692L987Q47l910K814p48l307M629j31l181K923j167k897M463j73l157L064
1846A364j461k506M349l97k721K676j616k037M403j151k165K609j638k165M414
1861A958j098k433L384k285j642M463j876j762L138k729j436M387j895j193K989
1876A970l163o86M053k099q88K735l016q84M404k384r21K774l209m89M337k532
$$ plain form
1768 -1202 1246 -2120 -450 3376 -987 -918 1456 -2264 27 3223 -1266 -639 1354 -2513 230 3210
1784 3210 -1175 -789 1424 -2507 86 3018 -1166 -542 1010 -2587 392 2845 -1335 -97 1109
1799 1109 -2544 290 2720 -1651 -177 878 -2724 694 2751 -1484 173 674 -2889 761 2478
1814 2478 -1758 464 730 -2883 1215 2359 -1606 672 533 -2876 1259 1698 -1507 928 437 -2692
1830 -2692 1295 2142 -1768 1046 298 -3009 1620 1489 -1692 1231 64 -2833 1630 1457 -1700 1364
1846 1364 -97 -2603 1746 1349 -1372 1304 -312 -2349 2054 903 -1262 1347 -291 -2456 1958
1861 1958 860 -1573 1811 -474 -2116 2347 471 -1291 1847 -882 -2318 2069 174 -1019 1970
1876 1970 -1193 -1879 2174 75 -813 1922 -1094 -1978 2426 42 -879 1895 -1314 -1803 2534 2
1892Bp79K763l337k76M023k660k74K588l756K85L614k581M71J525l353N79L235
1909B069k398jK006l294N71K975k723P14J804l761J211K662k510Q23J759m082
1925b175J079K975k916J485R90l743K001K084k696J672M97l476J865K105k969
1940a222J596J302l994J957K064l027K247N39l926K236J591k498K139L73l796
1955b419K695Q76k141K071j47l392K716P08k158K386l79k967K515O26k435K565
1971A120j91l033K785L1k253K963q21l079L279k15j869L218j452k892L576p52
1987D15j371K390j323k167K847m51j653L118j528k221K763n33j585L171j904j916
2003a948K902r51q33L105k505j586L308j838o99K950k454j461L076j507k17K560
$$ plain form
1892 2 -777 1986 -1351 -1627 2396 -264 -538 2050 -1706 -1421 2193 -388 83 1608 -1745 -1166 2069
1909 2069 -329 -330 1676 -1618 -1047 1928 -795 -81 1723 -2038 -827 1835 -675 148 1907 -2175
1925 -2175 -1096 1879 -1037 448 1438 -2305 -304 1780 -916 756 1253 -2223 -358 1747 -1222
1940 -1222 374 1676 -2318 -361 1703 -1324 923 1462 -2464 -228 1363 -1135 1004 1377 -2419
1955 -2419 276 1152 -989 1082 935 -2457 259 967 -1191 1195 816 -2151 364 990 -1445 1120
1971 1120 929 -2104 681 712 -1541 1422 601 -2478 801 586 -1283 1935 483 -2409 1167 415
1987 415 -956 1434 111 -2056 791 340 -1313 1805 277 -1944 819 286 -1299 1872 -32 -1948
2003 -1948 954 3 -830 2275 -230 -1816 1492 -346 -1045 1905 -549 -2010 1066 -441 -658 1902
2019A902k412r75K603j506m05K750k540j087L029k144J98K743k905p48K848j962
2035f11Q9K806l237l63K747k256M99K284l067J52K158k271J104J871k946R2K342
2052A393k534J139K039l091K8K221k213J323J925l653O78J848k484J470J776l127
2068a262O85J515k354J771J561l191P93J418k119J439J178k612J210R40k251J771
2084D92J011k905J182Q58k151K257P26l017J536M53k110K672L98k784J566K57
2100D41k216K525L97k694J799K40k019K393K49k651K045r6j908K626m7k495K226
2117H15m01j975K837l86k374K275o11j424K626o99k075K132r37j165K717r71j612
2134a228K138j306j001K842j098j627K314j521j084L275j731j218K434j555n63
$$ plain form
2019 1902 -510 -1485 1118 -388 -793 1957 -583 -1670 1359 -785 -587 2156 -749 -1497 1351 -611
2035 -611 -522 2284 -953 -1316 1431 -825 -326 1958 -1109 -957 1201 -1070 34 1905 -1041 -949 1393
2052 1393 -1141 -2 2037 -1054 -1026 1195 -1018 305 2230 -1423 -745 1103 -1381 89 1865 -1262
2068 -1262 -577 938 -1416 355 1916 -1275 -482 936 -1183 256 1434 -1178 32 972 -1279 492
2084 492 1503 -1402 -220 638 -1513 744 1470 -1547 -11 442 -1668 1004 1402 -1382 184 441
2100 441 -1775 750 1147 -1547 252 492 -1527 866 1115 -1536 509 413 -1495 1131 1084 -1411 815
2117 815 414 -1561 1276 890 -1484 791 180 -1244 1382 683 -1392 740 -197 -1362 1355 384 -1228
2134 -1228 910 -396 -1397 1445 347 -1280 1034 -487 -1571 1704 -27 -1245 1189 -366 -929
2149i29K778j532j362K180j649o13K868j682j078K031j844k8K600j826j012K247
2165A149j875l25K531j631n99J870j892q8K602k177m27J985j988O8K514k390K38
2182d35J745k554P06K095j908l7J576k390Q67J831k058K44J252k295J290J628
2198A557k352N17J346k484J081J854k411Q35J152k548J479J740k606R54O46k365
2214a605J696J192k252J190P31k410J580J001k040J174L58k041J566R87k133J345
2230C39M91k231J754O25j996J377M76k572K112M72j898J802l01j879J791M67j909
2247a080J813m94j730K240P1j931J813n54j711K411r5j492J641o20j884K337j88
2264E47j697K338r39j624K050l55j112J505r22r74K073m81j392J873j122r27K140
$$ plain form
2149 -929 1849 317 -1045 1135 -514 -1127 1741 59 -1019 1012 -832 -860 1740 -86 -1098 1149
2165 1149 -726 -1051 1480 -151 -750 1120 -772 -860 1742 -435 -862 1123 -865 -797 1717 -673 -435
2182 -435 1310 -1244 -538 1557 -351 -388 1188 -1202 -335 1496 -562 -318 934 -1361 -71 1557
2198 1557 -795 -278 1068 -1416 -335 1519 -892 -57 1095 -1453 26 1766 -840 114 760 -1605
2214 -1605 91 1283 -969 221 952 -1458 122 1123 -917 257 615 -1426 140 1127 -1006 339
2230 339 830 -1401 353 978 -1018 359 835 -1737 375 847 -1051 751 450 -1429 362 829 -1080
2247 -1080 733 239 -1491 749 820 -1111 702 148 -1563 848 753 -739 902 282 -1602 735 547
2264 547 -1150 1188 249 -1375 675 320 -792 713 -209 -1183 890 409 -983 890 -232 -1159 981
2281I81r46q06J904j441j185K582j008r48J859j371p94K170j072o81J943j564
2297c77p06K177j323k12J581j711l53K079j050m37J826k025k49J822j425n6J516
2314A077j745OJ704j681M92J393k244N17J516j676O04J155j740L4J629j667O32
2331FJ280k242M55J646k117Q58J002j818M74J318j826J097J008k252R91R85j369
2348e04P35P87k236J051R16j628J110Q26k038J072P80j789J448L92k123J243P62
2365H04j774J261M68j977J329N19j848J749L88k231J655O4j282J385J60j965J406
2382A11N77j447J314J5j605J646j00j574J874m10j729J820j76j335K076o97j485
2399a125J740p13q83J999r09j042J563m75p50J453n58j365J600l91r08J699j079
$$ plain form
2281 981 35 -771 1133 -308 -1493 1089 81 -867 992 -379 -1173 997 -75 -756 1187 -377
2297 -377 -1083 1094 -229 -441 1140 -571 -924 1155 105 -332 1494 -531 -780 1042 -383 -439 1077
2314 1077 -668 -662 1042 -639 -147 1246 -998 -481 1035 -641 -37 1118 -622 -588 1041 -626 6
2331 6 1286 -956 -501 1145 -972 -114 888 -930 -456 862 -964 133 1141 -1111 -120 865 -504
2348 -504 231 1018 -1218 -167 749 -879 231 1057 -981 91 871 -918 530 922 -1201 42 804
2365 804 -970 291 759 -1218 111 630 -1218 531 919 -1312 343 407 -875 510 670 -1295 111
2382 111 688 -759 555 570 -1035 611 511 -1063 811 401 -1328 492 316 -1019 1057 360 -1125
2399 -1125 615 -98 -981 1018 109 -933 630 155 -595 858 300 -1065 535 144 -764 935 -144
2416a44q20J729p87q04J838j235p19J823j380k38J812r39p31J115p87k68J650
2433A115j250q38J645j138k86J757j382o28J878j416k18K071j695l06J727j693
2449f57M24J604j935J55J098j454N56R87j450N4J476j465L88J208j495L5J074
2466F03j244O06J116j668J23J078j370N15J253j741N04J159j832J035P56j610
2482g17O34M17j240J056P41j649O74P19j472R36O73j576R17M60j485J031N96j575
2500h60J054K85j567J310Q15j855J098J74j353J529O5j465J140l7j245J216J71
2517D75j239J187j01j184J312K6j402J441k5j348J505k83j257J391l18r14J115
2534C81J59j104J098n58r76J868m43j355J273j90j008J705n06j244J464o24o66
$$ plain form
2416 -144 -964 765 -22 -826 1012 -223 -942 881 -499 -737 1075 136 -595 520 -267 -535 1115
2433 1115 -135 -973 672 -466 -752 1005 -377 -1005 873 -543 -761 1310 -385 -691 1036 -657
2449 -657 -233 1371 -564 -409 689 -765 -209 778 -672 -618 858 -607 -219 989 -506 -471 603
2466 603 -641 -35 1081 -587 -464 614 -756 -241 1012 -729 -225 934 -898 137 893 -717
2482 -717 -83 334 -906 150 891 -758 -84 635 -837 99 772 -804 113 573 -912 119 715 -860
2500 -860 194 479 -1088 222 1037 -818 280 454 -899 630 695 -770 370 333 -912 304 475
2517 475 -764 423 322 -862 450 476 -926 515 490 -858 647 364 -893 498 180 -734 381
2534 381 540 -564 534 -24 -1000 868 425 -930 343 153 -855 850 344 -900 564 -60 -726
2551g26J514o78o87J119m87p91J596p00p53J396j003o49J675r76m92J339r25l51
2569e79J712j318k99R97q66m52J544p73n93J288j261j68J550j234p8J336j423
2586f17l6J376r03j90J090j244K57R92j089k96J331j115J37R25r96O9J084j538
2604g63K16J228j169K82J110j448M15P89j394P33N32j245M51J084j337O30M67
2621E81j386O81Q94j366O59K67j225R84P81j251M06P30j648R73M97j269J049L61
2639G18j603Q26N98j303J140P0j382R17N26j124Q90J50j176J151k34n89Q49l0
2657C94j111J129Q2j175J167j53j190J370p2j014J075l88r88J375j89q90Q81K0
2675C23j015J080l98n90J366o96r56J443l47q00J282n43r17J369k71r84J345o53
$$ plain form
2551 -726 788 110 -577 542 55 -736 860 160 -593 803 -200 -849 826 -150 -642 697 -228 -579
2569 -579 1133 -185 -484 513 -353 -805 739 -34 -627 661 -600 -768 782 -452 -530 806 -617
2586 -617 -653 723 -180 -370 720 -524 -267 725 -364 -660 671 -444 -307 618 -378 -309 775 -763
2604 -763 -547 681 -488 -206 904 -544 -129 660 -734 -1 531 -714 -263 821 -516 114 581
2621 581 -805 -124 770 -596 63 330 -895 89 870 -381 25 755 -893 80 577 -692 357 718
2639 718 -885 -59 539 -764 376 446 -936 -19 507 -617 273 423 -753 398 164 -425 424 394
2657 394 -717 412 494 -681 486 333 -857 513 441 -573 502 114 -874 501 312 -578 303 323
2675 323 -692 388 -10 -600 766 70 -886 557 210 -590 692 149 -768 601 330 -654 691 38
2693C8p78J194m60m90J312q55n70J114l79n13J149j087k47J168p06k53Q80q28
2711c11l56J322q08Q1R37j272M3R85j199L6J131j033M8J237j114n6J273j331j49
2730e36J095q80K6J051j230J83J001j038M24P93j290L43O78j017K77O10q10J8
2748c02Q20j345P65P87j143K38Q44j205M42P59j326M29R14j048M18N00j137L66
2766b24M43p27Q96J87j318Q04L16r91Q37M60j421P66J36j017J154K91j217N66
2784e9O69j138R06m9q99P54J14r23R84o5r02Q47P7r49J095J6j050O72J62r37R48
2805B73J29o73L47J72p66J032m20p42Q63k88m63J164l97o91Q89k46o48Q41l02
2824G4n53Q57o67P9P66l54p12J026o64m98J393r29m50J050o38k35J339j068k52
$$ plain form
2693 38 -740 454 -6 -496 816 -39 -609 505 126 -387 762 -325 -572 596 -110 -363 517 -311
2711 -311 -667 655 -153 -72 865 -407 -364 621 -578 -542 589 -444 -396 841 -273 -329 944 -387 -536
2730 -536 559 -321 -295 756 -474 -291 710 -328 96 889 -401 -58 620 -397 -120 490 -320 -302
2748 -302 518 -827 -62 725 -418 -180 664 -541 -99 660 -666 -237 677 -371 47 547 -590 -224
2766 -224 219 -508 388 575 -743 61 377 -614 223 683 -738 28 164 -853 301 592 -625 -59
2784 -59 610 -528 378 329 -570 184 298 -625 359 294 -608 239 316 -633 462 478 -572 100 262 -675 273
2805 273 402 -271 76 248 -518 514 94 -648 215 -73 -536 628 231 -460 429 183 -465 376 74
2824 74 -479 378 -289 -210 556 202 -510 516 -148 -646 747 -182 -632 418 -220 -455 884 -184 -436
2843d36P63o41k4P91q41n6R75q09j36J026o95k93R27q30k09J237p44m21J089r64
2863b91m2J072j180K81O77r04N22N37j009J34Q80r32m6O26n53K5O22j010N16O52
2883E77q65J35N95q40O6R36j051M40K57n72J88K96n59J83P38j093O78K87j060
2902f64P58L45r40N7J006q65K97Q1o99O58N42q72M46J71j033P64L66j120P05L85
2922C88p05N88J17r62R60m0q47Q35j72o47P40j45n58N86K09q90R13k97n65O96
2942B04P2p82Q59j12p85Q59q1o53O55Pq61P89j8m30N01j74m33P65k95m10N98j55
2964A20p62J025k61o19Q98m08k95R56o61l98Q71l75n26Q64n40k15J010p74j50
2983b40P87m51j92P93n96l56N47n67K2M04m91J34O07l10m56Q88n24j29O02q77
$$ plain form
2843 -436 327 -314 -338 453 -388 -444 531 -278 -414 612 -83 -376 551 -279 -488 749 5 -416 673 -291
2863 -291 -333 739 -441 -160 517 -387 135 672 -337 -203 677 -255 -301 325 -228 -203 419 -591 -75 577
2883 577 -288 -153 442 -398 -332 604 -447 -7 250 -322 -134 162 -397 -214 524 -569 109 396 -664
2902 -664 94 439 -501 -444 562 -303 -6 75 -624 34 576 -296 150 321 -712 52 418 -702 3 388
2922 388 -317 271 388 -574 386 346 -501 334 162 -485 255 110 -448 138 347 -543 370 73 -492 204
2942 204 276 -506 353 241 -544 315 234 -419 236 243 -618 171 153 -277 224 50 -383 382 87 -323 275 120
2964 120 -642 383 122 -497 401 -7 -302 654 -7 -405 466 91 -435 429 -111 -326 684 -90 -240
2983 -240 547 96 -96 697 101 -255 292 -275 -253 151 -340 -206 401 91 -365 523 -1 -130 472 -405
3003d05O6Q20j091L31R99j142K93O93r28M62M56r24K01P21j026K28R47j008L18
3022A1N01j168P67K13p04M07N05j082M77L22p45M63K13q11Q75J11j128R55L14
3041D96r23N68J91p10M18J7o48N29L84q99O67pm34L54K32n14P97J1j020P21J21
3062C51p08N48N5m56M54Po76O31j35n70N59M3m09O47m7m34N18l21n96Q38k36m52
3084c89O00j99l69O34l72j57O31k88l73N41j03o23O25j71m01P27m17l09Q95k31
3104B51m52P55n80j48O73m97l14M78j01l58O08m38j56P33o66j64O53m10Q2Q33
3124G82j092j7N64j80m66Q23n49rK82m48r4O65n21o8Q40o13J6M94p77J95O67q31
3146c37L72N87q37p5N78o18L22K67l86L9O73p26J90L92q39K31P42r36M10K88n19
$$ plain form
3003 -405 -339 481 -610 -279 720 -422 -129 564 -364 98 554 -370 -169 552 -474 -246 701 -307 11
3022 11 512 -656 111 324 -380 27 532 -550 -73 249 -496 -33 180 -631 244 355 -773 182 496
3041 496 -427 141 332 -378 40 57 -591 -62 322 -577 90 83 -351 3 235 -279 518 529 -491 230 351
3062 351 -357 191 246 -210 244 251 -425 206 71 -499 60 103 -306 341 294 -140 378 57 -539 299 63 -389
3084 -389 211 12 -357 277 -95 -252 379 91 -282 259 156 -467 158 -13 -414 313 -104 -413 482 251
3104 251 -201 554 -26 -174 499 2 -312 166 65 -293 315 -123 -279 454 -212 -376 277 -133 -51 782
3124 782 -310 -327 237 57 -409 414 -135 -144 138 -310 -404 261 -260 -328 512 -101 -85 409 -368 -173 494 -337
3146 -337 35 622 -215 -290 288 -330 -8 259 -127 -88 585 -141 49 441 -398 -167 575 -361 49 337 -182
3167a82J03M36o11R3P20r55K37M34p06M75J95l55J65J99n37J81N17p37N59J39
3187C70n68K45P1n44N86j69m3O1J63m21M05K1o05M87k32k89L92K14m75O73J7o97
3209c38L63j65m2L73J72o34L98J23o80M98%l84M90q3m06P29m07m36Q98m31k61
3230b23N17P4p37M64kn48Q43l45l64N95j22m63O69k67m60N38j69m06N77j7l70
3251b16M46j89l95P64m40l87P81n57R3M91n14%J98k14o4N11m49J06M26n15k38
3272c62Q04l11m34Q49n75k99Q03o29J70L40p02M20J87l58J09M59n44qM68p77K49
3293a41K61k77J84K19m73K56M48o31mL81n44N47M5o57K30M65o14J93K54o70P28
3314B00K59m74P4Q2l86M19j9k83J98J39n72J88M79l31N5L23n00K39R4m06L00K52
$$ plain form
3167 -182 -79 357 -254 -161 559 -396 -159 275 -431 44 239 -116 49 248 -289 -108 409 -328 231 370
3187 370 -198 47 118 -426 160 -9 -52 9 172 -249 156 177 -428 59 -173 -462 -70 144 -331 342 359 -338
3209 -338 25 -140 -182 191 363 -271 127 250 -430 68 68 -316 174 91 -315 414 7 -429 469 38 -223
3230 -223 294 368 -369 95 93 -455 388 43 -321 274 152 -311 358 91 -369 169 0 -406 171 154 -216
3251 -216 230 41 -354 410 -30 -417 364 -193 -100 391 -123 -123 75 -139 -203 308 -141 -35 391 -124 -362
3272 -362 442 131 -303 546 -29 -328 475 -154 16 356 -346 74 261 -97 12 471 -73 -81 387 -390 -141
3293 -141 120 -157 27 246 -227 29 477 -154 -158 223 -321 226 271 -386 -156 309 -305 -112 142 -528 200
3314 200 459 -15 59 141 -245 174 155 -128 70 209 -363 -175 304 -27 28 351 -149 90 184 -222 78 330
3336C30q39Q52k79m00M80p2k81M09j63k06L27j06k81N47k49k65L35l5m72P49k59
3357A22n65O37j73l07L78J34n47P32n05k8J95j05k55L76j32m71R58o85J17M15
3377B91l24n36M65j5K20J76l63k59O68m03l25P94n96J12K75k79j31N00n84J18
3397a96O10m48j79P12p04K19M07k64j97M20n61m0N30k71j27N05o43J63K73q9n
3418A15J33l90j5O13p74L64K52m33J96Q3l37J58L41l03j48N62o32kN22n98K91
3439bM64n98n0M35p31O20L16p02N8L93m47M3M33l81K53J91m47K18J32l44M62j88
3461A28l66L62m9j76J96l3o17P93J20n89L07J36l75R0K19m27L58r4j79L30P4m95
3483b87N79p7n73M53J60l61L00j56k50L36k1p76P68O0o37O78N2n27M64k86j98
$$ plain form
3336 330 -509 343 64 -336 144 72 -209 200 37 -169 158 52 -229 318 69 -196 139 104 -368 381 122
3357 122 -443 194 21 -286 92 226 -321 411 -94 -122 73 -32 -287 89 -43 -514 444 -241 -124 291
3377 291 -33 -569 -104 -119 101 277 -86 -345 323 -80 -405 389 -207 -95 180 -99 -230 270 -314 -196
3397 -196 414 -34 -213 499 -205 14 421 157 -40 380 -181 -221 309 38 -89 416 -227 -64 209 120 115
3418 115 248 -142 -157 456 -318 46 298 -135 61 144 -193 -35 306 3 -145 417 -215 -217 305 -293 -2
3439 -2 462 -136 -186 249 -482 138 454 -248 -190 203 -244 -201 232 -149 104 295 -152 66 198 -146 316 128
3461 128 -238 124 75 -101 95 62 -555 238 358 -231 76 212 -163 -73 146 -281 77 -17 -196 134 208 -287
3483 -287 292 215 -358 95 255 -106 194 38 -212 124 103 -673 95 155 -482 196 248 -279 185 -101 -299
3504b99N52k39n8L49k65k81N59m50o1K50M1j28M59o50J04L48j54k54L84l65j88
3525c46O58l13j0J12l63J4M62l57K8K09m32K87K76m72k30Q03p35K77M36m61l9
3546a96M60m28J90M10m96K0N9k28j98O20m06l6N37k94l12M95l87LM74n23K89L52
3568D05n53JJ74k18J48J63l55L04j07l83N61J57m52O9K46o40L31K89k74J50K40
3589B56k56j80L83j82J2L38n38L58o8n80O45n1l02L68R5o45N74r9n31M71j3m45
3611c90N56J93r92M72K13l61N55j46m36N89p1m95M10R3l88L96p6k62N25j11n99
3632c25J48J30m1M55m66j31L61Lk00J56p0k7J60l82M9N08k71j25J79j10j56M47
3654B92p4n96Q90o43M6M65k20o63P05l82K18L9k42L3K78m27J08M01m81K58L31
$$ plain form
3504 -299 253 14 -44 305 40 -241 318 -132 -193 57 98 -30 429 -221 -117 231 77 -177 207 -158 -346
3525 -346 312 -1 -11 101 -262 -248 214 -143 -115 94 -338 -51 225 -247 -477 326 -409 -132 304 -157 -196
3546 -196 264 -164 26 436 -60 -40 19 -209 -407 213 -193 -229 308 14 -298 197 -190 -187 287 -236 53 405
3568 405 -148 -147 27 -191 -43 120 -235 69 -38 -421 140 297 -155 -86 160 -480 -149 140 -134 16 256
3589 256 0 -180 203 21 33 371 -167 191 123 -457 188 137 -165 203 298 -347 227 128 -403 68 55 -390
3611 -390 166 359 -633 -161 52 -309 246 100 -336 253 182 -313 97 190 -198 198 122 -140 385 274 -325
3632 -325 -177 -47 -88 367 -99 -230 131 134 -66 90 20 -7 153 -229 -180 328 57 -68 111 1 -155 292
3654 292 218 -378 512 -131 -85 380 160 -503 202 -180 38 77 -165 -132 146 -281 -173 228 -253 5 336
3675C36n03p8M73m68j01N01k20q8M05l32k87L44J40k35O81r79L36N50n10j3J88
3696A40l85Q5K51k66J69J66k87J79j29j21M13J06o34K34K34k73J52ql60L16K30
3717B12j90j60K62j71K2L13l76P9J29k60J03R7k64K93J11k98K70m4m44M52q1j31
3739g6R7J01l31J92Q5l36O15l93r5M23l45l25O18j17l11M18k57k15M34l66k9K07
3761fM5j33j09K91l24K58l0p1K05m1k4P8M2m03M20k42k41J26J61r6K55k60j88
3784b87N17k29j62K75l03L0K60k0j76K12l06n1M89n51J42M34n52K14M41k60j45
3805b8K66n58J74N36k7n66J58l1k0O9l8j46N62l36J3J10k71j5M97n03J17J67k26
3828i6P6K37m36K00J94k37J29k4k21J20J42m12J80q0J88o9Q1j62L59J08n26K62
$$ plain form
3675 336 -167 -245 228 -240 -341 160 -60 -148 257 -75 -362 -18 122 -113 568 -411 -75 475 -35 -48 140
3696 140 -245 -160 91 -175 -6 160 -127 52 -77 -198 215 321 -313 -79 155 -118 34 26 -334 -18 212
3717 212 22 -138 124 -47 -25 288 -88 -9 120 -140 -37 60 -204 89 200 -98 172 128 -316 136 55 -76
3739 -76 21 122 -209 -17 68 -268 347 -46 -141 282 -63 -388 230 113 -198 220 -37 -252 182 -184 -213 -6
3761 -6 39 -94 -203 88 -236 22 -8 -79 126 85 61 139 181 -222 198 -44 -285 -159 2 -94 161 -99 -287
3784 -287 230 1 -161 114 -189 -159 101 81 -95 117 -189 -240 249 -302 -160 274 -278 -64 377 117 -28
3805 -28 238 -320 -146 390 363 -203 -45 -76 -96 -27 -65 -211 351 15 28 138 -133 -148 349 -154 -37 130 -96
3828 -96 -20 217 -219 -19 175 -62 67 43 -178 -58 84 -328 -148 -228 -40 -109 -28 -190 169 277 -249 13
3850A3L5j78K11K87q01M94rm08N15j69l71L54R8m08N73r5l44K18M0N7R0k16n5
3873f9R0O4j85Q2K17k72M8kq9R3L54n29K13J15l10J94J43l86L92k9j82J81j75
3896d2K31J2J3l04K60o1k46L53j28j28P7R5j89J56k53j84M55l9k67L22j39j47
3918a53L45m15J87J89q5n09O10m37J51L02K5l89K10r9j02K90l17J33J36k01M03
3939B74j49k83oK79q5r6L66j77k56K95k38j6K67l10O4Q7R7m85N54j82j22L21l84
3962a85l2K08k14J97J56k34J69L35j72k41o9j4o2M04n75M55j04k80K26K13l09
3983a28J25J93l65p1M29k87%K76l64J12K64k86J98K31o07L17O9k80N9R7j89J90
4005a7J47l51K67r4k41M62k8l07K55k46j37K72j2j73K47J47o49O68j27j92n1L30
$$ plain form
3850 13 48 -130 81 368 -433 61 52 -356 159 -10 -381 -27 71 -337 236 141 -203 15 55 112 202 -14 -69
3873 -69 21 85 -100 -18 199 -73 -25 -27 -116 -23 331 -198 15 130 -180 14 157 -229 163 134 -48 133 -42
3896 -42 189 201 214 -90 170 109 -137 216 88 -40 37 132 -57 99 -154 -338 117 78 -189 133 -6 -153
3918 -153 192 -223 -36 153 68 -441 169 -268 -117 185 210 -179 31 -68 -170 120 -197 -64 72 -129 274
3939 274 125 -158 -164 115 30 -66 300 123 -133 162 -76 -92 175 -135 -71 16 113 -372 182 0 -122 199 -185
3962 -185 -217 -9 -223 -26 130 -104 65 400 228 -13 -82 -96 -158 246 -329 126 22 -258 -32 181 -128
3983 -128 -3 190 -175 -246 183 -104 -104 172 -192 -80 184 -102 96 327 -280 37 106 -174 -115 -18 -207 -17
4005 -17 130 -221 46 -48 -289 173 145 -162 93 -153 -290 -18 -30 -203 44 191 -458 210 83 -109 -160 170
4027A70n15O16m2k29P2L5l37L17q1j41Q2J47ON2l4m05L74M1k37K39j64r3L02k51
4051g6n3J01m3OL03k63r6M05k44J3r3j09j4M87m03P6J19q6M9J07j51k83J95k23
4075b76J96L94m39L8K68k63j90L03o8j13L28k88oK29j79J21J79l03q7J16J62r2
4097C0J44l40j9K87k20J49O6m55K94J74q1l86P63n77l4M02j44p7J32O4l01L41
4119B12m40L88J17n35J76J95k04j33J92j40O9L21l76K01L3k7l5J41l46J55N5j43
4141a24r0R8M7O0J72k85K37O0l03J8K66j62N5j95n2L85j35k45L35k74L9J27P2
4164A06r4O2o3j12K30p1m49L85J99m36J19n3K75j7J18l55K55K03m50K64j08q2
4186g4R1q5K39j1j64k40L83r5j43J16l7M8M4j70K30j29j65J78P4j54J18J54l39
$$ plain form
4027 170 -345 271 229 0 72 107 -230 87 6 -135 -53 94 100 152 118 -287 87 128 -109 130 -34 -127 175 -76
4051 -76 -129 -28 -71 -65 238 -25 -121 284 40 53 -40 -149 -163 324 -79 -3 116 30 79 186 35 -248 -53 -276
4075 -276 -80 314 -125 -87 181 -82 -272 31 -37 -150 178 -110 -116 113 -66 55 234 -69 -156 -40 122 30
4097 30 174 -166 -185 102 -118 31 97 -358 -64 110 29 -357 406 -171 -205 197 53 -24 108 172 -129 212
4119 212 -228 160 277 -258 -82 113 -91 -224 -32 -172 -103 218 -158 43 76 49 14 155 -191 -36 19 -124
4141 -124 -214 -116 -69 -9 163 -122 115 175 -128 -110 156 -6 49 -146 -198 187 52 -193 142 -132 -93 34 106
4164 106 12 74 11 -101 129 58 -391 -6 193 -243 -124 -177 98 81 199 -156 99 302 -148 116 8 -74
4186 -74 17 -68 171 160 -4 -244 139 44 -99 17 -20 28 72 -98 132 3 -162 16 90 -64 54 208 -131
4209a31j31L21k5K43j48j36n3K26k90J83K44k75K26Pl43K12J01k99J32R6j13o3
4231a6J59l07J4M49m24j48J69P4M6J32l26J35K5k52L03J81m00J53O1k09J45p3
4253a09r3K69K93k77j87K71k71J83K00k44J5K40j48J4j63L5j8J47m66L80L3j63
4275e9q3J21K2j20J53j90l7K92k23N8M3n6QK39l30O1J56k61M55k47j78K40K6k57
4299a67K26J51k94K17j24l27O12k01n2J34k14KJ25l9k50K63M5l74M29j36J22j3
4321A35p1k38J34J15l41N08k34j09M08k25k38K87p7L4K73n52J26J78n5k22L07
4342A43pk23o3J82j71L56m81J07L55m02K32j20K6L4L07n04K18J17k68J31K72m05
4364a64l5M49j75k31K50q9k72K07j60m3M08j13k45J29M7L6J55k0m3J29l01M9O4
$$ plain form
4209 -131 -262 59 34 277 129 -7 -60 166 -124 59 303 28 254 261 -82 130 231 -68 64 160 47 -16
4231 -16 143 -164 -150 299 -125 -273 -104 -30 16 148 -178 -43 -18 -270 33 214 -186 -33 28 -181 -36 -109
4253 -109 -202 67 360 83 -104 167 -104 79 279 35 50 290 142 156 -7 28 10 157 -309 71 104 -59
4275 -59 -142 -21 1 -119 34 -156 -193 99 -124 -66 -23 -79 -71 168 -162 -101 55 -206 249 2 -176 64 90 -167
4299 -167 59 210 -84 133 9 -318 294 93 41 175 -39 -37 88 49 -201 62 107 -267 162 26 148 135
4321 135 64 -174 -40 75 -266 242 8 -101 307 82 -156 131 54 88 361 -191 -65 113 58 -164 143
4342 143 136 -87 -150 32 -139 217 -264 -157 198 -204 28 -92 -66 -32 275 -229 -11 106 -162 -31 241 -164
4364 -164 -199 250 75 -156 94 5 -267 -60 -220 -263 145 32 -213 -84 -37 -1 154 134 91 220 -81 -32 32
4387C2j66J23K31m11J77J05l60M35J20k69Q9J3j19J4J97l26J59j29L5j17L79l94
4409a82m8L31k82K98N7l19K8M51m40N6j49J06M23l78M6P9j6k6M3L5k22K61j44
4432HN5J33O4k31J63P2l23L03p1j15m6Q1k17J33p5J51J30L5m51K44J1n01L30j55
4456b72J96L9K42l22L11j84K2o7Nj72L65k09j28L81k31N3K77l25k86L89p5ML93
4479D06m44n6Q5n7K37j77o7J8J28J35l18P0O9J2K73k87k1J96l00k14M32Ol02N49
4503C73n49K69n9l83M89K29m34m6K22k71J36O7J47k87n1J68j95J26J62k67K82
4524A28q3p9J62k03l9J86N9j61L55l40r1K01k1j10kNQ6L47n52L27J19l35J71j82
4548e2j90J64J53k50L13J03j89J27kj82m2P8j00j3J95k25m4Q5l2R5R9l91P0L43
$$ plain form
4387 32 -134 -11 220 -191 -14 91 -269 166 286 17 106 119 0 14 211 -115 44 -85 -50 -167 212 -182
4409 -182 -230 101 -181 117 174 -145 -117 334 -106 -50 -199 -93 330 -48 -2 77 61 35 78 113 -109 152 8
4432 8 63 196 260 29 192 264 -59 244 173 58 12 93 -124 9 -66 85 215 250 -201 43 54 -447 -117 -272
4456 -272 -76 -37 205 -117 194 10 32 -35 -30 -202 163 -46 -174 207 -24 29 306 -19 -305 84 9 13 406
4479 406 -38 -94 -9 -66 171 -6 -73 -55 73 208 -110 -40 29 41 314 27 6 202 -98 -312 120 126 -176 373
4503 373 -176 93 34 -349 140 369 -65 -111 111 -160 -24 43 190 -97 -148 20 -175 -49 113 -154 128
4524 128 45 -34 128 -75 -114 72 131 -30 325 -15 -106 95 74 -36 -38 -33 53 400 -152 175 294 -41 130 -52
4548 -52 -242 -78 75 -175 138 241 52 179 177 -5 -47 31 -69 -82 113 -112 -156 -71 -103 -8 91 -300 -230 113
4572A13r5n3k20J57J20j10j21k1J79j21j46L34j74L60j20oj01j89J39P9o1j90
4594b47L24j41J37J25j48n12N59j57j11J97K9k42J30j22LM06k87j4K27k88j31
4615b63L36j30O9K74k72j02L49j93k39J36m0P8J53k9k3j8l4k13J84k01J33N6J59
4638A70j90J57m31K24K76m09J01R8j79O4L40l67K93k3o8j46K34m65N1N14j55m5
4660D4K68l90K44n0j98Q7R1l33L65j19mK4Q9k52L62k39J61n7K5m5j96K88j04K18
4684B79p6n3k49L72m98J87K44M0m31K94r0rJ32k66K59k98J66m9j0J1J18n8o9o0
4708a14J10J04k8l1j68K44J6j79q2Q8m9qJ29j18K70l09J57O0l4l25L02R7m16O12
4732C28l08J31j56m9o6L85j37m00N33l82Q2K33j11j77L10k63J6K38m91K42K89
$$ plain form
4572 113 18 -35 -255 -98 22 -88 -209 -230 -51 -172 -318 16 -158 202 82 76 -25 -214 -75 4 -57 -247
4594 -247 77 -64 73 198 50 -462 97 -60 -171 26 55 -187 -57 -179 -176 230 -57 -71 156 -132 -263
4615 -263 73 -57 12 286 14 -88 261 68 -171 -35 -75 3 156 127 104 86 52 -161 23 -178 -45 11 170
4638 170 -20 137 -294 -70 206 -203 -102 -4 -183 -119 221 -146 147 124 56 -90 144 -321 -270 244 89 44
4660 44 312 -78 166 116 -82 5 96 -237 128 9 5 29 118 -134 228 -11 150 93 118 73 -123 165 61 279
4684 279 203 150 -99 273 -225 -38 206 246 -185 109 19 10 142 -124 135 -163 3 -46 -56 -45 73 15 -54 -114
4708 -114 -4 100 72 41 -127 117 133 -46 -128 -40 -89 -97 32 -86 184 -125 32 92 58 -267 35 132 -284 328
4732 328 20 151 -5 -54 -120 265 128 -272 261 -121 -39 194 83 -94 216 -47 -31 207 -284 -42 247
4753B47k48j48J12k5j1j84J50M2p4J76r9J75j36n9L6K84l43j3J13K3q9J48j86
4776a09L81l12J29k10R3M7K57l44P3N3k2j34K74j00p7J21k92R5J85o8j77K39M
4799A06m7J57k23j96J49j17J48j89M1J41n0P9M8k2j0O0p7k10J08J71j31P8lm65
4823d54N51l29Q9m8J53j6J10n7j36J34N0j70M3L4l94K71J44N3L9o3p7J82j02k50
4847b43L29J26k96J22j86O6M0J27n8L58n54J90R9j28j51o7J88k5R8j45M9K06j84
4870c9L9J40l14p2L1J63j38J80j6j73K46P6k19L42j67j90L08l67JM86k97k20L44
4893A44p3k89L58r0k85K29J99K4O3l71o3L28n20O33j4n73J89J07%k20J05K74l02
4916a47J55K00k55K65m19J94k45L35Ql13kJ59J20j2r6qP9m02M25r8M2R8j81J33
$$ plain form
4753 247 -1 -149 -37 -62 -73 -257 -107 -65 -139 37 -62 113 -23 -82 -46 238 -105 -118 -5 18 -71 77 -109
4776 -109 272 -40 89 -121 -28 19 276 -68 5 58 36 -98 176 76 -1 120 -172 -77 108 40 -137 102 106
4799 106 59 216 -7 -203 -54 -171 -23 -212 -171 -30 -80 -1 47 25 15 75 -2 -212 -104 67 -64 14 11 -454
4823 -454 97 -232 -143 -191 -38 -54 56 -1 -137 -3 47 -123 -80 -46 -440 -169 -25 28 67 4 -73 109 7 -243
4847 -243 86 212 -84 38 -148 -82 -42 85 27 385 -169 21 120 -8 -159 -226 -38 -63 35 -110 -61 145 -39
4870 -39 0 140 -174 -246 -215 -52 -190 -10 -26 -199 47 123 -96 246 79 -111 197 -170 -169 317 20 -200 144
4893 144 71 -218 140 50 -235 -6 193 217 280 -91 -154 174 -346 287 273 -300 -111 -4 -4 -224 -119 155 -147
4916 -147 8 208 -47 218 -201 -7 -252 83 91 -222 -224 -65 55 43 -53 -61 18 -384 41 -57 -15 83 -98 35
4940C5K31n14K1J94J56%q5j98L41r6j63J2K97k68m3K5J3J34j40M92l38K7k64K13
4964H2j4j46J92l9j35L44k42k05J69R7K3l8qj92K99l11J4K41j66m18L26J15J2
4987@N9n8n6m6J42L9o2n1n4N6J08j89K23j26k5j06M5P0P0j68J56M5P6j95K21j44
5013C0k19L1J04j16L97k5l81L77j76J10LP4l17M42j12kq9k88R4J31k32K1J13m8
5037g8K11Lk73P7O8j5r4K36j18M1R6k3l23K96l50K58L09m63k3J67jj37J11j75
5061b00M03j60L3P6L9m24L24j97K0J39J27l62K40J3Q1k59Q9j14J78l0j14O9L14
5084B85j99j89Q7j96M51k25l5m1K50j76k0N4J52k04o3l6q4L66k95J12K8q5Q5j60
5108a38J7P6L05k59o2J52l16J96L7j02J32J4j02oJ74l63K38k21j06M84l12p0K40
$$ plain form
4940 35 266 -248 -227 -33 123 123 38 -160 181 85 -78 -66 231 -37 -80 -55 -42 92 -48 444 106 133 -131 82
4964 82 68 -78 114 75 -60 284 42 -163 6 103 126 88 80 -112 187 -124 -110 131 -35 -453 -127 -12 0
4987 0 59 1 -55 -101 41 80 18 -33 -87 -31 77 -112 111 -15 -40 -146 -101 -31 39 -129 27 72 148 -47 174 30
5013 30 -189 -158 -54 -170 227 202 -179 198 22 132 135 209 -108 334 222 220 131 -157 -63 68 -164 -143 -30 -78
5037 -78 133 136 -137 -60 8 -7 -101 135 17 58 154 131 -192 104 -246 12 321 -142 -165 2 1 -136 -25 -200
5061 -200 203 43 76 152 191 -233 91 -106 -86 53 180 -182 58 71 152 -107 -18 -132 46 16 -98 -29 285
5084 285 86 -103 -16 -212 239 14 -21 -62 188 12 -8 46 198 -6 -69 -105 -189 177 -118 -6 22 -63 22 -138
5108 -138 -121 -45 260 1 -61 91 -225 -29 8 -94 38 52 -50 -56 118 -245 -7 -228 -334 150 -162 -232 8
5131HP9j50l2J48l32L74n6J8j01j23K09J38l34K32L8m16J67K3K3L3N8J87j64Q5
5155A12l9o1J00k54J75K33k28m3MN9r9J59j14j3r1K50k91K33j07Oj68K29J4k29
5179a63R9k22L48J00r9R7l0j95oK0J38M2k08n7j07R2J74l1p2Q3k04J31o9l4N2
5204a21N6K69o7j3j90J37LK43N9n96L26n7M3j27j00K56M7p4m0P0L2j63K14q9n3
5229F5L3k53J17r3K44k73j3J84n7q5q7K67n8j16J67jk36M4j37K03J51k86l9J37
5253a22m5J81l6J51k09J12LJ45k55J83l0J0O7l41K74Q6j67J69k41L75m16K42J59
5276B95k81N8j54J13J3k04q9J70J08Q8K3O5k78K93m57L61j53p2l5J99j05KOJ55
5300A21L9k17r6M38l34K64Rj44r0J58k68j2K39j26o3L76k91oN6L15l07j38K01
$$ plain form
5131 8 87 -63 -95 53 -279 95 39 57 -44 -167 42 180 -154 78 116 -300 -133 -110 -87 -54 4 191 27 112
5155 112 73 12 112 -142 33 266 38 -5 -1 58 -41 118 4 -9 -100 150 -141 92 -15 -9 -177 52 66 -163
5179 -163 -64 -286 62 162 63 160 130 -65 -71 -51 87 129 -79 -136 -243 -151 23 -8 -80 3 -201 -70 -139 -173 -121
5204 -121 -65 204 137 124 -66 71 74 317 376 -220 106 49 92 -35 -135 121 168 94 54 124 156 -7 207 118 65
5229 65 98 -155 -38 -131 113 -160 -173 11 -46 -131 -218 49 -9 -125 42 41 -195 -151 -288 -85 66 -220 -259 -122
5253 -122 -167 14 -22 129 -80 32 35 180 -75 108 78 88 155 -186 88 174 7 176 -65 310 -106 136 295
5276 295 14 72 -82 31 44 -160 -249 -79 29 117 140 205 -73 220 -237 124 -29 -101 -136 63 -42 -40 -34 121
5300 121 160 -57 -153 285 -49 215 224 80 -10 148 -120 -132 107 -19 -82 294 3 -3 53 368 61 -77 124
5323A24p2J7j46J15J00R1k72%QM7J2K7J99k80o2K1Q8J35k56m6K6K95j14j9j15
5348g7K04j69J73k35J00J81J3j61j96K91R3j58J6k25J78j02k1o3K89j09j09M1
5370d6N4P2k17J38L10k95M8j20J1k4R3p9j32L11q9K36m54L13j65K1Q4m3r8K34
5394A63l40N42k13m31M91k66R7j42j54K60J98k05j09K59q4o7K04l93K08j29J41
5415C0K5J42k13l6L05m17K95q1o3L1K43l10R4Q6p1J4Qj72J58Q4j85n8M5R0J35
5440A79j19j09o3R5p7k10L22j43K23m4o9j51N30n86K63O0J19l04K18j13k43J80
5462d2L7J20J2j08kK19l03M3J43r8O5j83J77k1N9j52p9Q0m2J33R1l36K6J71o3
5487e3O8j18K33l17M90k69r4N5j10J27m9Q3R1l60L63j81J58M5j00j1j35L60l16
$$ plain form
5323 124 52 69 -77 38 138 229 -43 -43 -35 12 24 51 250 -30 -92 -71 17 152 -104 -150 -124 171 57 38 -77
5348 -77 127 -42 131 -104 -4 177 190 29 -167 124 217 59 75 -150 28 -74 -95 -158 131 22 -87 -46
5370 -46 8 80 -137 1 311 16 64 -56 -45 -69 24 -55 -187 124 35 271 -183 130 -35 -14 70 27 -71 163
5394 163 -177 365 152 -279 212 -54 43 -99 -253 7 205 0 -109 150 66 -1 203 -190 18 -111 30
5415 30 55 197 -16 -52 253 -164 131 50 -13 18 261 -49 45 131 60 74 82 -90 68 152 -33 -91 -46 44 179
5440 179 60 -49 -112 -17 -94 -304 18 -125 98 54 -15 -166 364 -222 41 101 220 -84 134 21 -222 -42
5462 -42 -5 115 127 19 17 236 -67 -24 119 21 86 -97 80 59 118 -34 -113 -33 -75 58 149 -187 -161 10 -53
5487 -53 15 -103 130 -187 303 34 -60 -5 -115 12 -37 46 137 -223 140 -41 117 162 62 51 -84 276 -40
5510d0K9O0J01m8k23R5oj7J53l51M48j36o5J3lK3K11j46o1J9j89J41J6l2J62q2
5536G2m9K39n51L47L8p1J89N2m26K59l83M23J59l03J14n5J3r6L03j96R3j36l09
5559b74J56K82j50K4K9j86J48q5Q6Q7J35p2l34N17l95j17J22j13K78j53P4J37
5581A96m15L10P6k85J79j4j44R1o3N4n3M4n0j9L22k55J58J57l57j72lK33K02l8
5605A54k1jk08%J53K27j70j99O3p1K7J51qj62R7r9L37m81K34n0q7J16N9k06K13
5630F8J64j65j32J56J23j87j44R3R3oK25k76R0r9J8j23J92O2j3j44k7N7J12j87
5654e0P1j28N3J45j09p1L23m86J84M35k15j07j50J91k81L68j13Q1p2j89K33lL4
5677A44q4n1o3Rq5n8L83j46n1k16L41j55k66K45P1L1J21k02J16q8j03n3J40o8
$$ plain form
5510 -40 -11 49 150 102 -121 -26 -32 -49 104 -247 201 65 0 13 10 33 244 98 37 56 -133 8 24 -8 154 72
5536 72 23 262 -289 58 96 25 214 266 -160 99 -284 139 298 -5 109 54 67 -29 274 78 171 35 -274
5559 -274 -118 164 14 38 67 -119 29 -56 30 117 252 180 -154 363 -32 -149 -27 -140 138 -15 59 196
5581 196 -219 91 167 -118 61 47 -97 -6 -69 -15 -68 -24 -74 -93 229 -26 132 289 -68 -240 -243 -10 192 154
5605 154 133 132 -76 -76 77 304 134 -65 -2 -73 -46 105 97 -65 32 -67 270 -211 23 -27 -114 2 61 -145 68
5630 68 232 67 -65 91 214 27 -117 -24 69 63 288 12 102 3 21 -102 90 152 139 -5 -32 25 137 -50
5654 -50 21 -107 -54 91 -18 -89 234 -252 -68 367 152 45 -105 86 -195 173 60 141 69 -120 113 110 144
5677 144 60 9 -54 -45 -130 -188 195 49 -2 -218 123 -32 -298 -53 18 49 170 -32 84 -4 -107 -160 -20 -88
5701h8k8J88j18q5l3J30K2Q4m3k79J37J88j44M5l12J50j0J71J0k32K10K03k38
5724g2J67k18K39k17L0p3J1R4J13J01k54o9J82J08l17R8J20qn6k7J03r7Q9K14
5748B61j78on1q1p5K13q0r0o4J37NL4j55j31L85j15L0l02K30J39m69J23L8K31
5772B9k00J90j3o3j24L18j9r3J44n2m9j4m1L8K7j25J56lr5l8J65l41K35q7n4J75
5798F6pk23J91J08l9p9j28L2R1j33K77j15R3k8J13j21j93L10k49L7K6o2q4K44
5822A27K8j50L54l89K9j01Q7n3J50O3m39K62j80Q2J62k4j41L93j18q8j84L3J16
5845A9K6k99O5Q6j67O5K13j94J88M2P0j60n6K33j89M9K12k48N2K2o9K62k16k0
5869a4J34k05K44k33P1N3J03l81P2K89J97m04R1K7K19k38j82N5j9J75j81R9k70
$$ plain form
5701 -88 -116 72 -46 -131 -164 -34 -12 72 29 -250 -113 75 -69 -24 -336 -186 -196 -25 -15 -247 -37 166 -72
5724 -72 95 -123 116 -101 -71 -144 -133 -39 74 175 -79 -148 34 142 -175 -77 43 35 -21 -48 55 -42 47 261
5748 261 83 77 26 -55 -130 83 3 -87 -151 -14 -9 25 -130 -261 124 9 39 -263 -33 106 -363 -240 -202 29
5772 29 -171 19 6 -57 -181 137 118 25 169 117 68 54 13 51 78 -47 109 106 11 -27 138 -203 32 -55 -109 66
5798 66 59 -164 27 135 96 17 -111 -79 12 -121 156 41 134 106 219 98 -95 215 -34 3 29 -33 -117 127
5822 127 155 5 359 -30 -1 -102 -15 -68 82 145 -294 -32 -212 -130 32 8 -133 260 142 54 -130 -97 19
5845 19 45 -254 -189 -103 -270 -205 8 -186 2 44 114 -46 -102 131 -58 -9 203 -45 7 29 -40 222 6 -14
5869 -14 120 -85 159 -74 -3 50 153 -228 -156 133 330 -74 17 44 263 25 -157 -102 -121 54 -127 -28 -298
5892b98L03j04J15q7K6O5j33K66j63J13k34K71j36l1n2L3K75k99K38r0k14L5K3
5915g8L18m9k07m2K77Q6m94K37J1j14m3J73n20K66J61K63k90j32L7J83j66M5N
5938g3J00J48k04Qj16K92jj82J1J78k87P6ll%J73On6k01K1K16l04O8M6J2j20K25
5965C0j54o8K31j46J35O5J77m38M11j40j2j36J16r7J54J85o99M80j40N4j93K48
5987F3J79j85Q5j82K70l69R4R4k83J71L7j10K33j91Om9J13l05L31J98k26O3j72
6010a35K35j24Q3Q1k92J57k1n4R6m9j68K69q8L3j28P8M7L2k3K0q6K21k79M6j44
6035a93K7J45K9r2J86J62l75J11J08k50r0K09L7j96J96j8M7j91J57r6Q0j39J98
6058E2r3O4j97K8K53k50J09J30M3k63K17j83P8m9M1J37j86R1q2O4j82N8J41j36
$$ plain form
5892 -298 5 -99 16 -71 -45 20 -113 153 -10 103 -131 140 4 -27 -79 -46 229 -70 168 78 -136 -101 -78
5915 -78 240 191 -16 -58 219 305 -189 48 59 -55 -98 75 -445 -179 -18 245 -45 -177 -140 43 -123 -78 -73
5938 -73 27 175 -29 -21 -137 155 154 -28 -17 161 -126 -50 -53 -56 -56 117 123 67 -134 -113 103 -201 -133 -87 -75 -195 30
5965 30 -124 -192 39 -107 28 93 270 -168 243 103 91 -45 71 -26 128 313 -386 94 -46 8 -185 63
5987 63 242 57 142 -40 230 -139 -45 49 -234 -63 -26 -136 97 -94 -88 -137 -24 -329 2 200 -26 37 -135
6010 -135 100 -24 59 140 -152 5 -16 -70 26 -23 -191 78 -10 23 -105 -27 20 52 29 49 -37 184 -95 -49 -193
6035 -193 -166 -21 8 -84 102 264 -111 0 108 -142 -232 -23 14 -182 14 -4 43 -148 9 -87 -7 -146 52
6058 52 -41 23 -174 -146 107 -143 -34 96 139 -124 93 -90 -12 -61 -20 117 -69 22 -60 4 -178 -120 21 -115
6082a15J62m6P7j44J17q5J41R5r0j08n3J30j00J38j44R3j67J03J93J03j93j07
6104@k9J1k5n8Q7j4L0j31J73p4K94j65j26J42j84J62rr1r7j9J5ML35j80K25m1
6130B35j30j5k9n5J12m46K00J03r8K0L4q8K34j47J88j25K9K23m02L67o8k18M9
6153b7J23j88L64m08L21l9J4k0p2l2L3k46q7N67l64Mp4J43L2l8j49J09R9J13j24
6178E4o9R2J4j59L64n41M00L3k15Kj01l2K38k72o0K06N8k18M94k27l9K2j2l21
6202b89L25l8q5K21l12L45k14K36j9r5L2k42J39M2Q0j76kJ34k6k2m2j71J02P6
6226aJ61M9k79K16j35k18mj28J78K34M5q3n4Q5LM3j97m3K85J05l73J48l03K47
6250a9q9p2K92q7j91R3l8J9J22K22l34R5j49J37O0n1k96K89Q1j87K48O4j02J0
$$ plain form
6082 -115 47 1 78 -66 51 -34 107 202 112 4 -49 81 -19 119 -25 68 -99 4 197 300 107 0
6104 0 -29 -18 -43 -101 -14 -28 2 -129 44 -30 264 99 -27 115 -69 93 84 -7 -104 -123 -108 -104 231 51 276 235
6130 235 105 90 61 6 118 -328 -128 -25 -123 -103 -69 -157 77 -70 118 -7 22 245 -157 210 142 -76 -27
6153 -27 96 -92 272 -136 185 146 160 140 68 36 69 -177 -264 303 -61 -57 -131 12 44 6 -143 -34 65 178 54
6178 54 -15 77 91 -68 296 -245 155 188 -27 -25 -126 -158 80 -192 -252 -46 12 -206 288 61 22 44 32 -289
6202 -289 36 -2 -87 134 -178 167 -47 189 170 75 107 -135 4 46 126 -50 -52 82 56 34 -8 -179 -77 -1
6226 -1 160 209 -70 146 11 -207 -211 -339 -161 73 118 35 -19 66 69 112 -85 -128 157 262 -111 37 -266 -19
6250 -19 -108 -180 112 25 -166 -73 -111 -92 30 252 -82 13 -136 1 61 10 -286 3 84 -103 145 209 107 117
6274A17j49j35L52o1k28J82M7j02O5N0J15j1k82r6j7J83J55l60L94k48Q2L5k24
6297a36J08K73k85J71r7k46L33l01L91n64L72j09J50r2o4J71j61j25J87K93m81
6318b12J27N3K68j84j81J0M2J29j09N5PJ46l12RJ91O5p7j7p3J42l55J74J61j2
6342D7M1k48J93kj7m5J3L90m04j29J16J36r6R2j91K9M9Q6l03L50k11J55J26k93
6366a16R5J11j22j07K50j70m0K56j09l67J92%J20m8L16l79J82j61J89Lk74J55
6388b4N8N3n9J5q5J4J30k13L54k58q9K54l61J69j1j44Q5K12j06l8j8R9q3j11Q0
6413g7J61r2n7K5J38K09k28o6j19J23o0QK16k82J76j82RP2K68r9k38K28j47j18
6437a32j72M51p4k42M8L57q2j68P5j93K1k24J45J50J21P2j08j73K96Q4m21K50
$$ plain form
6274 117 -32 -167 185 124 -104 78 125 23 88 138 253 242 -40 -136 -153 30 185 -175 219 -29 53 88 -136
6297 -136 -28 245 -40 131 34 -212 121 -180 211 -353 19 -90 60 -32 -96 75 -86 -211 -24 269 -212
6318 -212 -85 -32 236 52 -129 -119 -77 52 -57 -2 5 151 -161 -152 39 104 27 10 -63 79 -276 -102 59 47
6342 47 88 -160 33 31 14 -31 -18 372 -32 -161 -45 91 -5 87 -104 -75 -26 60 -243 107 -104 51 177 -116
6366 -116 -21 90 -32 -139 111 -59 -99 157 48 -319 -127 -127 -7 -55 261 -118 64 -97 92 95 -179 -24
6388 -24 34 87 28 43 -42 -28 102 -111 243 -15 -104 150 -211 -42 -53 -197 -112 100 -6 -44 -62 37 -46 -157 -77
6413 -77 84 -8 -65 -40 98 307 79 13 -106 17 -43 -35 181 -101 75 -107 -98 -26 242 143 -95 133 -14 -132
6437 -132 -304 147 73 -169 -121 236 154 -14 61 -132 -111 -335 -190 -40 81 153 45 -128 168 252 -169 81
6459H1Q9M5j75M54k85m41K5K06P7J41l01r0L31M9l82J02J23j09%K76k61K39k8
6482A66qm2m4k27J23j34J13K5k02K79k80M90ML6k90j7o5P5J79k70p3J52L4o6J69
6507A27K2k27k5n9O3o2M47l54k1m5K1K89l40N5K96l11J52J10r4j28K03J36k55
6530@J77k84N9J72l69K24Q6k4K2j96M74m51j15J82l4J65l52J51k0QK57R5k58O1
6554C0l6j63J96O9k3k84P6k33M63j73o4L93j11k80M3J37k6j96K08q6L9L5ln5j2
6579e6J39r1oJ25k98K51J8r6k15J06K87j09j67K09N6k91j1J13o8K58L9k22R8L8
6603A07k27K3K21k9j6R1k8j73j18L6J52q3p4J09O5J81j50j9M1kK72l53J8j7j92
6628a65J47J13MO8j75J07m1M2j22j13O0j84K41J00Lk74L77j52o5N1O1k17P8l1
$$ plain form
6459 81 170 215 40 494 209 -232 -207 -1 76 217 -84 -174 157 206 -176 -74 49 -60 -60 216 -45 194 166
6482 166 158 116 72 -155 -32 -166 -53 -28 -230 49 -231 259 263 299 9 -8 -73 2 181 -89 -162 -10 24 -42 127
6507 127 149 -78 -103 -162 -99 -161 286 -68 -89 -134 -113 176 -164 -109 187 -124 28 138 44 -84 119 255 0
6530 0 177 -107 -48 124 -245 -21 65 41 63 -133 341 -110 -225 -43 -77 88 -264 -113 -133 -125 132 227 -31 30
6554 30 -6 -169 27 96 73 -211 -135 -368 95 -78 -142 251 140 -140 -97 40 14 -182 26 -60 -21 14 11 -44 -56
6579 -56 83 -8 -14 111 -187 64 82 -14 -229 -123 164 55 -112 97 153 -138 -149 -36 -104 154 193 -29 69 107
6603 107 -120 -97 124 95 79 170 142 -31 -149 -113 39 -44 -118 -9 56 237 87 68 109 107 379 26 44 27 -165
6628 -165 -18 95 99 167 -8 99 58 100 -22 -135 -75 -259 -18 82 85 -189 188 36 -29 22 83 -134 -56 -87
6652h7K62j94p8P0kK39n3j38J53o0j67j87M45l42Q0j3P4K93m33n4PJ43J98k28
6676g2n1K86n52L52m9o2K80k39j23L60j09J59k37j03K61j58j0K47K5j57P9r6K27
6699B58j56l07J10Q3J57j11j4K17l6l16J07j25J42j51K38m1o0Q6J77p6j51j04
6721g3L5k50J71K56k71O6M23m46J35Q4k03p0J49j16N8j38K58j8NO6K6j48j98N99
6745D00m81K3J80j28j14q6J37K3J91k58M7k70K29L78p3k75k20M71K54o96K55N6
6767D3l05K02K3Qn9N5J27j61J14j2Q6J32k09J04j02P4j33j27J18P1j67J74l6j48
6791a28J45Q7k53j40M01l47J48o9K26j02J46j27m8J9j76J67q8L0L7M2m0J21o4
6814a3l48M83j28kj7N2J84k16N9J26j16J44j33j87L8Q1J63p9p4j84K09N9j79J12
$$ plain form
6652 -87 175 -19 -97 -27 -29 210 157 19 172 112 -55 -242 203 -139 -59 -72 2 295 -138 -192 -185 -42 156 -72
6676 -72 -123 163 -389 -37 -86 -148 132 -107 -230 130 21 180 -57 -160 101 -57 -67 180 205 48 127 31 258
6699 258 102 -205 -95 -12 145 34 20 237 201 -115 -8 -133 9 -142 96 55 -5 81 258 182 31 -73
6721 -73 -38 -288 -117 139 -132 -66 357 -89 46 130 -73 -143 6 -110 -52 -190 68 50 55 121 147 -1 -199 400
6745 400 -81 -58 122 -6 -120 -206 -69 -46 145 -113 -66 -336 -107 271 198 -77 -297 174 428 -268 -13 43
6767 43 -262 -60 -37 -29 -88 -33 94 -67 47 35 121 253 44 148 46 120 -13 -140 -22 49 -118 56 20 -128
6791 -128 17 104 -149 -289 112 -235 -87 -156 70 -32 114 -13 -61 -42 -218 -51 -139 -109 -72 -30 -70 51 -13
6814 -13 -361 122 -6 -8 -25 27 211 -5 54 180 64 208 75 -112 -74 7 170 91 17 -167 42 101 -78 34
6838C4L9k72L62l92J73K68n00K91n6Q1q8L5Q2j46J58m7k06J17k54J26K35r9K98
6861B39ll28j25L98mj35K31m72L04j85J38k23J90J36j24j35M6K44j47k35K13O7
6883I0r5K6j22J53J77j56nm3Q0m30L80K01j83J17k15k50M05o1j69K32k74J49j48
6906a41M5K05q7k51K80l0k35J80r7J75K33l5k3l04k02K60J11j82J82O2j60M9j24
6929h9J83r5k65K76M1j21L8Q3m8J44j80j61j30K33K89k45r8R2K4L71m49J13j25
6952a19L43l41%M02l51n5j7p8K47q1J23m5k48j27J09K43o4L37j49m20L39m8O8
6975F8J78n68K43j85O03j7l55j69M1l2K23k05Q3O1j62K03p5L55l26Q0O8j18J07
6998A01j7Mp9j5j22j2l7r9K03N5R7k28L32k25j42K28k06J89J42p7j80J8j2P1N0
$$ plain form
6838 34 73 -199 163 -229 -56 212 -288 3 -53 28 -60 -25 57 -89 69 22 -184 -67 -321 -195 40 -59 239
6861 239 236 -92 -217 181 177 42 273 -199 105 -80 58 -165 25 161 37 -98 -52 192 45 -190 23 90
6883 90 -5 21 -101 52 229 73 68 25 105 -325 55 256 73 190 -25 -275 130 69 -100 132 -142 7 -141
6906 -141 -96 109 22 -229 51 21 -214 -34 -131 44 277 242 219 -85 -287 -27 84 -98 84 146 -14 35 -89
6929 -89 94 -1 -266 10 51 -70 -32 51 3 147 -33 -194 -324 -91 198 -47 -145 -53 -29 342 -107 6 -119
6952 -119 224 -117 -117 285 -66 -121 -138 -216 31 -50 73 28 -220 -347 -238 5 -59 278 129 -291 48 0 68
6975 68 246 -322 -79 -264 339 322 -33 -202 -161 -193 30 -175 -92 -31 -193 10 -65 290 -36 44 112 -6 101
6998 101 84 88 9 -6 -128 -140 -177 -276 -73 -18 79 -149 183 -42 -184 44 -162 27 169 92 -88 -70 -82 -11 39
7023C9j57J14N8j66l6J24j72K58o2L6j34L65j44N5jk94J91p6m7o6K01j80p2L62
7047A96m70M05m9j61O5K65Q7m10L85j63j21M8k01P3M7R1J27m6N5k25oO4K6j41
7071e9J4K19n01J05J60j06J95q1j12J85j8%k4M5k9rj12J59j68J11J59K0j86J16
7095H3p1L5PR6k92J30N32k72l87J20P1j56j2N8J99j96L1K54j47j34J68l23K52
7118D6j74P4K76k44k77mL65J49l53k1L15j04m0l14K63P6p4L67m13N4M0m1J2N3
7142C1k92J74j55J49J25J02r3j2k46K69Mj32K86j89J9L5J32k0l65J92P5j21J06
7165G4j48J10k8q7j0Kj06K84K4n9j45j64K68j02L0K4j10J84j86k7K4J46j41K00
7189E7p8p1pN3J28K4M0q2k08p4K11J34j08j45q9J2K05l2m5M3K08j53L5nj14J51
$$ plain form
7023 39 -118 -4 54 -112 -148 -24 -196 62 0 36 -98 267 123 178 177 -117 74 -2 -49 -115 86 -94 -166 196
7047 196 -274 131 82 -79 -14 251 338 -72 313 150 29 77 -124 -51 -4 87 214 168 223 -2 -8 56 82 -59
7071 -59 -45 174 -327 -222 -62 -168 27 -54 -166 19 1 1 -23 22 -7 -16 -128 31 -137 -26 133 153 -33 83
7095 83 12 47 54 150 -142 -12 520 248 -139 -19 52 -104 -116 -58 141 -55 -24 230 83 -51 117 -206 46
7118 46 -128 -54 222 -22 -299 -303 62 211 -142 -163 152 48 8 -306 -43 33 -41 326 -87 -33 7 -34 -22 31
7142 31 -261 -87 -242 -93 32 134 41 29 -217 52 56 -76 210 21 40 75 207 187 -178 14 89 -32 74
7165 74 -74 36 8 -79 -89 -87 -193 91 115 56 -89 -253 15 -87 -57 -33 -143 41 -145 -172 -148 -2 -143 57
7189 57 -21 -92 -99 -46 82 106 146 64 -144 -218 -7 127 19 -126 -215 -203 2 -30 -75 -32 176 23 58 53 -61 90
7215I0j30O4Pj0o9k9K17j39j94J17J10k0k19J95j46L46j76j56J15J02j30l0J98
7238A13J43j08k09k9R0q0k5L22l83K84j57J57p6k09L20j63R8L7k53R6J61k21J44
7261E2m5OJ37l13N5K59M1p3k55L71m47%JK77p5j61P9L1M4L0j23m1J52L4L8r8j38
7288a62J47O9k83K83j38O3K06N9l82L00l49L2J12K4p5K06P9j57K84k63L7k53J20
7311d1K55m40M17O9k15J11n76M83j52o0K23o2k9j30J36J94m25J69K5K45k54O0
7333CJ12q2K5q5Q2l2K4J3L7l41K70j17J70p7R1l08L92p3lL8Kj82J04m2j05J95
7359A11o7q5m1j33K16K08M1k88qn1p6K12J24l18J74o9j06K39Q8j57J19k1pk50
7383a45K64P1n0n2k58J11kj3J59q8O6NJ8k31K34j14J03Ok0J73k77K62o5k64J08
$$ plain form
7215 90 -40 24 31 21 -48 -77 140 1 -193 -76 34 14 -205 -10 -156 190 14 -142 -27 75 -55 -85 113
7238 113 256 148 -61 -90 0 -80 -105 217 -166 118 -39 118 42 -167 153 -10 88 125 -128 -32 129 -92 52
7261 52 7 13 150 -163 -108 151 192 119 -136 235 -212 -212 -211 66 -9 -170 -91 -60 -16 14 -109 -150 2 36 74 -24 -162
7288 -162 -15 54 -229 54 -84 -21 185 244 -138 162 -187 -155 -43 -19 -94 112 191 34 318 55 92 -161 -41
7311 -41 214 -226 191 260 45 156 -420 63 -89 -149 74 12 -17 -147 -11 183 -242 -73 -48 197 -57 3
7333 3 115 33 58 -27 55 23 47 60 97 -244 26 -91 79 2 93 -215 177 104 101 139 141 -41 63 21 -84 111
7359 111 44 -41 -82 -215 1 209 250 -38 -46 -97 -173 39 163 -155 19 -50 -156 83 171 14 133 112 105 -145
7383 -145 119 190 140 88 -170 -59 -61 -74 85 -3 63 68 86 -145 89 -25 78 84 64 237 -40 222 157 -107 1
7408Ar9N3k00K14O7l02J79O0j47J80J25k76J37NP6k91M41k69j08J96l23J34K12
7431F5j02J26j8k34m3L19J6l4M9k41j29K55J6N4j73j07J20k24L76j9M9k05J32
7454D8j3J45n4n2m4K39j74j02LJ84n12N93j76q8J1Q2Ll75L85l07J79J6J45j03
7478C3j22k04K97r3j27J82j25K72o5k66K52L1j5N5M1j08J00l14K36K5n3R3k57
7501a32K44j36M2J65mK8k98J55k00R2L8K02j49k7j4j09m7R1L5J3l6o9L2j04K04
7526A6K52k02j80Q7q1L05l23K03j16L5J53q3n7J28j37M06l55j31P9j61J82j30
7548a10R5l1J17J76J5m03K8M4j6J08J15k49K12k33M6K4J48m7q3j42K08l7j24m
7572a43j92K67K49l7j10Rk04K44k32QK53j33J02Ko3J62k11q8J30n2K29k76p1R9
$$ plain form
7408 1 -98 -45 -245 -31 36 -266 -87 -27 -174 6 131 -145 -8 -3 73 -218 223 -46 -154 42 -281 -147 65
7431 65 -37 89 71 -163 -206 113 129 95 144 -97 -226 29 45 99 -74 -181 -61 -285 91 72 121 -84 48
7454 48 35 180 126 74 30 269 95 -7 -4 180 -332 261 85 -3 8 90 93 -282 103 -204 -25 -9 136 33
7478 33 -89 -293 4 -89 -216 -34 -159 113 48 -218 34 65 50 105 146 38 138 -176 60 85 32 125 -132
7501 -132 112 -24 18 183 179 207 -91 64 -136 -44 -6 196 47 20 6 -103 -150 -59 -24 -11 -47 -116 -84 -188 16
7526 16 268 66 -114 -27 -108 197 -126 77 -39 -4 149 66 9 137 0 406 51 -80 -1 -162 20 -110
7548 -110 -15 -46 71 247 262 -141 -113 -69 -85 23 138 -111 101 -132 -86 -62 86 39 -44 -186 22 -15 -139 -143
7572 -143 -335 -68 181 144 34 43 -161 83 -149 -141 112 -21 81 83 20 182 -29 -117 13 -39 190 -86 -157 -58
7596e8k5L13j00j61J99j51L5k19K67l78K66J06j3k4j69O1l6J20j63J82j61J47
7618C8j5P4QJ00j62K08l44l7L49k07J7r5j3j02q1J37Q1r2K71O0j47j79l3L93n20
7643b91K31L66l30R4j34J12j78J01k12K41l2o6K52rk09J21j9J93j64o6K58m11
7665a52M36n00K84O5k47L9J44k26K72q4l4q4m7M17k16l57L30m9N1o4j84L39k29
7688i6K94j30j81jK32m6J13k59j81K39M97o33J73P5r2l2J21j69l1J74j8J8K0K8
7712A15m39K24K25r2k00Q5L1L7Q7n1j83j58M16l5j41L19k58P4k24M0J08p1J51
7735F0j35J42p0M5m9O5k0j37Q5M2j71R6j43L26q2R1k01L3r4K97m8j51jL00m59
7760a79N0K32j61k75K46p2N1K15r8K50k49j07Q2NN6Pj9L6k36%K23O8Jl66J8K72
$$ plain form
7596 -58 -83 230 130 -31 168 17 52 -167 100 -278 -12 94 81 57 -112 -51 -87 33 -130 52 -109 38
7618 38 23 97 105 205 43 251 -93 -130 219 12 29 -66 -79 -181 -262 -125 -44 -136 135 195 48 -131 -164 229 -291
7643 -291 -60 306 -24 70 -64 48 -130 -29 -241 0 -32 -98 154 145 -64 57 38 231 67 1 259 -152
7665 -152 284 -216 68 133 -114 -75 69 -157 115 31 -3 -87 -134 283 67 -290 40 -9 42 -22 -206 133 -96
7688 -96 198 68 -113 -114 118 72 185 -74 -255 -16 481 -152 21 96 4 -28 93 -76 -107 67 49 67 87 115
7712 115 -324 -100 125 33 -167 -82 -51 -14 73 22 -161 -319 97 62 -79 240 -18 56 -168 -128 -20 -91 60
7735 60 -75 67 -3 42 -7 58 38 -99 -14 28 -143 -47 -190 136 54 145 -56 -23 -117 180 132 -19 -20 280 -179
7760 -179 -129 103 -58 -333 -87 -159 -108 107 9 259 10 -97 -15 -10 46 53 34 70 -166 -166 57 125 126 -240 -222 50
7786E0K76k75j17j26K72j0k83J77K95j57Nj60J8P3k5L4k8K33k82n8j4L14j35R8
7810A75q6l40J52L45j97r0j17M6M9L1J29k09K10k28r7P8Q2R2j07J57p9j00j5K30
7834A11l10K50j93J18j4k1j3J04j31J26q9J73J35j04k34J65o2j05L41m18r2K68
7856En6J8p5J10J02r0j29n9K27p0o1L00j61j3n0j35K66j00j51L90m61J46l1O3
7880a5J03k62P7k29K87J95N4l33p6O7K62l5R0j82l52K84J19J28k27j07K36J01
7902A85j50j20K70k59JK21k51L65k86J42j39J30l38K36J36k93K87j41j76J9R2
7923f9L6j12L18l42K89L8j99K60m4k47m4j9K60j34rP3k03J32j53M08l53Qj07K24
7947A1K26l53J23l41L93P2k65K02o8J65k31J12k42K36j00rk42K66j77n5L99k3
$$ plain form
7786 50 326 51 -66 -192 80 70 -213 -36 259 102 107 -53 -35 38 13 47 19 252 -30 -88 -102 212 77 175
7810 175 89 -251 -99 246 49 -41 -158 -112 -63 -32 97 -112 98 -130 -227 -149 -67 25 -82 75 -4 -104 -119 111
7834 111 -199 51 -142 -24 -38 -59 -72 32 -99 27 -62 111 246 142 -92 73 11 -94 247 -171 -263 5
7856 5 -51 -33 -108 2 104 14 -115 -174 53 -17 -78 222 61 48 -2 -137 129 29 -122 268 -193 -47 -78 -15
7880 -15 88 -174 -97 -326 -39 156 210 -123 -199 -132 130 95 185 3 -349 -65 54 182 -45 -152 84 185
7902 185 35 -85 185 -74 -73 148 -103 262 -24 118 -21 109 -229 7 143 -150 137 -4 -180 -161 -69
7923 -69 -33 -145 173 -169 120 158 -41 219 175 -72 -116 -135 125 -9 -18 55 -148 -16 -169 239 -114 -106 -213 11
7947 11 237 -116 7 -334 59 131 -134 68 0 165 -66 46 -196 40 -60 -69 -311 -45 -222 -277 122 99
7969I9q2M0j09J7Q0M0Q3j70j97O5M14k60J9k09J63k39L45k16L84m10K64k19M2
7992e6N4j25j01K98j55J73J7q0nJ1r5QM2l8l8K00Q3j91R9K5k87K73j35N0P0j94
8018i7J56q2L24l77J8j39J60K0O3k97N5k9L28K12m50M54k40o1k07J69J21p0j46
8041a15J75j97K31j35J49j72J15m0J18k20L2P2J54k07K1J22R7k30N5R8j17K87
8063B93k96N6l0O9J07j73j2L4p6j03R7q0J38nJ8O1j97q0J1M9J60j34Q9J67n4j67
8089e8k15M82j03k5l5r1o7J88n3M0J53k65J32j3J25m50K20LJ82j3r8j39J68k13
8113a45M2R9j2J00j4n2j6o7J82j38K76o18M97k03J05j90M6jP8J18J8q1K8J3k13
8138a48J27RL8n1J24j43oK59l10K59r9n4O5j52J47j57L55k84O9R5j81j58L38j67
$$ plain form
7969 99 17 57 -52 -35 45 85 168 -2 -199 -134 280 20 39 -170 -7 -246 99 -117 267 -143 121 -98 -56
7992 -56 -2 -127 -228 70 -85 88 105 25 20 31 -64 -56 -14 -52 -90 110 193 2 101 126 -161 112 -23 27 97 -97
8018 -97 59 -23 301 -76 -58 -197 -37 -17 46 -251 -196 -225 103 315 -135 319 79 18 -189 -20 101 31 -115
8041 -115 60 -137 94 -41 108 -64 51 11 129 -91 -59 13 167 -40 -19 103 200 -30 25 123 6 293
8063 293 -3 53 23 92 199 26 14 48 -28 -131 -34 -114 24 19 37 98 -99 -179 -168 -119 41 -93 -4 163 109 -58
8089 -58 -273 209 106 81 46 -45 -112 76 23 63 216 -49 83 70 195 -255 -35 -32 150 137 39 -100 68 -145
8113 -145 -103 -4 -16 84 70 18 2 -65 117 -21 255 -363 134 -69 36 -154 -108 -109 -31 87 105 24 52 65 -148
8138 -148 -21 -12 26 -25 99 -44 -50 209 -101 158 59 5 70 -82 65 -92 263 -21 48 143 -38 -196 142 -25
8162b5J97l87J15L4J51j16l7L22k27n3J15j95k23L26J31j07Q8k9k20L47j90J12
8184A29k91K84o7j70M1J15J45
$$ plain form
8162 -25 172 -215 -100 -66 85 -31 -68 254 27 -26 89 -106 -329 -3 128 21 109 80 -140 207 17 129
8184 129 -162 122 55 -115 -74 41 186
8191A86
$$ Imaginary data points
##PAGE= N=2
##DATA TABLE= (X++(I..I)), XYDATA
0@%%%%%%%%%%%%qJ6j6J6k4L2m0M8n6P2q0Q8j04J28j52J76k00K24k58K98l40L85
34B05m36M89n48O15o88P68q55R51j057J169j292J430j580J740j918K115k329K565
52A344k826L118l444L809m224M702n255N903o677P623q806J0334j2392J5332j9910
67a1369K8050m6832J70529O3132k91870k4367n9597J41603K54726o8966k12504
78e7465m3870p1222J27782K61787n5674k07958o6798n8513J38929K47339o9944
89A44393j88726n6149o7340J31613K41970p0227j68956o3130p7194J43760K33091
100B03105q0097j51057o3411p8544J44382K16528p5757j35040o8338p9234J42510
111b4953K07898p3106j26076o7636q0321J39640K00137p1746j13096p0578q7443
$$ plain form
0 0 0 0 0 0 0 0 0 0 0 0 0 0 -8 8 -8 8 -16 16 -24 24 -32 40 -40 48 -56 72 -80 96 -104 120 -138 160 -180 205
34 205 -231 258 -290 325 -363 405 -450 501 -556 613 -679 751 -829 911 -1007 1108 -1221 1344
52 1344 -1482 1636 -1808 2001 -2223 2479 -2776 3127 -3550 4073 -4733 5601 -6791 8541 -11369
67 -11369 16681 -30151 140378 203510 -88360 -112727 -172324 -30721 224005 155039 -57465
78 -57465 -101335 -172557 -44775 217012 161338 -46620 -113418 -171931 -33002 214337 144393
89 144393 -44333 -100482 -167822 -36209 205761 135534 -33422 -96552 -173746 -29986 203105
100 203105 123008 -28049 -91460 -170004 -25622 190906 115149 -19891 -88229 -167463 -24953
111 -24953 182945 109839 -16237 -83873 -164194 -24554 175583 103837 -9259 -79837 -167280
122a67280J46429J93120p5545j02184p4690q3521J51867J73072p5567q3607p5297
133g3203q6665J44736J65785o2716p8079q6254q4915J51118J59499o7122p4324
144G860q0335q0494J44337J45991o0542n9088q6962q6324J48263J41007n8034
155G5679n5043r2937p8270J49360J25684n4252m4281r5135p8057J45875J18547
166A17170m7695l9846r7901p7226J44895J12741m4918l3672j01083p6579J46546
177B432J05501m3843k8877j02949p0749J43938R3020l6684k1806j06936o8129
188a35082J38881Q8669k8100k2241j11137o2563J37893Q1946k6212j9674j10092
199f7712n8567J33205P3659j9617j4330j14099n7325J32018O8838j4323j3524
$$ plain form
122 -167280 -20851 172269 96724 -5460 -80150 -163671 -11804 161268 85701 2094 -73203
133 -73203 -159868 -15132 150653 87937 9858 -76396 -161311 -10193 149306 82184 7860
144 7860 -72475 -152969 -8632 137359 76817 17729 -69233 -155557 -7294 133713 75679
155 75679 20636 -72301 -150571 -1211 124473 70221 25940 -69195 -147252 -1377 117170
166 117170 69475 29629 -68272 -145498 -603 112138 67220 33548 -67535 -144114 2432
177 2432 107933 64090 35213 -67736 -138485 5453 98473 61789 39983 -66953 -135082
188 -135082 3799 92468 64368 42127 -69010 -131573 6320 88266 62054 42380 -67712
199 -67712 -126279 6926 80585 60968 46638 -67461 -124786 7232 76070 61747 48223
210D8223j18662m9596J30417O0133j0845j0968j17693m5944J23788N5082k802
221F1133r418j21629m3035J22130N1878L75j0285j22433l7170J19127M4845N087
233F0605q978j22605l2487J13527L9853J1978r650j23461k8429J08462L7486J7543
245F3844j2245j24422k2761J04426L4259K0557j3409j22223j8210R7750L0238
256C7804K6588j2644j23539j6002R3822K9339L1218j6778j23337r326Q9325K4909
268C1379L4719j6931j21071o273Q2105K3477M0728j8487j22168l518P9067K2907
280B5934M3385k2460j19386J757P2941K0477M6587k3071j16631L608O6244K0744
292B0129N0903k6408j14551N763O1898K1806N2314k9694j11131R019N6368K1336
$$ plain form
210 48223 -70439 -120035 10382 70515 59670 48702 -68991 -114935 8853 63935 61133
221 61133 51715 -69914 -112949 9181 61059 61434 51149 -71284 -108454 10673 55518 60605
233 60605 51627 -70978 -103465 10062 49915 61893 52243 -71218 -99647 8815 46301 63844
245 63844 51599 -72823 -95584 8842 43101 63658 50249 -71974 -90184 7566 37804
256 37804 64392 51748 -71791 -87793 6029 35368 66586 49808 -73529 -82855 6470 31379
268 31379 66098 49167 -71904 -78177 3928 27405 68133 49646 -72522 -76040 3027 25934
280 25934 69319 46859 -72527 -70770 2171 22648 69235 46164 -70467 -66859 -615 20129
292 20129 71032 44624 -69927 -64164 -2266 19540 71854 42160 -68971 -59952 -3584 17752
304A7752N4301l1309j07650J0736M9588K2023N7940l3985j05050J1781M5145K3897
316A5169N9539l8128j01678J5251M0113K3302O0887l9735r7585J6406L3513K4901
328A1955O4055m2596r5127J6975L0069K6939O3916m5768r0359J8774K4715K7600
340A1148O4405m6576q6147J8031J9736L0429O5300m9107q2734J7948J6637L2548
352A1618O4223n1385p7535J7997J1992L4362O3519n1901p2583J5877Q248L7103
364A1535O2951n3330o9177J5333N515L9833O1623n5827o4120J5667J229M1366
376A2598O0790n6696n8868J3391k770M4746N9808n7438n5832J1507m139M7632
388A4729N7073n8857n0832J0991o785M8355N5466n8262m6412Q000r244N1535N3821
$$ plain form
304 17752 72053 40744 -66906 -56170 -6582 15441 73381 39396 -65654 -53873 -8728 15169
316 15169 74708 36580 -65098 -49847 -9734 13568 74455 34720 -62865 -46459 -12946 11955
328 11955 76010 33414 -61713 -44738 -14669 12270 76186 30418 -59941 -41167 -16452 11148
340 11148 75553 28977 -57170 -39139 -19403 11026 76326 27219 -55515 -37567 -20930 11618
352 11618 75841 24456 -53079 -35082 -23090 11272 74791 22890 -49693 -33816 -25568 11535
364 11535 74486 21156 -48021 -32688 -27173 12660 74283 18456 -45664 -29997 -28768 12598
376 12598 73388 16692 -42176 -28785 -31555 13191 72999 15561 -40271 -28764 -32903 14729
388 14729 71802 12945 -37887 -26896 -33681 14674 70140 11878 -34534 -26534 -35778 15757 69578
401F9578n9365m2740N914j0278N4406M9666n8767l8056L830j1646N5210M7446
413F5198n7043l4467k99j2251N7696M5023n6804l2126j578j2150N9041M2078n7238
426E080k7201l347j4343O0726L9116n5764k2811p771j5041O3827L5628n4239k0369
439a6509j1031j3111O4234L2217n2163j8186j2588j3692O4518L0367n0716j5749
451a2409j5354j3648O6383K7150m9253j2820j8399j2350O7095K2267m5944r792
463g074k2513j0687O6083K0748m2199j0316k4934r119O6918J8335m1565q877k5654
476c0854p990O6546J4652l9575n362k8691q186O7364J1879l5907l814l3151n381
489c8470O7545Q365l1967m876l4731k308O5231O445k9531m739l5118j201O3809
$$ plain form
401 69578 10213 -32527 -26613 -36891 17515 67181 8414 -29642 -25812 -37458 17752 65198
413 65198 8155 -26312 -26611 -38862 18834 63857 7053 -25073 -26651 -38801 20240 62318 5080
426 5080 -22121 -25468 -39811 20915 60031 4267 -18544 -26315 -41356 22471 58099 3860 -16509
439 -16509 -27540 -40651 23583 55800 3637 -14549 -27137 -40829 23689 54056 3340 -12409
451 -12409 -27763 -41411 24972 52122 2869 -9951 -28350 -40700 26395 48662 2718 -7074
463 -7074 -29587 -40274 25809 46557 4358 -5958 -30892 -40011 26907 45242 3677 -5200 -30854
476 -30854 -38844 27702 42354 2779 -2583 -31274 -39460 27904 39783 3876 62 -33089 -38470
489 -38470 29075 37440 5473 597 -34134 -36442 28789 35234 5703 964 -34154 -35355 28454
502B8454N189k7790l499l6951j63O3483K407k4270k867l9584K018O2088j08k0105
516H302l359m1740N198N9191l61j6713o052m2384P710N7627j578j5632o070m1682
530c7543R115N5785m205j2450m486m3939R695N4638n717p782o034m7003J3465
543b6461N3123p466m455r165m6006J6732M9127p667k537r752m4992J6709M6587
556B3777o787p53j0453m5841J8365M5135q126J788j1180m6292K0426M1743q153
569A3649N277j3478m6344K2502L8653p277P538j7015m4063K4117L5684o417P884
582B0710j7686m2471K4291L3081o836J0464j7676m3286K5294L0602o391J3897
594B3993k0959m3679K8226K7924n679J5056k3913m0320K8777K3818l621J5501
$$ plain form
502 28454 33643 5853 2354 -34597 -34760 28723 31130 6860 3993 -35591 -33573 28515 28407 8302
516 8302 4943 -36797 -31599 27592 27231 10518 4466 -37918 -30208 27419 25841 10209 4139 -37543
530 -37543 -28428 27357 23152 10702 6216 -37723 -28028 26610 20893 13111 7077 -39926 -26461
543 -26461 26662 19196 14741 5576 -40430 -23698 25429 17762 15225 5473 -39519 -22810 23777
556 23777 16990 16237 5784 -40057 -21692 23443 15317 17105 5925 -40367 -19941 21802 13649
569 13649 18926 5448 -40896 -18394 20259 12982 20520 3505 -40558 -16441 19243 12826 20710
582 20710 3024 -39447 -15156 17925 11089 21553 3877 -39409 -14115 16487 10096 23993
594 23993 3034 -40645 -12419 15505 9826 24882 969 -39351 -10574 13244 9623 25124
606B5124k4572l8315K7516K2265k680J6061k5288l7487K8013K0496k253J7217
618B6097k6787l6148K8868J7052l84J8850k9409l3765K8296J4825K185J8517l1503
631c306l1055K8153J2499L420J7838l1469k8901K7343J0113M540J9129l2303k8266
644c2265K7358Q132O616J9529l5073k6070K8203N456Q388J8898l6445k2328K6610
657b991L300J0525J8164l6292k0892K4543K699J2598J7303l7047j8981K3934J540
670a597J3536J6610l7219j6563K2259j89J5633J5840l7959j4471K1049j119J7778
683A3588J4235l8513j1793J9419j887J9019J2970l7865j0025J7711l451K1234
695A4642J2119l7955q627J5872k983K2656J0499l8363o432J5204m241K3687R292
$$ plain form
606 25124 552 -37763 -10247 12018 9338 25399 111 -37376 -9363 11133 8880 26097
618 26097 -690 -36838 -7970 9082 8698 27548 -1861 -35626 -7330 7495 9680 28197 -3306
631 -3306 -34361 -6208 6291 9711 27549 -3920 -32821 -5478 4635 9175 28304 -3999 -32265
644 -32265 -4907 3225 9841 29370 -5703 -31773 -3570 1886 10274 29172 -7273 -29601 -2991
657 -2991 309 10834 28998 -7294 -28186 -3643 -944 11654 28957 -8090 -27071 -3137 -1597
670 -1597 11939 28549 -8670 -25233 -2974 -3163 12470 28310 -9649 -24120 -3071 -4190 13588
683 13588 27823 -10690 -22483 -3064 -4951 14068 27038 -10827 -20852 -3141 -6592 14642
695 14642 26761 -11194 -19821 -3949 -6932 15724 26223 -12140 -18572 -3368 -7609 16078 25370
708B5370l7806m071J2641n018K5501Q093l6966l477J0473l823K6736N944l6146
721a2549j594R014m068K7141M784l5114l15O421l683K8529L163l4126P31M906
735f760l209K9294J014l2914K350K803k498K9528k80l1333L084O73k455L1045
749B0342j841l0423M019j128j099L1063l749k9060N252k977p41L1610n110k7499
763a1341N831n224O31L1788o516k5744N452o228J750L1373p775k4312O079p451
777a1687K189L0941q779k1893N758r391L795L0839r957k0738N642j0528N885K9917
791B1993j1327j8456N313j1318N974K9562j2221j6236M833j2981P647K8932j2998
804H717j4966M514j4104R661K8085j4432j2926M249j5008J0499K6767j4360j1138
$$ plain form
708 25370 -12436 -16507 -3866 -8884 16617 24710 -12256 -15733 -5260 -9083 17653 23597 -12549
721 -12549 -14143 -5129 -9197 17944 22728 -12386 -12701 -6280 -9963 18566 21729 -12397 -11666 -6760
735 -6760 -9969 19325 20339 -12575 -10225 -7422 -9920 19608 19328 -12005 -8921 -8248 -10703 20342
749 20342 18501 -11922 -7903 -9031 -10130 20933 17184 -11876 -6624 -9601 -10342 21268 16158 -11341
763 -11341 -5510 -10734 -10103 21685 15169 -10575 -5123 -11351 -9601 21772 13997 -10315 -4236 -11687
777 -11687 -9498 21443 12664 -9229 -3471 -12862 -9067 21772 11815 -8923 -3281 -13809 -7924 21993
791 21993 10666 -7790 -2477 -13795 -7821 21741 9520 -6716 -1883 -14864 -7217 21715 8717
804 8717 -6249 -1735 -15839 -6178 21907 7475 -5451 -1202 -16210 -5711 21056 6696 -4442
817d442L859j6648J1995K6529j5180r792K905j6483J3181K4616j5488p574J584
830i38j6502J3807K3555j5333o174R96j7470J4997K2604j5555m594m80j7307J6366
844b028K0939j5813k963j625j7173J7345J9438j5240j536l151j7334J8672J7412
857A6943j4594l01m425j6639J9385J6037j4895J336m820j7236K0326J4427j4227
870A317K711o755j7023K1467J3050j3619L373p937j5414K1384J1101j2632M262
883E285q979j4941K1140J0150j1469M893j0288j4409K1737R066j1050N615j1792
896e042j3107K2101P352j0319O187j2927j2245K2559N167q495O757j4018j1166
909a7196K1910M189p406O794j5031j0353K2295L001o715P229j5747r734K2244
$$ plain form
817 -4442 -583 -17231 -5236 21293 6113 -3679 -774 -17257 -4076 20540 5052 -2522 -938
830 -938 -17440 -3633 19922 4589 -1585 -589 -18059 -3062 19542 3987 -607 -1087 -18394 -2028
844 -2028 18911 3098 135 -1490 -18663 -1318 18120 2880 1344 -1807 -19141 -469 16943
857 16943 2349 2048 -2377 -19016 369 16406 1511 2847 -1973 -19209 1117 15544 1317
870 1317 4028 -2727 -19750 1717 14767 1148 4521 -3416 -18830 2554 13655 1023 5285
883 5285 -3694 -18635 2505 12655 1186 6079 -4209 -18618 3119 12185 1135 6750 -5042
896 -5042 -18149 3952 11304 985 7172 -5755 -18000 4559 9726 1231 7988 -6030 -17196
909 -17196 4714 8903 1497 8291 -6740 -17093 5202 8203 1488 8717 -7030 -16764 5480
922E480J926n562P451j7194q371K2621J58m412P266j8088o107K0930j024k393
936B681P030j8477n567K0066j173j018N913j8654m836J9667j458l08O123j9658
950i669l776J9641k978P19N887k0306j897J8610m374K998M996k0942j87J7157
964E879m405M016M164k0846N45J6119m205M440L931k0758Q55J5992n288N687L432
979I558k1538K720J4965o057P110K470k1601M708J2264n796Q948Q64k0229M383
993g231J1114m736R184r1k0004M366J1302m595R303r29k0044O136J0200n869J0705
1008H811j414k0160Q154P381n079J2022k967j9158Q200O368m330J2259l929j8182
1022a2024Q241N100l533J2672m566j7858Q242N110l763J3392n783j7409R907L257
$$ plain form
922 5480 7406 1844 9295 -7899 -16270 6351 6509 2097 9363 -8725 -14832 6098 5074 2681
936 2681 9711 -8766 -14333 5733 4560 3542 9455 -9199 -14035 5632 4174 3866 9989 -9669
950 -9669 -13445 6196 3218 3937 9824 -10482 -12379 6231 1857 4855 9851 -11091 -11278 5879
964 5879 1474 5490 9654 -11192 -10647 5472 1267 5707 9638 -11120 -10265 5727 439 6126 9558
979 9558 -11980 -9260 5705 -352 6758 9228 -12373 -7665 4599 -1197 7751 8615 -11614 -7231
993 -7231 3883 -853 8331 8240 -11764 -7398 3904 -691 8612 7683 -12361 -6225 3975 -1894 8811
1008 8811 7397 -12763 -4609 2772 -2307 9715 6748 -12410 -4210 2158 -2172 10087 6158 -12024
1022 -12024 -3783 1317 -2216 10456 5890 -11968 -3726 1384 -2379 11013 5230 -12179 -2272 985
1036I85l524J3787o802j5930R776J209k155J4514p953j4816R086N70m63J3590
1050A1874q601j4032R174M49o88J3672r043j3253R729p86m98J4078r972j2056
1064i953R985k657P45J4669j1540j0617R541l759K849J3349j2206r125Q812m005
1078c912L161J3499j2473q597Q337m183L893J2737j2808p551Q780n848M614J2748
1092A2397j3369n989P848o531N916J2148j3543n236O712o410P367J0747j3652
1105a595m172O262o280P006J0134j3191l610O115p224Q147J0032j3824k485N313
1119F28p748R507Q973j4035j168M016p633J0396Q158j4290K93K832p400J0856
1133C385P172j3690L14K645p410J1060O549j3490J400J890p744J1926N718j3293
$$ plain form
1036 985 -2539 11248 4446 -11484 -1708 -499 -2654 11860 3907 -10909 -1823 -1253 -1716 11874
1050 11874 3273 -10759 -1585 -1136 -1824 11848 2805 -10448 -719 -1505 -2003 12075 2103 -9953
1064 -9953 32 -2625 -1880 12789 1249 -9368 173 -3586 -737 12612 406 -8719 93 -3912
1078 -3912 -751 12748 275 -8322 15 -4168 -275 12462 -346 -7897 883 -4965 -351 12397
1092 12397 -972 -6961 887 -5644 272 12420 -1123 -6359 353 -6057 1310 12057 -1595
1105 -1595 -5767 495 -5785 1221 11355 -1836 -5446 669 -6555 1592 11624 -2200 -4685 628
1119 628 -7120 2387 11360 -2675 -3843 173 -7460 2936 11094 -3196 -2903 -71 -7471 3385
1133 3385 10557 -3133 -2819 -174 -7584 3476 10025 -3465 -2065 -175 -7919 4007 9725 -3568
1147c568K391M83p672J2949M562j2722K840p16o447J2677L950j2036K818j285
1161a776n867J3102K613j1364L702k389o080J3933J505j0626M177l583n294J4146
1175F199O79j0495N080m442m912J4155L65j0061N128n082m559J4538j116q596
1189c119N106n871l556J4365k056p959N511o155l426J4448k738p084N236p064
1203d362k467J3795k913o425M954p250j768J3519l752n258M820q055q90J2998
1217F946m118m269M448q536j02J2965n079l235M162r536R73J2441n344k538L995
1232C173r628J502J2215n757j945L974j0372K259J1581o387q54L474j0397K946
1246d216J1152o691O0L075j0577L669J0066o540P13K786j0933M073R748o284J127
$$ plain form
1147 -3568 -1177 -694 -8366 4583 9145 -3577 -737 -1453 -7900 4777 8727 -3309 -491 -1776
1161 -1776 -7643 5459 8072 -3292 410 -1979 -8059 5874 7379 -3247 930 -2653 -7947 6199
1175 6199 6878 -3617 1463 -2979 -7891 6264 6629 -3432 1696 -3386 -7945 6593 5477 -3119
1189 -3119 1987 -3884 -7440 6925 4869 -3090 2421 -3734 -7160 7288 4550 -2534 2702 -4362
1203 -4362 -6829 6966 4053 -2372 2582 -4668 -6436 7083 3331 -1927 2893 -5162 -6052 6946
1217 6946 2828 -1441 3007 -5529 -5631 7334 2255 -980 3182 -6354 -5381 7060 1716 -822 3173
1232 3173 -6455 -4953 7262 1505 -440 3534 -6838 -4579 7002 615 -239 3235 -7162 -4216
1246 -4216 6936 245 305 3380 -7197 -3528 6538 -2 711 3497 -7436 -3363 6385 101 1228
1261A228J784j0708M978Q925o491K026J245j0657N469P877o318L089J95j0482
1275g840N992P384o279L481j15j0861P101O435o390M248r00j0316P274N372n628
1290a042M573j615j0195P871M783n801N343k320r531P767M263n523N694l148r002
1305g883Q540K881m957N788l581q596Q430K377m629O520m358q243Q673J908m276
1320a406O612n098p875R413M97l397O502n364p130Q735L22k790O437n974o791
1335g307R039k92k588P083o932n752Q786j245j741P020p560n068Q711j937p58
1350e41O601p969m237Q535k305n67O529q059m063Q195k581L23N954q073l476P988
1366B254l173R81O131q919k619Q046l885J648N870r170j856P007l831K312M966
$$ plain form
1261 1228 3012 -7696 -2718 6207 -284 1742 2987 -7670 -2201 5676 -642 2447 2642 -7840
1275 -7840 -1848 5536 -743 2738 2623 -8238 -1137 5298 -1092 3156 2256 -8060 -786 4586 -1042
1290 -1042 3531 1916 -8279 -408 4375 -1426 3917 1597 -7934 -167 4096 -1427 4267 1119 -7883
1305 -7883 657 3538 -1419 4369 788 -7808 622 2999 -1630 4890 532 -7711 962 2870 -1406
1320 -1406 5206 108 -7767 1646 2143 -1254 5248 -116 -7246 1489 1811 -979 5458 -516 -7307
1335 -7307 1732 1440 -1148 5935 -997 -6749 2037 792 -949 6071 -1489 -6557 2154 217 -541
1350 -541 6060 -1909 -6146 2389 84 -483 6046 -2013 -6076 2119 -462 -139 5815 -2258 -5734 2254
1366 2254 -919 62 6193 -2726 -5345 2701 -1184 464 6334 -2836 -4692 2315 -1516 796 5762
1381E762q740j096O218l756K729M911r206r20O068m070L284M657r469O8N837m529
1397b252L961L925r989J549M651m717N006L188r413J444M379m428M920K973r136
1412c939J862L571m390N403K500r028J872L844m909O110K063r290K819K576m375
1427c311O868R92q976L207K001l895O822M38q502L725J421l910O682L04q230L947
1443d17R40l857P086k0p774L982K10l577P828j148p551M614o88k891Q206k263
1459B680o848M809j237k272P534k291o168M639j816k127P573j985o053M369j641
1474h34k263P937k713n877M819k601j386Q297l961m931M999l591j74P397m263
1489H55l851M585l812J17P211m409l246M039l799N2P361m373l366M391m290N40
$$ plain form
1381 5762 -2978 -4074 2144 -1612 1117 6028 -3178 -4098 1970 -2100 1184 5841 -3628 -3560 2277 -2252
1397 -2252 1709 5634 -4355 -2806 1845 -2872 2134 5322 -4091 -2647 1732 -2696 2224 5197 -3939
1412 -3939 -2077 1494 -2896 2507 5007 -4021 -2149 1695 -3214 2896 4959 -4331 -1512 1064 -3311
1427 -3311 3557 4549 -4427 -1220 781 -3114 3708 4146 -4356 -631 790 -3120 3562 3866 -4364 -417
1443 -417 523 -3334 3752 3732 -4042 -60 150 -3427 4401 3253 -4298 316 -372 -3263 4943 2680
1459 2680 -4168 641 -596 -2868 4666 2375 -3793 846 -970 -3097 4476 2491 -3562 807 -834
1474 -834 -3097 4840 2127 -3750 1069 -1532 -2918 5379 1418 -3513 1486 -2105 -2279 5118 855
1489 855 -2996 1589 -2223 -2106 5105 696 -2550 1489 -2310 -2258 5103 730 -2636 1755 -2535 -1995
1505a995P486n653k338M558n103J546O920n994j650L914n017J710O737n416j295
1520a590L309n192K314O101n362j208L132n037K510O330n952j003L188n310K966
1535h04N851o060l0K726n758L983M624n947R85J708n412M015M011n363J402J193
1551A124n372M405M037n360J278J162n592M822L630n939K130P37n252N231K856
1566C897n781K861l83n156N723K252m990K489l99m886N479K128m778K734q42m917
1582d569N968J618m731L133j404m251O206J000m873L676j944l978O041L54l991
1597a745L763k258l805O144P7l615L397k627l269O185l26l760L980l099l048O645
1613B639q18l516M167l359k968O354j155k605M084m159k484O218j562k006M094
$$ plain form
1505 -1995 5491 -162 -2500 2058 -3045 -1499 5421 -573 -2223 1691 -3326 -1616 5121 -295 -1590
1520 -1590 1719 -3473 -1159 4942 -420 -1628 1504 -3533 -1023 5307 -645 -1648 1540 -3770 -804
1535 -804 5047 -1013 -1043 1683 -4075 -92 4532 -1415 -430 1278 -4134 -119 3892 -1471 -69 1124
1551 1124 -4248 157 4194 -1166 112 1274 -4318 504 4134 -1805 325 1062 -4190 1041 3897
1566 3897 -1884 977 594 -4562 1161 3413 -1577 912 513 -4373 1106 3234 -1544 1190 348 -4569
1582 -4569 1399 3017 -1714 1419 15 -4236 1970 2970 -1903 1773 -171 -4149 1892 2246 -1745
1597 -1745 2018 -240 -4045 2099 2176 -1439 1958 -669 -3938 2247 1921 -1839 2141 -958 -4006 2639
1613 2639 1821 -1695 2472 -887 -3855 2499 1344 -1261 2823 -1336 -3820 2398 836 -1170 2924
1628B924m525j864O067j776j821L675m450j715O162k113j359L515m908j215O286
1643B883k604q81L555n144q07N733l042P5L195n576n2N521l286L03L030n553L32
1660b318M972l265O70K694n656O57N023l603R68K806o027J218M511l702J685J814
1676B447n723J673L970l551J733J858n613J917L538l657K352J397n446K044L078
1691B017l466K486J342n923K747K916l445K634O02n299K824K547l692L245N63
1706B098n640L436J851l452L362P8n228L260J347k757L594k23m983L551R80l006
1722a732L870m96n081L797Q32k917M046j110m533L618O24k548L908j080m340L893
1738G51r5k365M358j866l871L904m01j779M067j978l767L959o14j669M362k575
$$ plain form
1628 2924 -1601 -3465 2602 826 -995 2680 -1770 -3485 2677 564 -795 2720 -2188 -3403 2883
1643 2883 279 -602 2953 -2191 -2998 2735 -307 -232 2963 -2613 -2665 2856 -430 -127 2903 -2650 -2318
1660 -2318 2654 -611 59 2753 -2903 -2246 2777 -826 142 2948 -3079 -1861 2650 -1052 633 2447
1676 2447 -3276 -1603 2367 -1184 549 2407 -3206 -1289 2249 -1408 944 2341 -3105 -1061 2017
1691 2017 -1449 1037 2379 -3544 -797 2119 -1326 1308 1910 -3389 -565 1982 -1710 1535 2098
1706 2098 -3542 -106 1745 -1707 1655 1733 -3495 -235 1112 -1645 1949 1726 -3257 294 1274 -1732
1722 -1732 2138 1642 -3439 358 1190 -1727 2319 1209 -3324 294 918 -1630 2278 1198 -3142 751
1738 751 656 -1709 2649 783 -3088 816 415 -1364 2703 725 -3042 917 303 -1366 2996 421
1754D21l154M020j368j124M272k697l155L986j441j225M388l133k268L987k053
1769e44l97M245l575k287L729j963n6M175l736j862L725k322q8M270m007j676
1785b369L790k801Q47L833m322j004L437k494O71L625m320n56L006k736J120L265
1801B992m163m45L146l106J091L378m164k51K921l054J559K917m234N02K295l365
1817a981K487K455m482N64K173l222K316K565m550Q79J966l321K403K513m427
1832a662J073J867l468K969J888m646J668J231l200L221J224m332K271P69l100
1847b227L185Q18l716J889Q27l262L787P85m165K191L39k729L590N08m097K848
1863E71q8k602L619J36l783L014p12k778M489m11l204K804j108k143M136q35l043
$$ plain form
1754 421 -2733 1287 -81 -1205 3067 370 -2785 1201 -240 -1465 2923 -210 -2478 1509 -544
1769 -544 -941 3304 -271 -2558 1171 -792 -848 3327 -409 -2271 1454 -868 -956 3314 -693 -2369
1785 -2369 1421 -1380 -533 3300 -1022 -2026 1411 -1083 -412 3213 -1107 -1663 1343 -1393 -273 2992
1801 2992 -1171 -1616 1530 -1576 -485 2893 -1271 -1522 1399 -1655 -96 2821 -1413 -911 1384 -1981
1817 -1981 506 2961 -1521 -957 1216 -2006 310 2875 -1675 -796 1170 -2151 252 2765 -1662
1832 -1662 -589 1278 -2190 779 2667 -1979 -311 920 -2280 941 2165 -2167 104 873 -2227
1847 -2227 958 1776 -1940 -51 776 -2486 1301 2086 -2079 112 451 -2278 1312 1820 -2277 571
1863 571 483 -2119 1500 1636 -2147 867 155 -2623 1866 1455 -1749 1055 -53 -2196 1940 1105 -1938
1880a938K708j227j337L735p65l042K788j358j673M098r65k678K806j472j667
1895a987M262j677k309L280k259j323M481j904j990K838k303q75M127j809j756
1910a204K486j949j076M039k147j590L003k557o23M078k299j133K438k799JL869
1926B537k867l96K415l375O28L443k852P3J875l326O71L309k545m14K368l019
1942a475J72L708l294K26K519l782J095L045l077N63J691l374J248L013l161Q58
1958b5J164l123J792K308k860N74J507l273J878J755k798J240J073l364J722K175
1974A745k924J557Q99l675K515J695l199J964M17l570L073P56k371J884r1l043
1990b368K945Q67k646J931j35k767K460J134k871K175R1l042K577R29k541K398
$$ plain form
1880 -1938 770 -457 -1794 1941 1176 -1866 922 -436 -2109 1989 1024 -1654 1152 -320 -1987
1895 -1987 2275 598 -1711 1569 -690 -2013 2468 564 -1426 1412 -891 -1766 2361 552 -1204
1910 -1204 1282 -667 -1743 2296 149 -1441 1562 -995 -1618 2460 161 -972 1466 -1333 -1332 2537
1926 2537 -330 -726 1689 -1686 -1058 2385 -467 -394 1481 -1845 -1174 2135 -410 -824 1544 -1475
1942 -1475 -1303 2405 -889 -663 1856 -1926 -831 2214 -863 -300 1391 -1983 -735 2278 -883 -25
1958 -25 1139 -1984 -192 2116 -744 -170 1337 -1936 -58 1697 -1101 139 1212 -2152 -430 1745
1974 1745 -1179 378 1277 -2398 117 1812 -1387 577 994 -2576 497 1253 -1118 766 675 -2368
1990 -2368 577 1444 -1202 729 594 -2173 287 1421 -1450 725 816 -2226 351 1280 -1261 1137
2006A137p02k656L053J31k132K428j005k250L175l55k002K439j021k096K724l61
2022E07j495K540j318k300L166n65j696K930j905k137L292o20j420K782k162j450
2038a851L159j183r32K554k333j117K914j120r39K422j935j196K709j323n17K305
2054A617k270j013K936j567j86K395k770q49K805j485j55K525l013j35K439j878
2070f04L50K076k799k17K465j887M14K091k748k58K482j907M87J775k874K41K311
2087A398k455R94J737k924N77J732k042R90J796l172P17J803k054J530R77k816
2103a212N11J936k128J474J232l225Q84J702k398J556J192l024J304J129k003
2118a070J908M75l008J697O47j899J945N50k849J679P30k404K425L57k928J938
$$ plain form
2006 1137 435 -2221 832 963 -1169 1259 254 -1996 1179 824 -1178 1261 240 -1856 868 507
2022 507 -988 1552 234 -2066 1100 535 -1161 1769 -136 -2273 1019 399 -1021 1761 -401 -1851
2038 -1851 1308 125 -807 1747 -586 -1703 1211 91 -848 1574 -361 -1557 1152 -171 -688 1617
2054 1617 -653 -1666 1270 -297 -483 1912 -858 -1707 1098 -387 -542 1983 -1030 -1165 1274 -604
2070 -604 -254 1822 -977 -1194 1271 -616 -202 1889 -859 -1117 1365 -542 -55 1720 -1154 -913 1398
2087 1398 -1057 -63 1674 -1250 -673 1059 -983 7 1803 -1369 -652 1151 -903 627 1604 -1212
2103 -1212 -701 1235 -893 581 1813 -1412 -528 1174 -1224 332 1524 -1500 -196 933 -1070
2118 -1070 838 1313 -1695 2 649 -1250 695 1245 -1604 75 805 -1599 826 1183 -1745 193
2134A93L83k073K350L01k733J772M83j869K294k36k511K214j38j648K310m38k313
2151a659K457l34j572K529p64k311K232k79j548K578r71j898K278p84j274K460
2167A140q33j845K255p83r89K436j227j544K623j503r37K782j504j466K260j203
$$ plain form
2134 193 576 -1497 853 1154 -1579 193 676 -1193 1101 865 -1646 568 430 -1218 1092 654 -1659
2151 -1659 798 464 -1108 1421 657 -1654 578 299 -1249 1329 358 -1540 738 -46 -1320 1140
2167 1140 307 -1538 717 -66 -1055 1381 154 -1390 1233 -270 -1207 1575 71 -1395 865 -338
$$ [...]
8191a38
##END NTUPLES=NMR FID
##END=
