##TITLE=1H_LR-717-B1
 D2O, 108 sc, 
 26.10.2020
##JCAMPDX= 6.0         $$ Bruker NMR JCAMP-DX V2.0
##DATA TYPE= NMR FID
##DATA CLASS= NTUPLES
##ORIGIN= UXNMR, Bruker Analytische Messtechnik GmbH
##OWNER= root
$$ XWIN-NMR		Version 3.5
$$ Mon Oct 26 13:05:19 2020 Russian Standard Time (UT+4h)  she@DPX200
##.OBSERVE FREQUENCY= 200.1315066352
##.OBSERVE NUCLEUS= ^1H
##.DELAY= (6, 6)
##.ACQUISITION MODE= SIMULTANEOUS
##.ACQUISITION SCHEME= undefined
##.AVERAGES= 108
##.DIGITISER RES= 18
##SPECTROMETER/DATA SYSTEM= spect
##.PULSE SEQUENCE= zg30
##.SOLVENT NAME= CDCl3
##.SHIFT REFERENCE= (INTERNAL, CDCl3, 0, 15.7039)
##AUDIT TRAIL= $$ (NUMBER, WHEN, WHO, WHERE, WHAT)
$$ ##TITLE= Audit trail, XWIN-NMR		Version 3.5
$$ ##JCAMPDX= 5.01
$$ ##ORIGIN= Bruker BioSpin GmbH
$$ ##OWNER= she
$$ F:/spectra/data/she/nmr/H-F/1/audita.txt
$$ ##AUDIT TRAIL=  $$ (NUMBER, WHEN, WHO, WHERE, WHAT)
(   1,<2020-10-26 13:04:14.54 +0400>,<she>,<DPX200>,
      <continue with go, POWCHK disabled, PULCHK disabled
       configuration hash MD5:
       00 E9 B6 7A A2 85 ED C7 34 08 36 98 17 FE 4E 26
       data hash MD5: 16K
       C7 43 D3 C0 4F DD 32 E8 7E A9 C7 53 A9 FF C6 22>)
$$ ##END=
$$ 
$$ hash MD5
$$ 84 CA 79 A8 DC 06 B8 12 19 EC 17 8F 67 83 B3 1C
##$RELAX= 
##$RELAX= 
##$RELAX= 
##$RELAX= 
##$RELAX= 
##$RELAX= 
$$ Bruker specific parameters
$$ --------------------------
##$DU= <F:/spectra>
##$EXPNO= 1
##$NAME= <H-F>
##$PROCNO= 1
##$TYPE= <nmr>
##$USER= <she>
##$AMP= (0..31)
100 100 100 100 100 100 100 100 100 100 100 100 100 100 100 100 100 100 
100 100 100 100 100 100 100 100 100 100 100 100 100 100 
##$AQSEQ= 0
##$AQ_mod= 1
##$AUNM= <au_zg>
##$AUTOPOS= <>
##$BF1= 200.13
##$BF2= 200.13
##$BF3= 200.13
##$BF4= 200.13
##$BF5= 200.13
##$BF6= 200.13
##$BF7= 200.13
##$BF8= 200.13
##$BYTORDA= 1
##$CFDGTYP= 0
##$CFRGTYP= 5
##$CHEMSTR= <none>
##$CNST= (0..31)
1 1 145 1 1 1 1 1 1 1 1 1 1 1 1 1 1 1 1 1 1 1 1 1 1 1 1 1 1 1 1 1 
##$CPDPRG= <>
##$CPDPRG1= <>
##$CPDPRG2= <>
##$CPDPRG3= <>
##$CPDPRG4= <mlev>
##$CPDPRG5= <mlev>
##$CPDPRG6= <mlev>
##$CPDPRG7= <mlev>
##$CPDPRG8= <mlev>
##$CPDPRGB= <>
##$CPDPRGT= <>
##$D= (0..31)
0 1.2 0 0 0 0 0 0 0 0.06 0 0.03 0 0 0 0 0.0002 0 0 0 0 0 0 0 0 0 0 0 0 
0 0 0 
##$DATE= 1603702651
##$DBL= (0..7)
120 120 120 120 120 120 120 120 
##$DBP= (0..7)
150 150 150 150 150 150 150 150 
##$DBP07= 0
##$DBPNAM0= <>
##$DBPNAM1= <>
##$DBPNAM2= <>
##$DBPNAM3= <>
##$DBPNAM4= <>
##$DBPNAM5= <>
##$DBPNAM6= <>
##$DBPNAM7= <>
##$DBPOAL= (0..7)
0.5 0.5 0.5 0.5 0.5 0.5 0.5 0.5 
##$DBPOFFS= (0..7)
0 0 0 0 0 0 0 0 
##$DE= 6
##$DECBNUC= <off>
##$DECIM= 32
##$DECNUC= <off>
##$DECSTAT= 4
##$DIGMOD= 1
##$DIGTYP= 9
##$DL= (0..7)
0 120 120 120 120 120 120 120 
##$DP= (0..7)
150 150 150 150 150 150 150 150 
##$DP07= 0
##$DPNAME0= <>
##$DPNAME1= <>
##$DPNAME2= <>
##$DPNAME3= <>
##$DPNAME4= <>
##$DPNAME5= <>
##$DPNAME6= <>
##$DPNAME7= <>
##$DPOAL= (0..7)
0.5 0.5 0.5 0.5 0.5 0.5 0.5 0.5 
##$DPOFFS= (0..7)
0 0 0 0 0 0 0 0 
##$DQDMODE= 0
##$DR= 18
##$DS= 0
$$ [...]
##$SUBNAM2= <"">
##$SUBNAM3= <"">
##$SUBNAM4= <"">
##$SUBNAM5= <"">
##$SUBNAM6= <"">
##$SUBNAM7= <"">
##$SUBNAM8= <"">
##$SUBNAM9= <"">
##$SW= 16.880792210976
##$SWIBOX= (0..15)
0 0 2 0 0 0 0 0 0 0 0 0 0 0 0 0 
##$SW_h= 3378.37837837838
##$TD= 16384
##$TD0= 1
##$TE= 0
##$TE2= 300
##$TE3= 300
##$TEG= 300
##$TL= (0..7)
0 120 120 120 120 120 120 120 
##$TP= (0..7)
150 150 150 150 150 150 150 150 
##$TP07= 0
##$TPNAME0= <>
##$TPNAME1= <>
##$TPNAME2= <>
##$TPNAME3= <>
##$TPNAME4= <>
##$TPNAME5= <>
##$TPNAME6= <>
##$TPNAME7= <>
##$TPOAL= (0..7)
0.5 0.5 0.5 0.5 0.5 0.5 0.5 0.5 
##$TPOFFS= (0..7)
0 0 0 0 0 0 0 0 
##$TUNHIN= 0
##$TUNHOUT= 0
##$TUNXOUT= 0
##$USERA1= <user>
##$USERA2= <user>
##$USERA3= <user>
##$USERA4= <user>
##$USERA5= <user>
##$V9= 5
##$VALIST= <valist>
##$VCLIST= <CCCCCCCCCCCCCCC>
##$VD= 0
##$VDLIST= <DDDDDDDDDDDDDDD>
##$VPLIST= <PPPPPPPPPPPPPPP>
##$VTLIST= <TTTTTTTTTTTTTTT>
##$WBST= 1024
##$WBSW= 4
##$XGAIN= (0..3)
0 0 0 0 
##$XL= 0
##$YL= 0
##$YMAX_a= 1665165
##$YMIN_a= -1608213
##$ZGOPTNS= <>
##$ZL1= 120
##$ZL2= 120
##$ZL3= 120
##$ZL4= 120
##$ABSF1= 10
##$ABSF2= 0
##$ABSG= 5
##$ABSL= 3
##$ALPHA= 0
##$AQORDER= 0
##$ASSFAC= 0
##$ASSFACI= 0
##$ASSFACX= 0
##$ASSWID= 0
##$AUNMP= <proc_1d>
##$AZFE= 0.1
##$AZFW= 0.1
##$BCFW= 1
##$BC_mod= 2
##$BYTORDP= 1
##$COROFFS= 0
##$CY= 11.3945322036743
##$DATMOD= 1
##$DC= 2
##$DFILT= <>
##$DTYPP= 0
##$F1P= 16.9975609425685
##$F2P= -3.02152046262296
##$FCOR= 0.5
##$FTSIZE= 0
##$FT_mod= 4
##$GAMMA= 1
##$GB= 0.15
##$INTBC= 1
##$INTSCL= 1
##$ISEN= 128
##$LB= 0.24
##$LEV0= 0
##$LPBIN= 0
##$MAXI= 10000
##$MC2= 0
##$MEAN= 0
##$ME_mod= 0
##$MI= 1.114404
##$NCOEF= 0
##$NC_proc= 0
##$NLEV= 6
##$NOISF1= 3.799351
##$NOISF2= 2.8
##$NSP= 1
##$NTH_PI= 0
##$NZP= 0
##$OFFSET= 15.70392
##$PC= 1
##$PHC0= -10695.99
##$PHC1= 13.20088
##$PH_mod= 1
##$PKNL= yes
##$PPARMOD= 0
##$PSCAL= 0
##$PSIGN= 0
##$REVERSE= no
##$SF= 200.130013532006
##$SI= 16384
##$SIGF1= 3
##$SIGF2= 2
##$SINO= 400
##$SIOLD= 16384
##$SREGLST= <1H.CDCl3>
##$SSB= 0
##$STSI= 0
##$STSR= 0
##$SW_p= 3612.71676300578
##$SYMM= 0
##$S_DEV= 0
##$TDeff= 0
##$TDoff= 0
##$TI= <>
##$TILT= no
##$TM1= 0
##$TM2= 0
##$TOPLEV= 0
##$USERP1= <user>
##$USERP2= <user>
##$USERP3= <user>
##$USERP4= <user>
##$USERP5= <user>
##$WDW= 1
##$XDIM= 8192
##$YMAX_p= 0
##$YMIN_p= 0
$$ End of Bruker specific parameters
$$ ---------------------------------
##NTUPLES= NMR FID
##VAR_NAME=  TIME,          FID/REAL,        FID/IMAG
##SYMBOL=    X,             R,               I
##VAR_TYPE=  INDEPENDENT,   DEPENDENT,       DEPENDENT
##VAR_FORM=  AFFN,          ASDF,            ASDF
##VAR_DIM=   8192,          8192,            8192
##UNITS=     SECONDS,       ARBITRARY UNITS, ARBITRARY UNITS
##FACTOR=    0.000296,      1,               1
##FIRST=     0,             0,               0
##LAST=      2.424536,      0,               0
##MIN=       0,             -1608213,        0
##MAX=       2.424536,      1665165,         0
$$ Real data points
##PAGE= N=1
##DATA TABLE= (X++(R..R)), XYDATA
0 0 0 0 0 0 0 0 0 0 0 0 0 0 0 0 0 0 0 0 0 -108 108 -108 108 -108 108 -205 216 -216 240 -320 324 -414 432 -513
34 -513 552 -644 725 -808 893 -999 1119 -1239 1381 -1535 1695 -1873 2066 -2274 2515 -2773
50 -2773 3049 -3357 3702 -4082 4511 -4991 5530 -6143 6860 -7696 8692 -9911 11403 -13330
64 -13330 15904 -19508 24991 -34387 54505 -217669 838352 1665165 667984 -842146 -1608213
75 -1608213 -699837 839295 1563941 714711 -802008 -1550231 -741949 786344 1549600
84 1549600 740376 -771760 -1526674 -753774 766138 1509249 740047 -729734 -1490465
93 -1490465 -751572 732795 1461413 736092 -695884 -1434916 -742690 675102 1414006
102 1414006 742662 -650866 -1387173 -752822 626104 1381829 750780 -614722 -1357575
111 -1357575 -752676 598998 1338903 745539 -572597 -1322893 -748535 563111 1297444
120 1297444 748056 -534962 -1282395 -752857 519876 1270250 749889 -505838 -1247953
129 -1247953 -751301 488074 1231815 747616 -466649 -1209366 -751854 445929 1195199
138 1195199 758700 -429139 -1186044 -759913 419240 1174036 753975 -408168 -1155040
147 -1155040 -752471 392732 1137446 747750 -372860 -1118507 -753057 354006 1103623
156 1103623 757231 -340183 -1093780 -757193 325729 1081917 760149 -315075 -1069643
165 -1069643 -757561 303871 1056670 753536 -291605 -1038979 -754035 277961 1024111
174 1024111 751888 -260083 -1012640 -755399 248915 999969 758001 -237368 -990691
183 -990691 -754343 223425 978202 756305 -216679 -964938 -754257 204010 953910 750640
193 750640 -191293 -941392 -754845 181647 927576 751371 -167893 -919615 -752075 158790
203 158790 906105 752785 -148638 -896084 -750232 135899 884232 752318 -127140 -873910
213 -873910 -752087 117597 866243 750377 -109218 -856754 -749184 102110 844803 747900
223 747900 -90415 -834353 -745392 80237 823033 746830 -71787 -814223 -745993 62968
233 62968 806681 745061 -56277 -797259 -744412 48067 788983 741589 -38418 -779126 -742084
244 -742084 30894 770104 740528 -24243 -762093 -739093 16875 752024 736684 -9122
254 -9122 -743047 -736365 -47 732787 734992 9087 -724966 -735554 -16296 718743 735471
265 735471 22022 -710936 -734048 -27110 702667 730464 31454 -692778 -726876 -39714
275 -39714 682619 724546 49510 -672328 -725464 -60045 664176 726730 67125 -659237 -727850
286 -727850 -71836 653910 725834 74517 -646709 -721001 -79809 636712 716609 86531
296 86531 -624445 -714022 -95715 614613 714608 105130 -607211 -716294 -112322 602610
306 602610 716468 115728 -597313 -712888 -118321 590693 708724 123096 -580439 -704222
316 -704222 -130571 570387 703457 138112 -561296 -702203 -145052 555520 702784 150527
326 150527 -549415 -700258 -154727 543319 697065 158366 -535195 -693144 -163895 526041
336 526041 691960 170002 -517594 -690340 -176193 511847 688963 180771 -505698 -687063
346 -687063 -184870 497275 682642 189964 -489238 -679267 -195595 479288 679415 202558
356 202558 -472460 -678276 -207407 467918 677933 211327 -461978 -674838 -214428 456977
366 456977 670495 216897 -448423 -665144 -221785 438174 662157 228206 -430123 -661088
376 -661088 -235242 424164 661571 240413 -421200 -660546 -242562 416165 658376 243666
386 243666 -409424 -652211 -246444 400621 646704 251641 -391245 -645663 -257380 385540
396 385540 645012 262241 -379491 -642957 -265986 375113 641758 267746 -371060 -637274
406 -637274 -269087 363996 632567 272271 -356794 -630435 -277413 348341 626812 281667
416 281667 -343122 -625797 -284952 337842 624156 286732 -332671 -619074 -290715 326931
426 326931 616272 292444 -317963 -612473 -296356 312227 611438 301374 -309056 -608502
436 -608502 -302072 302227 605587 303173 -297568 -600083 -307313 290827 597332 308667
446 308667 -282729 -594916 -313869 278777 591380 316522 -272018 -590051 -318304 265837
456 265837 586246 321606 -263972 -583726 -323079 257331 579807 323689 -251556 -574330
466 -574330 -328299 245261 570792 328861 -237198 -569650 -333348 233305 565666 336684
476 336684 -228046 -564814 -335445 222037 560179 339578 -220748 -556078 -340949 211670
486 211670 553183 341688 -206285 -549182 -346859 202243 545370 346458 -195118 -544700
496 -544700 -348126 190564 537877 351319 -185383 -536559 -352575 177958 532648 355391
506 355391 -174069 -529200 -357579 169655 526291 356353 -164111 -522631 -358957 159583
516 159583 516166 360405 -154634 -513944 -362081 148391 511531 365032 -145071 -508298
526 -508298 -365991 139338 505076 366613 -135252 -500161 -368290 129919 497378 368743
536 368743 -124982 -493404 -369438 120148 489128 372111 -116671 -487166 -372009 110794
546 110794 483547 374555 -105497 -479457 -375432 101556 476511 375131 -97451 -474242
556 -474242 -375168 92671 467495 377961 -88260 -464720 -377277 83259 462589 380571 -79210
567 -79210 -456639 -381080 74997 455272 379437 -69845 -451432 -382196 66812 445223 383476
578 383476 -60035 -444806 -383508 58289 440560 385216 -54999 -436953 -383188 49542
588 49542 433280 384113 -45916 -428240 -386075 40145 425555 385734 -35359 -423331 -386955
599 -386955 35191 417758 386695 -29382 -416029 -385936 26447 411123 387027 -23490
609 -23490 -406734 -387030 16568 403985 386749 -14341 -400172 -389375 11189 397864 387012
620 387012 -7050 -395479 -387887 4982 389878 387806 -1313 -387745 -387143 -3361 382318
631 382318 387619 6686 -378774 -388452 -11621 377080 388973 13763 -373041 -388696 -16416
642 -16416 369850 387019 20537 -365365 -386427 -24601 361447 387045 27486 -358048 -385715
653 -385715 -31049 355344 387786 32947 -352784 -386675 -35729 348746 385409 38913
663 38913 -344129 -384975 -43054 340057 385117 46686 -337708 -385092 -49428 335354 385060
674 385060 51667 -331715 -384702 -55061 328190 382983 57653 -325265 -382218 -60841
684 -60841 319600 382554 64470 -316768 -382673 -68908 313431 383605 70266 -310905 -382592
695 -382592 -73335 307626 381241 75027 -303344 -379643 -78267 298902 378470 81779
705 81779 -295789 -378712 -86357 291972 377824 87786 -288352 -377972 -90866 286313 378148
716 378148 92821 -282884 -375788 -96283 278814 375529 98803 -274915 -375323 -102041
726 -102041 271505 373817 104712 -268130 -373457 -106542 264937 372877 108844 -261875
736 -261875 -370707 -111744 258181 371247 114123 -254008 -370992 -116859 250894 368973
746 368973 120124 -248440 -369545 -122739 244844 367600 123832 -241387 -366521 -126176
756 -126176 238137 363961 128717 -233455 -363305 -131447 230761 364091 134055 -228234
766 -228234 -364010 -136142 225248 361819 137991 -221815 -359877 -139892 218955 358957
776 358957 141685 -214400 -357482 -144650 210635 356373 148610 -206627 -355306 -148850
786 -148850 204755 354766 152745 -201366 -353625 -153439 198726 352106 154800 -195591
796 -195591 -350574 -156605 191175 349273 158798 -188143 -348211 -160453 185002 346123
806 346123 162698 -181337 -344913 -165196 179360 343917 165779 -176334 -342300 -168468
816 -168468 172635 341610 170121 -170253 -339682 -170874 167253 338241 172359 -163219
826 -163219 -336673 -173750 160268 335519 175543 -157096 -334628 -178268 153722 332190
836 332190 179899 -151074 -330270 -181966 148043 329895 182834 -145285 -328059 -184585
846 -184585 141740 325479 184970 -137738 -323818 -186938 136259 321960 188534 -132524
856 -132524 -321596 -189638 129754 320014 190997 -127555 -319214 -191629 123909 316311
866 316311 192710 -122102 -314447 -193849 118285 313480 194852 -115530 -311935 -196970
876 -196970 112399 310165 198132 -111387 -307980 -199242 106761 306739 199162 -105262
886 -105262 -305103 -201119 102870 303649 202719 -98583 -301616 -203099 98075 300036
896 300036 204221 -94126 -298492 -205238 91383 296169 206115 -89289 -294334 -207052 85761
907 85761 292921 208011 -84156 -291832 -209579 80870 290877 209400 -78814 -287392 -210490
918 -210490 76821 285052 211651 -72403 -283373 -212361 69934 282430 212860 -67428
928 -67428 -281413 -215049 64851 279663 214696 -62530 -277281 -215022 61276 276302 215511
939 215511 -58598 -272861 -216396 55529 272023 217507 -52627 -270349 -219097 49704
949 49704 268742 218666 -49056 -267461 -220442 46145 265845 219638 -42984 -262826 -220715
960 -220715 39879 260527 221716 -38416 -259797 -222404 36969 257672 221525 -33860
970 -33860 -256132 -223347 32122 253793 222737 -28923 -251380 -223453 26113 250374 224218
981 224218 -25709 -249108 -225427 21486 246397 225506 -20434 -245235 -225289 18438
991 18438 243455 225019 -16520 -240779 -225193 14332 238226 226234 -10712 -237502 -226661
1002 -226661 9037 235637 228074 -7429 -233893 -226044 5741 232087 226531 -3415 -229794
1013 -229794 -227147 1816 228536 226789 215 -225274 -227085 -2812 223892 228332 4611
1024 4611 -222508 -227615 -6749 220875 228204 7857 -217694 -227755 -10502 216901 226993
1035 226993 13097 -214839 -228093 -14214 213134 227169 15955 -210759 -227917 -18867
1045 -18867 208224 228640 20888 -206406 -227627 -23226 205211 227248 23951 -202255
1055 -202255 -227603 -27097 201139 227937 27862 -198797 -228084 -29443 197155 227325
1065 227325 31474 -194819 -226186 -31808 193292 226887 34613 -190771 -228380 -37315
1075 -37315 189113 226443 39486 -187734 -227527 -40223 186597 226283 41376 -183951
1085 -183951 -225810 -44071 182416 226082 45069 -179716 -225536 -46747 177876 226031
1095 226031 48663 -176110 -225263 -49857 174269 224787 50964 -171851 -224260 -52486
1105 -52486 170519 224837 54333 -168495 -223542 -57654 167252 223790 57434 -165056
1115 -165056 -223487 -60270 163302 223101 61273 -160176 -223029 -63333 158760 222722
1125 222722 63678 -157530 -222416 -65553 155362 221317 66930 -153503 -220611 -69282
1135 -69282 151095 220335 70791 -150272 -219975 -70932 147806 219050 74250 -145531
1145 -145531 -219570 -74453 144065 218379 75967 -142319 -218832 -77163 140293 217829
1155 217829 78085 -138892 -217709 -78587 136637 216685 80575 -133806 -216216 -82353
1165 -82353 132651 215291 83887 -130795 -215966 -84970 128966 214136 85871 -127458
1175 -127458 -213196 -87153 126323 213769 88477 -124848 -212540 -89310 121812 211651
1185 211651 91452 -120025 -211099 -91880 117823 210766 93608 -117282 -210461 -93647
1195 -93647 115202 210049 96083 -112755 -209340 -96201 111328 207590 98661 -109132
1205 -109132 -207938 -98805 107075 207767 99471 -106557 -205757 -101215 103414 204579
1215 204579 101550 -102124 -204363 -103137 99642 203772 104354 -98757 -203520 -105780
1225 -105780 97097 202419 105574 -95806 -201517 -106423 92761 200959 107521 -91496
1235 -91496 -199602 -108611 91186 198051 109338 -88636 -197581 -110518 86538 197729
1245 197729 111591 -84369 -196269 -112564 82996 196295 112345 -81786 -193969 -114104
1255 -114104 80198 194108 115170 -78967 -193568 -115256 75985 191961 116197 -75040
1265 -75040 -190711 -117392 73088 190623 117609 -70806 -188027 -118930 69485 189576
1275 189576 120584 -69244 -188609 -120332 66311 187115 120900 -65308 -185951 -121831
1285 -121831 63274 184715 122394 -61767 -184053 -123615 59487 182561 123414 -59080
1295 -59080 -182940 -124208 56788 181094 124345 -55567 -180643 -125660 53593 179497
1305 179497 125713 -52372 -178707 -127063 51120 177334 127623 -48910 -177509 -128354
1315 -128354 47313 175957 129244 -46178 -174299 -129146 43963 173917 130399 -43447
1325 -43447 -173273 -130808 41013 172097 130939 -39943 -170868 -131589 38539 169674
1335 169674 132741 -36952 -169679 -132855 35486 167678 132925 -33812 -166723 -134279
1345 -134279 32449 165462 134062 -31475 -164763 -134657 29838 163782 134332 -28595
1355 -28595 -163227 -134800 26390 161675 135714 -25740 -160746 -135970 23957 159623
1365 159623 135722 -21957 -158148 -136859 21172 157863 137141 -19488 -156693 -138137
1375 -138137 18564 155272 137477 -17238 -154217 -138598 15109 154294 137551 -14209
1385 -14209 -151815 -138719 12881 151405 138030 -11841 -150640 -139657 8601 149745
1395 149745 140033 -8501 -147970 -139729 7559 146759 140264 -6282 -145650 -141005 4444
1406 4444 145164 140493 -3854 -143752 -140132 2721 142146 139692 -961 -140873 -141118 247
1418 247 139879 140656 1300 -139866 -141067 -2906 137874 140608 3499 -137384 -140827 -3832
1430 -3832 136756 140434 5730 -135649 -141322 -7228 133024 141153 8959 -132236 -141717
1441 -141717 -8212 131488 141815 10787 -130696 -140859 -11606 128958 140876 13700
1451 13700 -127708 -140984 -14642 126078 140824 16345 -125924 -141925 -16992 125574
1461 125574 140958 18246 -123627 -141775 -18921 122442 141750 20917 -121213 -141280
1471 -141280 -20383 120214 141525 22143 -119161 -141583 -22998 116835 140528 24226
1481 24226 -116008 -141028 -26369 115076 141046 27012 -114026 -141598 -27631 112872
1491 112872 141977 28907 -112068 -141858 -30098 111442 140407 31087 -109411 -140890
1501 -140890 -31032 108397 140169 31922 -107080 -140396 -33736 106239 141205 34740
1511 34740 -105441 -140587 -36598 104748 139645 37359 -102185 -140713 -37648 101773
1521 101773 140289 38653 -99408 -139305 -39877 99417 139404 40902 -98091 -139615 -41988
1532 -41988 97831 138597 42071 -95753 -138442 -43200 95190 138626 44093 -94214 -137894
1543 -137894 -45373 93330 137346 45324 -92563 -137694 -47245 91096 137891 48112 -89107
1554 -89107 -137278 -48270 88672 137205 49025 -86579 -136659 -49640 85870 135086 50917
1565 50917 -85314 -136248 -51850 83706 135919 52852 -82872 -135599 -52789 81877 134589
1576 134589 53454 -81094 -134887 -54100 79630 133989 54960 -78640 -133796 -55797 77142
1587 77142 133713 56728 -76370 -134006 -58131 75026 133317 58306 -74556 -132750 -58496
1598 -58496 72680 131784 59971 -71640 -131876 -60501 70215 131996 60860 -69551 -130342
1609 -130342 -61657 68679 129833 62896 -67327 -130003 -63094 65879 129443 64061 -64629
1620 -64629 -129475 -65074 64526 128828 65957 -62501 -127956 -66137 62094 128325 66636
1631 66636 -60285 -127500 -67339 60637 127113 67435 -59242 -125765 -68227 57525 125672
1642 125672 68812 -56472 -124765 -68330 55252 124045 70652 -54598 -123863 -70408 53377
1653 53377 123969 70769 -52113 -122820 -72262 51336 123512 72709 -49433 -122627 -72841
1664 -72841 49272 120828 73409 -47937 -122052 -73880 47042 120547 74266 -45946 -120131
1675 -120131 -74995 44521 119937 75337 -44087 -119009 -75895 42821 118232 76433 -42675
1686 -42675 -117735 -77428 39995 116962 76633 -39474 -117610 -77797 38578 117167 77666
1697 77666 -38259 -116370 -78435 36198 114515 79110 -35569 -114937 -79036 35051 114494
1708 114494 79230 -33455 -113203 -79359 32534 113100 80202 -32112 -111500 -80770 30893
1719 30893 112187 81347 -29340 -111277 -81531 29102 110322 81904 -28562 -109978 -81799
1730 -81799 26955 109933 82521 -26686 -109314 -83357 25613 108098 82906 -25420 -107630
1741 -107630 -83675 23167 106682 83853 -22546 -106517 -83591 22100 105884 85343 -20655
1752 -20655 -103857 -84818 19423 104476 85978 -18921 -103575 -84535 17770 103861 85360
1763 85360 -17918 -102665 -85579 16027 101697 85711 -15165 -101426 -86817 15680 101507
1774 101507 86565 -14517 -100493 -85611 12461 99637 86925 -11871 -98917 -86944 10632
1785 10632 97095 87365 -9526 -97138 -87343 8893 96218 87983 -7547 -96642 -88487 6756 95390
1798 95390 88809 -6173 -94454 -88488 6431 94042 88793 -5679 -93127 -87352 3921 92711 89356
1811 89356 -4184 -91559 -88963 3109 91521 88299 -2041 -90982 -89295 1444 90213 89433 -834
1824 -834 -88991 -89077 -853 88240 89440 960 -87225 -89563 -2092 87045 88962 4544 -85621
1837 -85621 -88952 -3462 86101 89070 5326 -84923 -90037 -5941 84641 89711 5560 -83977 -89937
1850 -89937 -7499 82213 90437 7455 -82231 -90619 -8385 80849 89910 8385 -80490 -89693 -9659
1863 -9659 79711 89976 10839 -78473 -89916 -11532 78294 90412 11681 -78465 -90227 -12622
1875 -12622 77713 90366 13261 -76173 -90040 -13792 76210 89668 14100 -74833 -89753 -14756
1887 -14756 74196 89684 15213 -72734 -89838 -16133 73165 88989 17021 -72771 -89555 -17970
1899 -17970 71993 90353 18035 -70900 -88839 -18772 70524 89686 18888 -68979 -89341 -19800
1911 -19800 69149 88967 20972 -68842 -89551 -20867 67709 89884 21832 -66771 -88344 -22870
1923 -22870 66573 87840 23220 -65662 -89177 -24018 65227 88743 24542 -64217 -87879 -25029
1935 -25029 63576 88526 25721 -63074 -88861 -26210 61265 88307 26408 -61971 -88137 -27609
1947 -27609 60149 87904 27786 -61205 -88004 -29291 59449 87134 29225 -59644 -87137 -28640
1959 -28640 57766 87148 28445 -57035 -85924 -29279 56233 86810 31428 -54976 -86038 -31231
1971 -31231 53891 86957 31616 -54691 -85908 -31829 54070 85047 32398 -53341 -85335 -32414
1983 -32414 52614 86197 33240 -51834 -84704 -33429 50436 85107 35219 -50528 -84259 -34436
1995 -34436 50004 84143 34337 -48661 -84192 -36537 48273 84597 36636 -47042 -82410 -37594
2007 -37594 47119 83577 36921 -45747 -82914 -38227 45410 83997 38539 -45129 -83068 -38752
2019 -38752 44434 83509 37661 -43488 -83163 -39387 43093 82031 40072 -42823 -81024 -40426
2031 -40426 41432 81411 40601 -41258 -81658 -41294 40908 80784 40698 -39191 -80830 -41297
2043 -41297 38699 81078 42358 -37923 -79608 -42655 37086 80364 41975 -36825 -79199 -42583
2055 -42583 36505 79599 43940 -35623 -79837 -44476 35203 78440 43962 -34142 -78971 -44206
2067 -44206 33049 78081 44749 -33132 -78486 -45229 33028 77692 45959 -31240 -77524 -46765
2079 -46765 31663 76116 45724 -30368 -76874 -46369 29635 75287 46083 -30230 -74305 -46997
2091 -46997 27814 75475 47660 -27854 -74996 -48442 26440 75158 47289 -26514 -74203 -48096
2103 -48096 26195 74023 48872 -25212 -74237 -49307 25189 73666 49438 -24141 -72511 -49629
2115 -49629 22861 74128 48913 -23065 -72076 -50519 22131 72263 50415 -21641 -71767 -51275
2127 -51275 21382 71541 50051 -20957 -71184 -50550 20065 70863 51062 -19171 -70300 -50786
2139 -50786 19424 69456 52045 -17894 -69380 -50795 17516 69820 51714 -17040 -69642 -51724
2151 -51724 15788 68659 52447 -16055 -68544 -52149 15801 68060 53015 -14755 -67117 -53107
2163 -53107 13860 66108 53186 -12767 -66587 -53164 13478 66595 54386 -12710 -65601 -52446
2175 -52446 12171 64593 54109 -11166 -64485 -53621 11013 64092 54301 -11109 -63510 -55007
2187 -55007 9490 62781 53740 -8904 -63679 -54757 8453 62906 54305 -8456 -62389 -54107 7991
2200 7991 61652 54330 -7636 -61249 -53581 6799 60958 54738 -5440 -61514 -55181 5657 59704
2213 59704 54600 -4504 -60658 -55528 4912 59972 55706 -3813 -59364 -55028 2757 58338 55033
2226 55033 -3866 -58012 -56770 2536 58052 56005 -2053 -57400 -56086 1848 57062 54757 -409
2239 -409 -57284 -55820 -88 56448 55891 51 -55220 -55892 -973 55326 56371 709 -55717
2252 -55717 -56179 -689 54950 56705 1415 -54288 -56916 -2143 54283 56154 2518 -53364 -55546
2265 -55546 -2919 53380 55851 3668 -52871 -55757 -4336 52114 55972 4876 -50779 -56419 -4819
2278 -4819 51831 56390 5422 -50861 -55845 -6516 50351 56389 6153 -50092 -56696 -6678 49480
2291 49480 55711 7240 -49120 -56111 -7420 48662 56243 8125 -47520 -56460 -8334 48334 56174
2304 56174 8220 -46831 -55922 -9013 46749 56050 9608 -47182 -55811 -9392 46273 55924 11169
2317 11169 -45931 -55998 -10270 45655 55793 11208 -44349 -56117 -11836 44017 56333 11785
2329 11785 -44859 -56111 -13089 43576 55470 13336 -42466 -55789 -12917 41676 55441 14107
2341 14107 -42093 -55368 -13444 42158 55323 14440 -40510 -55068 -14122 40943 54496 13767
2353 13767 -39921 -55871 -14688 39852 55028 15928 -39691 -55342 -15784 38217 54922 16235
2365 16235 -39007 -54811 -16528 38171 54143 15872 -38417 -55214 -17441 37935 54539 17297
2377 17297 -36878 -54506 -17596 36337 53575 17456 -36399 -53473 -17354 35697 54421 17617
2389 17617 -35030 -54017 -19389 34601 53632 19267 -34966 -53897 -18726 34715 54007 19994
2401 19994 -34395 -54064 -19603 33393 53059 21096 -32395 -53987 -20024 32803 53016 20272
2413 20272 -31360 -52458 -21675 31898 53108 22014 -30888 -52535 -21452 30020 53242 22991
2425 22991 -30800 -52405 -23366 30395 52073 22569 -29974 -52238 -23661 29870 53164 22642
2437 22642 -28273 -51685 -23142 28556 51760 24189 -28817 -51664 -24569 27497 51913 24722
2449 24722 -27316 -52075 -24473 27588 51391 25164 -26811 -51068 -24978 25374 51033 25864
2461 25864 -24420 -51358 -25882 24835 49886 25644 -24187 -51082 -26252 24611 51063 26765
2473 26765 -24262 -49287 -26311 23552 50912 26117 -23974 -49612 -27346 22886 49330 26935
2485 26935 -23280 -49403 -26948 22320 49764 27499 -21589 -48320 -27794 20911 49211 27946
2497 27946 -20869 -48221 -28022 20263 48198 27287 -19499 -47909 -28251 19369 48238 28862
2509 28862 -19471 -47871 -29256 18462 48190 28870 -18288 -47366 -29532 18061 47783 29995
2521 29995 -17689 -47541 -30276 17257 47099 29406 -16785 -46112 -30078 16860 46442 29431
2533 29431 -15986 -45515 -30276 15784 46351 30389 -14876 -46338 -30899 15554 45796 29726
2545 29726 -15242 -44650 -29830 14978 44850 30702 -13704 -44733 -30407 14483 44758 31330
2557 31330 -13125 -44978 -31198 13069 44810 30929 -12446 -45372 -31103 12373 43691 31886
2569 31886 -11666 -41931 -30808 11654 43420 32153 -10699 -43801 -32118 11105 43259 32461
2581 32461 -10271 -42126 -32774 9991 42326 32981 -10082 -42046 -32330 9964 42089 32390 -9794
2594 -9794 -41575 -32600 9058 41327 32726 -9525 -41489 -33337 8101 41311 33264 -7742 -41024
2607 -41024 -33402 7586 40032 33279 -7310 -41385 -33644 7431 39403 33117 -7039 -40101 -32264
2620 -32264 6582 39670 34017 -5860 -39331 -33730 5338 39129 33371 -5513 -39186 -33442 5172
2633 5172 38497 34082 -4237 -38958 -34184 5441 37146 34361 -4554 -38310 -34361 3432 37953
2646 37953 33907 -3474 -37969 -33948 2410 37373 34382 -3110 -36609 -34485 2262 36560 34626
2659 34626 -3102 -37068 -33924 1728 36187 33939 -2132 -35924 -34017 505 36534 34736 -1320
2672 -1320 -35721 -34889 1582 35266 34772 -810 -34673 -34348 332 33851 35227 562 -34072
2685 -34072 -34378 598 33610 34841 608 -34436 -34720 -1435 33942 35683 1033 -33874 -34654
2698 -34654 -1335 33865 34177 1745 -32568 -35213 -1778 34363 34967 2728 -32416 -34924 -2182
2711 -2182 32566 34989 2501 -33211 -34578 -2300 31949 35134 2926 -30834 -35534 -4292 31083
2724 31083 35205 3943 -30914 -35537 -4588 31611 34933 4221 -31536 -34810 -4827 30526 36032
2737 36032 4980 -30446 -35047 -4268 29012 34378 5604 -28939 -34259 -4923 29571 35044 5366
2750 5366 -28700 -34543 -6011 28287 34219 7051 -28841 -34756 -6734 28365 35094 6197 -28589
2763 -28589 -34343 -7418 28107 34945 7276 -28221 -33928 -7695 27238 34683 8457 -27121 -34601
2776 -34601 -8165 25761 34252 7510 -26201 -35360 -8265 25921 34374 8682 -26310 -34315 -8855
2789 -8855 25524 34816 8796 -25123 -33474 -9183 24979 34907 8556 -24435 -33965 -9732 24600
2802 24600 34442 10048 -24751 -33994 -10417 23999 34413 10310 -23508 -33570 -11150 23462
2814 23462 34577 10721 -22684 -33114 -11162 23082 33960 11241 -22390 -34046 -11670 22052
2826 22052 33589 10993 -21903 -33820 -12529 22070 34057 12181 -21411 -33430 -11788 21535
2838 21535 33659 13670 -20389 -32608 -12212 21122 32526 11891 -20296 -32650 -11960 20548
2850 20548 32737 12036 -19346 -32259 -13285 19990 33008 12309 -19341 -33067 -12980 19870
2862 19870 33501 13511 -19620 -33667 -13146 18818 33303 12851 -18761 -32458 -14068 19310
2874 19310 33076 14764 -19345 -33027 -14389 18748 32898 13853 -18153 -32095 -14481 17188
2886 17188 32790 14797 -17141 -32044 -14998 16441 32309 15286 -17559 -31524 -15065 16311
2898 16311 30641 15252 -15515 -31825 -15213 15592 30939 15248 -16336 -31885 -15695 15295
2910 15295 31032 15719 -14893 -30423 -15888 16065 30827 16119 -15119 -31490 -16304 14354
2922 14354 31410 16449 -14954 -31047 -16146 13948 30757 16018 -14070 -30106 -15971 13197
2934 13197 30087 17089 -13080 -31499 -17675 12582 29777 17283 -11846 -29709 -18282 13517
2946 13517 30821 17720 -12501 -29563 -17872 12365 30555 17197 -12375 -29979 -17444 11916
2958 11916 29821 17206 -11945 -29118 -17406 11234 28634 18307 -11093 -29447 -18568 11222
2970 11222 29624 18584 -10810 -28843 -17860 10769 28228 18154 -10658 -28822 -19459 9622
2982 9622 28134 18886 -10155 -28688 -19551 10144 28806 18874 -9763 -29107 -19566 9016 27796
2995 27796 19429 -8937 -28535 -18994 8175 27495 19357 -8413 -27558 -19685 7206 27692 19574
3008 19574 -8377 -27623 -19004 8120 27209 19848 -7782 -27607 -20034 6780 27250 19430 -6741
3021 -6741 -26450 -19426 7180 26538 19908 -6873 -25342 -19283 6132 26826 19963 -5927 -26130
3034 -26130 -20786 5139 25925 20797 -5625 -26064 -20378 5867 25187 18988 -5963 -25366 -20337
3047 -20337 5256 25802 20885 -3862 -25963 -19921 4833 25707 20743 -5029 -25735 -20222 4192
3060 4192 24933 20250 -3492 -23949 -20829 3746 23843 19755 -4766 -24581 -20857 4027 23968
3073 23968 20089 -3908 -23890 -20473 3458 23601 20853 -2918 -22882 -20801 3139 24235 21820
3086 21820 -3154 -22821 -21229 2718 23837 20840 -2848 -22560 -20914 1913 24024 21290 -1525
3099 -1525 -23792 -20836 1015 22384 21287 -1682 -22452 -20061 1443 22547 21829 -1684 -22279
3112 -22279 -20537 792 22114 20585 -832 -21636 -21653 481 21900 20654 -446 -22417 -20305
3125 -20305 -81 20706 20170 -143 -21285 -20587 191 21047 20829 936 -21272 -20792 42
3138 42 20832 21337 445 -20887 -21323 -1217 20094 21237 1134 -20438 -20632 -601 19858 20287
3152 20287 1705 -19470 -21511 -1349 19568 21635 1839 -20111 -21640 -1821 20063 21158 1878
3165 1878 -19909 -21550 -1031 19474 21366 1637 -19292 -20383 -2372 19600 22795 2795 -18107
3178 -18107 -21795 -2028 18067 21376 2920 -17520 -21254 -2317 17910 21269 2301 -18414 -21758
3191 -21758 -4016 18767 21291 3004 -17585 -20798 -3907 18175 21138 3315 -18576 -21506 -3643
3204 -3643 17779 21369 3644 -17225 -20944 -3915 17482 21607 4141 -17013 -21483 -4130 16982
3217 16982 21097 4461 -16308 -21439 -4593 16082 20609 4807 -16077 -20908 -4755 16034 20895
3230 20895 4690 -15934 -20528 -5451 16068 20661 5362 -15696 -20888 -5175 15703 21357 5672
3243 5672 -15900 -20719 -4593 15347 20168 5639 -15547 -21494 -5355 14305 20375 6723 -14871
3256 -14871 -20351 -5783 14017 20681 6478 -14881 -20107 -6474 14399 20508 5431 -14170 -19622
3269 -19622 -6478 13735 20264 6390 -13752 -19855 -6417 13917 21026 7003 -13508 -20815 -6528
3282 -6528 12899 19985 6853 -13341 -20163 -7457 12674 20474 7144 -13989 -20966 -7358 12504
3295 12504 20260 8243 -12739 -20216 -7474 12760 19624 7660 -12785 -19177 -7010 12258 19996
3308 19996 8721 -11942 -18916 -8015 11941 20360 7926 -11716 -19177 -7836 11245 19701 7623
3321 7623 -11927 -19063 -8828 10451 19875 8441 -11194 -20780 -8807 10742 19234 8837 -11536
3334 -11536 -20260 -8822 10921 19446 8867 -10066 -19402 -8883 10719 18798 8365 -10469 -18565
3347 -18565 -9584 10023 19021 9381 -10188 -19521 -8392 9526 19168 9936 -9325 -18911 -9361
3360 -9361 9615 19314 9959 -9424 -18585 -9110 8917 18691 9619 -8680 -18128 -10287 8040 19604
3374 19604 9240 -8666 -18429 -10148 8037 18548 9580 -9264 -17723 -9705 8498 18607 10280
3387 10280 -8078 -18388 -10535 7919 17560 10777 -7355 -18762 -9882 8507 18024 9470 -7645
3400 -7645 -17988 -10409 8146 17812 10366 -7652 -18015 -10272 7703 16636 10424 -6757 -18176
3413 -18176 -10768 7221 18063 10222 -6800 -17365 -10638 6453 17413 10362 -7051 -17781 -10449
3426 -10449 6404 17381 9515 -6214 -17051 -11340 6217 16978 11324 -6110 -17100 -10502 5815
3439 5815 17194 11523 -5958 -16325 -11653 5834 17446 10407 -5639 -16482 -10996 5715 16536
3452 16536 11554 -5970 -16490 -10981 5047 15939 11362 -5147 -16715 -10806 5008 16753 12027
3465 12027 -5411 -16176 -10628 4498 16350 11318 -3937 -16299 -11711 4977 15787 11025 -3989
3478 -3989 -16386 -10958 3780 15907 11458 -3913 -16946 -11573 5235 15986 10962 -3546 -14960
3491 -14960 -10561 3222 15168 11090 -2921 -15273 -11644 3758 14852 12196 -3796 -15311 -12085
3504 -12085 4723 15252 10928 -2532 -14899 -11698 2762 14632 12182 -2722 -14879 -12293 3628
3517 3628 14268 13344 -3347 -14702 -10612 2656 14831 12250 -2833 -14038 -11995 3397 14413
3530 14413 10926 -2373 -14448 -11885 2901 13615 11048 -2397 -14058 -12713 1996 14064 12248
3543 12248 -974 -14137 -11691 2204 15040 11837 -1877 -14132 -11675 1581 12865 12674 -2061
3556 -2061 -14388 -12805 2155 13281 12360 -1306 -12673 -12470 1253 13229 11770 -1280 -14166
3569 -14166 -12061 490 12936 12571 -711 -12556 -12690 681 13576 11705 -673 -12838 -12117
3582 -12117 1116 13009 12499 -923 -13028 -12045 1117 12452 11732 -257 -12664 -12324 216
3595 216 11900 12027 -7 -12646 -11346 444 12526 12055 374 -12278 -12200 -172 11462 12802
3609 12802 -170 -11559 -11994 -270 12541 12132 254 -13026 -11974 -515 12010 12131 777
3622 777 -12166 -11882 -67 12290 12871 6 -12126 -12304 -1283 10976 11801 1180 -11440 -12035
3636 -12035 -979 11668 11361 1226 -11485 -11652 137 11072 12367 796 -10884 -12390 -1007
3649 -1007 10875 12919 1363 -11190 -11999 -1341 10821 11674 851 -10677 -11871 -1384 10706
3662 10706 12385 1363 -11000 -11681 -1116 10589 12093 1021 -11016 -11563 -1143 11547 12737
3675 12737 1532 -10202 -12409 -2372 10923 13001 1394 -9897 -12215 -2178 10135 11904 1840
3688 1840 -10576 -12332 -2635 9800 12125 2817 -9870 -12455 -2449 9091 12769 2730 -9503
3701 -9503 -12645 -2061 9838 11830 2322 -9122 -12069 -2422 10286 11582 3099 -9704 -12117 -3005
3715 -3005 9840 12288 2814 -8761 -12126 -2929 9041 12759 2024 -9807 -11273 -2725 8455
3728 8455 11757 3228 -9123 -11784 -3786 8970 11828 2802 -8323 -11743 -3413 8269 11465 2797
3742 2797 -8206 -11442 -3337 9064 11888 2995 -7772 -11080 -2771 8773 11532 3161 -8897 -11596
3756 -11596 -3145 8737 11155 2676 -7893 -11459 -3595 7917 11529 3604 -7665 -11980 -3578 7371
3770 7371 12303 3675 -7727 -11731 -4481 8112 11181 4265 -7973 -10393 -3222 6957 11787 4229
3784 4229 -7506 -11415 -3747 7519 10555 4196 -7419 -11610 -3696 7227 11695 4082 -6472 -10679
3798 -10679 -4827 6959 11561 4016 -6998 -11121 -3972 6458 11568 3923 -5590 -11759 -4184 6338
3812 6338 11795 4415 -6762 -10929 -4555 7156 11022 5078 -5971 -10642 -5097 6822 11187 4367
3826 4367 -5327 -11056 -4515 6033 10925 4459 -6965 -10830 -5293 6467 10663 4635 -6538 -11329
3840 -11329 -5039 6279 10440 4880 -6152 -10679 -4362 5955 11606 4500 -5230 -10775 -4992 6052
3854 6052 9875 5122 -5574 -10662 -4739 6121 10546 5819 -5792 -10770 -5200 5530 10407 4624
3868 4624 -5044 -10473 -5263 5445 9603 5848 -5673 -10951 -5443 5124 10038 4966 -5323 -10901
3882 -10901 -4901 5169 10572 4914 -5845 -10658 -5200 4696 10205 6354 -4853 -10310 -5094 4915
3896 4915 10762 5183 -4218 -10517 -5833 4593 10725 5199 -5114 -9615 -4782 4334 9753 5601
3910 5601 -4560 -9608 -5744 4521 9866 5552 -3871 -10499 -5490 4314 9859 6107 -3268 -9767
3924 -9767 -6747 4745 10462 5698 -4207 -9139 -6294 4831 10224 5280 -3465 -10637 -6045 4477
3938 4477 10359 6370 -4601 -9737 -5355 4173 10001 6125 -4280 -9482 -6420 3729 10261 6695
3952 6695 -3338 -9644 -5677 3934 10071 6103 -3681 -9248 -5951 3105 9729 6177 -3279 -10438 -4781
3967 -4781 3817 9415 5758 -3139 -10038 -7336 3246 9293 7088 -2791 -10149 -5732 3518 7916 5693
3982 5693 -2695 -9400 -6258 3486 8747 6045 -3048 -9075 -5655 2293 8919 5896 -2485 -9493 -5834
3997 -5834 2809 9011 5804 -2516 -9161 -7018 3228 8926 6574 -2980 -9268 -5382 2270 7986 5922
4012 5922 -2980 -8383 -6637 1841 8148 5365 -3596 -8757 -5783 2917 8467 6461 -1409 -8541 -6674
4027 -6674 2029 8166 7243 -2646 -8678 -6610 2276 8843 6405 -1439 -8391 -6224 2201 8917 6737
4042 6737 -1430 -8322 -6875 1638 8430 6316 -687 -8375 -7316 2465 7633 6678 -1969 -9279 -6642
4057 -6642 1944 9012 7341 -1256 -9409 -6972 1155 8538 6999 -2290 -8459 -6746 1941 7650 5823
4072 5823 -1280 -8129 -6645 1481 7883 7846 -673 -8545 -5877 1175 7859 7460 -1439 -8112 -5819 1634
4088 1634 8536 5896 -755 -8555 -6889 1532 8359 7763 -732 -7307 -7286 1147 8344 6113 -1057 -7658
4104 -7658 -7040 109 8215 6766 -1179 -7150 -7357 -199 7562 6687 -271 -8026 -7218 670 7928 7002
4120 7002 -901 -8015 -7424 939 7768 6809 -337 -7701 -7170 -50 6718 7836 -76 -7211 -6620 502
4136 502 6473 7722 256 -7852 -6827 310 7252 6551 474 -6840 -6843 920 6788 6889 353 -7462
4152 -7462 -7277 -683 6763 6872 575 -6423 -6872 -172 6936 7718 -218 -7380 -7139 68 6960 6697
4168 6697 142 -6948 -5655 1104 6482 6341 -64 -7116 -6933 951 7009 7304 491 -6919 -7194 -854
4184 -854 6345 7052 638 -6568 -6247 -99 7085 7030 777 -7034 -7812 -1090 6356 7427 -425 -6635
4200 -6635 -6462 -692 7087 7472 448 -5776 -7783 -485 5166 6985 974 -6582 -7624 -410 6029
4215 6029 7014 311 -6579 -6418 -1779 6243 6688 681 -6255 -6948 -1202 5845 7988 1299 -6216 -6925
4231 -6925 -848 6030 7441 964 -6412 -6734 -749 5325 7095 1775 -4606 -6690 -635 6145 6404
4246 6404 2025 -5961 -7002 -755 5993 6832 1083 -5781 -7416 -674 4889 6610 435 -6130 -6422
4261 -6422 -1666 5519 7225 1271 -6098 -7034 -1543 4789 6328 880 -5465 -7067 -1509 5161 6440
4276 6440 1789 -5809 -7627 -2070 4685 6372 1237 -5868 -7268 -1705 4662 7525 2079 -4177 -7290
4291 -7290 -1461 5077 7357 1039 -4297 -6576 -2383 4977 7125 1943 -5790 -6429 -1486 5171 6624
4306 6624 2032 -4749 -7359 -2733 5219 7181 1889 -5887 -6710 -885 4813 6451 1735 -5068 -6499
4321 -6499 -2110 5669 6935 2107 -4607 -7235 -1932 4408 8075 2360 -4929 -6926 -2010 4751 7128
4336 7128 1017 -5144 -6575 -1130 5067 6669 2579 -4498 -7196 -3076 5095 6455 2389 -4149 -7000
4351 -7000 -1780 4838 6901 1833 -4143 -6356 -2730 4635 6156 2731 -4531 -6147 -2254 4018 6523
4366 6523 2558 -3603 -6463 -3348 4319 7250 2874 -4195 -6687 -2986 4074 6018 1785 -4526 -6954
4381 -6954 -2726 3623 6571 3520 -3699 -6791 -3053 4704 7515 2281 -4023 -6966 -2545 3700 6017
4396 6017 1812 -4073 -7234 -1743 3548 6724 2184 -4119 -6957 -2390 4042 6246 1997 -3349 -6963
4411 -6963 -3733 3878 6927 2802 -3781 -6683 -2747 3580 6831 3269 -4339 -6506 -3266 3454 6553
4426 6553 2992 -4053 -6621 -2854 3990 6119 2594 -3882 -6496 -2890 3131 6318 2893 -4208 -7301
4441 -7301 -3554 2474 5933 2081 -3246 -7005 -2985 2571 6030 2451 -3381 -6620 -3131 3730 6628
4456 6628 3097 -4291 -6694 -3560 2567 6752 2684 -4255 -5789 -2753 2911 6286 3937 -3136 -6807
4471 -6807 -3700 3022 5974 3671 -4029 -6352 -3079 3141 6297 3382 -3771 -6489 -4333 3265 6528
4486 6528 4599 -2339 -6124 -3764 3186 6325 3661 -2363 -6031 -3325 2737 5967 3111 -1870 -6718
4501 -6718 -3954 3853 6542 3452 -2716 -6682 -3664 3280 5653 4831 -2570 -6971 -3511 2256 5926
4516 5926 4191 -2063 -6021 -4210 2929 6023 3790 -3443 -6808 -2853 1996 5329 4269 -2210 -6597
4531 -6597 -3045 1786 5535 3788 -1481 -5820 -3723 1424 5932 3494 -2281 -5946 -3995 3609 5776
4546 5776 3944 -2309 -5786 -4180 1468 6400 4482 -3006 -6056 -3718 1829 5487 4350 -2100 -6031
4561 -6031 -4573 1897 6429 4248 -1757 -6276 -5050 1595 5779 5149 -1370 -5550 -3770 1286 5449
4576 5449 4220 -2262 -4850 -3692 1517 6065 3738 -1978 -6146 -3528 1641 6642 4555 -895 -5208
4591 -5208 -4188 1611 5133 4062 -1830 -5477 -4002 1971 6127 4135 -1578 -5932 -4426 2495 5812
4606 5812 4029 -2011 -5659 -4510 1273 5780 3932 -1086 -5771 -3818 545 6194 5103 -822 -5359
4621 -5359 -4166 912 5316 3826 -555 -5441 -4725 1582 5670 4213 -1478 -5107 -4546 1235 5976
4636 5976 3953 -856 -5348 -4702 1712 4684 3892 -1009 -5323 -4698 1670 5872 4680 -1652 -4804 -4063
4652 -4063 1018 5635 4142 -1344 -5657 -4369 13 5758 4332 -542 -5157 -4678 1066 5792 4635
4667 4635 -1226 -5273 -4959 852 4029 4399 -450 -4085 -3923 1288 5476 4762 -737 -4601 -4258 265
4683 265 5558 4713 -487 -5847 -4774 358 4994 4142 -1071 -5265 -4099 -210 5778 5087 -723 -5594
4699 -5594 -4759 453 5578 4793 -86 -5359 -3736 563 4533 4863 -613 -4907 -4518 774 5334 4947
4715 4947 -835 -4814 -4771 -121 4915 4275 -838 -4323 -3424 -101 5344 4618 -446 -4929 -3882 529
4731 529 3622 4532 -764 -4387 -4414 -294 4845 4113 -276 -4856 -4866 -592 5069 4142 -954 -5102 -5156
4748 -5156 -814 6249 5594 410 -5464 -4690 229 5314 4213 -295 -4655 -4716 469 4372 5336 524
4764 524 -4952 -4622 -100 4491 4855 -222 -4672 -4810 -314 4479 5077 -1120 -5214 -5289 -85 4770 4454
4781 4454 130 -5147 -5721 -107 4701 5359 -285 -4457 -4958 -242 4352 4961 413 -3484 -4634 -758
4797 -758 4016 5231 167 -3670 -4464 -252 4130 4956 478 -3423 -4025 367 5151 4762 560 -4311
4813 -4311 -4993 -568 3584 4580 755 -4715 -5505 -723 4617 5307 1183 -4242 -3390 472 3969 5310
4829 5310 216 -4576 -4916 -909 3723 5307 1029 -4219 -4498 -1499 3823 4563 1160 -4344 -4481 -184
4845 -184 3514 5312 660 -3854 -4556 -947 3681 5888 667 -3498 -3946 -70 3710 4834 876 -4593
4861 -4593 -4771 -1813 3906 4790 787 -3769 -4636 -1249 4185 4183 1096 -3974 -5357 -1579 4012 4794 1341
4878 1341 -3577 -5922 -236 3256 5423 626 -3443 -5214 -1386 4188 3870 880 -3852 -4098 -1231
4893 -1231 3346 4779 1633 -3767 -4505 -1284 2964 4865 940 -3908 -5216 -1072 3697 5303 1248
4908 1248 -4027 -4683 -1699 3554 5538 1713 -2948 -5242 -2139 2934 4495 2549 -3830 -4924 -791
4923 -791 2727 5220 2187 -3409 -5724 -1201 3191 4980 1943 -3762 -4006 -1014 2720 4637 1537
4938 1537 -2323 -5356 -1998 3858 4876 1977 -2171 -3804 -1759 3476 5648 1462 -3214 -5273 -1153
4953 -1153 2458 5529 1706 -3677 -5141 -2380 2916 5507 2199 -2707 -4283 -2443 3436 4216 957
4968 957 -4656 -4583 -1661 3563 4643 2064 -2506 -4632 -1254 3183 5265 1384 -2808 -5522 -1585 2770
4984 2770 4939 1442 -2852 -5146 -2457 2614 5892 1652 -2489 -4525 -2207 1896 4425 2016 -3372
4999 -3372 -4044 -2191 2954 4781 2468 -3274 -4929 -2149 3089 4915 2299 -1829 -4342 -1910 2540
5014 2540 4533 2831 -2293 -4780 -1894 2569 4660 2263 -2816 -4676 -1950 2705 5811 2199 -2297
5029 -2297 -5391 -1856 2950 5428 1259 -2506 -5220 -2713 3165 5674 2983 -2124 -4635 -2818 2919
5044 2919 5576 2356 -2428 -4160 -2661 1958 4316 2483 -2613 -5288 -2831 2863 4378 1811 -1597
5059 -1597 -4876 -3529 2600 4743 2397 -1959 -4403 -2344 2393 4918 3012 -1513 -4574 -2613 1580
5074 1580 4484 2479 -1666 -5730 -3036 2133 4407 2636 -1927 -5357 -2345 1275 5297 3115 -2763
5089 -2763 -4541 -2218 1651 4630 3021 -2265 -5270 -3163 2405 4920 2460 -1959 -4859 -3314 2191
5104 2191 3826 2713 -1412 -5049 -2963 2192 5549 2744 -1991 -3814 -3481 1817 5107 2811 -1187
5119 -1187 -4409 -2531 1501 4722 3566 -1082 -3570 -3075 1140 4952 3299 -2301 -3137 -3142 1551 4756
5135 4756 2578 -1361 -5198 -2980 1574 3360 3358 -1852 -5368 -2113 1936 4593 3358 -1463 -4548 -2638
5151 -2638 1798 5550 3141 -1361 -4569 -3112 2072 5048 3228 -1633 -4291 -3564 1183 4595 3153
5166 3153 -572 -4867 -2281 1005 5214 3113 -974 -4281 -3553 1799 4595 3830 -943 -4200 -3496 728
5182 728 3727 2650 -1159 -4752 -3032 439 4517 3610 -886 -4087 -3125 1683 4433 3372 -411 -4991
5198 -4991 -3371 676 3891 3717 -888 -3523 -3336 571 4063 3544 -1533 -4953 -3379 1595 4536 3610
5214 3610 -789 -4287 -3503 798 5009 3340 583 -4758 -3645 686 3677 3046 -106 -4117 -3151 687
5230 687 4585 3371 -1553 -3562 -3721 -59 3292 3312 -958 -4560 -4257 67 4648 3073 -1454 -5023
5246 -5023 -3092 366 3682 3579 -757 -4626 -4047 1137 3241 3205 -673 -4005 -3234 3 4074 4267
5262 4267 -1138 -3811 -3599 152 3532 2946 -852 -4305 -4048 422 4360 4023 -1080 -4374 -3830 -517
5278 -517 3850 3764 -21 -3110 -3183 315 3173 4943 -333 -3557 -4514 -201 4273 3068 -278 -3262
5294 -3262 -3463 761 4076 4539 1069 -4133 -3664 -442 4100 3215 -104 -4251 -4884 -265 4079 3328
5310 3328 -838 -3703 -3376 10 3722 3815 -186 -3510 -4080 80 3176 3740 663 -3593 -3499 -510 3564
5327 3564 4060 1069 -3420 -3524 170 3148 3290 559 -3266 -3763 -12 3983 3596 -558 -4534 -3136
5343 -3136 -231 3538 4400 405 -4635 -3734 -537 2511 3126 581 -3307 -4213 -136 3572 3487 359
5359 359 -3782 -4335 -767 4046 5080 753 -3173 -3428 -253 3434 4480 469 -2945 -3830 -486 3299
5375 3299 3791 739 -3856 -4030 -367 3064 3064 986 -2468 -3457 -742 2985 4445 1554 -3346 -4703
5391 -4703 -1555 2892 3218 650 -3415 -4111 39 2589 4581 548 -2689 -4218 -1374 2830 4217
5406 4217 195 -2708 -3650 -1894 2267 4246 -218 -3407 -4253 -862 3771 4044 1158 -3708 -3584 -255
5422 -255 3213 4245 629 -3118 -3593 -290 3105 3961 58 -2905 -4008 -1158 3883 4969 871 -2852
5438 -2852 -2986 -1208 3014 3799 1614 -3503 -2990 -2025 2995 3874 586 -2922 -3878 61 2815 3166 1214
5455 1214 -2733 -4096 -1307 2170 4050 628 -1537 -3965 -2291 2909 4157 1046 -3924 -4382 -1501
5470 -1501 2812 3774 1323 -3073 -3848 -1570 2701 3090 1615 -3094 -3606 -1675 3663 3947 2475 -3090
5486 -3090 -4782 -1406 2556 3888 1385 -2203 -3991 -1165 2782 3785 1230 -3165 -3758 -1647 2907
5501 2907 4009 1853 -2640 -3496 -2148 2207 3523 1414 -2486 -4764 -1929 2675 4240 1551 -2155
5516 -2155 -3961 -1606 2791 4167 2440 -1460 -3997 -1596 2414 3572 2067 -3282 -3481 -1345 1721
5531 1721 3935 1461 -1863 -4511 -3101 1709 2940 1886 -2330 -3646 -1902 2027 4046 1335 -2252
5546 -2252 -4355 -2789 1466 4629 1966 -2217 -4965 -1053 2198 4182 1389 -2587 -3320 -2460 2331
5561 2331 4134 1899 -1730 -3572 -2042 2502 4488 1928 -1129 -2357 -1840 2346 4075 1738 -1812
5576 -1812 -4050 -1356 1520 4719 1755 -2158 -3417 -1028 2288 4102 3002 -618 -3486 -2016 1762
5591 1762 3611 1742 -1526 -4636 -2478 1338 4219 1684 -2193 -3495 -2575 1812 3837 2067 -1223
5606 -1223 -3537 -2014 2789 4917 1638 -1059 -3779 -2631 2632 3661 2766 -1620 -4240 -1729 1908
5621 1908 3662 2333 -1587 -4023 -2149 1244 4036 1464 -1380 -3341 -2954 1900 4889 2828 -916
5636 -916 -4321 -2424 2136 3784 2642 -1370 -3827 -3062 1154 3961 1751 -1972 -3902 -3095 1803 3825
5652 3825 2832 -859 -3195 -2410 1121 3809 2818 -1437 -4152 -2633 1211 4006 3545 -680 -4266 -2329
5668 -2329 407 3728 3356 -1685 -3853 -2428 1894 4405 3466 -1155 -3672 -2546 834 3917 2230
5683 2230 -419 -4615 -2292 1861 3306 2282 -684 -2543 -2966 1169 3104 2582 -221 -3801 -2374
5698 -2374 923 3412 3297 -1802 -3438 -2252 950 4142 2703 -886 -4464 -3307 1314 4438 3550
5713 3550 -857 -3371 -3399 239 4270 2652 -218 -3497 -3115 848 3438 3284 -1281 -3921 -3203 -90
5729 -90 4157 3092 -741 -3499 -3248 438 3294 3196 -882 -3529 -3206 603 3699 2573 -365 -2738
5745 -2738 -3959 -97 3374 2940 -547 -4035 -3338 519 2836 3105 -619 -3746 -3596 665 3467 3164
5761 3164 -655 -2929 -3871 615 3871 2685 43 -4091 -3070 328 4171 2919 -74 -3070 -3145 126
5777 126 3979 2503 -378 -3718 -3310 285 3700 3616 -890 -2943 -3422 457 3446 2518 -1447 -3752
5793 -3752 -2808 16 3355 3036 -290 -2590 -3356 863 2934 2811 509 -3140 -3182 131 2986 3464 396
5810 396 -4432 -3794 -319 3203 3417 -472 -3861 -3849 396 3160 3430 94 -2933 -2931 -356 3497 2717
5827 2717 447 -2680 -3225 -558 3179 2973 175 -2973 -2969 -611 2887 3126 544 -2956 -2816 -53 3117
5844 3117 3208 -398 -2847 -3234 -698 2820 2654 -151 -2864 -3129 -699 3529 3059 -538 -3352 -3602 -817
5861 -817 2649 3932 -335 -2684 -3926 -735 2836 3174 -71 -3221 -3263 -533 3076 3370 1574 -2745
5877 -2745 -3290 -861 3813 3328 1373 -3629 -4551 -312 2268 4022 205 -3511 -2636 -756 1434 4033
5893 4033 769 -3461 -3745 -444 2801 3724 1515 -2046 -4174 -924 2445 3585 223 -2889 -3100 -1218
5909 -1218 2695 3535 816 -2695 -2808 -1046 2995 3833 932 -2756 -3744 94 3208 3731 777 -2772
5925 -2772 -2863 -1869 1552 3235 1958 -1816 -2841 -347 3096 3208 2061 -1924 -3275 -651 3016 4337
5941 4337 531 -2946 -3231 -644 3145 3531 666 -2441 -3871 -1704 1887 3431 -37 -3192 -3594 -598
5957 -598 1632 3351 1541 -1531 -2651 -2185 2276 3914 1092 -1880 -3667 -1415 2336 3480 1490
5972 1490 -1999 -4450 -922 2162 3138 1375 -2352 -3400 -694 1777 2961 1746 -1802 -3677 -1044
5987 -1044 2632 3466 1523 -1454 -3007 -1424 1792 2473 1802 -2143 -3027 -1355 1823 3972 1929 -2150
6003 -2150 -3197 -689 1739 4006 1461 -2388 -3756 -606 1976 3026 1312 -2183 -2425 -916 1603
6018 1603 3160 1629 -1546 -3612 -564 1856 3334 1586 -2131 -2945 -1312 1668 3497 522 -2463
6033 -2463 -3325 -1597 1404 4281 1406 -2085 -3808 -2195 1978 3015 1475 -1086 -2999 -2418 1689
6048 1689 3502 1850 -1849 -2953 -1889 903 3413 1291 -1508 -3177 -2255 1750 3266 2198 -1109
6063 -1109 -3995 -2081 1571 3396 1912 -1411 -3638 -910 1926 3699 1450 -1330 -2836 -1873 1552
6078 1552 3405 1505 -1572 -4265 -2276 1283 2630 2401 -1267 -2998 -1974 1008 3469 746 -2459
6093 -2459 -3380 -1745 1151 3754 1212 -1387 -3658 -1233 562 3493 3107 -1189 -4334 -2512 503
6108 503 3913 2229 -1522 -3532 -2114 1897 3290 2792 -1123 -2757 -2901 525 2570 3136 -602 -3794
6124 -3794 -1786 635 2925 2583 -1537 -3333 -2129 775 2458 2600 -137 -2922 -2259 1833 3831 2247
6140 2247 -664 -3517 -2142 2158 2823 1589 -691 -3511 -2333 771 2842 1869 -969 -3001 -2576 680
6156 680 2917 1496 -1397 -2597 -2958 994 3180 1039 -2030 -2005 -1464 926 2918 3246 -1281 -2926
6172 -2926 -1165 61 3555 2018 -1083 -2274 -1619 685 2538 1864 -313 -3479 -2305 812 3027
6187 3027 2386 -376 -3092 -1811 1110 3496 2241 -231 -2848 -2100 177 4185 2230 -44 -2862
6202 -2862 -2520 962 3698 2542 -635 -2999 -2426 464 3797 2898 -2379 -2856 -1843 490 2954 2600
6218 2600 219 -2314 -2066 870 2512 2376 570 -3237 -2808 1051 2956 2159 -441 -3977 -2635 62
6234 62 2525 2252 -593 -2263 -1988 817 2996 1962 -881 -3360 -2619 -299 2565 2176 -25 -2606
6250 -2606 -3328 147 2810 3288 -599 -2342 -2508 420 2621 2853 -506 -2268 -2609 -23 3370 2708
6266 2708 -37 -2830 -2644 -595 2027 1963 566 -3543 -2566 399 3421 2276 469 -2863 -2382 -196
6282 -196 3274 3452 -1025 -2649 -2679 773 2832 2701 4 -2321 -2804 273 3135 2495 681 -2720 -2058
6299 -2058 667 2742 2087 401 -2293 -3458 -263 3716 2695 407 -2155 -2977 529 3492 2288
6314 2288 -781 -3133 -3290 235 1857 3305 242 -2627 -1559 -1 2639 2697 91 -2079 -2306 -299
6330 -299 2395 2587 451 -2936 -2726 -1535 3175 2478 339 -2223 -3299 -571 2027 2438 699 -1710
6346 -1710 -2713 271 2204 3638 567 -3017 -2647 -1093 1646 2755 476 -2534 -1927 -293 1353
6361 1353 2745 38 -1966 -3474 330 3118 3423 1024 -2787 -3123 -277 2381 3105 391 -3327 -2707
6377 -2707 -1026 2301 2869 138 -1086 -2221 -589 2559 3532 750 -2240 -3496 10 2762 2854 492
6393 492 -2057 -2126 -384 3322 3226 275 -1904 -2592 -1067 2676 2850 518 -2133 -2605 -357 2243 3518
6410 3518 915 -1308 -2808 -267 1806 3233 314 -1727 -2611 -790 2764 2845 372 -2658 -2316 -391
6426 -391 2453 2106 809 -2937 -2740 17 1938 3347 1104 -2102 -3301 -432 1372 3334 738 -2099
6442 -2099 -2220 -720 1911 2982 739 -1936 -2754 -694 1820 3925 1273 -1909 -2952 -496 1497
6457 1497 3047 276 -1959 -2825 -1815 1682 3030 1176 -2439 -2514 -1647 1719 2341 1536 -2359 -3917
6473 -3917 -1363 2420 2447 1032 -1940 -2124 -940 1427 3171 1684 -2812 -2754 -830 1991 2994 1024
6489 1024 -1618 -2150 -1674 2055 2858 738 -1911 -1929 -432 3122 3223 579 -1388 -2615 -1321 1150
6505 1150 2742 999 -1711 -2922 -1520 2127 2168 838 -1386 -3852 -1385 2059 3108 1059 -1697
6520 -1697 -3601 -436 1618 3318 1613 -3073 -3025 -1337 732 3632 1494 -1890 -2688 -728 847 2456
6536 2456 1645 -2438 -3348 -937 1045 2480 934 -900 -2640 -1773 923 2961 1712 -771 -3017 -1924
6552 -1924 1680 3162 1211 -1455 -3562 -887 1354 2786 1897 -1433 -2495 -1751 1637 3290 1423
6567 1423 -308 -3059 -1593 139 2519 1070 -1299 -3096 -964 1118 3013 2059 -1747 -3176 -976
6582 -976 777 2939 2288 -696 -3782 -1467 938 2657 2671 -2378 -2284 -1331 1103 3257 1387 -899 -2767
6599 -2767 -2249 1473 3195 1930 -1298 -2846 -1974 1013 2678 3132 -1664 -3554 -2423 720 2258 1970
6615 1970 -718 -2838 -1673 1421 3472 1949 -271 -2350 -1627 824 2658 2076 -923 -2419 -1954 1007
6631 1007 3010 837 -792 -2142 -1671 1183 2891 1925 -724 -2568 -1712 884 2953 1036 -1349 -2548
6647 -2548 -1953 466 2815 958 -1579 -2613 -1775 911 1813 1049 -713 -2497 -2403 538 3152 2209 -841
6664 -841 -2271 -2135 593 2411 2367 -688 -2117 -2667 568 2405 2016 -14 -2761 -2392 519 3496 1702
6681 1702 210 -3213 -2412 -280 3048 1261 -1985 -2330 -1516 302 3115 1658 -884 -2919 -1790 497
6697 497 2629 1411 -361 -2664 -2362 584 1967 1493 -1863 -2543 -3408 794 2676 1051 -683 -1896
6713 -1896 -1681 376 2345 2402 -213 -3220 -2147 1210 2401 1384 92 -2122 -2985 1191 2925 2127
6729 2127 -43 -2902 -1947 1039 1917 3219 309 -1441 -2401 537 1690 1705 -850 -2201 -2015 41
6745 41 1907 2276 -170 -4011 -2559 279 2855 2183 -278 -2173 -1719 172 2489 1280 -657 -3639
6761 -3639 -2905 544 2481 2277 -96 -2500 -2236 159 2202 2010 -232 -3283 -2396 620 2059 1415
6777 1415 -555 -2174 -1613 92 2640 2180 332 -2093 -1944 -688 2222 2531 -161 -2190 -2055 707
6793 707 1949 2609 194 -2245 -2561 675 2022 2572 -430 -2306 -1657 -682 2199 2495 -327 -2414 -2463
6810 -2463 221 2030 1950 -105 -2575 -1656 -532 2512 2444 66 -2023 -2247 -19 2129 1884 1238 -1957
6827 -1957 -2029 -605 2825 2236 -553 -2228 -2577 63 2042 2851 622 -2276 -1792 -472 2796 2327 2
6844 2 -1846 -2277 -97 2266 2820 494 -1387 -2548 -194 2209 2279 667 -2427 -2777 658 1560 2254
6861 2254 498 -1805 -1777 -166 1682 2733 1399 -1675 -2712 -716 2196 3169 562 -1969 -1914 -350
6877 -350 2121 2100 -85 -2044 -2610 -983 1533 2081 821 -2574 -1639 63 2387 2918 291 -1734 -2077
6894 -2077 -773 1918 2615 293 -1988 -2259 192 2195 2242 14 -2709 -2519 -472 2337 1453 935 -1816
6911 -1816 -1733 -482 2430 3351 1049 -2399 -2183 -323 1270 2448 904 -1913 -2878 -1137 1434 1945
6927 1945 859 -1276 -2024 -1233 2024 2254 750 -1414 -3713 -933 1609 2606 487 -1272 -2809 -990
6943 -990 2044 2697 970 -1383 -2196 -73 1580 3126 985 -1691 -3273 -514 1260 2133 1448 -1904
6959 -1904 -2815 -379 893 1976 929 -2169 -2174 -484 1380 2128 831 -2398 -3092 -959 901 3287
6975 3287 527 -1291 -2372 -1143 1894 2776 1235 -1720 -2590 -1678 1534 2566 1384 -1155 -1884 -1502
6991 -1502 2395 1821 1309 -2322 -2087 -375 1590 1999 1699 -751 -2095 83 1069 2389 1032 -1403
7007 -1403 -2819 -877 71 2427 -108 -845 -2106 -521 1489 2866 1025 -1049 -2615 -1055 1892
7022 1892 1942 1377 -1699 -2744 -711 1353 2763 1669 -1166 -2207 -851 1473 2503 956 -1294 -2613
7038 -2613 -1222 1806 2635 336 -1630 -2924 -1755 2060 2957 895 -1864 -2587 -1128 837 2415 1310
7054 1310 -1482 -2253 -716 373 2764 843 -1451 -3305 -1437 997 1546 635 -1597 -2334 -1831 1539
7070 1539 3180 1331 -1716 -1916 -1772 711 1588 1549 -647 -2301 -2219 1246 3389 696 -1454 -2392 -1461
7087 -1461 1139 2337 1067 -758 -3352 -2124 1726 2168 1209 127 -2756 -1126 1461 2666 1388
7102 1388 -1051 -2601 -1426 1113 2442 191 -1425 -3386 -2047 1162 3527 969 -1017 -2291 -1429
7117 -1429 868 2352 1425 -1268 -2926 -1565 529 2454 1371 -1015 -2896 -1682 1232 1767 1485 -618
7133 -618 -2167 -1557 412 2822 2353 -663 -2327 -1684 1464 3028 1398 -940 -1972 -1453 1497 2717
7149 2717 1363 -106 -2276 -2006 465 2650 1233 -1994 -2390 -654 631 2408 2538 -1148 -2355 -2200
7165 -2200 -264 2864 1819 -1560 -2917 -1161 704 2065 1222 -172 -2337 -2652 95 2096 1855 -1057
7181 -1057 -2350 -1215 491 2310 2063 -616 -2465 -1317 -648 2229 1571 -733 -2294 -1973 575 2358
7197 2358 1500 -482 -2277 -2212 1133 1797 1731 89 -3060 -2771 668 2371 747 -280 -2738 -2350 -53
7214 -53 2173 2894 -267 -2462 -1235 172 1892 2303 -1023 -1868 -1561 467 2137 2192 358 -1404 -1325
7231 -1325 -337 2403 2636 88 -2482 -2069 -289 773 1633 549 -1538 -2570 233 2358 1739 -755
7247 -755 -2457 -1725 115 3182 2115 -18 -1823 -2508 -276 1821 1517 -185 -1561 -1988 917 2314
7263 2314 1701 -167 -2869 -1929 826 1863 1735 161 -1734 -2438 113 1307 1367 -69 -1034 -2166 123
7280 123 2985 872 655 -2161 -3001 487 1830 2081 -513 -1791 -1845 -803 2730 2071 -456 -2073 -1583
7297 -1583 561 2625 2592 -561 -1792 -2351 -148 1775 2237 696 -1130 -2085 -800 1242 2558 -663
7313 -663 -2355 -2309 -335 1848 2106 53 -1980 -2533 -334 2017 3148 146 -2670 -2016 -362 1870
7329 1870 1764 645 -1595 -1658 -1005 1221 1860 -167 -1659 -1827 -20 2234 2826 272 -1123 -2002 -60
7346 -60 1537 2244 232 -2653 -2276 27 2150 2582 -841 -1106 -1701 81 1996 1978 83 -1435 -2043
7363 -2043 -850 2221 2154 -752 -2583 -2425 -592 1451 1651 1126 -1154 -2217 70 1329 1600 587
7379 587 -2540 -2600 -1160 1134 1956 725 -1245 -1889 -674 1669 2567 1205 -1676 -2271 -873 1862 2777
7396 2777 231 -2305 -1611 -462 1933 2325 360 -1043 -2522 22 2167 2289 782 -826 -2065 -452
7412 -452 458 2517 681 -1931 -1683 -1453 1921 2295 479 -2424 -1881 -142 1543 2397 1018 -960 -2229
7429 -2229 -1013 802 1476 1276 -1667 -2295 -222 1650 2601 488 -1227 -2596 -1725 1665 1716 919 -1179
7446 -1179 -1762 -679 1159 2225 175 -631 -2364 -480 704 2308 8 -975 -2308 -1346 1814 2545
7462 2545 1448 -1124 -3272 -990 910 2481 1939 -952 -1711 -852 2061 1793 574 -1249 -2528 -463
7478 -463 1108 1656 561 -969 -2047 -715 1259 2763 1437 -789 -2448 -496 1060 2411 964
7493 964 -1451 -1565 -980 1359 1967 1715 -973 -546 -729 447 1833 1525 -976 -1928 -1076 1264 1560 2372
7511 2372 -492 -1801 -801 474 1838 189 -1314 -2392 -1056 1112 2336 1139 -891 -2695 -980
7526 -980 596 2649 1384 -1116 -2559 -736 508 2794 1331 -976 -2502 -1560 495 1675 991 -1344
7542 -1344 -2165 -1339 1102 1884 814 -351 -2111 -972 285 2047 1586 -589 -2393 -1947 251 2805
7558 2805 973 -1103 -1669 -609 26 1829 1546 -813 -1537 -1660 977 1056 643 -305 -1459 -795 -320 1934
7576 1934 1158 -1049 -2563 -721 347 2235 889 -414 -1834 -1647 22 2304 1020 593 -1335 -1133
7592 -1133 680 2187 1199 -1057 -2201 -1470 -160 1578 812 -1216 -1865 -1257 1141 2315 1487 -1063
7608 -1063 -1712 -1481 369 3131 1750 -820 -1110 -1623 405 1224 1803 -1038 -2253 -1662 206 1954 470
7625 470 52 -1949 -1345 656 1791 2367 -94 -2099 -1359 914 2733 1260 -1062 -2049 -2006 33 2108
7642 2108 1313 -689 -2355 -940 785 2051 1921 -767 -1671 -2378 -490 2094 2008 -184 -1854 -1663 -33
7659 -33 2467 1678 263 -2241 -1639 -139 2329 1877 -651 -1877 -852 -19 2120 1698 -677 -2408 -1789
7676 -1789 477 1378 2147 -273 -2273 -1682 469 1884 1197 114 -988 -319 -101 2149 1988 -67 -511
7693 -511 -2018 -433 1457 2322 567 -1403 -1594 -935 1228 1528 958 -1727 -2150 -508 1722 1342 182
7710 182 -2608 -1333 940 1197 1291 755 -777 -2068 689 850 1363 -56 -1022 -1830 324 1994 1397
7727 1397 -949 -1849 -1798 -344 1909 1521 -510 -1787 -1891 835 1542 2088 209 -1347 -2221 835 1701
7744 1701 2273 349 -1040 -1031 142 1563 1563 131 -1303 -1850 -107 2088 888 12 -1458 -1758 -36
7761 -36 1728 2716 974 -1043 -1730 226 1850 1017 243 -1814 -1808 -182 1088 2272 1211 -1587 -735
7778 -735 -270 1517 1433 59 -1318 -2795 -356 1564 1884 -628 -1466 -1979 395 1557 1231 536 -1031
7795 -1031 -1963 -26 1764 2045 876 -804 -2402 -1155 1229 1971 -462 -1979 -1473 -112 1064 2360
7811 2360 992 -1304 -2311 148 1872 2174 239 -1787 -1760 -780 1144 1304 186 -2324 -1632 224
7827 224 1509 2727 387 -646 -1174 -813 1610 1751 796 -1777 -2340 -1231 1652 1816 -96 -1220 -2164
7844 -2164 632 1600 1629 -540 -951 -1761 -687 1123 1420 84 -1482 -2234 -990 1695 2171 1210 -1462
7861 -1462 -1899 -533 1581 1355 1335 -2018 -1923 -1351 1446 1976 1077 -798 -1830 -1199 1847 2662 1058 -867
7879 -867 -955 -346 341 1052 1081 -818 -1579 16 1367 2068 199 -1218 -1602 -1196 2340 2070 112 -1771
7897 -1771 -1617 -2214 930 2887 534 -1111 -2123 -655 1633 2482 630 -1462 -2725 -1026 641 2419
7913 2419 1246 -194 -2123 -1730 1933 2233 920 -562 -2136 -683 1705 2271 893 -1287 -1449 -891
7929 -891 343 1955 446 -844 -2714 -934 806 2819 950 -750 -1537 -989 618 2334 736 -178
7945 -178 -2219 -812 364 2082 839 -599 -1779 -620 1472 1454 699 -393 -1248 -585 601 1789
7961 1789 2019 -1045 -1012 -840 358 1657 1044 -211 -1607 -1834 955 2090 1736 -432 -2055 -1901 1366
7978 1366 1487 1818 -710 -1584 -2036 707 1009 1740 -275 -2842 -1789 125 2214 1546 -860 -1188 -1000
7995 -1000 723 1855 1003 -880 -1869 -587 910 2369 1192 -865 -1332 -1397 510 1581 367 -849
8011 -849 -1416 -1218 1063 2084 976 115 -1848 -1338 752 1918 1049 -565 -1564 -1122 341 1301 2053
8028 2053 -447 -1507 -1866 281 1444 1696 -754 -2816 -1263 223 2946 920 -964 -2457 -1482 432
8044 432 1102 1090 -574 -1915 -1410 677 2126 764 -874 -1342 -1538 788 1825 500 126 -1528 -1000
8061 -1000 554 962 2097 -758 -1864 -878 388 1471 1537 -41 -1426 -1436 873 1550 1253 -1239 -1931
8078 -1931 -1873 264 1725 1397 504 -1514 -1426 1289 1523 939 -267 -1433 -1098 69 2305 151 -920
8095 -920 -1492 -1346 -240 1723 1706 -521 -1738 -1351 900 1315 2295 241 -1945 -1927 56 1423 1154 246
8113 246 -1131 -1911 518 1408 1733 168 -1467 -1741 134 1687 1178 -630 -1653 -1622 220 1772 1304
8130 1304 -102 -2166 -1431 543 2300 1672 456 -2156 -1224 -188 1081 1658 -201 -1284 -1470 -222
8146 -222 854 1764 -74 -1610 -905 168 2352 1437 306 -1407 -2140 786 762 1661 -400 -1335 -1660
8163 -1660 387 1138 1384 301 -1589 -2054 646 2046 1530 -558 -189 -1711 76 1703 1847 433
8179 433 -2137 -688 -469 1359 844 -385 -496 -1869 -835 1060 1642 249
8191B49
$$ Imaginary data points
##PAGE= N=2
##DATA TABLE= (X++(I..I)), XYDATA
0 0 0 0 0 0 0 0 0 0 0 0 0 0 0 0 0 108 -108 108 -108 108 -134 216 -216 271 -324 338 -432 540 -544 650 -758
31 -758 866 -974 1090 -1269 1407 -1603 1765 -1970 2221 -2467 2727 -3037 3357 -3716 4108 -4527
47 -4527 4990 -5504 6053 -6682 7364 -8112 8959 -9903 10966 -12175 13579 -15199 17120
60 17120 -19431 22279 -25889 30627 -37148 46746 -62378 92058 -169286 849879 1533546
71 1533546 -213970 -1365567 -1374624 119206 1382734 1338321 -90444 -1347591 -1331338 49483
81 49483 1337096 1340015 -36067 -1331430 -1320520 15364 1315914 1318178 -18369 -1286472
91 -1286472 -1296919 -11016 1279939 1284586 3452 -1241660 -1262011 -28527 1216622 1251887
101 1251887 41771 -1191288 -1235996 -59692 1161830 1236844 73937 -1152369 -1220613
110 -1220613 -83115 1128798 1212134 86459 -1104391 -1198872 -105643 1088556 1184802
119 1184802 110992 -1058267 -1176612 -127516 1039559 1171151 135408 -1025537 -1156001
128 -1156001 -145082 1000922 1149092 152882 -981133 -1134039 -168179 957688 1127616
137 1127616 182759 -938799 -1126218 -192536 927330 1119523 196275 -912470 -1105285
146 -1105285 -202519 893264 1094267 208311 -871907 -1081263 -222798 850845 1075584
155 1075584 235149 -834514 -1071113 -241966 818286 1063403 253794 -807129 -1059181
164 -1059181 -257551 792495 1050206 262960 -778353 -1037982 -269312 760129 1030078
173 1030078 276420 -741900 -1021610 -287225 729300 1015708 295041 -713530 -1012433
182 -1012433 -300775 702081 1002405 310137 -689929 -996614 -312422 674232 990338
191 990338 318542 -661876 -978833 -327035 646908 973333 331371 -632787 -967012 -338112
201 -338112 621934 958669 344985 -609649 -954925 -348867 596093 946593 357311 -586077
211 -586077 -941111 -362366 572502 936580 366707 -562858 -929000 -371333 552707 921965
221 921965 375083 -539297 -914663 -380832 528015 907710 386998 -516057 -904000 -391412
231 -391412 505962 897662 395857 -496549 -892942 -400173 487487 886728 402859 -477093
241 -477093 -879962 -407882 467196 874325 409986 -457838 -869297 -414936 448811 862440
251 862440 418488 -438974 -856475 -421240 428463 850066 425683 -418128 -844571 -432050
261 -432050 409918 840711 435203 -401352 -836598 -437986 395449 831609 438920 -386440
271 -386440 -822354 -440510 376337 815269 442522 -365300 -807606 -450002 353863 805026
281 805026 454441 -345217 -802098 -459737 338718 798739 461362 -333367 -793090 -461099
291 -461099 326051 785106 461685 -317042 -775352 -464153 305201 769231 469151 -294418
301 -294418 -765470 -475992 286683 762625 478637 -280837 -758679 -479462 275393 752746
311 752746 479901 -268763 -744807 -478947 259590 737090 482486 -249782 -731891 -486757
321 -486757 240610 727696 490505 -234231 -723900 -493464 226764 719903 493409 -221111
331 -221111 -712925 -494049 213552 705417 495899 -205358 -699189 -498040 196500 694581
341 694581 500577 -191314 -691002 -501796 184961 685679 501957 -177858 -678172 -503135
351 -503135 168805 671122 506716 -159231 -665116 -510458 152675 662770 512712 -148004
361 -148004 -659250 -513222 142284 653790 511667 -137963 -646050 -509859 130252 638073
371 638073 512186 -121248 -632483 -515858 112873 627519 519413 -105149 -625401 -520444
381 -520444 102634 621516 520539 -98193 -615903 -518469 92950 609371 517535 -85707
391 -85707 -601930 -518517 76840 596017 522985 -69840 -592255 -524534 65245 588507 525442
402 525442 -61995 -585356 -524419 57655 578525 521629 -52171 -572085 -522564 45334
412 45334 564790 523433 -37391 -560648 -525269 33475 556496 526289 -28788 -552757 -523899
423 -523899 24080 546953 523199 -19486 -539801 -524755 11832 535957 524469 -5225
433 -5225 -531516 -526076 4016 525317 525563 2052 -522285 -523009 -6731 514679 523591 10933
445 10933 -508808 -523139 -19385 505235 522869 22420 -497891 -525521 -27060 495325 522757
456 522757 32428 -492035 -523713 -34814 484890 522371 39549 -480536 -518163 -45552
466 -45552 474198 520935 48436 -467273 -520179 -55896 464887 519549 60349 -458604 -522167
477 -522167 -62057 455016 518730 67395 -449828 -517329 -70484 441633 517203 75323
487 75323 -438872 -515226 -82804 433506 515968 83470 -427694 -515194 -88785 424710 512066
498 512066 93008 -416767 -513548 -97544 412191 511517 102381 -408800 -511974 -106251
508 -106251 404094 510938 107576 -399717 -508737 -112879 394588 507136 115548 -387500
518 -387500 -506427 -121367 382938 505449 125852 -378406 -505598 -128117 373494 503761
528 503761 130917 -369959 -501057 -134707 364872 501046 137752 -359084 -499048 -142048
538 -142048 355046 497301 146373 -350298 -496332 -148867 344398 495870 153705 -340222
548 -340222 -494024 -156779 337099 492180 157726 -331539 -491386 -161747 327847 488221
558 488221 165851 -321943 -488219 -168428 316841 485871 171414 -312965 -484562 -174304
568 -174304 307391 484157 176371 -302868 -479160 -181448 299205 478439 182763 -292552
578 -292552 -479721 -186905 290808 475745 190265 -286651 -475156 -190070 280974 472133
588 472133 193600 -277587 -469476 -196858 270451 469754 199319 -266551 -468229 -204171
598 -204171 264219 466280 203823 -259258 -465609 -205717 256000 459865 209169 -250132
608 -250132 -458819 -210172 244887 457516 215221 -241496 -455785 -217411 236939 454265
618 454265 217329 -232416 -452640 -220674 230873 449244 221090 -225292 -447857 -223667
628 -223667 220325 444775 226694 -217094 -443390 -228626 212334 442992 231278 -208389
638 -208389 -440287 -233166 206380 438596 232360 -201511 -435784 -235245 196807 431982
648 431982 237895 -192252 -431110 -239453 188465 429746 242551 -186167 -428383 -242911
658 -242911 183336 425364 245309 -178719 -421540 -245124 173452 418611 247964 -169431
668 -169431 -417939 -249007 165384 416310 252564 -163966 -414715 -253308 159750 412283
678 412283 253635 -156321 -408821 -253828 151998 406249 256372 -146245 -403637 -258815
688 -258815 142804 401997 261330 -139419 -401513 -261646 135912 399278 263469 -133662
698 -133662 -396418 -263492 128627 392826 264719 -125983 -390126 -266221 121784 388245
708 388245 267885 -117258 -385853 -269913 113772 383422 270883 -110882 -381359 -272432
718 -272432 107329 379358 272356 -103584 -375695 -274287 99429 374376 275285 -96773
728 -96773 -371909 -276914 93297 369546 276682 -90226 -367230 -276899 86752 364349 279449
739 279449 -82437 -361209 -280264 78902 359066 282210 -76092 -356899 -282891 72777
749 72777 354505 283448 -70149 -352884 -283479 66855 349947 284213 -62724 -346575 -284327
760 -284327 58607 343700 286217 -54615 -342244 -287656 51661 339111 288490 -49511
770 -49511 -336964 -288394 47146 334182 288193 -43536 -331317 -289691 40543 327766 289727
781 289727 -36452 -325108 -290444 32821 323300 291729 -30280 -322087 -292009 27642
791 27642 319629 291743 -25194 -317146 -292343 22074 313086 292726 -19353 -310221 -293294
802 -293294 15920 307659 293279 -11665 -305642 -293600 8616 301309 293960 -7056 -299976
813 -299976 -294151 4593 297114 294878 -739 -295248 -295273 -1574 292227 295652 3928 -289572
825 -289572 -294327 -6866 287396 295413 9575 -284699 -294526 -12433 281773 294811 15910
836 15910 -279685 -295533 -18331 276788 295726 20143 -274452 -295692 -23315 272236 294982
847 294982 24749 -268764 -295137 -28288 265748 294279 30322 -263512 -295477 -33552
857 -33552 259865 294509 36077 -257445 -294822 -38419 255962 295186 40277 -252942 -293330
868 -293330 -42500 250502 293234 44679 -248103 -293252 -46935 245032 292876 48871
878 48871 -243008 -292941 -50613 239338 292697 53572 -236850 -292262 -56041 234852 292729
889 292729 57983 -233222 -291551 -59786 229528 291504 61873 -227836 -290322 -64552
899 -64552 225240 289226 65837 -223038 -288911 -68280 219484 288634 70340 -218062 -289073
910 -289073 -72975 214927 288383 74538 -212995 -289232 -76176 209744 286112 78398
920 78398 -207738 -286262 -80957 204875 286260 82523 -202718 -285722 -85580 200244 285533
931 285533 86429 -198104 -284522 -88254 195983 284071 88927 -193223 -283533 -92037
941 -92037 189926 282736 94100 -187912 -281465 -96669 185123 282083 97642 -182570 -280970
952 -280970 -99878 181007 279527 101249 -178398 -279654 -102575 175856 278997 104728
962 104728 -173333 -278759 -104683 169142 277643 106533 -168748 -276238 -108122 166012
972 166012 276133 110660 -163553 -275402 -112488 161748 274379 114344 -158553 -273816
982 -273816 -115075 156054 272663 117641 -154528 -271568 -119114 151991 270928 118760
992 118760 -149787 -268722 -121175 148374 268299 121640 -144758 -268178 -124222 142755
1002 142755 266783 125707 -140153 -266864 -127280 137443 265847 127862 -136229 -264268
1012 -264268 -128568 133243 262629 129602 -130571 -261901 -131351 128814 260974 133245
1022 133245 -126205 -260276 -135188 125286 259500 136093 -122232 -258458 -136358 119701
1032 119701 257441 137645 -117580 -255452 -139144 115179 254764 139974 -113656 -253385
1042 -253385 -141581 110589 252295 142305 -108773 -251811 -144423 107318 250500 145138
1052 145138 -104741 -248682 -146191 102284 247311 147021 -99992 -247053 -148183 97739
1062 97739 245576 148554 -96453 -244010 -149807 93952 243040 150438 -90975 -241137
1072 -241137 -151278 89065 241907 152685 -86232 -240067 -153168 84933 238774 153865
1082 153865 -82676 -237412 -154611 81594 235572 155347 -79558 -234976 -156058 76640
1092 76640 233512 157308 -74577 -231648 -158377 73045 230690 158428 -71401 -229442
1102 -229442 -160862 67983 228622 159652 -67268 -226066 -160720 64513 225448 162138
1112 162138 -63291 -225118 -162335 59870 223193 163257 -58135 -222010 -164102 56655
1122 56655 220554 165545 -54545 -219748 -165965 53305 217118 166906 -50462 -217059
1132 -217059 -165894 47579 215869 167962 -46879 -213344 -167969 44463 213248 169042
1142 169042 -43984 -210465 -169132 40765 209560 168987 -39330 -208665 -170660 37367
1152 37367 207235 170426 -35203 -206328 -170316 33358 204295 171122 -32654 -202699
1162 -202699 -171282 30647 201713 172489 -28036 -199849 -172733 26650 198962 172855
1172 172855 -24772 -197238 -174111 22027 195646 174183 -21446 -195210 -173585 18739
1182 18739 192686 174273 -19036 -192307 -175024 15414 189620 175110 -14050 -189071
1192 -189071 -175907 12036 187580 176741 -11176 -185935 -176506 9141 184724 177057 -7312
1203 -7312 -183564 -177029 6057 181458 175429 -4946 -181243 -176700 2013 178371 176720
1214 176720 -774 -177551 -177278 -382 176457 177881 1787 -174064 -177244 -3664 173746
1225 173746 176608 4741 -172222 -178578 -6019 170685 177550 8465 -168703 -177312 -10200
1236 -10200 167834 178075 11353 -165816 -178527 -13034 165077 178709 14096 -163532
1246 -163532 -178054 -15490 161869 178781 17725 -159894 -178762 -18342 158621 177946
1256 177946 20317 -157944 -178244 -22018 155855 178253 22929 -155021 -177906 -25252
1266 -25252 153699 178194 25144 -152290 -177973 -27936 150128 178294 28508 -148646
1276 -148646 -177923 -30364 146929 178269 31673 -145327 -177233 -33767 144043 177522
1286 177522 33627 -143082 -177020 -36419 141123 176587 36921 -139670 -177503 -38820
1296 -38820 138436 177512 39618 -137581 -176355 -40513 135966 177036 41801 -133708
1306 -133708 -176453 -43281 131806 175598 43825 -130253 -176557 -46091 129465 176458
1316 176458 47540 -127941 -175617 -47923 126680 175414 48875 -125653 -174819 -50219
1326 -50219 123989 174380 51930 -122822 -174992 -52896 120065 174546 54557 -119263
1336 -119263 -173218 -55281 117546 173594 56629 -117597 -173627 -57004 114710 173038
1346 173038 57921 -114385 -172963 -60269 112452 172953 60989 -110785 -171924 -61662
1356 -61662 110192 172089 62289 -108094 -171360 -63659 105760 171149 65392 -104652
1366 -104652 -170063 -66027 104043 170593 66824 -102436 -169266 -67857 101576 168873
1376 168873 69564 -99792 -168151 -70908 97671 168735 71381 -97510 -168124 -71877 96039
1387 96039 168133 72698 -93725 -166308 -72967 92235 166982 74507 -91339 -166437 -76020
1398 -76020 90496 165556 76602 -88639 -165031 -77207 87405 164663 78197 -85480 -163884
1409 -163884 -78557 84045 164357 79635 -82723 -163333 -80664 81821 162657 81488 -80539
1420 -80539 -161540 -82217 79415 161084 82839 -78355 -161339 -83747 76338 161356 84568
1431 84568 -75335 -158180 -84935 72857 157730 85676 -72691 -158375 -86809 70901 157249
1442 157249 86953 -70158 -156875 -88140 69078 156859 88743 -67799 -156184 -89108 64610
1453 64610 155164 90474 -64429 -155690 -90443 63483 153956 92044 -60728 -153373 -92683
1464 -92683 60698 153356 92950 -58789 -152054 -93306 57202 151580 94231 -56690 -150161
1475 -150161 -93946 54731 149469 95454 -52841 -148209 -96573 52343 147705 97151 -51128
1486 -51128 -148107 -97189 49682 145980 98114 -48668 -146923 -98208 46726 145312 98821
1497 98821 -45892 -144153 -99205 44739 144804 99148 -44420 -143852 -100934 42141 142236
1508 142236 100843 -41243 -142631 -101530 39984 141159 101730 -38661 -139944 -102798
1518 -102798 38131 139675 102441 -35993 -138794 -103865 34946 137726 104536 -33904
1528 -33904 -138196 -103949 32684 137434 105021 -32282 -135370 -104300 30588 134945
1538 134945 105848 -29607 -134257 -106345 27800 133185 106144 -26821 -132553 -105644
1548 -105644 27105 131972 106179 -24535 -130971 -107211 23849 130839 107223 -22614
1558 -22614 -129299 -107797 21351 128032 107794 -19774 -127712 -109109 18867 127489
1568 127489 109250 -17960 -125784 -108293 17447 124749 108357 -16100 -124597 -109509
1578 -109509 14309 123059 109383 -13029 -123510 -109804 12712 121887 109448 -11626
1588 -11626 -120614 -110701 10923 119625 109399 -9983 -119368 -111076 7489 118388 110567
1599 110567 -7592 -117367 -110316 6850 116996 110255 -5930 -115967 -111256 3849 114342
1610 114342 111392 -3218 -114726 -111393 2187 113861 111596 -1891 -112705 -111816 -861
1621 -861 112139 111073 559 -110665 -111855 -2215 109823 111407 2658 -109907 -111264 -3907
1633 -3907 108345 112382 4203 -107989 -112402 -4691 107540 111515 6467 -104829 -111600
1644 -111600 -8012 104170 112560 8437 -102891 -112307 -9439 101843 112435 10858 -102215
1655 -102215 -111689 -10279 100105 112024 12256 -99356 -113382 -12339 99021 112542 13890
1666 13890 -98358 -112719 -14244 97167 112431 16457 -96639 -112630 -16934 94590 111853
1677 111853 17795 -93853 -112783 -18498 93762 112028 19869 -92781 -112634 -19722 92299
1688 92299 111703 21558 -90298 -113431 -21699 90278 112435 22498 -88564 -111994 -22950
1699 -22950 88136 112559 25431 -86657 -112373 -25483 86095 111766 26647 -86222 -111378
1710 -111378 -26559 83818 111713 26997 -83839 -111495 -28625 82962 112605 29634 -83270
1721 -83270 -111882 -30027 81550 110520 30541 -80333 -111051 -31210 79351 109878 31993
1732 31993 -78792 -110368 -32390 78619 110679 33852 -76983 -109944 -33828 75698 110284
1743 110284 35230 -74255 -109007 -35083 73715 110654 36858 -72787 -110340 -36801 71545
1754 71545 108986 38364 -71193 -108778 -38624 70297 108844 39190 -69481 -109365 -39063
1765 -39063 69683 108425 40835 -68034 -107921 -40519 67128 107336 41321 -66390 -108742
1776 -108742 -41646 65034 107169 42892 -63927 -107650 -42552 62588 107322 44293 -62192
1787 -62192 -107239 -45239 62210 106594 45443 -60366 -105883 -45577 59725 106155 46600
1798 46600 -59422 -104885 -47625 57496 105543 48108 -57519 -105038 -48196 56791 104395
1809 104395 48641 -55982 -104259 -49973 54461 103654 49663 -54146 -103428 -50388 52976
1820 52976 102554 51597 -51496 -103721 -52352 50952 103551 51981 -49995 -103409 -52576
1831 -52576 49524 102147 52393 -48934 -102147 -54548 47148 101117 54129 -46723 -100226
1842 -100226 -55104 46454 100613 55807 -45651 -99838 -56314 43811 99941 55512 -43419
1853 -43419 -99220 -55816 42102 99126 56268 -42525 -98174 -58160 41016 98473 57689 -39510
1865 -39510 -97805 -58310 39468 97917 58417 -39132 -96504 -58699 37468 96054 59977 -36985
1877 -36985 -96220 -60112 37095 95241 60853 -35151 -94738 -60068 34877 95413 59124 -34461
1889 -34461 -94297 -61173 33575 93775 61832 -32965 -93447 -61773 31208 92604 61953 -30626
1901 -30626 -92865 -61392 30404 93194 62972 -30301 -91590 -62453 28336 90716 63639 -27866
1913 -27866 -91447 -63632 27085 90189 63417 -25528 -90263 -63724 26147 89625 64459 -25808
1925 -25808 -90128 -63972 24440 89092 65444 -23144 -88384 -64674 22755 88328 65471 -22377
1937 -22377 -86844 -65824 20740 87053 65820 -21243 -85827 -66425 19020 85577 66176 -19045
1949 -19045 -85413 -66691 18771 84610 66993 -17631 -84407 -66747 16589 83413 67011 -15993
1961 -15993 -83250 -67450 15716 83143 67989 -15119 -81938 -68398 14356 81545 68459 -12985
1973 -12985 -80530 -68171 11490 81637 67935 -12577 -79993 -67747 12182 79682 68373 -10049
1985 -10049 -79782 -69630 10535 78634 69122 -9643 -78962 -68496 8208 78106 69380 -8045
1997 -8045 -76737 -69935 7853 76040 69558 -7646 -76360 -69619 5722 75372 69038 -5235 -75123
2010 -75123 -69854 5156 75333 70142 -4066 -74566 -70889 3658 73723 70323 -2574 -73156 -70791
2023 -70791 2895 72960 70426 -1335 -72229 -71159 483 71224 70902 -978 -70686 -69447 -41
2036 -41 69833 70588 591 -69083 -70926 -1492 68627 70756 1796 -68663 -70361 -3289 68465
2049 68465 71097 3427 -67379 -70661 -4015 67179 71007 4498 -66464 -71152 -4657 65689 70883
2062 70883 6296 -65582 -71143 -6157 65607 71327 6021 -64500 -70385 -7660 63936 70517 7893
2075 7893 -63533 -71014 -7756 62282 70034 9356 -61731 -70641 -9648 61715 70272 8991 -60964
2088 -60964 -70639 -9502 60668 71309 10714 -59381 -71062 -11380 59315 71176 12198 -58781
2100 -58781 -69956 -12836 57564 70637 13625 -57852 -70760 -13926 56997 70625 14547 -56206
2112 -56206 -70673 -15346 55833 71056 14513 -55083 -69997 -15996 54453 71047 16151 -53573
2124 -53573 -70415 -15393 54170 69773 16289 -53592 -69956 -17994 53313 70179 17572 -52035
2136 -52035 -70528 -18494 51651 69828 19489 -51671 -70087 -19648 50595 69890 20580 -49510
2148 -49510 -70644 -20556 49700 69742 20685 -48142 -69780 -20901 48007 68944 21072 -47382
2160 -47382 -69340 -22170 47339 68846 22162 -45660 -69316 -22654 45804 68745 23261 -45222
2172 -45222 -68592 -23975 45149 68910 23924 -43671 -68468 -24881 43687 67793 25105 -43362
2184 -43362 -67819 -25330 42736 68567 26061 -42557 -67845 -26850 42025 67208 27042 -40615
2196 -40615 -67495 -27108 39904 67163 26879 -38810 -66905 -27832 39109 66189 27916 -38252
2208 -38252 -66747 -27869 39349 67714 28949 -36288 -65950 -28779 36870 66543 29600 -36963
2220 -36963 -65668 -30487 36625 66102 30473 -35069 -65776 -30947 34611 65114 30287 -34387
2232 -34387 -64347 -30919 34235 65080 31209 -33420 -64769 -31220 33056 64809 32503 -32422
2244 -32422 -64983 -32614 32223 63635 32047 -31642 -63538 -33180 31417 63722 32921 -29244
2256 -29244 -63762 -33481 29601 63139 34192 -28859 -62672 -34525 27991 62911 34647 -28557
2268 -28557 -62616 -34143 27999 62739 35072 -27524 -61223 -35428 27111 61558 35022 -26799
2280 -26799 -62634 -36660 24811 62229 35875 -25962 -61097 -36980 25531 60619 36556 -24527
2292 -24527 -60471 -36322 24654 60537 36482 -23789 -60591 -37465 23145 59995 36631 -22645
2304 -22645 -60476 -36777 21350 59055 37317 -21442 -58945 -38265 21616 58657 39004 -20015
2316 -20015 -58288 -38251 20229 58667 38838 -19016 -58198 -39252 18907 58026 39162 -19501
2328 -19501 -56978 -38623 17974 56921 38946 -18258 -57138 -39293 17390 56722 40369 -17053
2340 -17053 -56721 -39776 15546 56483 40029 -16059 -56054 -41011 16073 55646 40516 -15236
2352 -15236 -55665 -40574 14431 55171 41014 -13971 -55105 -41243 13535 54259 40966 -12969
2364 -12969 -53876 -40901 12830 53841 40542 -12238 -53503 -41838 11483 53031 40966 -11929
2376 -11929 -52471 -41308 10996 52873 41184 -10296 -51849 -41148 9755 51537 41934 -9706
2388 -9706 -51604 -42287 8315 51619 42336 -9315 -51009 -42038 9384 50910 42120 -8058 -50457
2401 -50457 -42797 8057 50299 42503 -7655 -50722 -42308 6450 49775 42426 -6526 -49770 -42526
2414 -42526 5944 49367 43268 -6345 -49302 -44392 5160 48452 43460 -4367 -47542 -43316 5604
2427 5604 48128 43415 -3941 -46879 -43804 3321 47587 43254 -3700 -46924 -43472 3691 45438
2440 45438 43986 -2034 -45953 -44122 2683 45793 42734 -1452 -45484 -43958 2101 45599 44559
2453 44559 -1864 -45145 -44660 901 44862 44343 -925 -43828 -44711 -394 43125 43680 409
2466 409 -43318 -44774 -238 43127 44009 1179 -42998 -44231 -1430 42813 44484 2600 -42757
2479 -42757 -44039 -2742 41868 44344 2405 -41805 -43830 -2746 40458 44316 3052 -41109 -44673
2492 -44673 -3788 40713 44147 3603 -40125 -44229 -3464 39991 44724 4541 -40369 -44299 -4516
2505 -4516 39149 43884 5124 -38735 -43602 -5073 39355 44462 5311 -37539 -43764 -6449 37876
2518 37876 43303 5817 -37526 -43718 -6466 37463 43941 7284 -36612 -43763 -7011 36429 43952
2531 43952 7460 -36428 -44116 -8361 35779 44220 8388 -35432 -43204 -8541 35785 44212 8671
2544 8671 -34634 -43919 -9249 33871 43804 9145 -34877 -43854 -9883 33655 43348 10192 -32766
2557 -32766 -43419 -9986 33211 43494 9875 -33141 -43659 -10176 33006 43108 11721 -32198
2569 -32198 -42985 -11519 31459 43775 11580 -32310 -43227 -12298 30977 43399 11804 -31663
2581 -31663 -44341 -11778 31252 42265 13520 -30077 -43417 -13861 30259 43115 13382 -29849
2593 -29849 -42993 -13793 29296 42832 13363 -28179 -42205 -14129 29314 43082 14313 -28717
2605 -28717 -42962 -13793 27728 42442 14053 -28060 -41803 -14995 28026 42085 14975 -26684
2617 -26684 -42789 -15473 26302 42306 15617 -25111 -41739 -16241 25512 42328 16914 -26144
2629 -26144 -41659 -15930 24953 41369 16699 -25059 -40820 -16462 24351 41459 17756 -24081
2641 -24081 -41785 -17897 23859 41219 16528 -24064 -40983 -17664 24007 41305 18465 -24375
2653 -24375 -40794 -18407 23264 40951 18784 -23032 -41116 -18585 22554 40990 18002 -22301
2665 -22301 -40378 -18895 20424 41262 18806 -21103 -40682 -19467 21640 41000 19007 -20418
2677 -20418 -39546 -19371 19815 39709 20129 -19407 -40227 -20066 20168 39500 20106 -19645
2689 -19645 -39697 -20435 18582 39541 20736 -19927 -39444 -21787 18341 39357 20356 -17448
2701 -17448 -39008 -20153 17758 39069 20349 -18129 -38264 -21831 16688 38465 20717 -17141
2713 -17141 -38908 -22524 16882 38332 22186 -16328 -38549 -22480 16123 38537 22608 -14604
2725 -14604 -37901 -21914 15335 38385 22218 -15062 -37443 -23061 15126 38138 22005 -15526
2737 -15526 -37403 -23038 14527 37477 22807 -13290 -37432 -23509 13865 37195 22822 -13467
2749 -13467 -36967 -23312 13087 36976 23429 -12267 -37464 -23580 13535 35996 24085 -13009
2761 -13009 -36635 -24495 12835 35588 24510 -11564 -36002 -24349 11541 35527 24799 -11512
2773 -11512 -35655 -24433 11744 35453 25049 -11997 -34933 -24350 10746 35182 24444 -10011
2785 -10011 -35125 -25357 9683 34480 24784 -9434 -34401 -25214 9406 34756 24909 -9293 -34321
2798 -34321 -25636 9053 33947 25124 -7960 -33792 -24682 8311 33326 25185 -7143 -33612 -26332
2811 -26332 7551 32328 25980 -7020 -33138 -25487 7631 33173 26129 -6951 -32165 -25948 6822
2824 6822 32530 25964 -6483 -32178 -25021 6448 31073 26544 -6079 -31810 -26113 5517 32005
2837 32005 25724 -5298 -31429 -26657 4953 31335 26491 -5245 -31733 -26785 4658 30329 25348
2850 25348 -5059 -30509 -26114 4024 30655 26630 -4066 -31196 -26443 2843 31263 26674 -3573
2863 -3573 -30482 -26827 3389 30253 27144 -2279 -30028 -26856 1916 29885 26663 -2477 -28503
2876 -28503 -26636 2584 28139 26799 -2084 -29272 -27352 2021 28681 27411 -1497 -28336 -26904
2889 -26904 1610 28776 26513 -1451 -27433 -27299 771 28468 27725 -1785 -28080 -27875 744
2902 744 27260 27673 -468 -27771 -27438 667 27804 27626 372 -26648 -27476 -801 27273 26810
2916 26810 187 -26780 -27448 -1532 26956 27113 1520 -26625 -27213 -2150 25661 27245 1133
2929 1133 -26016 -27316 -1818 26036 27845 1468 -25197 -26409 -2163 25193 27716 2129 -24887
2942 -24887 -27988 -2363 24156 27749 2352 -24667 -27821 -2650 24258 27013 3731 -23976 -27545
2955 -27545 -3468 24446 27251 3140 -24098 -27653 -3578 23167 27154 4673 -23966 -27809 -3380
2968 -3380 22837 26802 4370 -22918 -26880 -4454 22355 27021 4930 -22783 -26636 -5572 22637
2981 22637 27514 4019 -21509 -26886 -5625 22241 27156 5868 -21777 -28014 -6458 21210 26581
2994 26581 5498 -20647 -27956 -4977 20819 27255 6490 -20910 -26238 -7141 20673 26756 6762
3007 6762 -20460 -27455 -5995 19692 26930 7533 -20344 -27088 -7415 20055 26752 5997 -19982
3020 -19982 -26701 -6876 19799 27361 7407 -18032 -27006 -8358 18543 27040 8276 -19353 -26213
3033 -26213 -8476 18566 26914 8091 -18117 -26237 -7961 19196 26642 8426 -18461 -26679 -9213
3046 -9213 17825 26814 9002 -18023 -25118 -8863 17596 26229 8629 -17085 -26545 -9292 17483
3059 17483 25612 9310 -16343 -26765 -9316 16330 26447 8691 -16643 -25904 -9192 15595
3071 15595 25796 9716 -15965 -25873 -9554 15743 25886 10683 -14974 -25580 -10809 15272
3083 15272 25752 10288 -15417 -26307 -11163 16287 25534 10253 -14593 -25193 -11080 14376
3095 14376 24905 10807 -14582 -25332 -11030 15370 24831 10241 -14414 -25355 -10706 13602
3107 13602 25050 11642 -13925 -24493 -11421 13671 24752 10922 -13409 -23939 -11397 12979
3119 12979 24396 11288 -13337 -24010 -11500 12119 24633 11529 -12268 -24103 -12154 12468
3131 12468 23913 12394 -12066 -24750 -11246 12270 24171 11855 -11599 -24112 -12125 11612
3143 11612 23735 12073 -11385 -23978 -12361 10540 23314 13025 -10446 -22644 -13292 11134
3155 11134 23372 13140 -10143 -23908 -12835 10915 24005 13666 -9722 -22898 -13656 9978
3167 9978 23067 12768 -9950 -23196 -13090 9994 23388 13927 -8696 -23140 -13981 9777
3179 9777 22722 14420 -8872 -22503 -13957 9296 23756 13284 -7718 -22911 -13311 9089 21615
3192 21615 13168 -8689 -22499 -13767 8321 22129 14176 -8052 -22501 -13820 7559 21939 13487
3205 13487 -8730 -21942 -14108 6937 21807 13843 -6790 -22269 -13753 6960 21249 14115 -7370
3218 -7370 -21794 -14089 7577 22206 14835 -6589 -21270 -15009 7320 21169 14329 -6163 -21128
3231 -21128 -14889 6204 21672 15105 -6040 -20797 -15202 5903 20410 15834 -6201 -20837 -14539
3244 -14539 6241 20169 15026 -5434 -20940 -15702 5168 20640 15874 -5722 -20519 -16103 5343
3257 5343 20240 16385 -4610 -20400 -15984 5065 21363 15171 -4471 -20304 -14783 5493 19709
3270 19709 16667 -4282 -20105 -14716 4730 19043 14857 -4205 -19513 -16012 3545 20309 15263
3283 15263 -3155 -20237 -15993 3640 18548 16311 -2497 -18817 -16111 3633 18571 16005 -2891
3296 -2891 -18757 -15904 2042 19502 15659 -2931 -19372 -15610 3063 18546 16192 -2404 -18848
3309 -18848 -15249 3072 18676 16141 -2398 -18792 -16804 1494 18000 17473 -1071 -18137 -16483
3322 -16483 1979 17659 16006 -1750 -18939 -16963 1901 17449 16298 -1012 -17279 -16734 369
3335 369 17753 16688 -1207 -16986 -15677 613 16979 16513 714 -16210 -15283 431 17710
3348 17710 16425 -1280 -16745 -16142 1033 16758 15189 -714 -17066 -15637 292 15868 16490
3361 16490 -58 -15953 -17248 522 16347 16953 288 -15638 -16775 -153 16077 15921 108
3374 108 -16181 -16995 -320 15018 16270 529 -16092 -16338 -569 15743 16060 1074 -15173 -15981
3388 -15981 -1616 15909 16458 1515 -15834 -15633 -780 15171 16304 569 -14143 -16787 -1445
3401 -1445 15234 16724 2453 -15575 -16896 -2256 14422 15946 1132 -14920 -15349 -1814 14505
3414 14505 15686 1808 -14990 -16368 -1545 14651 15549 2332 -14073 -16279 -2285 13180 17503
3427 17503 2720 -13561 -15332 -3154 13423 16296 2756 -12533 -15702 -4060 13013 16470 2368
3440 2368 -13002 -16065 -3414 12585 16524 2858 -13308 -15690 -3141 12926 16395 2941 -12652
3453 -12652 -15824 -3265 12186 15073 3678 -12932 -16310 -3810 12277 15442 3449 -11645 -15767
3466 -15767 -3951 11568 15558 3056 -12293 -16005 -4051 11541 15902 4002 -11457 -15323 -4494
3479 -4494 12306 15463 4815 -11549 -14952 -4507 9972 15134 4510 -11078 -16424 -4599 11083
3492 11083 15461 4941 -10845 -15259 -4541 10378 16224 4708 -11117 -15581 -4071 9633 15672
3505 15672 5139 -10251 -15615 -5436 10501 15151 4803 -10287 -16450 -5438 10386 15885 3766
3518 3766 -10682 -14954 -5975 9256 14890 5615 -9989 -15871 -5105 9831 14939 6227 -9303
3531 -9303 -15326 -5469 10376 15952 5084 -10371 -15430 -5724 9010 15364 5806 -10168 -14215 -5680
3545 -5680 9518 15470 4869 -9509 -15139 -5799 8630 14598 5908 -8100 -14517 -6101 8128
3558 8128 14347 5803 -8395 -14111 -6462 9561 14786 6356 -8373 -14320 -7237 8758 14173 6272
3572 6272 -7301 -15097 -6224 7682 14655 6956 -7865 -13790 -6077 8413 15028 6804 -8236 -14339
3586 -14339 -6577 8228 14441 7532 -7277 -14593 -7258 7791 14418 7090 -7099 -14251 -6743 7582
3600 7582 14418 6188 -6720 -14862 -6328 7386 13997 7173 -6393 -14113 -6278 7851 13491 7029
3614 7029 -7122 -14306 -6880 6942 13990 7095 -7016 -14650 -7653 5586 14315 7634 -6523 -14463
3628 -14463 -7020 6312 14249 7680 -6176 -13388 -7398 5969 14025 8246 -7273 -13615 -8017 6166
3642 6166 13397 6974 -5716 -14444 -7135 6360 13370 7630 -5703 -13989 -7492 5349 13203 7718
3656 7718 -6248 -12967 -7492 4758 12565 8184 -4821 -13574 -7746 4221 12974 8341 -4166 -13049
3670 -13049 -8719 5125 12996 7653 -5305 -12579 -7220 4642 12094 8104 -4883 -11877 -8031 4522
3684 4522 13038 7606 -4513 -12396 -7001 4376 12508 8438 -4620 -12014 -7941 4649 12163 8763
3698 8763 -4762 -12635 -8364 3652 12513 8256 -3628 -12664 -8939 3899 12802 7714 -4437 -11857
3712 -11857 -7683 3407 12596 8421 -3432 -12717 -8458 3530 12949 8434 -4032 -12077 -9193 3854
3726 3854 12681 8405 -4599 -11655 -8230 3655 10920 7925 -3390 -11930 -8348 3038 12297 8334
3740 8334 -3877 -11712 -8540 3628 11596 8270 -2983 -11647 -9216 3609 12310 8418 -1987 -11476
3754 -11476 -9050 2384 11818 8457 -2414 -11813 -9020 2798 10885 8887 -2754 -11210 -8287 2890
3768 2890 10557 9398 -2948 -10827 -8499 2198 10593 8215 -2725 -10716 -8539 2497 11816 8993
3782 8993 -2516 -11256 -8519 1197 10918 8936 -2287 -11045 -8997 1372 10683 9527 -2382 -10719
3796 -10719 -9096 1959 10509 9006 -1523 -10397 -8116 51 10158 9104 -275 -11280 -8840 1252
3810 1252 10069 8582 -1671 -10965 -7763 1801 10735 9097 -1562 -9989 -8906 1601 10329 8348
3824 8348 -1084 -9297 -8301 1760 10923 10392 -828 -10254 -8436 1398 10399 8865 -1527 -10089 -9038
3839 -9038 717 10358 8813 -1376 -10158 -8981 377 9801 9469 -1265 -9693 -8593 400 10435
3853 10435 9550 -531 -9092 -8734 922 9907 8729 221 -8788 -8788 -317 8973 9508 437 -8532 -9829
3869 -9829 161 9278 9352 587 -9836 -8563 76 8838 9155 -356 -9763 -9409 -11 7329 9288 -135
3885 -135 -9291 -9599 -767 9099 8383 91 -8848 -9875 -696 8865 9176 238 -8255 -8363 -237 8711
3901 8711 8424 393 -8828 -8809 -636 8118 9647 400 -7838 -9025 -372 7748 9682 -322 -9027
3916 -9027 -9750 -443 8394 8894 1209 -8844 -9322 -1021 8178 8608 1583 -7809 -8612 -295 8426 8844
3932 8844 1028 -8774 -8368 -193 8745 9754 887 -7603 -9344 -1606 7859 8456 1787 -8768 -8540
3947 -8540 -805 8039 8437 1219 -6990 -8593 -1259 7272 9082 1830 -7261 -8988 -861 7570 9112
3962 9112 1773 -7327 -8623 -385 7081 8899 950 -7138 -9494 -2121 7770 8939 2463 -7236 -9344
3977 -9344 -1766 6704 10135 2018 -7327 -9699 -2044 6898 9627 2728 -6915 -9172 -1857 7581 8807
3992 8807 2800 -7664 -9539 -1134 6998 8959 1792 -7450 -8538 -2553 6433 9037 1228 -7238 -8706
4007 -8706 -1916 6681 9952 2030 -6396 -9479 -2212 6352 9175 2410 -5876 -9106 -1437 6439 8622
4022 8622 2043 -6126 -9618 -3018 6534 9007 1987 -6249 -8425 -2856 6265 8379 2115 -5785 -8704
4037 -8704 -3289 6926 8023 2647 -5135 -8730 -2657 6447 8413 2110 -6383 -9604 -2473 5980 8677
4052 8677 3453 -4974 -8844 -3510 6049 8914 2945 -5386 -8953 -2996 5349 8532 2563 -5808 -8040
4067 -8040 -2472 4077 8378 3572 -5515 -9268 -2729 5550 7426 3262 -5561 -8561 -2955 5826 8273
4082 8273 2627 -5339 -8449 -3490 5040 8524 3616 -4993 -8250 -2538 5664 8683 3869 -4950 -8684
4097 -8684 -3709 5111 8488 3957 -5049 -7831 -3271 5576 8342 3276 -4794 -8365 -3698 5021 8493
4112 8493 3791 -4878 -8504 -3631 3795 8134 2938 -3631 -8312 -3324 4057 8038 4029 -4530 -7241
4127 -7241 -2634 4542 7660 3559 -4245 -7387 -3957 5664 8248 3664 -5036 -8490 -3833 3406 7845
4142 7845 5069 -3326 -8953 -4928 3850 8537 4663 -3736 -8151 -4019 4007 8130 3699 -4187 -8142
4157 -8142 -3376 4619 8856 4360 -3944 -7728 -3828 4153 7743 4283 -3782 -8251 -4920 2742 8006
4172 8006 4930 -3850 -7763 -4148 4564 7820 4217 -3201 -7580 -4661 3247 7960 3776 -3209 -8742
4187 -8742 -4649 2736 8560 4636 -3032 -8622 -4572 4141 7525 4764 -3787 -8311 -4621 3967 7445
4202 7445 4065 -3393 -7811 -5091 3259 7758 4104 -3803 -7487 -4060 3687 7697 5025 -4140 -7540
4217 -7540 -3714 3061 7358 4338 -3206 -8135 -4806 2545 7932 3936 -3708 -7776 -4336 3026 7152
4232 7152 4946 -2446 -7919 -3993 2293 7447 5316 -3701 -6545 -4646 3179 7215 3523 -2795 -6609
4247 -6609 -4584 2583 7198 4253 -3325 -7459 -4328 2532 7620 5552 -2467 -7340 -3739 3485 7964
4262 7964 5001 -2639 -7781 -5879 3094 7113 4451 -2720 -6218 -4026 2656 7049 4649 -2576 -7342
4277 -7342 -5057 2002 6679 5275 -1992 -7593 -4271 2252 6925 5103 -1279 -7179 -5459 1903 7242
4292 7242 4768 -2479 -6438 -5245 2297 7658 4692 -1331 -7131 -4925 1753 6500 5485 -1711 -6775
4307 -6775 -4273 1857 7941 5247 -1656 -6833 -5497 2421 6498 5306 -1740 -6654 -5062 1347 5722
4322 5722 5424 -2275 -5993 -4501 1250 6968 4980 -1431 -7199 -5952 1368 6648 4398 -1560 -6863
4337 -6863 -5054 1529 6380 5166 -1422 -6518 -4769 1791 6832 5143 -1670 -6491 -5375 1120 6266
4352 6266 5998 -1482 -6665 -4834 1531 7506 5652 -1838 -5558 -5420 1551 6225 5478 -1264 -5793 -5026
4368 -5026 1656 6101 5190 -606 -6491 -5234 1214 6396 5600 -970 -6001 -4564 829 6854 5375
4383 5375 -1364 -5774 -4721 397 6593 5721 -339 -5880 -5677 1164 6744 5593 -885 -6147 -6232 587
4399 587 6879 4878 -676 -6527 -6263 1373 5732 5147 -522 -7187 -5128 956 6607 5191 -65 -5439
4415 -5439 -4740 826 6246 5241 -997 -5910 -5888 -76 5446 6422 -702 -5148 -5245 1425 6104 5562 123
4432 123 -6536 -4864 -52 5531 4955 -300 -5959 -4342 48 5172 6121 192 -6249 -5510 731 7076
4448 7076 4729 -519 -6083 -5675 -262 5880 5908 241 -5076 -6080 163 5021 6262 -231 -5617 -5425
4464 -5425 98 5244 4813 -568 -5541 -5715 -746 5153 5203 -7 -5161 -6756 -248 5377 5442 -489
4480 -489 -4892 -5352 -486 5428 5936 69 -4864 -5667 -157 4832 5906 1017 -5501 -5338 -500 5677
4496 5677 6143 348 -4821 -5092 -274 4946 5665 778 -5027 -5623 -450 5467 6289 293 -4996 -6663
4512 -6663 -100 4448 5035 1220 -4396 -5098 -1124 5119 5601 539 -4998 -6420 -1269 4786 5829 974
4528 974 -5094 -4931 -1024 5327 6283 1026 -4946 -5000 -790 4122 5547 869 -4560 -6141 -563 4897
4544 4897 6829 1969 -5334 -5211 -1527 5133 5748 2271 -5237 -5513 -539 4834 5847 1910 -4823 -6179
4560 -6179 -1190 3996 5622 1490 -4758 -5561 -595 4332 6017 2294 -3581 -5367 -867 4571 5230
4575 5230 1313 -4713 -6172 -1103 4255 5507 1199 -4180 -5479 -1635 3966 4906 560 -3908 -5783
4590 -5783 -1389 4089 5564 2069 -3734 -5982 -1385 4593 6731 1752 -4846 -6958 -1375 4479 5198
4605 5198 1413 -4114 -5991 -2255 4555 4823 2225 -4452 -4860 -1619 4843 6208 1064 -4380 -4904 -1545
4621 -1545 3630 5561 1812 -4099 -6376 -888 4243 5842 1811 -4069 -5266 -1427 3082 5559 2076
4636 2076 -3555 -6202 -1541 4525 6049 1998 -3441 -6203 -1708 3473 5271 1828 -3461 -6021 -2201
4651 -2201 3798 5788 2287 -4391 -5551 -1576 3662 5329 1767 -4168 -5892 -2118 3740 5683 2278
4666 2278 -4027 -5784 -2037 3498 5540 2465 -3582 -5444 -2584 3293 6637 3517 -3264 -5326 -2586
4681 -2586 2460 6637 2711 -3703 -4994 -2085 3777 6496 2500 -2389 -5567 -2657 3268 5281 2764
4696 2764 -3255 -5314 -1775 2981 6268 2642 -2967 -5226 -2499 3728 5846 2362 -3529 -4869 -1895
4711 -1895 3374 7014 3352 -3538 -6520 -2611 3266 5717 1897 -3336 -6071 -2965 2652 5521 1908
4726 1908 -2773 -5752 -3051 2105 6211 1962 -2838 -6179 -2390 2657 5130 2560 -3245 -5751 -2728
4741 -2728 2149 4859 3004 -2661 -5721 -3101 2950 5751 2893 -2959 -5801 -2013 3134 5645 3674
4756 3674 -2753 -5328 -2436 3408 5452 2824 -1647 -5795 -2570 2781 4912 3727 -2761 -5421 -1860
4771 -1860 3248 4995 3188 -2375 -5462 -3137 1793 5768 3586 -1717 -5586 -2550 1562 5327 2579
4786 2579 -2213 -5625 -3278 2083 5007 3838 -2101 -5364 -3045 2370 4629 2556 -3360 -4336 -3093
4801 -3093 2855 5198 2771 -2918 -5325 -3019 2418 5245 3087 -2220 -5627 -3371 2572 5008 3183
4816 3183 -2602 -4279 -4056 2274 5050 3096 -2001 -4987 -2726 2428 4958 2982 -1354 -5593 -3257
4831 -3257 2588 5179 2734 -2093 -5195 -3544 1366 5590 3968 -1959 -5524 -3321 1333 4810 3959
4846 3959 -1889 -6117 -3297 1782 4451 3655 -2238 -5273 -3016 2220 5184 3166 -796 -5387 -3612
4861 -3612 1150 4839 2881 -1775 -4202 -3457 1157 5422 3832 -1585 -4311 -3148 1341 5375 2551
4876 2551 -2231 -5142 -3247 1499 5425 3345 -1933 -5039 -3581 1536 4565 3244 -1019 -5379 -2663
4891 -2663 1122 4511 3522 -1941 -4481 -4038 1096 4831 2598 -312 -4219 -3903 479 5613 4346 -1623
4907 -1623 -3967 -3328 2009 5086 3842 -1651 -5097 -3587 1694 5688 3856 -1214 -4629 -3720 416
4922 416 4696 3777 -1102 -4719 -3922 790 4323 4525 -676 -4362 -4029 1243 5398 4012 -453 -4809
4938 -4809 -4056 636 4931 3991 -146 -4588 -3738 1172 4969 3665 -622 -4649 -3581 1221 4797 4172
4954 4172 -319 -5290 -4865 994 3357 4723 -693 -4036 -3724 1030 4718 3541 -541 -4674 -3928 76
4970 76 4249 4957 -673 -4586 -4038 446 4866 3616 -522 -4455 -3475 676 4577 3670 -599 -5119
4986 -5119 -4237 1360 5278 4040 -85 -4564 -3725 -63 3674 3395 -601 -4580 -3839 515 4554 3054
5002 3054 491 -4713 -4372 -183 3960 3924 -586 -4593 -4139 1300 4308 4173 43 -3850 -4239 1016
5018 1016 3589 3680 -726 -4512 -4181 220 4817 4206 -248 -4897 -4471 -301 4032 4496 -730 -4274
5034 -4274 -4579 139 4934 4382 1398 -4505 -2947 164 4052 4810 60 -4054 -4798 -253 3938 4674
5050 4674 -463 -3659 -4130 87 4256 4007 -268 -2994 -4675 -414 3315 4805 -221 -2820 -4723
5065 -4723 -633 3850 3962 -193 -4488 -4624 -155 4928 4056 358 -4148 -3608 -274 3165 3585 901
5081 901 -3597 -3976 -763 4195 4317 -169 -3419 -4041 -465 3776 4762 1511 -3604 -4226 -1060 3441
5097 3441 4568 728 -3928 -4099 766 4299 4376 340 -3987 -4432 -675 3404 4020 1113 -3055 -3859
5113 -3859 -106 3949 5430 996 -4329 -4309 -126 3945 3949 906 -3310 -5209 -140 4016 4319 485
5129 485 -4477 -4183 -464 3334 4148 1964 -3602 -4413 -812 3525 4622 819 -3881 -4571 -684 4202
5145 4202 4073 1082 -3395 -4806 -797 3450 3790 1867 -2899 -4807 -1456 3638 4594 388 -3292 -3895
5161 -3895 -486 3757 4893 842 -3122 -4375 -1196 2778 4924 754 -2305 -5123 -1427 3669 3515
5176 3515 1294 -3170 -4182 -1530 3322 5661 250 -3203 -4326 -1778 3292 3913 1601 -3677 -4469
5191 -4469 -1373 3912 4061 861 -3725 -5240 -701 3728 3243 1782 -3481 -3721 -888 3053 3515 710
5207 710 -3324 -4628 -1498 3033 4037 1030 -3533 -4900 -1809 3209 4520 2729 -3511 -4854 -1977
5222 -1977 2990 3626 2180 -2997 -3565 -2426 2759 4224 1848 -2694 -4234 -1683 2819 4034 1815
5237 1815 -3056 -4471 -1405 2254 5607 1082 -2598 -4116 -1306 1939 4240 1161 -2948 -4271 -2489
5252 -2489 2664 5047 1470 -2914 -4907 -2435 3035 4264 1566 -2379 -3727 -1693 3022 4819 2071
5267 2071 -3659 -4787 -1623 2104 4384 1632 -2346 -3719 -1204 2945 5269 1914 -2940 -3435 -1557
5282 -1557 1985 4915 1814 -1932 -4152 -2443 2318 4633 1638 -2180 -4331 -1968 2217 4240 2999
5297 2999 -2641 -4423 -1294 2596 4318 2215 -2388 -4312 -1840 2350 4749 2460 -1341 -4365 -1923
5312 -1923 2663 4145 2216 -1547 -4901 -1759 2493 3216 2331 -1461 -4533 -2536 1991 4793 1663
5327 1663 -2100 -3947 -2093 1728 4529 1381 -2150 -4165 -1903 1997 3637 2251 -2461 -4905 -2443
5342 -2443 1953 5133 1854 -2496 -3645 -2342 1823 4642 2522 -1718 -3471 -2709 2420 5026 2757
5357 2757 -2114 -3480 -3050 2185 3779 2226 -1916 -4126 -2584 1131 4066 3098 -1159 -3848 -3030 1586
5373 1586 4777 2620 -1823 -4578 -2552 2847 4090 3160 -923 -4061 -2482 2188 4488 2096 -1013
5388 -1013 -4928 -2419 1346 3919 2236 -1862 -4658 -3223 703 3567 2951 -1674 -3377 -2607 1474
$$ [...]
##END NTUPLES=NMR FID
##END=
