##TITLE=1H_LR-715-M1
 CDCl3, 8 sc, 
 22.10.2020
##JCAMPDX= 6.0         $$ Bruker NMR JCAMP-DX V2.0
##DATA TYPE= NMR FID
##DATA CLASS= NTUPLES
##ORIGIN= UXNMR, Bruker Analytische Messtechnik GmbH
##OWNER= root
$$ XWIN-NMR		Version 3.5
$$ Thu Oct 22 10:52:57 2020 Russian Standard Time (UT+4h)  she@DPX200
##.OBSERVE FREQUENCY= 200.1315066352
##.OBSERVE NUCLEUS= ^1H
##.DELAY= (6, 6)
##.ACQUISITION MODE= SIMULTANEOUS
##.ACQUISITION SCHEME= undefined
##.AVERAGES= 8
##.DIGITISER RES= 18
##SPECTROMETER/DATA SYSTEM= spect
##.PULSE SEQUENCE= zg30
##.SOLVENT NAME= CDCl3
##.SHIFT REFERENCE= (INTERNAL, CDCl3, 0, 15.7039)
##AUDIT TRAIL= $$ (NUMBER, WHEN, WHO, WHERE, WHAT)
$$ ##TITLE= Audit trail, XWIN-NMR		Version 3.5
$$ ##JCAMPDX= 5.01
$$ ##ORIGIN= Bruker BioSpin GmbH
$$ ##OWNER= she
$$ F:/spectra/data/she/nmr/H-F/1/audita.txt
$$ ##AUDIT TRAIL=  $$ (NUMBER, WHEN, WHO, WHERE, WHAT)
(   1,<2020-10-22 10:51:45.96 +0400>,<she>,<DPX200>,
      <created by zg, POWCHK disabled, PULCHK disabled
       configuration hash MD5:
       00 E9 B6 7A A2 85 ED C7 34 08 36 98 17 FE 4E 26
       data hash MD5: 16K
       76 1B 9C B0 68 91 DE 40 5D 92 2C D0 69 3A CF 71>)
$$ ##END=
$$ 
$$ hash MD5
$$ 38 34 B1 5E 7C AB CB 75 A0 5F B2 86 1F BF F1 4D
##$RELAX= 
##$RELAX= 
##$RELAX= 
##$RELAX= 
##$RELAX= 
##$RELAX= 
$$ Bruker specific parameters
$$ --------------------------
##$DU= <F:/spectra>
##$EXPNO= 1
##$NAME= <H-F>
##$PROCNO= 1
##$TYPE= <nmr>
##$USER= <she>
##$AMP= (0..31)
100 100 100 100 100 100 100 100 100 100 100 100 100 100 100 100 100 100 
100 100 100 100 100 100 100 100 100 100 100 100 100 100 
##$AQSEQ= 0
##$AQ_mod= 1
##$AUNM= <au_zg>
##$AUTOPOS= <>
##$BF1= 200.13
##$BF2= 200.13
##$BF3= 200.13
##$BF4= 200.13
##$BF5= 200.13
##$BF6= 200.13
##$BF7= 200.13
##$BF8= 200.13
##$BYTORDA= 1
##$CFDGTYP= 0
##$CFRGTYP= 5
##$CHEMSTR= <none>
##$CNST= (0..31)
1 1 145 1 1 1 1 1 1 1 1 1 1 1 1 1 1 1 1 1 1 1 1 1 1 1 1 1 1 1 1 1 
##$CPDPRG= <>
##$CPDPRG1= <>
##$CPDPRG2= <>
##$CPDPRG3= <>
##$CPDPRG4= <mlev>
##$CPDPRG5= <mlev>
##$CPDPRG6= <mlev>
##$CPDPRG7= <mlev>
##$CPDPRG8= <mlev>
##$CPDPRGB= <>
##$CPDPRGT= <>
##$D= (0..31)
0 1.2 0 0 0 0 0 0 0 0.06 0 0.03 0 0 0 0 0.0002 0 0 0 0 0 0 0 0 0 0 0 0 
0 0 0 
##$DATE= 1603349505
##$DBL= (0..7)
120 120 120 120 120 120 120 120 
##$DBP= (0..7)
150 150 150 150 150 150 150 150 
##$DBP07= 0
##$DBPNAM0= <>
##$DBPNAM1= <>
##$DBPNAM2= <>
##$DBPNAM3= <>
##$DBPNAM4= <>
##$DBPNAM5= <>
##$DBPNAM6= <>
##$DBPNAM7= <>
##$DBPOAL= (0..7)
0.5 0.5 0.5 0.5 0.5 0.5 0.5 0.5 
##$DBPOFFS= (0..7)
0 0 0 0 0 0 0 0 
##$DE= 6
##$DECBNUC= <off>
##$DECIM= 32
##$DECNUC= <off>
##$DECSTAT= 4
##$DIGMOD= 1
##$DIGTYP= 9
##$DL= (0..7)
0 120 120 120 120 120 120 120 
##$DP= (0..7)
150 150 150 150 150 150 150 150 
##$DP07= 0
##$DPNAME0= <>
##$DPNAME1= <>
##$DPNAME2= <>
##$DPNAME3= <>
##$DPNAME4= <>
##$DPNAME5= <>
##$DPNAME6= <>
##$DPNAME7= <>
##$DPOAL= (0..7)
0.5 0.5 0.5 0.5 0.5 0.5 0.5 0.5 
##$DPOFFS= (0..7)
0 0 0 0 0 0 0 0 
##$DQDMODE= 0
##$DR= 18
##$DS= 0
##$DSLIST= <SSSSSSSSSSSSSSS>
$$ [...]
##$SUBNAM2= <"">
##$SUBNAM3= <"">
##$SUBNAM4= <"">
##$SUBNAM5= <"">
##$SUBNAM6= <"">
##$SUBNAM7= <"">
##$SUBNAM8= <"">
##$SUBNAM9= <"">
##$SW= 16.880792210976
##$SWIBOX= (0..15)
0 0 2 0 0 0 0 0 0 0 0 0 0 0 0 0 
##$SW_h= 3378.37837837838
##$TD= 16384
##$TD0= 1
##$TE= 0
##$TE2= 300
##$TE3= 300
##$TEG= 300
##$TL= (0..7)
0 120 120 120 120 120 120 120 
##$TP= (0..7)
150 150 150 150 150 150 150 150 
##$TP07= 0
##$TPNAME0= <>
##$TPNAME1= <>
##$TPNAME2= <>
##$TPNAME3= <>
##$TPNAME4= <>
##$TPNAME5= <>
##$TPNAME6= <>
##$TPNAME7= <>
##$TPOAL= (0..7)
0.5 0.5 0.5 0.5 0.5 0.5 0.5 0.5 
##$TPOFFS= (0..7)
0 0 0 0 0 0 0 0 
##$TUNHIN= 0
##$TUNHOUT= 0
##$TUNXOUT= 0
##$USERA1= <user>
##$USERA2= <user>
##$USERA3= <user>
##$USERA4= <user>
##$USERA5= <user>
##$V9= 5
##$VALIST= <valist>
##$VCLIST= <CCCCCCCCCCCCCCC>
##$VD= 0
##$VDLIST= <DDDDDDDDDDDDDDD>
##$VPLIST= <PPPPPPPPPPPPPPP>
##$VTLIST= <TTTTTTTTTTTTTTT>
##$WBST= 1024
##$WBSW= 4
##$XGAIN= (0..3)
0 0 0 0 
##$XL= 0
##$YL= 0
##$YMAX_a= 343829
##$YMIN_a= -240387
##$ZGOPTNS= <>
##$ZL1= 120
##$ZL2= 120
##$ZL3= 120
##$ZL4= 120
##$ABSF1= 10
##$ABSF2= 0
##$ABSG= 5
##$ABSL= 3
##$ALPHA= 0
##$AQORDER= 0
##$ASSFAC= 0
##$ASSFACI= 0
##$ASSFACX= 0
##$ASSWID= 0
##$AUNMP= <proc_1d>
##$AZFE= 0.1
##$AZFW= 0.1
##$BCFW= 1
##$BC_mod= 2
##$BYTORDP= 1
##$COROFFS= 0
##$CY= 11.3945322036743
##$DATMOD= 1
##$DC= 2
##$DFILT= <>
##$DTYPP= 0
##$F1P= 16.9975609425685
##$F2P= -3.02152046262296
##$FCOR= 0.5
##$FTSIZE= 0
##$FT_mod= 4
##$GAMMA= 1
##$GB= 0.15
##$INTBC= 1
##$INTSCL= 1
##$ISEN= 128
##$LB= 0.24
##$LEV0= 0
##$LPBIN= 0
##$MAXI= 10000
##$MC2= 0
##$MEAN= 0
##$ME_mod= 0
##$MI= 1.114404
##$NCOEF= 0
##$NC_proc= 0
##$NLEV= 6
##$NOISF1= 3.799351
##$NOISF2= 2.8
##$NSP= 1
##$NTH_PI= 0
##$NZP= 0
##$OFFSET= 15.70392
##$PC= 1
##$PHC0= -10691.34
##$PHC1= 15.60089
##$PH_mod= 1
##$PKNL= yes
##$PPARMOD= 0
##$PSCAL= 0
##$PSIGN= 0
##$REVERSE= no
##$SF= 200.130013532006
##$SI= 16384
##$SIGF1= 3
##$SIGF2= 2
##$SINO= 400
##$SIOLD= 16384
##$SREGLST= <1H.CDCl3>
##$SSB= 0
##$STSI= 0
##$STSR= 0
##$SW_p= 3612.71676300578
##$SYMM= 0
##$S_DEV= 0
##$TDeff= 0
##$TDoff= 0
##$TI= <>
##$TILT= no
##$TM1= 0
##$TM2= 0
##$TOPLEV= 0
##$USERP1= <user>
##$USERP2= <user>
##$USERP3= <user>
##$USERP4= <user>
##$USERP5= <user>
##$WDW= 1
##$XDIM= 8192
##$YMAX_p= 0
##$YMIN_p= 0
$$ End of Bruker specific parameters
$$ ---------------------------------
##NTUPLES= NMR FID
##VAR_NAME=  TIME,          FID/REAL,        FID/IMAG
##SYMBOL=    X,             R,               I
##VAR_TYPE=  INDEPENDENT,   DEPENDENT,       DEPENDENT
##VAR_FORM=  AFFN,          ASDF,            ASDF
##VAR_DIM=   8192,          8192,            8192
##UNITS=     SECONDS,       ARBITRARY UNITS, ARBITRARY UNITS
##FACTOR=    0.000296,      1,               1
##FIRST=     0,             0,               0
##LAST=      2.424536,      0,               0
##MIN=       0,             -240387,         0
##MAX=       2.424536,      343829,          0
$$ Real data points
##PAGE= N=1
##DATA TABLE= (X++(R..R)), XYDATA
$$ [...]
$$ plain form
2073 296 430 -773 255 1173 73 -735 169 -432 -1253 -156 444 -431 -953 -198 -1039 -1749 -535 168
2091 168 -1450 -1096 -111 -1646 -2259 354 -762 -1913 -168 -745 -2421 -812 102 -1832 -838 266 -1525
2108 -1525 -2039 -142 -910 -1655 517 94 -1549 -368 31 -1365 -275 436 -192 -137 26 -827 -532 319
2126 319 346 406 483 184 361 -212 -157 901 879 -81 752 733 -770 119 1440 -90 336 1591 -97 -680
2146 -680 1383 332 -610 1072 1426 -1346 125 1316 -1189 -239 2047 -31 -787 1297 -378 -1460
2162 -1460 997 913 -953 121 876 -1444 -490 1052 -346 -369 758 20 -687 213 0 -212 296 570
2180 570 -202 -284 -140 -115 221 287 647 440 -217 -38 507 3 466 1365 285 -275 737 377 -221 1203
2200 1203 1419 278 428 1104 -303 58 1458 827 -44 1300 1003 -645 492 1502 -118 287 1247
$$ packed form
2073B96J34j203J028R18j100q08R04o01q21J097O00q75n22P55q41p10J214P03
2091A68j618L54R85j535o13K613j116j151J745n77j676J609R14j934R94J104j791
2108a525n14J897p68p45K172m23j643J181L99j396J090P11o28N5J63q53K95Q51
2126C19K7O0P7k99J77n73N5J058k2r60Q33j9j503Q89J321j530M26J255j688n83
2146f80K063j051r42J682L54k772J471J191k505R50K286k078p56K084j675j082
2162a460K457q4j866J074P55k320R54J542j398k3J127p38p07R00k13k12N08K74
2180E70p72q2J44K5L36O6L60k07o57J79N45n04M63Q99j080n60J012l60n98J424
2200A203K16j141J50O76j407L61J400o31q71J344k97j648J137J010j620M05R60
$$ plain form
2217 1247 -381 -840 692 211 -576 467 838 -1177 -702 416 -637 -679 602 -173 -1033 -147 -422 -1417
2235 -1417 -392 271 -939 -1245 -453 -1161 -1514 -175 -224 -1276 -1068 -531 -1496 -1533 -275 -700 -1267 -684 -640
2254 -640 -1899 -1002 -95 -772 -877 -135 -742 -1105 -480 -134 -545 -366 573 -28 -550 -57 68 -232 341 931
2274 931 -275 -371 762 -22 -310 784 1073 -36 243 962 -71 41 1518 834 12 1169 802 -381
2292 -381 579 1549 236 322 1597 160 -510 1319 1122 -340 944 963 -574 225 1173 -330 76 1251
2310 1251 370 -1010 686 85 -1049 379 760 -483 -176 532 -842 -896 622 -35 -453 620 -329
2327 -329 -671 -289 13 -410 623 81 -262 -253 -163 -266 -31 131 12 520 -42 -683 669 275 -336 893
2347 893 929 -926 293 1285 -607 249 1856 -302 -510 1166 -213 -1023 1550 860 -1105 731 853
$$ packed form
2217A247j628m59J532m81p87J043L71k015M75J118j053m2J281p75q60Q86k75r95
2235a417J025O63j210l06P92p08l53J339m9j052K08N37r65l7J258m25n67N83M4
2254f40j259Q97R07o77j05P42o07l63O25L46m11J79R39o01n22M93J25l00N73N90
2274I31j206r6J133p84k88J094K89j109K79P19j033J12J477o84q22J157l67j183
2292c81R60R70j313Q6J275j437o70J829j97j462J284J9j537P99R48j503M06J175
2310A251q81j380J696o01j134J428L81j243L07P08j374n4J518o57m18J073r49
2327c29l42L82L02m23J033n42l43RR0j03K35J62j19N08n62o41J352l94o11J229
2347H93L6j855J219R92j892Q56J607k158k08J676j379q10K573o90j965J836J22
$$ plain form
2364 853 -1443 195 1567 -932 -190 1586 -861 -1086 1047 -382 -1308 980 381 -1438 -151 155
2380 155 -1448 -196 294 -974 -555 -363 -1174 -633 -315 -998 -44 -655 -1246 -580 -630 -1352 -560 10 -1293
2399 -1293 -750 129 -1691 -1122 643 -842 -1299 648 -694 -1736 677 130 -1245 801 598 -1174
2415 -1174 -67 934 -694 -59 1686 -96 -453 847 242 -280 1388 1030 -33 890 725 59 830
2432 830 923 536 670 748 522 524 341 911 1401 712 514 1164 403 -40 1548 836 -61 1294 778 -756
2452 -756 300 941 -394 403 1736 -382 -730 976 -331 -820 1077 174 -1168 535 219 -883 268
2469 268 472 -747 -87 224 -706 -476 399 -432 -216 64 -428 -456 -35 -569 -163 564 -706 -50 347 -1076
2489 -1076 -173 789 -337 -91 1072 -659 -940 1058 -101 -848 1074 682 -1271 452 1003 -1319 352
$$ packed form
2364H53k296J638J372k499P42J776k447k25K133j429r26K288n99j819J287L06
2380A55j603J252M90j268M19J92q11N41L18o83R54o11n91O66n0p22P92N70j303
2399a293N43Q79j820N69J765j485m57J947j342j042K413n47j375K046k03j772
2415a174J107J001j628O35J745j782l57J300o05n22J668l58j063R23j65o66P71
2432H30R3l87J34P8k26Kj83N70M90o89j98O50p61m43J588p12q97J355n16j534
2452g56J056O41j335P97J333k118l48J706j307m89J897r03j342J703l16j102J151
2469B68K04j219O60L11r30K30Q75q31K16K80m92k8M21n34M06P27j270O56L97j423
2489a076R03R62j126K46J163j731k81J998j159p47J922l92j953J723N51k322J671
$$ plain form
2506 352 1406 -917 -487 1153 -707 -933 1325 114 -1103 831 353 -1065 25 710 -708 -4
2522 -4 630 -497 -526 313 -754 -371 376 -410 -318 -263 -671 -567 -104 -491 -491 -133 -850 -576 14 -718 -669 386
2544 386 -676 -1186 62 -628 -1237 584 160 -1273 -45 103 -866 -113 615 -565 -320 861 -293
2561 -293 -867 765 512 -574 498 808 -573 280 1131 101 339 1047 640 -299 546 634 54 914 1630
2580 1630 462 -54 954 607 140 953 1174 374 609 654 413 220 1151 787 280 735 628 -26 205
2599 205 562 195 271 450 128 -191 -19 428 185 -93 198 -198 -787 -299 -120 -149 -277 494 -250 -965 -58
2620 -58 -360 -934 71 242 -667 -655 165 -1127 -773 426 -239 -1054 -14 -279 -1478 -51 212 -664 -77
2639 -77 129 -1137 -703 461 -204 -365 521 -95 -592 -255 95 -245 159 565 -6 -135 190 -36 -97 206
$$ packed form
2506C52J054k323M30J640j860k26K258j211j217J934m78j418J090O85j418P04
2522dO34j127k9Q39j067L83P47p86R2N5m08J04M63l87%L58p17K74N90p32M9J055
2544C86j062n10J248o90o09J821m24j433J228J48r69P53P28j180K45J181j154
2561b93n74J632k53j086J072L10j381Q53Q51j030K38P08m07r39Q45Q8n80Q60P16
2580A630j168n16J008l47m67Q13K21q00K35M5k41j93R31l64n07M55j07o54K31
2599B05L57l67P6J79l22l19J72M47k43k78K91l96n89M88J79k9j28P71p44p15R07
2620e8l02n74J005J71r09J2Q20j292L54J199o65q15J040k65j199J427K63q76N87
2639g7K06j266M34J164o65j61Q86o16m97L37L50l40M04M06n71j29L25k26o1L03
$$ plain form
2659 206 501 207 -445 -168 113 -209 222 989 128 -367 324 -224 -317 475 726 -330 311 254 -638 -300
2679 -300 506 -258 -112 483 -423 -812 56 -107 -394 220 -215 -567 -304 -260 -423 89 13 36 -350 -725 -590
2700 -590 55 -248 -144 664 -290 -910 481 -242 -531 868 506 -757 410 574 -770 220 1260 -443
2718 -443 -52 1377 -34 -350 1157 449 -319 1228 732 -227 645 1085 30 900 1323 -121 429 1184
2736 1184 -72 36 1133 216 170 898 -15 335 803 156 308 1055 -204 -280 694 -293 -178 657 -291
2755 -291 -730 535 21 -986 509 208 -1310 97 383 -1402 -414 392 -1123 -689 409 -940 -1199
2772 -1199 180 -597 -1282 337 -154 -1406 -234 150 -1285 -493 136 -554 -613 51 -351 -660 1 -128
2790 -128 -279 -334 -249 -87 -313 4 164 252 -111 278 219 -400 45 458 -330 297 1059 -59 -2 521 24
$$ packed form
2659B06K95k94o52K77K81l22M31P67q61m95O91n48r3P92K51j056O41n7q92L38
2679c00Q06p64J46N95r06l89Q68j63k87O14m35l52K63M4j63N12p6K3l86l75J35
2700e90O45l03J04Q08r54o20J391p23k89J399l62j263J167J64j344R90J040j703
2718d43L91J429j411l16J507p08p68J547m96r59Q72M40j055Q70M23j444N50P55
2736A184j256J08J097r17m6P28r13L50M68o47J52P47j259p6R74r87J15Q35r48
2755b91m39J265n14j007J495l01j518J407K86j785R88Q06j515M34J098j349k59
2772a199J379p77o85J619m91j252J172L84j435P92O29o90n9O64m02l09O61j29
2790a28j51n5Q5J62k26L17J60Q8l63L89n9o19M45M13p88O27P62j118N7N23m97
$$ plain form
2811 24 -128 733 228 -317 312 370 -388 446 591 7 172 608 -200 -345 408 331 29 27 92 63 -199 -40
2833 -40 -24 -196 -91 171 -198 -597 45 52 -707 79 433 -734 -342 289 -327 -295 480 -593 -700 551 79
2854 79 -828 501 468 -714 147 506 -605 -152 981 -312 -80 792 -192 -255 819 370 -12 643 308
2873 308 76 222 376 411 292 562 423 331 262 212 494 51 398 599 252 95 539 381 -446 478 332
2894 332 -212 136 423 -497 121 603 -78 -249 510 -123 -881 312 -10 -650 -100 -131 -893 -411 16 -412
2914 -412 -690 -183 -174 -509 -236 -240 -925 -464 -136 -531 -753 -434 -231 -518 -600 80 -568 -552 -274 -422 -829 19
2936 19 32 -569 -26 -153 -679 -371 379 121 -67 236 93 -439 254 191 -381 241 340 -12 174 274 50
2957 50 175 488 458 503 87 562 501 395 263 434 202 164 355 249 -10 382 578 -73 34 275 -174 8
$$ packed form
2811B4j52Q61n05n45O29N8p58Q34J45n84J65M36q08j45P53p7l02kO5k9k62J59
2833d0J6j72J05K62l69l99O42Pp59P86L54j167L92O31o16L2P75j073j07J251m72
2854G9r07J329l3j182Q61L59j111M53J133j293K32Q72r84o3J074m49l82O55l35
2873C08k32J46J54L5j19K70j39r2o9n0K82m43L47K01l47j57M44j58q27R24j46
2894C32n44L48K87r20O18M82o81j71P59o33p58J193l22o40N50l1p62M82M27m28
2914d12k78N07Rl35K73mo85M61L28l95k22L19K03k87q2O80o48J6K78j48m07Q48
2936A9J3o01N43j27n26L08P50k58j88L03j43n32O93o3n72O22R9l52J86J00k24
2957E0J25L13l0M5m16M75o1j06j32J71k32l8J91j06k59L92J96o51J07K41m49J82
$$ plain form
2979 8 745 4 -214 543 -256 -359 67 238 -230 -29 424 -697 -384 242 -167 -398 289 -175 -513 4
2999 4 4 -295 -178 361 -360 -336 -11 -53 -284 112 305 -143 -261 334 216 25 645 181 -176 -53 256 -195
3021 -195 378 170 138 119 145 -46 -29 307 367 240 340 389 216 80 283 350 260 80 294 291 -152 195 202 -235
3045 -235 283 465 -288 -179 252 48 -348 528 -17 -737 -74 -53 -776 -296 505 -590 -474 150 -650 -677
3065 -677 219 -333 -742 -191 -271 -847 -320 29 -569 -253 123 -382 -587 -423 -365 -461 20 -186 -229 -73 -330
3086 -330 -392 -108 -355 168 -85 -262 -122 -247 -54 99 746 93 21 387 -124 -115 631 256 140 518 488 120
3108 120 441 325 27 68 590 376 74 293 176 -81 448 640 13 -2 468 156 -61 276 322 94 -92
3129 -92 481 17 -124 449 238 -161 355 1 -341 79 -12 -520 78 182 -453 -540 86 -70 -389 402 -340
$$ packed form
2979HP37p41k18P57p99j03M26J71m68K01M53j121L13O26m09k31O87m64l38N17
2999D%k99J17N39p21K4L25m2k31L96J93m48j18N95j18j91O20m64l57J23L09m51
3021a95N73k08l2j9K6j91J7L36O0j27J00M9j73j36K03O7r0j80K14lm43L47Pm37
3045b35N18J82p53J09M31k04l96Q76n45p20O63K1p23M80Q01j095J16O24q00k7
3065f77Q96n52m09N51q0n76N27L49n98L16L76n05k05J64N8r6M81k06m3J56k57
3086c30o2K84k47N23k53j77J40j25J93J53O47o53p2L66n11RP46l75j16L78l0l68
3108A20L21j16k98M1N22k14l02K19j17k57N29J92o27j5M70l12k17L37M6k28j86
3129i2N73m64j41N73k11l99N16l54l42M20r1n08N98J04o35q7O26j56l19P91p42
$$ plain form
3150 -340 -421 137 -155 -318 -127 133 -187 -207 -241 -87 -163 51 79 331 32 -122 -27 -181 -246 380 -40 -97 446
3173 446 206 -285 334 464 -327 93 591 -567 17 394 17 -237 676 -15 -301 519 346 -85 -7 672
3193 672 -178 -3 109 -119 -138 202 -188 -110 -246 150 -104 -127 -10 115 -399 -394 57 -439 -552 28 -122 -217
3215 -217 -24 84 -759 -389 111 -565 -568 359 -392 -763 147 -484 -701 75 7 -636 -59 -196 -288 35 62 -387
3237 -387 -279 147 -231 -189 246 31 267 323 -36 75 430 198 647 443 -130 227 555 -8 182 946 -11
3258 -11 -185 745 391 -264 925 426 -445 749 571 -425 313 1025 -307 442 866 -290 -13 899 -122
3277 -122 -585 617 165 -520 383 105 -292 384 90 -84 61 -162 -623 -96 14 -275 16 -78 -383 -274
3297 -274 -190 -561 -32 -52 -577 101 -18 -523 -83 71 -619 -235 110 -519 -433 381 -321 -509 271 -14 -309
$$ packed form
3150c40q1N58k92j63J91K60l20k0l4J54p6K14K8K52k99j54R5j54o5O26m20n7N43
3173D46k40m91O19J30p91M20M98j158N84L77l77k54R13o91k86Q20j73m31P8O79
3193F72q50J75J12k28j9L40l90P8j36L96k54k3J17J25n14NM51m96j13N80j50r5
3215b17J93J08q43L70N00o76lR27p51l71R10o31k17P76o8o43N77j37r2L23K7m49
3237c87J08M26l78M2M35k15K36N6l59J11L55k32M49k04n73L57L28n63J90P64r57
3258a1j74R30l54o55J189m99q71J194j78r96P38P12j332P49M24j156K77R12j021
3277a22m63J202m52o85R03k78l97O76k94j74J45k23m61N27J10k89K91r4l05J09
3297b74Q4l71N29k0n25O78j19n05M40J54o90L84L45o29Q6Q14p02j88P80k85k95
$$ plain form
3318 -309 112 295 -680 121 229 -303 -160 386 -6 -171 240 310 -17 308 425 63 -32 42 149 -136 150
3339 150 354 -13 -24 167 -42 -222 180 305 -440 264 301 -133 0 403 -155 -344 283 -565 -397 469 169
3360 169 -530 -74 -258 -377 -125 -69 -418 -105 -18 -494 -199 -54 -323 9 -77 39 -123 -326 -419 77 153 -394
3382 -394 -98 59 -378 160 231 -238 77 437 -159 -306 499 -12 -159 527 381 -386 765 449 -332 461
3402 461 636 -44 426 466 -8 162 330 251 164 406 44 142 258 414 314 76 276 173 -54 -119 83 488
3424 488 145 534 151 -136 185 399 101 124 144 -100 -227 157 -61 -374 172 207 -479 50 76 -622 -157
3445 -157 81 -392 -254 170 -528 -554 -236 -457 -79 -158 -343 -265 -434 -343 -300 -222 -463 -57 195 -473 -307 125
3467 125 -200 -320 422 -184 -262 369 135 -423 726 482 -422 217 248 -470 16 419 -301 -66 763 -126
$$ packed form
3318c09M21J83r75Q01J08n32J43N46l92j65M11P0l27L25J17l62r5P4J07k85K86
3339A50K04l67j1J91k09j80M02J25p45P04L7m34J33M03n58j89O27q48J68Q66l00
3360A69o99M56j84j19K52N6l49L13Q7m76K95J45k69L32q6J16j62k03r3M96P6n47
3382c94K96J57m37N38P1m69L15L60n96j47Q05n11j47O86j46p67J151l16p81P93
3402D61J75o80M70M0m74J70J68p9q7K42l62R8J16J56j00k38K00j03k27o5K02M05
3424D88l43L89l83k87L21K14k98K3K0k44j27L84k18l13N46L5o86N29K6o98M65
3445a57K38m73J38M24o98k6L18k21L78p9j85P8j69R1M3P8k41M06K52o68J66M32
3467A25l25j20P42o06p8O31k34n58J149k44r04O39L1p18M86M03p20K35Q29q89
$$ plain form
3487 -126 -369 679 418 -300 661 2 -463 504 148 -39 105 407 -299 89 213 -155 -152 188 -262 140
3507 140 68 -282 -219 -66 -264 -52 92 -471 -403 95 -228 -188 361 -409 -309 108 -176 -658 154 -333 -466
3528 -466 -128 57 -297 49 137 -194 0 7 -153 -471 6 174 -301 304 305 -26 -166 378 197 135 361 394
3550 394 121 52 336 162 194 451 263 176 163 317 -196 279 600 -39 370 513 -26 152 378 108 111 395
3572 395 115 -263 178 402 -515 190 -65 125 125 -92 -223 -75 -142 -21 217 -451 -319 -148 -345 -351 -147 -32
3594 -32 -601 -126 81 -520 -114 -200 -532 -312 258 -552 -718 98 -118 -536 99 -131 -521 173 -56 -413 123
3615 123 124 -284 -185 282 -48 -166 136 27 -47 -266 -119 -1 207 115 204 206 -8 298 174 64 280 187 -53
3638 -53 318 172 39 50 408 9 147 524 32 -98 220 405 -120 339 324 -57 250 177 -103 -109 46 36
$$ packed form
3487a26k43J048k61p18R61o59m65R67l56j87J44L02p06L88J24l68LL40m50M02
3507A40p2l50O3J53j98K12J44n63O8M98l23M0N49p70J00M17k84m82Q12m87j33
3528d66L38J85l54L46Q8l31J94Pj60l18M77J68m75O05Jl31j40N44j81o2K26L3
3550C94k73o9K84j74L2K57j88q7j3J54n13M75L21o39M09J43n39J78K26k70LK84
3572C95k80l78M41K24r17P05k55J90%k17j31J48o7J21K38o68J32J71j97oK04J15
3594c2n69M75K07o01M06q6l32K20N70q10j66Q16k16m18O35k30l90O94k29l57N36
3615A23Jm08R9M67l30j18L02j09p4k19J47J18K08r2Q9Kk14L06j24j10K16r3k40
3638e3L71j46j33J1L58l99J38L77m92j30L18J85n25M59j5l81L07p3k80oJ55j0
$$ plain form
3660 36 41 -209 -8 -293 153 -41 41 -200 -242 -16 -219 -471 -5 54 -401 -234 222 -395 -265 272 -178 -193
3682 -193 390 -346 -407 159 -172 -582 134 141 -516 90 123 -126 61 667 -288 206 596 142 -387 466 296
3703 296 -31 468 296 -146 188 166 5 156 310 39 210 -54 -31 -12 314 24 108 95 -189 170 150 258
3725 258 -83 -1 -159 82 171 -341 130 283 -376 -523 -101 -126 -671 222 73 -425 -272 -83 -283 -260 181
3746 181 -321 -429 -320 -255 -341 -344 -75 -312 -150 -112 -421 -368 -9 -160 -250 87 -151 -41 -217 -70 -73 -96 35
3769 35 -206 -293 166 -37 -5 -65 241 -32 -203 188 47 129 335 286 97 322 183 301 -12 460 242 142
3791 142 184 159 -30 135 459 144 167 51 158 -175 202 430 264 45 507 236 -79 198 344 -8 69
3812 69 328 -296 -137 82 -97 -305 287 -2 -222 96 -100 -208 85 165 -214 -301 122 -120 -278 215 -64
$$ packed form
3660C6Nk50K01k85M46j94Q2k41m2K26k03k52M66N9m55J67M56o17J30N37m50j5
3682a93N83p36o1N66l31m10P16Po57O06L3k49J87O06r55M94L90m54n29Q53j70
3703B96l27M99j72m42L34k2j61J51J54k71J71k64K3J9L26k90Q4j3k84L59k0J08
3725B58l41Q2j58K41Q9n12M71J53o59j47M22k5n45Q93j49m98J53J89k00K3M41
3746A81n02j08J09O5q6lK69k37J62L8l09N3L59j51r0L37k38J10j76J47lk3J31
3769C5k41q7M59k03L2o0L06k73j71L91j41Q2K06m9j89K25j39J18l13M72k18j00
3791A42M2k5j89J65L24l15K3j16J07l33L77K28j66k19M62k71l15K77J46l52P7
3812F9K59o24J59K19j79k08N92k89k20L18j96j08K93Q0l79q7M23k42j58M93k79
$$ plain form
3833 -64 -205 79 80 -191 -125 124 -228 2 145 194 -293 42 69 -277 198 59 196 -91 30 70 130 316 141
3856 141 382 118 32 146 106 238 277 204 71 216 293 -42 110 524 -130 -83 264 33 -103 237 -249 -186
3878 -186 131 34 -284 205 135 -434 -165 228 -419 -144 26 -193 -476 130 -103 -500 -44 -129 -234 148 -199
3899 -199 -169 -277 54 -343 -341 -229 42 -277 -212 -12 -367 -145 -326 86 -232 -7 -265 117 -340 94 188 -108
3921 -108 302 171 10 190 252 -120 277 478 -218 -22 340 184 161 383 229 147 267 420 171 161 317
3942 317 459 450 452 338 222 173 232 206 311 -46 309 -169 -46 259 4 -114 189 195 -287 270 82 61 -21 49
3966 49 -423 -232 86 33 -200 87 -220 -284 -40 -283 -223 -7 240 -298 -16 89 -13 26 -24 -32 -215 -28 -286
3989 -286 -242 -80 -85 -81 -227 17 173 94 -119 87 102 -48 45 384 -56 -19 249 -211 -51 331 82 2 235
$$ packed form
3833f4j41K84Jk71O6K49l52K30J43M9m87L35K7l46M75j39J37k87J21M0O0J86j75
3856A41K41k64q6J14m0J32L9p3j33J45P7l35J52M14o54M7L47k31j36L40m86O3
3878a86L17r7l18M89p0n69K69L93o47K75J70k19k83O06k33l97M56q5j05L82l47
3899a99L0j08L31l97KJ12K71l19O5K00l55K22j81M12l18K25k58L82m57M34R4k96
3921a08M10j31j61J80O2l72L97K01o96J96L62j56k3K22j54q2J20J53k49j0J56
3942C17J42rKj14j16m9N9k6J05l57L55m78J23L05k55j18L03Om82N57j88k1q2P0
3966D9m72J91L18n3k33K87l07o4K44k43O0K16K47n38K82J05j02L9n0qj83J87k58
3989b86M4J62nMj46K44J56p9k13K06J5j50R3L39m40L7K68m60J60L82k49q0K33
$$ plain form
4012 235 27 -37 347 109 -135 53 312 -108 -47 272 87 -65 190 216 -34 129 -8 -125 -79 -145 63 103
4034 103 -414 -9 150 -259 201 43 -395 -193 134 -537 -151 190 -385 -156 80 -268 -495 213 83 -729
4054 -729 287 16 -452 58 226 34 174 186 -577 -115 76 -150 221 80 -5 121 314 59 89 491 -127
4075 -127 242 97 -92 -144 495 516 119 621 136 -111 646 295 -255 543 499 -207 511 388 -226 275 569
4096 569 -107 178 493 -246 15 507 105 -154 310 86 -262 188 37 -235 265 10 -159 -188 40 -239
4116 -239 -6 -240 -249 -428 -72 -317 -144 -135 -154 -194 258 -495 -451 -59 -349 -147 315 23 -409 106 -500 -236
4138 -236 405 -131 -601 118 70 -513 171 232 -511 23 520 -372 -159 380 -29 -20 260 -9 -114 204 57
4159 57 127 78 -16 150 412 -277 130 280 -249 15 274 43 -165 306 31 -160 129 -113 -228 168 59
$$ packed form
4012B35k08o4L84k38k44J88K59m20O1L19j85j52K55K6k50J63j37j17M6o6K08M0
4034A03n17M05J59m09M60j58m38K02L27o71L86L41n75K29K36l48k27P08j30q12
4054g29J016k71m68N10J68j92J40J2p63M62J91k26L71j41q5J26J93k55L0M02o18
4075a27L69j45j89n2O39K1l97N02m85k47P57l51n50P98m4p06P18j23o14N01K94
4096E69o76K85L15p39K61M92m02k59M64k24l48M50j51k72N00k55j69k9K28k79
4116b39K33k34rj79L56k45J73Rj9m0M52p53M4L92k90K02M62k92m32N15o06K64
4138b36O41n36m70P19m8n83O84O1p43N34M97q92K13N39m09RK80k69j05L18j47
4159E7P0m9r4J66K62o89M07J50n29K64K59k31k08M71k75j91K89k42j15L96j09
$$ plain form
4180 59 -160 107 147 -251 33 261 -170 -338 207 -89 -132 49 -266 -388 86 -42 -428 119 37 -120 69
4201 69 -174 -295 -53 44 65 79 7 -236 -65 -174 -41 199 173 -99 -138 188 -277 31 187 -240 48 366
4223 366 -26 286 339 95 103 256 172 -299 375 392 16 386 355 259 255 269 318 -136 270 310 -186 281 443 55
4247 55 -20 411 14 -103 248 155 -226 285 137 -288 309 96 -206 228 -242 -176 -79 -21 -274 -298 91 -101
4269 -101 -30 -68 -68 -215 -199 -340 -434 -177 -6 -42 -266 -323 -349 -44 118 -554 -261 -207 -204 85 91 -419 168 230 -272
4294 -272 -28 -119 -274 -213 241 2 -144 207 180 -315 185 232 -182 -110 317 -119 82 143 17 -287 511 304
4316 304 -95 371 42 -128 17 143 124 99 147 -12 123 220 99 95 154 24 0 -99 -15 165 -238 -391 259
4339 259 -83 -111 -87 62 -189 78 10 -264 -276 152 -207 36 260 -89 -195 -65 -209 -313 50 215 -129
$$ packed form
4180E9k19K67M0l98K84K28m31j68N45k96m3J81l15j22M74j28l86N47q2j57J89
4201F9k43j21K42R7K1J4p2k43J71j09J33K40k6k72l9L26m65L08J56m27K88L18
4223C66l92L12N3k44QJ53q4m71O74J7l76L70l1r6mJ4M9m54M06M0m96M67J62l88
4247E5p5M31l97j17L51r3l81N11j48m25N97k13l02M34m70O6R7N8k53k4L89j92
4269a01P1l8%j47J6j41r4K57J71l6k24n7k6L05J62o72K93N4LK89On10N87O2n02
4294b72K44r1j55O1M54k39j46L51k7m95N00M7m14P2M27m36K01O1j26l04P98k07
4316C04l99M66l29j70J45J26j9k5M8j59J35R7j21mN9j30k4r9Q4J80m03j53O50
4339B59l42k8K4J49k51K67o8k74j2M28l59K43K24l49j06J30j44j04L63J65l44
$$ plain form
4360 -129 -27 200 21 -11 78 256 -156 118 38 -48 -21 422 130 52 231 319 -7 20 182 -38 98 262 259
4383 259 -127 250 389 -64 83 517 59 210 307 272 -192 294 141 42 86 -5 55 134 53 -33 -118 24 91 -205
4407 -205 -69 -87 -65 -167 -138 -24 -80 159 -6 -512 142 -318 -288 -99 -17 -97 -39 196 -78 -333 -320 -168 -253
4430 -253 -353 -79 -245 -177 21 -73 -288 -175 103 -47 -253 -156 -73 -103 -56 8 -53 -450 175 27 76 217 157
4453 157 -199 92 462 -95 188 489 -166 104 498 170 -87 419 179 -253 369 433 -206 326 266 -14 279
4474 279 361 -10 109 257 -43 18 14 178 -58 175 -253 -76 344 -7 10 -66 -75 -178 270 -135 101 280 -349
4497 -349 -45 -170 -27 -297 217 137 -282 -24 158 -332 -24 415 -260 124 238 -355 -90 129 23 -167
4517 -167 267 96 -232 269 280 -247 -34 196 -228 236 306 -77 199 143 138 170 218 129 271 175 208 185 156 192
$$ packed form
4360a29J02K27j79l2Q9J78m12K74q0q6K7M43k92p8J79Q8l26K7J62k20J36J64l
4383B59l86L77J39m53J47M34m58J51R7l5m64M86j53r9M4r1O0P9q1q6q5J42O7k96
4407b05J36j8K2j02K9J14n6K39j65n06O54m60L0J89Q2q0N8K35k74k55J3J52q5
4430b53j00K74j66O8J98r4k15J13K78j50k06R7Q3l0M7O4o1l97O25j48M9J41o0
4453A57l56K91L70n57K83L01o55K70L94l28k57N06k40m32O22O4o39N32o0k80K93
4474B79Q2l71J19J48l00O1mJ64k36K33m28J77M20l51J7p6rj03M48m05K36J79o29
4497c49L04j25J43k70N14q0m19K58J82m90L08M39o75L84J14n93K65K19j06j90
4517a67M34j71l28N01J1n27K13K30m24M64P0l83K76n6nL2M8q9J42r6L3k3k9L6
$$ plain form
4541 192 240 266 -185 101 264 -290 215 439 -24 -290 103 -285 191 367 -47 -291 175 -110 -83 120 8
4562 8 -32 -121 -66 -161 -204 7 -135 -85 93 -443 47 -159 -414 -58 -328 -337 -32 -77 -643 -127 -61 -402 71 5
4586 5 -502 -210 437 -124 -310 226 10 -74 206 -98 -356 208 -45 -239 350 439 -102 -28 447 -146 293 522
4608 522 -35 249 314 333 193 84 -155 194 404 120 251 204 167 1 278 233 125 358 -20 269 236 140
4630 140 -142 434 371 -321 472 609 -233 88 105 -160 -400 301 -95 -345 -76 57 -226 88 -68 -138 121
4651 121 -102 -62 -158 50 -58 -398 -125 -52 -2 -284 -200 127 -359 -118 -170 -78 -156 112 61 -40 378 -124 -353
4674 -353 -13 183 35 208 257 -225 -13 93 -50 134 209 -211 10 262 63 62 332 -116 -16 0 -179 -143
4696 -143 342 -111 -341 315 -21 82 -18 -174 -76 420 -286 -201 -66 12 -466 82 -32 -274 -162 -103 -373
$$ packed form
4541A92M8K6m51K86J63n54N05K24m63k66L93l88M76J76m14k44M66k85K7K03j12
4562Hm0q9N5r5m3K11j42N0J78n36M90k06k55L56k70rL05m5n66N16O6l41M73o6
4586En07K92O47n61j86N36k16q4K80l04k58N64k53j94N89Q9n41P4M75n93M39K29
4608E22n57K84O5J9j40j09k39L49K10k84J31m7l7j66K77m5j08K33l78K89l3r6
4630A40k82N76o3o92P93J37q42L21J7k65k40P01l96k50K69J33k83L14j56p0K59
4651A21k23M0r6K08j08l40K73P3N0k82Q4L27m86K41n2R2p8K68n1j01M18n02k29
4674c53L40J96j48J73M9m82K12J06j43J84P5m20K21K52j99jK70m48J00J6j79L6
4696a43M85m53k30O56l36J03j00j56R8M96p06Q5J35P8m78N48j14k42J12N9k70
$$ plain form
4717 -373 -182 -77 -372 -256 74 -410 -519 62 -424 -240 16 102 -229 18 3 -158 235 303 -17 -177 -141
4738 -141 -261 -378 -247 -93 53 23 67 -66 64 315 202 25 99 371 -29 8 229 286 41 203 157 -19
4760 -19 97 525 37 289 168 146 136 232 -70 115 323 62 153 240 305 172 208 128 169 -40 -19 178 134 -134
4784 -134 -52 69 -37 -137 281 -69 -203 157 39 -396 -158 89 -246 122 103 -418 -389 106 -153 -36 189
4805 189 -327 -325 209 -210 -340 15 148 -182 16 -47 -82 170 81 -350 1 -60 -200 -137 127 -195 -220 -116 -138
4828 -138 37 303 72 47 89 9 22 199 164 -6 86 244 97 58 -149 -154 199 185 150 88 173 -35 194 8
4852 8 -121 -343 262 8 -272 117 37 -332 64 -187 -317 -105 3 -293 -88 -65 -115 -99 -100 -405 -116 -83 -13
4875 -13 100 -84 -129 -65 6 17 57 -59 -125 318 -70 -92 134 -102 -56 233 64 -49 40 124 141 -195 151 205
$$ packed form
4717c73J91J05k95J16L30m84j09N81m86J84K56Q6l31K47j5j61L93O8l20j60L6
4738a41j20j17J31J54J46l0M4j33J30K51j13j77P4K72m00L7K21N7k45J62m6j76
4760a9J16M28m88K52j21k2j0R6l02J85K08k61R1Q7O5j33L6q0M1k09K1J97m4k68
4784a34Q2J21j06j00M18l50j34L60j18m35K38K47l35L68j9n21K9M95k59J17K25
4805A89n16KN34m19j30L55J33l30J98o3l5K52q9m31L51o1j40O3K64l22k5J04k2
4828a38J75K66k31k5M2q0J3J77l5j70R2J58j47l9k07nL53j4l5o2Q5k08K29j86
4852Hj29k22O05k54k80L89q0l69L96k51j30K12J08k96K05K3n0J6jl05K89L3P0
4875a3J13j84m5O4P1J1M0j16o6M43l88k2K26k36M6K89j69j13Q9Q4J7l36L46N4
$$ plain form
4899 205 70 182 142 192 327 268 249 23 -14 212 158 -8 369 322 -62 380 118 0 -174 186 199 207 218 109
4923 109 -133 189 281 -216 171 -22 -12 -129 64 -132 -62 65 -55 29 -49 84 -202 -39 -248 -149 -137 -29
4945 -29 -259 -124 -297 4 -84 -17 -263 -378 -109 -1 -148 -175 -87 -205 -143 -97 -2 -63 -54 -44 141 17 -153 -96
4969 -96 64 -98 -128 -24 -132 -54 115 -153 270 -4 -112 295 -125 -96 23 -101 178 -155 -7 -48 -68 31
4991 31 241 76 61 186 -32 -77 263 85 -17 186 55 -113 211 250 -21 -218 -17 290 -303 -63 -109 -52
5013 -52 -64 219 209 36 223 -216 -341 234 -7 -72 -37 -71 -159 -191 -53 31 -197 -13 -247 -159 240 -228 -10
5036 -10 94 96 -61 266 -3 -111 196 121 10 -22 -41 85 211 164 -107 125 243 136 -12 -61 99 169 265
5059 265 153 -32 219 -143 143 309 148 83 311 46 40 138 215 -27 31 191 -35 -103 431 -173 -50 -87 -225
$$ packed form
4899B05j35J12m0N0J35n9j9k26l7K26n4j66L77m7l84M42k62j18j74L60J3QJ1j09
4923A09k42L22R2m97L87j93J0j17J93j96P0J27j20Q4p8J33k86J63k09R9J2J08
4945b9k30J35j73L01q8O7k46j15K69J08j47k7Q8j18O2M6R5o1RJ0J85j24j70N7
4969i6J60j62l0J04j08P8J69k68M23k74j08M07m20K9J19j24K79l33J48m1k0R9
4991C1K10j65j5J25k18m5L40j78j02K03j31j68L24L9k71j97K01L07n93K40m6N7
5013e2j2K83j0j73J87m39j25N75k41o5L5l4q8l2J38Q4k28J84k34Q8L99m68K18
5036a0J04Kj57L27k69j08L07p5j11l2j9J26J26m7k71K32J18j07j48m9J60P0R6
5059B65j12j85K51l62K86J66j61o5K28k65oR8P7k42N8J60k26o8N34o04J23l7j38
$$ plain form
5082 -225 85 -44 89 -224 55 -193 -199 -6 -190 -160 -121 -251 -128 -34 74 -25 -152 -173 -177 23 -219 -176 73
5105 73 -159 -145 96 -103 -90 -135 -115 -23 -171 -119 -259 -88 -261 -111 143 -49 -133 186 -19 45 -58 -66 155 -179
5129 -179 169 142 -149 128 241 160 25 162 266 139 294 108 60 70 233 334 196 -14 -62 379 -152 51
5151 51 281 58 -253 173 -45 44 258 171 -65 268 64 87 -129 74 -163 -340 128 -25 -317 156 -6
5172 -6 -71 118 -112 -324 37 115 -80 148 -112 -9 -44 68 -183 -172 162 90 -47 -22 30 211 -9 -134 85
5195 85 85 -117 171 212 -221 -40 297 169 51 471 -110 -11 -33 53 -76 104 383 -186 84 228 63 21 333
5218 333 -30 -50 52 -154 -179 93 504 -135 161 95 -259 -95 289 14 -110 117 -44 -56 120 -167 -45
5239 -45 -150 -61 167 -453 -104 -135 -395 -124 -78 -87 -339 -115 -95 187 -107 -373 54 150 -41 -300 -338 186 -288
$$ packed form
5082b25L10j29J33l13K79k48oJ93j84L0L9j30J23R4J08r9j27k1mK00k42M3K49
5105G3k32J4K41j99J3m5K0R2j48N2j40J71j73J50K54j92q4L19k05O4j03qK21l34
5129a79L48k7k91K77J13q1j35J37J04j27J55j86m8J0J63J01j38k10m8M41n31K03
5151E1K30k23l11M26k18Q9K14q7k36L33k04K3k16K03k37j77M68j53k92M73j62
5172fo5J89k30k12L61P8j95K28k60J03l5J12k51J1L34p2j37K5N2J81k20j25K19
5195H5%k02K88M1m33J81L37j28j18M20n81R9k2Q6j29J80K79n69K70J44j65m2L12
5218C33l63k0J02k06k5K72M11o39K96o6l54J64L84k75j24K27j61j2J76k87J22
5239d5j05Q9K28o20L49l1k60K71M6rk52K24K0K82k94k66M27R6j91k59l8N24m74
$$ plain form
5262 -288 35 -135 -115 175 36 -71 -24 -76 -192 13 -19 4 -176 28 -26 -95 186 -83 -44 346 -153 122 190
5285 190 24 30 69 10 131 220 238 -59 445 345 -137 -133 336 158 108 131 28 42 104 -81 -269 286 -91 17
5309 17 100 99 -84 -96 47 -25 -5 180 -202 68 -71 -43 -45 -72 -314 -144 -77 -182 -254 -101 -93 -85 30 -359 80 432
5335 432 -170 46 -56 -136 -264 -11 217 360 -98 193 60 23 -110 17 0 -61 -149 -241 10 -19 -71 -50 246
5358 246 50 -54 -16 59 177 150 168 -140 -49 133 -27 -178 -98 76 -4 189 -268 -120 -83 128 -33 -124 -4
5381 -4 -66 -235 -114 16 -157 213 -186 -68 -199 -19 159 -160 -133 91 -69 -124 201 -36 -115 150 -38 -293
5403 -293 -154 -447 -88 -155 -135 15 -204 -156 -164 -9 186 -46 47 -43 -9 46 -222 112 -58 -123 63 -102 -211
5426 -211 49 138 172 4 115 323 -63 112 7 136 -3 135 -23 73 374 -96 -12 159 -6 43 -77 44
$$ packed form
5262b88L23j70K0K90j39j07M7n2j16K05l2K3j80K04n4o9K81k69L9L90m99K75O8
5285A90j66OL9n9J21Q9J8k97N04j00m82MM69j78n0K3j03J4O2j85j88N55l77J08
5309A7Q3jj83j2J43p2K0J85l82K70j39K8kk7k42J70O7j05p2J53QQJ15l89M39L52
5335D32o02K16j02q0j28K53K28J43m58K91j33l7j33J27j7o1q8r2K51k9n2K1K96
5358B46j96j04L8P5J18k7J8l08R1J82j60j51Q0J74q0J93m57J48L7K11j61r1J20
5381do2j69J21J30j73L70l99J18j31J80J78l19K7K24j60n5L25k37p9K65j88k55
5403b93J39k93L59o7K0J50k19M8qJ55J95k32R3r0L4N5k68L34j70o5J86j65j09
5426b11K60Q9L4j68J11K08l86J75j05J29j39J38j58R6L01m70Q4J71j65M9j20J21
$$ plain form
5448 44 137 71 247 73 -32 26 -147 -31 88 -114 220 84 293 19 -4 19 274 -22 -11 38 10 -106 -92
5471 -92 118 -173 67 74 -14 -134 230 -388 37 221 40 -98 -173 -190 -187 37 239 142 -211 6 -8 -170 -101 -23
5495 -23 37 -167 122 23 12 257 -302 -108 -72 10 -113 242 52 106 28 215 173 199 166 45 -34 -122 -55 -20 1
5520 1 -189 -147 23 -114 -94 196 -132 99 -141 -2 81 -252 -133 -181 -305 40 -11 114 -105 -6 28 58 -309
5543 -309 -282 -79 -20 -111 -85 -96 -185 2 -127 -189 -370 170 -297 -224 12 -168 -68 -248 100 -41 -48 0 -272 -98
5567 -98 -26 -74 -184 -16 48 -15 126 -34 -310 248 -5 82 -93 49 272 316 31 87 132 -34 86 138 273
5590 273 120 26 154 -128 -48 144 69 37 215 -93 70 106 140 231 -46 -10 -39 84 105 -141 -240 34 -187 -38
5614 -38 74 -150 13 -57 -95 47 63 113 -22 150 -150 -244 -131 17 -287 60 325 -141 49 -132 29 -22
$$ packed form
5448D4R3o6J76j74j05N8j73J16J19k02L34j36K09k74k3K3K55k96J1M9k8j16J4
5471i2K10k91K40Pq8j20L64o18M25J84j81j38p5j7LK24K02r7l53K17j4j62O9P8
5495b3O0k04K89r9j1K45n59J94L6Q2j23L55j90N4p8J87m2K6l3j21p9q8O7L5K1
5520Aj90M2J70j37K0K90l28K31k40J39Q3l33J19m8j24L45n1J25k19R9L4L0l67
5543c09K7K03N9r1K6j1q9J87j29o2j81N40m67P3K36j80J00j80L48j41pM8k72J74
5567i8P2m8j10J68O4o3J41j60k76N58k53Q7j75J42K23M4k85N6M5j66J20N2J35
5590B73j53r4J28k82Q0J92p5l2J78l08J63L6L4R1k77L6k9J23K1k46r9K74k21J49
5614c8J12k24J63p0l8J42J6N0j35J72l00r4J13J48l04L47K65m66J90j81J61n1
$$ plain form
5636 -22 -52 -72 -71 -52 -333 -92 -21 -125 155 75 88 169 -29 -49 249 144 -31 -100 -168 143 117 165 -202 -6 -141
5661 -141 -6 -328 20 196 31 173 311 -46 25 171 -202 -233 -46 27 47 45 -127 85 -47 -26 56 208 -69
5684 -69 188 34 -105 64 -44 -23 66 -59 -16 21 62 68 -223 163 -56 116 -95 62 -156 -45 198 -183 121
5707 121 54 -1 -286 160 -79 113 -161 -177 -127 -21 14 -44 81 44 12 40 210 -107 319 167 56 -20 -12 10
5731 10 30 66 -5 187 -72 31 178 219 -20 132 161 -90 27 -137 -26 -194 46 -187 21 -24 -111 271 517
5754 517 8 -54 -256 -85 0 42 -109 6 -84 -145 22 -452 -199 -50 -107 -48 -66 -89 -280 -595 -47 -114 -354
5777 -354 -20 -8 -343 -60 232 -311 244 -60 -346 146 84 -19 -25 33 -329 -25 72 15 -81 143 17 8 221
5800 221 33 -89 156 90 -172 242 101 -2 219 286 -281 -73 187 -275 240 45 -174 21 153 -258 -137
$$ packed form
5636b2l0k0JJ9k81K41P1j04K80q0J3Q1j98k0K98j05j75o9o8L11k6M8l67J96j35
5661a41J35l22L48J76j65J42J38l57P1J46l73l1J87P3K0kj72K12j32K1Q2J52k77
5684f9K57j54j39J69j08K1Q9j25M3L7M1Ok91L86k19J72k11J57k18J11K43l81L04
5707A21o7n5k85M46k39J92k74j6N0J06L5n8J25l7l2K8J70l17M26j52j11p6QK2
5731A0K0L6p1J92k59J03J47M1k39J52K9k51J17j64J11j68K40k33K08m5q7L82K46
5754E17n09o2k02J71Q5M2j51J15r0o1J67m74K53J49n7N9j8k3j91l15N48o7k40
5777c54L34J2l35K83K92n43N55l04k86M92o2j03oN8l62L04R7n7r6K24j26rK13
5800B21j88j22K45o6k62M14j41j03K21O7n67K08K60m62N15j95k19J95J32m11J21
$$ plain form
5821 -137 269 65 86 194 194 23 286 -104 -294 309 211 -129 151 161 -274 -123 -88 -23 57 132 -191 55 258
5844 258 -160 -194 360 -104 -96 68 -40 123 -159 -15 52 -26 75 -115 13 64 -183 31 -29 -25 10 -94 38
5867 38 29 195 -30 -26 56 -95 121 254 -173 42 98 -126 92 -19 53 171 -130 257 221 183 119 166 152 25
5891 25 -214 300 151 23 -59 22 -16 91 -80 -128 58 76 70 -70 -151 -300 132 84 -373 292 -22 -194 -94
5914 -94 -68 -66 60 225 -183 -211 144 -238 -132 197 -229 -27 -83 -186 -255 -114 52 -298 119 287 -521 1
5936 1 -57 -96 148 99 -111 106 19 6 135 95 83 51 230 -58 116 -4 45 -91 45 119 -167 294 49 -68
5960 -68 212 -19 -76 71 95 -119 -24 -6 73 -25 330 -190 53 302 94 -27 58 13 102 83 -47 -55 -73 -260 -232
5985 -232 -58 44 62 -156 5 144 4 213 -38 -69 -163 -177 84 -25 15 -125 42 119 -154 103 -161 104
$$ packed form
5821a37M06k04K1J08%j71K63l90j90O03r8l40K80J0m35J51L5O5Q0P5l23K46K03
5844B58m18l4N54m64QJ64j08J63k82J44O7p8J01j90J28N1k47K14o0ML5j04J32
5867C8rJ66k25MQ2j51K16J33m27K15N6k24K18j11P2J18l01L87l6l8o4M7j4j27
5891B5k39N14j49j28q2Q1l8J07j71m8J86J8oj40q1j49M32m8m57O65l14j72J00
5914i4K6KJ26J65m08k8L55l82J06L29m26K02n6j03o9J41J66l50M17J68q08N22
5936An8l9K44m9k10K17q7j3J29m0j2l2J79k88J74j20M9j36J36P4k86M61k45j17
5960f8K80k31n7J47K4k14R5J8P9r8L55n20K43K49k08j21Q5m5Q9j9j30qj8j87K8
5985b32J74J02J8k18J61J39j40K09k51l1r4j4K61j09M0j40J67P7k73K57k64K65
$$ plain form
6007 104 56 -3 -305 -88 -4 -166 127 93 175 397 145 147 219 20 152 105 36 -22 277 26 314 230 -101 91
6031 91 315 110 112 124 -151 49 304 379 -102 232 41 -82 132 116 -50 -57 112 93 205 50 125 -187 140
6054 140 73 107 203 151 -54 95 157 36 173 -36 30 -176 -115 -119 90 -193 -264 -238 77 -154 12 -187 -134 79
6078 79 -222 -278 -59 -52 38 31 269 106 -142 166 -171 -101 188 -252 329 289 97 -95 194 -4 -117 -86 16
6101 16 -189 -15 277 -106 304 220 108 271 146 175 223 167 21 249 121 -26 132 222 216 173 298 -24 90
6124 90 54 -73 -150 200 -251 -8 183 -53 53 263 -153 -239 165 34 -282 -21 -131 -189 44 25 37 10 59
6147 59 -109 7 -67 -133 -33 -119 -266 7 -60 -25 34 165 -354 -16 49 -53 -238 -120 -273 -85 298 -39 49
6170 49 -49 -34 -81 -1 23 46 -51 65 30 50 70 -113 -51 -58 120 57 257 194 166 -84 105 162 222 148 -30 -117 300
$$ packed form
6007A04m8n9l02K17Q4j62K93l4Q2K22k52KP2j99J32m7o9n8K99k51K88q4l31J92
6031I1K24k05KJ2k75K00K55P5m81L34j91j23K14j6j66pJ69j9J12j55P5l12L27
6054A40o7L4R6n2k05J49O2j21J37k09O6k06O1mK09k83p1K6L15k31J66j99N3K13
6078G9l01n6K19PR0pK38j63k48L08l37P0K89m40N81m0j92j92K89j98j13L1J02
6101A6k05J74K92l83M10q4j12J63j25K9M8n6j46K28j28j47J58R0om3J25l22J14
6124I0l6j27p7L50m51K43J91k36J06K10m16q6M04j31l16K61j10n8K33j9J2k7M9
6147E9j68J16p4o6J00q6j47K73o7L5N9J31n19L38O5j02j85J18j53J88L83l37Q8
6170D9r8J5m7Q0K4K3r7J16l5K0K0j83O2pJ78o3K00o3k8k50J89N7O0p4j78q7M17
$$ plain form
6197 300 77 -88 -40 22 177 -140 18 -34 42 -166 -71 -52 -161 50 148 40 47 83 -388 -41 -195 -119 -104 -197
6221 -197 -208 -110 -178 -32 -222 -37 7 -212 -151 95 -12 -183 141 -228 -215 -173 196 -145 81 219 181 138 46
6244 46 13 110 -28 9 29 -334 -32 -50 -11 311 85 126 229 21 -77 149 265 197 -158 355 -124 -111 61 199
6268 199 -56 -61 -104 -93 88 79 217 39 100 157 48 67 -169 -162 -91 -128 -52 -167 -184 -15 248 -64 -165 117 -200
6293 -200 -192 140 95 82 -184 -197 -86 10 -127 105 -3 -106 -234 158 184 -246 -120 74 -93 83 154 -169 -144
6316 -144 34 209 -302 7 -182 -21 -85 -34 38 159 95 104 104 -33 -96 180 -37 -49 308 -192 137 195 64 96
6340 96 57 -49 -125 -6 35 -39 27 240 -82 85 214 -230 125 -138 -266 1 165 -129 -42 116 -112 -210 23
6363 23 92 24 -158 -36 -67 8 -137 -267 8 -27 -176 -1 -265 2 -362 100 -123 -114 -149 -66 -6 -19 -238 50
$$ packed form
6197C00k23j65M8O2J55l17J58n2P6k08R5J9j09K11R8j08PL6m71L47j54P6J5r3
6221a97j1R8o8J46j90J85M4k19O1K46j07j71L24l69J3M2L69l41K26J38l8m3r2
6244D6l3R7j38L7K0l63L02j8L9L22k26M1J03k08r8K26J16o8l55N13m79J3J72J38
6268A99k55nm3J1J81rJ38j78O1N7j09J9k36PP1l7P6j15j7J69K63l12j01K82l17
6293b00QL32m5j3k66j3J11R6j37K32j08j03j28L92K6m30J26J94j67J76P1l23K5
6316a44J78J75n11L09j89J61o4N1P2J21o4R%j37o3K76k17j2L57n00L29N8j31L2
6340I6l9j06p6J19M1p4O6K13l22J67J29m44L55k63j28K67J64k94Q7J58k28r8K33
6363B3O9o8j82J22l1P5j45j30K75l5j49J75k64K67l64M62k23Rl5Q3O0j3k19K88
$$ plain form
6387 50 52 21 -202 -83 90 170 224 56 -84 135 19 30 42 108 -157 0 233 33 80 216 81 133 247 -149
6411 -149 43 78 -127 -73 -77 5 -107 210 -46 83 122 51 -70 225 206 -88 2 -156 -91 340 103 -198 28
6434 28 -66 -17 88 -122 -117 106 -44 103 -186 -267 76 -62 -91 123 54 -42 -242 38 -333 -81 -104 74 -199
6457 -199 -111 138 79 76 -95 18 -42 -15 -91 -59 228 -134 -208 25 80 -43 172 -65 -3 109 273 296 52 232
6481 232 53 96 284 -161 80 148 17 -22 85 -20 -133 134 -258 1 375 -77 -175 -15 67 -40 -31 -12 71
6504 71 198 -30 -76 -21 145 -281 114 160 166 -149 18 -138 -75 82 -130 -219 165 -91 -90 123 -193 -308 -14
6527 -14 -59 -25 -57 240 -325 -42 79 29 -194 -38 -200 2 96 -66 -111 70 2 -76 -114 99 4 99 173 277
6551 277 27 182 183 61 200 266 0 60 -227 -201 149 185 182 203 6 -146 74 -137 -54 229 -182 158 43
$$ packed form
6387E0Kl1k23J19J73Q0N4j68j40K19j16J1J2O6k65J57K33k00M7J36j35N2J14l96
6411a49J92L5k05N4mQ2j12L17k56J29L9p1j21K95j9k94R0j58O5M31k37l01K26
6434B8r4M9J05k10NK23j50J47k89q1L43j38k9K14o9r6k00K80l71K52k3J78k73
6457a99Q8K49n9lj71J13o0K7p6L2K87l62p4K33N5j23K15k37O2J12J64K3k44J80
6481B32j79M3J88m45K41O8j31l9J07j05j13K67l92K59L74m52r8J60Q2j07RJ9Q3
6504G1J27k28m6N5J66m26L95M6Ol15J67j56O3J57k12q9L84k56JK13l16j15K94
6527a4m5L4l2K97n65K83J21n0k23J56j62K02R4j62m5J81o8p8l8K13r5R5P4J04
6551B77k50J55Jj22J39O6k66O0k87K6L50L6lK1j97j52K20k11Q3K83m11L40j15
$$ plain form
6574 43 112 -330 78 -88 -207 -222 3 16 206 -160 -44 -112 -183 42 -20 -95 178 -195 -211 -25 84 -169 -32
6597 -32 -310 -24 38 -164 -241 -144 -119 -121 -234 71 47 -50 -136 27 -105 -204 -143 -164 27 -89 208 -45 10 -112 -140
6622 -140 181 9 -5 153 249 1 55 83 61 114 172 -3 -90 -28 77 75 66 31 -24 279 -154 -2 -116 230 188
6647 188 -120 129 -42 108 -38 -43 -201 132 153 51 54 -227 -99 -172 -206 -147 136 174 144 185 -98 92 -229 -301
6671 -301 -264 -101 -52 -151 -306 -39 -88 16 -255 -22 74 -156 -149 59 -65 -179 -91 -29 -117 -7 -73 64 -183 -93
6695 -93 12 13 -134 -99 58 58 -26 189 46 -79 0 121 145 0 256 -161 -56 316 408 -50 113 104 -14 35
6719 35 -86 46 118 12 -30 97 -84 -23 -56 -212 149 -170 -85 21 316 88 -126 32 11 -161 56 3 -188
6742 -188 -348 237 -159 60 43 19 -165 113 -111 -312 -66 120 -82 -107 -8 -94 -167 247 -77 -114 -54 -170 41
$$ packed form
6574D3O9m42M08j66j19j5K25J3J90l66J16o8p1K25o2p5K73l73j6J86J09k53J37
6597c2k78K86O2k02p7R7K5kj13L05k4r7q6J63j32r9O1k1J91j16K97k53N5j22k8
6622a40L21j72j4J58R6k48N4K8k2N3N8j75q7O2J05krl5n5L03m33J52j14L46m2
6647A88l08K49j71J50j46nj58L33K1j02Lk81J28p3l4N9K83L8l0M1k83J90l21p2
6671c01L7J63M9r9j55K67m9J04k71K33R6k30PK08j24j14Q8O2q8J10o6J37k47R0
6695i3J05Jj47L5J57%q4K15j43j25P9J21K4j45K56m17J05L72R2m58J63rj18M9
6719C5j21J32P2j06m2J27j81O1l3j56L61l19Q5J06K95k28k14J58k1j72K17n3j91
6742a88j60N85l96K19j7k4j84K78k24k01K46J86k02k5R9q6p3M14l24l7O0j16K11
$$ plain form
6765 41 -304 63 -193 41 -14 -47 -72 194 -204 160 -13 -41 168 -13 -103 167 224 -117 -98 97 105 187 363 -65
6789 -65 324 278 175 -70 135 44 -63 -142 -77 -71 -72 454 -65 -222 100 27 18 26 138 -112 -203 108 36 -196 -220 174
6815 174 -126 -125 44 -156 77 -70 -228 18 -144 -77 41 -1 -2 -273 -181 -89 -57 -185 125 68 -18 83 136 -140
6839 -140 65 83 16 -111 -58 49 52 -73 73 280 27 -55 -170 -119 86 -104 72 202 283 44 -151 -79 -101
6862 -101 72 39 47 29 -60 -85 -116 25 -87 35 24 -112 -106 51 -132 136 -150 -116 -232 -19 -35 36 374 9
6886 9 -73 -92 9 -150 -248 14 -290 -95 131 -86 -202 -65 46 -51 -6 47 144 -37 127 34 94 -142 59 -63
6910 -63 11 125 -22 -34 161 -50 -128 6 -50 -143 51 154 156 -19 86 195 82 -95 -31 156 29 36 142 -92
6934 -92 125 41 42 -22 -19 260 215 132 258 279 173 20 192 5 48 68 165 176 136 208 98 195 -56 -81 16 226
$$ packed form
6765D1l45L67k56K34n5l3k5K66l98L64j73k8K09j81r0K70N7l41J9J95QQ2J76m28
6789f5L89m6j03k45K05r1j07p9O5OjN26n19j57L22p3rQJ12k50r1L11p2k32k4L94
6815A74l00JJ69k00K33j47j58K46j62O7J18m2jk71R2R2L2j28L10n7q6J01N3k76
6839a40K05J8o7j27N3J07Lj25J46K07k53q2j15N1K05j90J76J30Q1k39j95P2k2
6862a01J73l3Qj8q9k5l1J41j12J22j1j36OJ57j83K68k86L4j16K13j6P1L38l65
6886Iq2j9J01j59r8K62l04J95K26k17j16J37J11r7M5N3R7j81J64r3O0k36K01j22
6910f3P4J14j47j2J95k11p8J34n6r3J94J03Kj75J05J09j13j77O4J87j27PJ06k34
6934i2K17q4Jo4LK79m5q3J26K1j06j53J72j87M3K0R7J1m0P2j10R7k51k5R7K10
$$ plain form
6960 226 103 -204 -64 21 -116 -34 -211 52 -17 158 -4 73 -253 -157 152 36 -45 -27 -79 69 74 -229 -171 -99
6984 -99 -71 -176 152 132 -13 -94 -80 461 -196 -80 -56 -95 222 130 22 58 127 -21 198 271 -17 -154 -11 8
7008 8 255 290 98 25 324 261 20 19 172 11 -71 46 -159 181 -126 -36 -96 -14 -8 171 -166 -23 -26 -275 -96
7033 -96 13 161 -167 71 27 -113 -54 7 64 -110 -6 -155 -64 72 -237 33 11 -35 43 38 4 -65 55 -201
7057 -201 63 -40 51 118 36 -100 -255 127 -93 -53 219 77 217 172 144 -112 36 32 228 7 -43 48 195
7080 195 83 70 113 13 98 144 251 12 11 328 144 -90 121 34 131 -25 2 43 39 -229 -9 43 212 132 19
7105 19 74 -42 -31 169 9 88 60 18 -394 -199 -47 -34 94 -133 31 67 95 -13 -283 69 -132 46 99
7128 99 -249 3 -42 -135 -155 -160 100 -90 -221 -117 153 -105 -77 -223 82 135 140 -62 -163 -26 1 67 -150 40
$$ packed form
6960B26j23l07J40Q5j37Q2j77K63o9J75j62P7l26R6L09j16q1J8n2J48Nl03N8P2
6984i9K8j05L28k0j45q1J4N41o57J16K4l9L17r2j08L6O9j48K19P3k88j37J43J9
7008HK47L5j92p3K99o3k41jJ53j61q2J17k05L40l07R0o0Q2OJ79l37J43lk49J79
7033i6J09J48l28K38m4j40N9O1N7j74J04j49R1J36l09K70k2m6P8nl4o9J20k56
7057b01K64j03R1O7q2j36j55L82k20M0K72j42J40m5k8k56J48mJ96k21n0R1J47
7080A95j12j3M3j00Q5M6J07k39jL17j84k34K11q7R7j56K7M1mk68K20N2J69q0j13
7105A9N5j16J1K00j60P9k8m2m12J95J52J3J28k27J64L6K8j08k70L52k01J78N3
7128I9l48K52m5r3k0nK60j90j31J04K70k58K8j46L05N3Nk02j01J37K7O6k17J90
$$ plain form
7152 40 226 145 140 142 70 -144 -7 237 199 121 -8 40 135 14 -239 -256 90 133 27 133 83 119 214 102 9 18
7178 18 -16 285 -51 -281 160 58 -218 -163 121 -228 -192 -120 -99 -126 -139 -51 10 -226 -5 -5 -194 59 142 -84
7202 -84 74 118 101 -351 -36 305 -138 -194 9 -201 -101 50 -207 38 -86 30 161 -4 -72 -28 -235 -167
7224 -167 -140 141 -61 193 -39 397 -189 95 146 74 -28 -175 67 42 -24 34 220 207 55 45 -56 -26 98
7247 98 -164 -42 28 -13 172 237 4 84 16 -202 -29 -189 103 17 51 145 -44 231 -126 -178 5 -60 31 85
7271 85 -11 -217 -117 -310 30 -258 59 -241 34 -110 -165 -42 -227 32 -142 105 -217 -260 -167 142 -81 89
7293 89 -265 -15 -39 -161 -137 15 152 198 76 133 -31 166 58 124 105 129 -49 256 115 384 29 21 147
7316 147 -225 -286 103 257 -59 -85 139 -79 -77 50 -18 41 62 79 -74 -94 71 175 -59 226 57 22 -29 -13
$$ packed form
7152D0J86q1nKp2k14J37K44l8p8j29M8R5j21k53j7L46M3j06J06n0L6R5j12r3R
7178A8l4L01l36k30M41j02k76N5K84l49L6P2K1k7j3Q8O1k36K21%j89K53Q3k26
7202h4J58M4j7m52L15L41m43n6K03k10J00J51k57K45j24J16J31j65o8M4k07O8
7224a67K7K81k02K54k32M36n86K84N1p2j02j47K42k5o6N8J86j3j52j0j01L0J24
7247I8k62J22P0m1J85O5k33Q0o8k18J73j60K92q6L4R4j89K75l57n2J83o5R1N4
7271H5r6k06J00j93L40k88L17l00K75j44n5J23j85K59j74K47l22m3R3L09k23J70
7293H9l54K50k4j22K4J52J37M6j22N7j64J97j08O6j9K4j78L05j41K69l55qJ26
7316A47l72o1L89J54l16k6K24k18KJ27o8N9K1J7j53k0J65J04k34K85j69l5n1J6
$$ plain form
7340 -13 -56 -266 -117 34 72 -104 102 -128 -24 60 -227 -99 153 53 -205 -49 -291 -92 -242 -6 51 -172
7362 -172 -36 30 -37 -190 209 64 -38 14 212 81 -48 132 -284 -110 117 -42 205 -106 -93 45 92 -249
7384 -249 -202 29 180 303 83 147 167 -54 -17 62 191 69 -112 210 -101 -118 106 33 -61 -65 15 28 117 166 -85
7409 -85 -45 -46 88 -51 104 159 -236 -72 -284 -31 -81 -76 -253 1 -27 -133 -104 -286 -157 -82 -337 -121 289 -211
7433 -211 -255 -157 -324 -117 85 89 207 -44 206 26 27 29 199 -125 -18 -145 -163 103 70 -235 337 141 -43
7456 -43 98 80 36 120 261 -129 83 80 252 253 138 -20 52 -34 -37 -41 239 245 -31 -148 122 48 69 -62 55 -27
7482 -27 -112 -127 -22 -78 418 55 -126 -172 197 38 -153 243 -208 -105 -43 -79 -87 -63 -76 -226 -186 -95 -27 -148 -114
7507 -114 -108 -13 -68 -35 7 -18 -123 -11 60 77 275 -43 -18 13 -39 -59 61 6 77 -209 41 -29 -163 -96 6 20
$$ packed form
7340a3m3k10J49J51L8j76K06k30J04Q4k87J28K52j00k58J56k42J99j50K36N7k23
7362a72J36O6o7j53L99j45j02N2J98j31j29J80m16J74K27j59K47l11J3J38M7l41
7384b49M7K31J51J23k20O4K0k21L7P9J29j22j81L22l11j7K24p3r4mQ0J3Q9M9k51
7409h5M0jJ34j39J55N5l95J64k12K53n0Nj77K54k8j06K9j82J29P5k55K16M10n00
7433b11m4R8j67K07K02MJ18k51K50j80JKJ70l24J07j27j8K66l3l05N72j96j84
7456d3J41j8m4Q4J41l90K12lJ72Jj15j58P2q6lmK80Ok76j17K70p4K1j31J17q2
7482b7q5j5J05n6M96l63j81m6L69j59j91L96m51J03O2l6qK4j3j50M0R1O8j21L4
7507a14OR5n5L3M2k5j05J12P1J7J98l18K5L1n2k0J20n5P1k86K50p0j34O7J02J4
$$ plain form
7533 20 -88 -57 -42 8 141 154 118 40 157 61 402 -48 -117 92 -4 -135 232 46 17 266 17 126 185 45
7557 45 -244 -6 -16 100 -150 -22 15 120 9 -108 29 -15 -263 -35 -169 -74 -116 -62 -87 -152 54 -77 -30
7580 -30 -131 135 -96 -197 -34 -114 123 -345 -43 -32 -56 -109 22 14 -149 8 82 -32 -172 -35 139 -169 18
7603 18 3 87 221 -98 -145 -208 180 -216 62 323 92 37 23 -181 165 67 85 157 0 -117 47 328 134
7626 134 247 -13 -36 -20 -141 70 82 -34 -291 -55 -107 -190 -79 -118 -123 -67 58 -106 36 -53 113 -33 31 83
7650 83 -284 25 -217 -104 -124 10 -254 -128 0 111 -37 93 -288 -240 -17 11 -32 -142 -24 96 43 103
7672 103 37 -181 -14 -9 183 -17 174 -48 55 58 65 79 -9 11 90 10 41 -65 -161 -237 -137 9 2 -41 -55 9 -102
7699 -102 -26 136 174 20 59 77 -40 -28 -43 68 170 178 -154 131 70 -46 5 -5 -95 -205 44 -16 -137 80
$$ packed form
7533B0j08L1J5N0J33J3l6p8J17r6L41m50o9K09r6j31L67j86k9K49k49J09N9j40
7557D5k89K38j0J16k50J28L7J05j11j17J37m4k48K28j34R5m2N4k5o5K06j31M7
7580c0j01K66k31j01J63q0K37m68L02J1k4n3J31qj63J57P4j14j40J37J74l08J87
7603A8j5Q4J34l19m7o3L88l96K78K61k31n5j4k04L46r8J8P2j57j17J64K81j94
7626A34J13k60k3J6j21K11J2j16k57K36n2q3J11l9nN6J25j64J42q9J66j46O4N2
7650H3l67L09k42J13k0J34k64J26J28J11j48J30l81M8K23K8m3j10J18J20n3O0
7672A03o6k18J67NJ92k00J91k22J03LPJ4q8K0P9q0L1j06r6p6J00J46pm3j4O4j11
7699a02P6J62L8j54L9J8j17J2j5J11J02Ql32K85o1j16N1j0r0j10K49o0j21K17
$$ plain form
7723 80 -310 -171 -121 -74 -155 -159 -195 -48 -105 123 -34 63 55 -283 -96 49 81 -46 -88 -108 27 177 61 63 21 199
7749 199 -153 105 -18 -200 107 87 -256 179 211 41 -15 82 -196 -12 46 75 -94 -35 82 31 371 101 29
7772 29 75 84 22 302 4 117 39 -54 141 36 -267 -44 151 407 53 -44 -229 -31 91 -173 127 -9 -27
7795 -27 -49 -286 -165 61 -204 -157 -215 -244 -128 -39 -121 -29 -46 -19 195 -38 -192 40 -53 9 33 -20 268 -76 182
7820 182 62 2 30 224 -73 38 -32 -32 -113 -16 199 133 158 -14 -79 -112 43 -68 177 -112 340 -408 117 106
7844 106 349 -240 -27 323 -130 -264 55 151 147 83 72 -85 -35 96 -100 28 152 79 49 -296 272 -19 -67
7867 -67 32 192 55 -42 53 27 127 -121 79 93 33 -60 -319 -212 -185 -38 -109 29 -33 -35 -206 -21 55 -16 -13 -52
7893 -52 -127 -31 -72 -89 -149 183 -184 201 150 5 43 175 215 2 1 -119 8 82 -199 328 268 81 -80 121
$$ packed form
7723H0l90J39N0M7q1ml6J47n7K28j57R7ql38J87J45L2j27m2k0J35J50j16Km2J78
7749A99l52K58j23j82L07k0l43M35L2j70n6R7k78J84N8K9j69N9J17n1L40k70p2
7772B9M6Ro2K80k98J13p8r3J95j05l03K23J95K56l54r7j85J98J22k64L00j36j8
7795b7k2k37J21K26k65M7n8k9J16Q9q2R2j7K7K14k33j54K32r3O2K4n3K88l44K58
7820A82j20o0K8J94k97J11p0%q1R7K15o6K5j72o5l3J55j11K45k89M52p48N25j1
7844A06K43n89K13L50m53j34L19R6mo4j1j57N0J31j96J28J24p3l0l45N68k91m8
7867f7R9J60j37r7R5k6J00k48K00J4o0r3k59J07K7J47p1J38o2kj71J85P6p1Ll9
7893e2p5R6m1j7o0L32l67L85n1j45L8J32M0k13jj20J27P4k81N27o0j87j61K01
$$ plain form
7917 121 1 -138 266 -11 94 47 274 9 235 125 -55 -64 30 -79 -115 12 59 95 -136 122 -48 85
7939 85 -147 65 -105 -154 -82 69 -61 21 -132 -314 46 -155 -40 5 225 -158 -286 104 63 -26 -213 -55
7961 -55 11 55 -89 -102 -77 -284 37 -102 6 -7 28 24 -5 -161 -239 229 29 -134 -65 133 186 35 -83 129
7985 129 -25 122 80 -24 234 101 94 248 205 86 -90 138 -290 114 40 151 46 230 -75 -9 161 -30
8007 -30 -20 148 279 136 175 -132 196 -180 85 -65 17 -154 84 -207 197 -91 -249 -58 -129 -72 6 -197
8029 -197 -85 -3 -45 164 229 -24 -1 243 171 1 27 143 -161 151 -232 -12 -21 101 -26 -287 -69 -70 -324
8052 -324 148 -195 247 8 124 23 -360 114 39 15 -129 69 109 77 -16 162 -81 351 -38 19 23 18 -8 136
8076 136 166 -120 73 48 21 45 -258 148 -305 -41 -103 81 0 27 -10 117 -42 -134 59 46 139 -40 -109 -37
$$ packed form
7917A21j20j39M04k77J05m7K27k65K26j10j80rR4j09l6J27M7L6k31K58j70J33
7939H5k32K12j70m9P2J51j30Q2j53j82L60k01J15M5K20l83j28L90m1q9j87J58
7961e5O6M4j44j3K5k07L21j39J08j3L5mk9j56p8M68k00j63O9J98N3j51j18K12
7985A29j54J47m2j04K58j33pJ54m3j19j76K28m28M04p4J11j05J84l05O6J70j91
8007c0J0J68J31j43L9l07L28l76K65j50Q2j71K38k91M04k88j58J91p1N7P8k03
8029a97J12Q2m2K09O5k53K3K44p2j70K6J16l04L12l83K20rJ22j27k61K18jk54
8052c24M72l43M42k39J16j01l83M74p5k4j44J98M0l2r3J78k43M32l89N7Mnk6J44
8076A36L0k86J93k5k7K4l03M06m53K64o2J84q1K7l7J27j59r2J93j3R3j79o9P2
$$ plain form
8100 -37 -272 211 -94 -35 43 -275 373 108 -110 -130 55 -208 55 47 71 -143 231 -182 44 68 67 198 -132
8123 -132 -226 -14 168 -141 -50 74 128 -155 124 -238 103 59 138 -19 116 -83 43 -91 -87 108 38 -213 64
8146 64 182 -18 -22 87 155 -41 -252 -198 317 -160 89 -2 62 -3 -124 -190 217 -40 -22 81 188 -160 21
8169 21 -136 -111 -27 -80 87 -252 35 -34 98 -45 -169 45 -46 -147 42 -9 -44 -168 26 71 -122 35
$$ packed form
8100c7k35M83l05N9P8l18O48k65k18k0J85k63K63qK4k14L74m13K26K4jJ31l30
8123a32r4K12J82l09R1J24N4k83K79l62L41m4P9j57J35j99J26j34MJ95p0k51K77
8146F4J18k00mJ09O8j96k11N4N15m77K49r1O4o5j21o6M07k57J8J03J07l48J81
8169B1j57K5Q4n3J67l39K87o9J32j43j24K14r1j01J89n1l5j24J94M5j93J57
8191C5
$$ Imaginary data points
##PAGE= N=2
##DATA TABLE= (X++(I..I)), XYDATA
$$ plain form
0 0 0 0 0 0 0 0 0 0 0 8 -8 8 -11 16 -16 24 -25 32 -40 48 -59 72 -85 99 -117 136 -157 181 -209 241 -275 312
32 312 -355 401 -453 510 -571 640 -713 795 -887 984 -1089 1207 -1334 1474 -1625 1792 -1973
49 -1973 2175 -2394 2639 -2909 3211 -3548 3933 -4369 4870 -5456 6148 -6984 8016 -9322
63 -9322 11037 -13402 16872 -22469 32959 -59278 263452 343829 -160245 240155 160758 -122475
75 -122475 217928 293710 -65446 159428 264608 -41885 33661 204901 -18148 79089 270809
86 270809 -7064 -69888 167458 -4075 -54273 171990 21299 -106004 94610 -1689 -104144
97 -104144 78832 20765 -74386 81748 -10619 -156585 21333 20432 -121170 40779 37384
108 37384 -172712 -31605 59772 -135107 -33903 91445 -93671 -61274 54844 -102690
$$ packed form
0@%%%%%%%%%Qj6J6j9K7l2M0m9N7p2Q8j07J31j57J84k16K53k93L38l90M50n16N87
32C12o67P56q54R63j081J211j353J508j682J871k073K296k541K808l099L417l765
49a973M148m569N033n548O120o759P481q302R239j0326J1604j3132J5000j7338
63i322K0359k4439L0274l9341N5428r2237L22730Q0377n04074M00400p9397k83233
75a22475L40403P5782l59156K24874J05180l06493P5546J71240k23049R7237J91720
86B70809k77873o2824K37346j71533n0198K26263j50691j27303K00614r6299j02455
97a04144J82976n8067r5151J56134r2367j45966J77918r01j41602J61949l395
108C7384k10096J41107R1377j94879J01204J25348j85116L2397J16118j57534
$$ plain form
118 -102690 -88405 76819 -26732 -81830 42668 -33114 -109428 27899 14846 -72425 40110
129 40110 41982 -76256 -15522 9136 -56270 8002 29763 -37373 -4849 3009 -42243 1849
141 1849 6586 -31171 20052 21779 -43292 -7298 9989 -45263 3053 31126 -53814 -27969 28201
154 28201 -44668 -29612 39631 -31094 -37145 34755 -31678 -66697 10959 -9211 -46000 12178
166 12178 -8953 -64908 -14325 -486 -42305 -4798 7659 -36040 -8974 -4031 -44137 -11810
178 -11810 4269 -23652 4397 1288 -43408 -6853 14024 -19890 12611 28811 -24983 -5180
190 -5180 27345 -26923 -13062 45288 1142 -11176 36335 -8805 -31537 39596 25626 -11895
202 -11895 35362 25284 -20442 15295 27138 -8330 18470 37427 2764 5029 19066 5521
$$ packed form
118a02690J4285J65224j03551n5098J24498p5782p6314J37327j3053q7271J12535
129D0110J872j18238O0734K4658o5406O4272K1761o7136L2524P858m5252M4092
141A849M737l7757N1223J727o5071L5994J7287n5252M8316K8073q4940K5845N6170
154B8201p2869J5056O9243p0725o051P1900o6433l5019P7656k0170l6789N8178
166A2178k1131n5955N0583J3839m1819L7507J2457m3699K7066M943m0106L2327
178a1810J6079k7921K8049l109m4696L6555K0877l3914L2501J6200n3794J9803
190e180L2525n4268J3861N8350m4146j2318M7511m5140k2732P1133j3970l7521
202a1895M7257j0078m5726L5737J1843l5468K6800J8957l4663K265J4037j3545
$$ plain form
214 5521 16995 35146 23701 21776 16774 5444 21206 22772 13587 35077 29522 1837 23258
227 23258 26780 -2474 30078 52665 10669 15882 39198 -2410 2756 48972 15454 17 39070
240 39070 13075 -13866 26920 20245 -3331 30434 24258 -10365 4487 7039 -8674 11610 13521
253 13521 -7080 778 -5419 -18393 1080 -95 -14648 9022 1803 -32605 -8060 -2999 -36673
266 -36673 -3007 15661 -38893 -23837 11264 -40780 -31052 25662 -21246 -38151 20692 -18773
278 -18773 -57660 10621 849 -48150 6766 8664 -54801 -15831 12154 -39161 -13124 22764
290 22764 -25333 -26901 5842 -24512 -28238 9964 -6603 -21720 -668 -14177 -25870 -2719
302 -2719 -5241 -11210 7864 -5769 -19154 19 -12970 -18807 14043 -726 -22245 8651 -4039
$$ packed form
214E521J1474J8151j1445j925n002j1330J5762J566r185K1490n555k7685K1421
227B3258L522k9254L2552K2587m1996N213K3316m1608N166M6216l3518j5437L9053
240C9070k5995k6941M0786o675k3576L3765o176l4623J4852K552j5713K0284J911
253A3521k0601P858o197j2974J9473j175j4553K3670p219l4408K4545N061l3674
266c6673L3666J8668n4554J5056L5101n2044R728N6714m6908j6905N8843l9465
278a8773l8887O8281r772m8999N4916J898o3465L8970K7985n1315K6037L5888
290B2764m8097j568L2743l0354l726L8202j6567j5117K1052j3509j1693K3151
302b719k522n969J9074j3633j3385J9173j2989n837L2850j4769k1519L0896j2690
$$ plain form
315 -4039 -30069 11173 12577 -23880 8300 17954 -29687 -8242 20149 -18030 -6562 28118 -12669
328 -12669 -25810 16059 -630 -16713 22259 14009 -17197 5995 10449 -17185 1240 21630
340 21630 1947 1920 10675 -5683 -6070 11654 12289 10635 11862 6848 6312 1649 1555 16101 14198 6869
356 6869 19205 9873 -7840 13171 21811 5630 19666 29038 932 3844 25472 7178 5476
369 5476 31619 17891 343 21005 15851 -1744 20726 27308 6154 11841 19151 2705 6768
382 6768 21062 11061 7256 12705 4084 -803 6590 8015 11121 12606 3028 1337 -1075 -8492 2867
397 2867 9520 -1349 2167 4288 -14954 -14025 1818 -5327 -7482 7908 -3566 -22025 -7962 -7205
411 -7205 -22228 -5217 4299 -18498 -16907 -6688 -23941 -21890 -239 -7724 -19273 -8666 -13325
$$ packed form
315d039k6030M1242J404l6457L2180R654m7641K1445K8391l8179J1468L4680m0787
328a2669j3141M1869j6689j6083L8972q250l1206K3192M454k7634J8425K0390
340B1630j9683k7Q755j6358l87J7724O35j654J227n014n36m663r4J4546j903p329
356F869J2336r332j7713K1011Q640j6181J4036R372k8106K912K1628j8294j702
369E476K6143j3728j7548K0662n154j7595K2470O582k1154N687P310j6446M063
382F768J4294j0001l805N449q621m887P393J425L106J485r578j691k412p417J1359
397B867O653j0869L516K121j9242R29J5843p145k155J5390j1474j8459J4063P57
411g205j5023J7011R516k2797J591J0219j7253K051K1651p485j1549J0607m659
$$ plain form
424 -13325 -28057 -15652 -4871 -15824 -13319 -4643 -17510 -23843 -11089 -9845 -12577 -4724 -5142 -15773
438 -15773 -16229 -7993 -7971 -8673 -1616 -2622 -12169 -10839 -5888 -6506 -2139 5149 3198 -5187 -7284 -4076
454 -4076 -4344 167 10893 9119 -2069 -1599 452 -5408 848 14026 9805 2533 9003 1823 -10080
469 -10080 4688 15206 2070 5955 14485 -5483 -7219 12667 5302 -1122 16514 9876 -10643
482 -10643 1325 9377 -4047 5165 20025 1323 -6743 8537 -333 -5347 15716 13474 -1911
495 -1911 5456 7485 -3991 2190 12072 8802 5940 8465 4777 -3125 3617 14411 10256 6239 10350
510 10350 5592 -2343 5751 13281 8727 8991 16059 5892 -5291 8089 10618 2812 15626 18355
524 18355 -950 8 9462 1799 2345 15380 9506 -2914 5685 5457 -7651 1827 12093 1425
$$ packed form
424a3325j4732J2405J0781j0953K505Q676j2867o333J2754J244k732P853m18j0631
438a5773m56Q236K2p02P057j006r547J330M951o18M367P288j951q385k097L208
454d076k68M511J0726j774j1188M70K051n860O256J3178m221p272O470p180j1903
469a0080J4768J0518j3136L885Q530j9968j736J9886p365o424J7636o638k0519
482a0643J1968Q052j3424R212J4860j8702q066J5280q870n014K1063k242j5385
495a911P367K029j1476O181R882l270k862K525l688p902O742J0794m155m017M111
510A0350m758p935Q094P530m554K64P068j0167j1183J3380K529p806J2814K729
524A8355j9305R58R454p663N46J3035n874j2420Q599k28j3108R478J0266j0668
$$ plain form
538 1425 -1246 2305 -5940 -8476 670 4661 -2041 -5189 -751 -7915 -15911 -3187 606 -9194 -2796
553 -2796 -551 -17156 -16470 -2817 -8449 -13756 890 -3249 -23102 -11519 -2311 -20016 -9528 5845
567 5845 -16084 -19258 -1558 -15683 -20670 2714 -1126 -18178 -6746 -4235 -21923 -10643 4133
580 4133 -9590 -8129 3323 -12335 -17025 -2113 -2962 -5317 2302 -545 -7871 -6399 -3607 -3345 102
595 102 2655 1222 -1169 -5174 -4036 3275 2592 2162 9919 1601 -6792 5018 3966 -2950 11982
610 11982 13303 -3430 2921 9374 -3752 2216 19020 8326 -299 12738 4924 -7217 11731
623 11731 15456 -1033 8938 15007 -4689 -916 14189 4413 2967 16029 6478 -6038 6519
636 6519 8487 -1443 8186 13435 -143 -346 5939 -1315 655 10335 7282 1791 3405 933 -1665
$$ packed form
538A425k671L551q245k536R146L991o702l148M438p164p996J2724L793r800O398
553b796K245j6605O86J3653n632n307J4646m139j9853J1583R208j7705J0488J5373
567E845k1929l174J7700j4125m987K3384l840j7052J1432K511j7688J1280J4776
580D133j3723J461J1452j5658m690J4912q49k355P619k847p326J472K792K62L447
595A02K553j433k391m005J138P311o83m30P757q318q393J1810j052o916J4932
610A1982J321j6733O351O453j3126N968J6804j0694q625J3037p814j2141J8948
623A1731L725j6489R971O069j9696L773J5105r776j446J3062r551j2516J2557
636F519J968r930R629N249j3578k03O285p254J970R680l053n491J614k472k598
$$ plain form
651 -1665 2162 4833 5257 3994 251 -301 -72 -1199 3205 8695 2168 -623 3866 -3172 -4751 7781
667 7781 6099 -2756 5274 3497 -9424 -681 8250 -1513 2104 12250 -2596 -9189 4687 379
681 379 -5451 8057 6751 -8262 -1769 2312 -8127 -2558 7561 -634 -4556 1159 -5361 -9695
695 -9695 -2196 865 -3545 -3855 -3474 -7968 -9953 -4485 -1274 -4403 -5724 -3216 -7807 -12787 -5413 -2300
711 -2300 -9624 -5081 -1626 -14496 -13788 -1389 -7448 -10211 2821 -4862 -16959 -5185 -3462 -13397
725 -13397 -2431 3663 -10128 -9074 -1466 -10549 -9392 4242 1289 -4724 999 -2297 -8687 -1387
739 -1387 2643 1195 2342 2433 -341 -2017 -1753 3584 7095 3932 6061 7699 -1380 -659 10189 4641
755 4641 1408 13377 6487 -4525 8986 10242 -1987 10250 17149 -878 2880 14380 418
$$ packed form
651a665L827K671M24j263l743n52K29j127M404N490o527k791M489p038j579J2532
667G781j682q855Q030j777j2921Q743Q931r763L617J0146j4846o593J3876m308
681C79n830J3508j306j5013O493M081j0439N569J0119q195l922N715o520m334
695i695P499L061m410l10L81m494j985N468L211l129j321K508m591m980P374L113
711b300p324M543L455j2870P08J2399o059k763J3032p683j2097J1774J723r935
725a3397J0966O094j3791J054P608r083J157J3634k953o013N723l296o390P300
739a387M030j448J147R1k774j676K64N337L511l163K129J638r079P21J0848n548
755D641l233J1969o890j1012J3511J256j2229J2237O899j8027L758J1500j3962
$$ plain form
768 418 895 17672 7238 -3188 10739 6375 -5230 9427 14020 93 5531 11398 -2916 -2109
782 -2109 8636 3494 2059 9155 3300 -4963 72 2352 505 3618 5946 2753 -1389 -1847 -823
797 -823 -851 -889 4356 3211 -4538 -3239 -505 -4618 -832 6966 206 -4647 1254 -2452 -7288 1071
813 1071 4075 -3713 -1123 2490 -7046 -7250 3339 1466 -2471 3533 782 -8310 -3155 3748 -2105
828 -2105 -2683 3987 -1453 -8579 -913 1284 -5463 1410 7167 -4381 -7348 493 -4804 -6968 5516
843 5516 2791 -8887 -3168 -1535 -11038 -3690 5282 -4107 -4328 2497 -6937 -10965 -1730 -2448 -5328
858 -5328 27 -2407 -10034 -6622 -3141 -4190 -1408 -582 -4154 -4531 -5420 -6213 -1977 -2514 -3341 1469 -3851
875 -3851 -9584 -1738 -1166 -5200 4633 4856 -7159 -1832 3992 -5929 -1543 9279 -1078 -3846 8248
$$ packed form
768D18M77J6777j0434j0426J3927m364j1605J4657M593j3927N438N867j4314Q07
782b109J0745n142j435P096n855q263N035K280j847L113K328l193m142m58J024
797h23k8l8N245j145p749J299K734m113L786P798o760m853N901l706m836Q359
813A071L004p788K590L613r536k04J0589j873l937O004k751r092N155O903n853
828b105n78O670n440p126P666K197o747O873N757j1548k967P841n297k164J2484
843E516k725j1678N719J633r503P348Q972r389k21O825r434m028R235p18k880
858e328N355k434p627L412L481j049K782Q26l572l77q89p93M236n37q27M810n320
875c851n733P846N72m034R833K23j2015N327N824r921M386J0822j0357k768J2094
$$ plain form
890 8248 73 -6743 8407 8366 -1466 8060 8153 -4553 2827 10227 2750 4461 10357 3060 293 6523
906 6523 5509 3725 8486 9480 5593 4756 3054 3741 5207 5543 8773 6259 -129 3392 6124 512
922 512 5131 10500 1432 898 7379 -624 -3248 8051 4851 -3224 5048 2016 -8596 382 6639
937 6639 -2384 1227 6297 -5611 -5579 2512 -2639 -4223 3108 170 -4993 -2601 -3269 -4609 -611 992
953 992 -598 -2156 -4940 -3806 -2099 -4146 -320 1841 -5907 -6062 -140 -5777 -6076 5166 116 -7263
969 -7263 1892 -1609 -11972 -90 5449 -7324 -1323 4189 -9664 -7141 5276 -2244 -5229 6219
983 6219 53 -9190 215 1598 -6770 1218 5063 -5804 -4938 320 -4641 -2939 4591 1419 -3031
998 -3031 -1863 -2466 -3807 -2330 654 763 -1851 -2080 -2436 -4951 -3620 1756 2220 -1901 -699 -314 -5679
$$ packed form
890H248q175o816J5150m1r832R526R3j2706P380P400p477J711N896p297k767O230
906F523j014j784M761R94l887q37j702O87J466L36L230k514o388L521K732n612
922E12M619N369r068n34O481q003k624J1299l200q075Q272l032j0612Q978O257
937F639r023L611N070j1908L2Q091n151j584P331k938n163K392o68j340L998J603
953I92j590j558k784J134J707k047L826K161p748j55N922n637k99J1242n050p379
969g263R155l501j0363J1882N539j2773O001N512j3853K523J2417p520k985J1448
983F219o166r243R405J383q368P988L845j0867Q66N258m961J702P530l172m450
998c031J168o03j341J477K984J09k614k29l56k515J331N376M64m121J202L85n365
$$ plain form
1015 -5679 -3001 3337 -1646 -2456 2514 -2411 -5872 231 1590 -1864 1884 4369 -2532 -4029 2425
1030 2425 817 -1912 4476 3262 -3472 374 3952 -936 259 7153 4296 -1198 4566 4937 -2389
1045 -2389 3699 9755 -113 443 8641 775 -980 9525 6226 374 8285 7100 -2077 3250 8990
1060 8990 999 3412 10187 1277 -791 6229 2121 835 7096 5112 1880 3747 1896 -213 1360
1075 1360 2752 2723 2305 305 -1041 319 -1341 -1050 3566 368 -3083 1803 -2264 -7332 876 320
1091 320 -6861 -303 303 -8901 -4100 1665 -6208 -4740 3161 -4671 -9491 99 -2775 -8613 346
1106 346 -139 -8939 -3717 -1114 -7137 -3247 1576 -2608 -4254 -2272 -3627 -5276 -1918 910 -1401
1121 -1401 -2608 -1840 -2770 -4033 -1828 2141 402 -1266 2114 -823 -5644 217 2887 -1930 2007
$$ packed form
1015e679K678O338m983q10M970m925l461O103J359l454L748K485o901j497O454
1030B425j608k729O388j214o734L846L578m888J195O894k857n494N764L71p326
1045b389O088O056r868N56Q198p866j755J0505l299n852P911j185r177N327N740
1060H990p991K413O775q910k068P020m108j286O261j984l232J867j851k109J573
1075A360J392k9m18k000j346J360j660K91M616l198l451M886m067n068Q208n56
1091C20p181O558O06r204M801N765p873J468P901p832m820R590k874n838Q959
1106C46m85q800N222K603o023L890M823m184j646J982j355j649L358K828k311
1121a401j207P68r30j263K205L969j739j668L380k937m821N861K670m817L937
$$ plain form
1136 2007 3517 -4795 -2950 3705 -1099 -522 5637 1320 -3071 1327 667 -3115 2600 4373 -1527
1151 -1527 -442 341 -2499 260 2959 1546 1473 -257 -1283 120 -919 372 3580 692 -2219 828
1167 828 -1350 -4350 3859 4831 -2361 1880 3619 -5678 -1790 6425 -1644 -1018 7628 -1072 -5971 4532
1183 4532 2078 -3420 6879 6359 -3792 1327 4852 -2866 1623 8320 1138 -64 4456 -28 -838
1198 -838 4988 4389 2713 4470 2738 590 1234 1768 3846 4614 2203 2202 2106 -1556 1440 5630 988
1215 988 1409 5674 -731 -2974 3908 1062 -2362 5387 2429 -5329 -32 1433 -4219 630 4665
1230 4665 -2850 -2788 920 -3894 -4258 1048 -909 -3164 -1149 -2931 -5148 -3273 -1906 -1509 -1738 -3376
1246 -3376 -3104 -3917 -6086 -1830 -533 -4816 -2642 -524 -7290 -5707 1849 -4025 -4515 3429 -2858 -9041
$$ packed form
1136B007J510q312J845O655m804N77O159m317m391M398o60l782N715J773n900
1151a527J085P83k840K759K699j413p3j730j026J403j039J291L208k888k911L047
1167H28k178l000Q209R72p192M241J739r297L888Q215q069O26Q646q700m899J0503
1183D532k454n498J0299n20j0151N119L525p718M489O697p182j202M520m484q10
1198h38N826n99j676J757j732k148O44N34K078P68k411jr6l662K996M190m642
1215I88M21M265o405k243O882k846l424P749k958p758N297J465n652M849M035
1230D665p515O2L708m814l64N306j957k255K015j782k217J875J367L97k29j638
1246c376K72q13k169M256J297m283K174K118o766J583P556n874m90P944o287o183
$$ plain form
1262 -9041 1068 -1045 -7547 2479 3379 -7257 -1612 2504 -6517 -1772 6017 -2288 -2579 4216 -2615
1277 -2615 -4498 3914 937 -1765 4151 781 -3303 1774 1473 -332 4530 2414 -1280 2675 658
1292 658 -2011 4791 3102 -1304 4305 2251 -4522 2833 4699 -2571 3846 6405 -4062 -421 6424
1307 6424 -2835 -902 8034 -514 -3947 5519 -144 -5079 5726 3917 -3894 2833 3094 -5423 732
1322 732 4959 -1688 735 4022 -1897 -2057 1596 -366 465 3388 758 130 745 -1149 722 2568
1338 2568 21 1781 2794 -2319 51 3654 -866 1223 5817 -745 -2295 3932 -422 -2142 5475
1353 5475 2718 -2228 2878 2035 -3848 1733 4915 -874 1260 3555 -2256 -1373 2785 -376 131 2259
1369 2259 -762 -1171 -153 -1756 -34 1440 -1433 -88 -499 -4326 -1350 1082 -3317 -1459 2073
$$ packed form
1262i041J0109k113o502J0026R00j0636N645M116r021M745P789q305k91O795o831
1277b615j883Q412k977k702N916l370m084N077l01j805M862k116l694L955k017
1292F58k669O802j689m406N609k054o773P355J866p270O417K559j0467L641O845
1307F424r259J933Q936q548l433R466n663m935J0805j809p811O727K61q517O155
1322G32M227o647K423L287n919j60L653j962Q31K923k630o28O15j894J871J846
1338B568k547J760J013n113K370L603m520K089M594o562j550O227m354j720P617
1353E475k757m946N106q43n883N581L182n789K134K295n811Q83M158l161N07K128
1369B259l021m09J018j603J722J474k873J345m11l827K976K432m399J858L532
$$ plain form
1384 2073 -4864 -4983 1588 -3999 -4998 3498 -1689 -7563 797 -1824 -8315 569 1802 -6938 -2092
1399 -2092 1644 -7363 -4404 2541 -4241 -3853 2984 -3306 -6150 578 -1258 -4107 1827 32 -3854
1414 -3854 -468 -976 -3074 650 646 -1156 1543 -485 -2383 1349 447 -1195 3627 1977 -2768 2659
1430 2659 2754 -2422 3393 5380 -2100 1128 5336 -1905 -58 7252 961 -1072 5686 1387 -2646
1445 -2646 4861 3671 -1361 4127 4624 -2184 700 3965 -340 1724 4970 498 -312 2012 368
1460 368 -40 1818 1757 1648 807 -501 242 68 -173 2238 1526 -2082 543 1148 -3168 -242 3298 -1559
1478 -1559 -1054 2698 -2254 -3710 3251 647 -2841 2743 871 -4498 238 2083 -2404 511 2817
1493 2817 -2105 -1797 1636 -1200 -1081 2987 919 -1139 332 -818 -1016 1268 869 800 1404 -1147 -560
$$ packed form
1384B073o937j19O571n587r99Q496n187n874Q360k621o491Q884J233q740M846
1399b092L736r007K959O945o782L88O837o290k844O728j836k849N934j795l886
1414c854L386n08k098L724mj802K699k028j898L732r02j642M822j650m745N427
1430B659R5n176N815J987p480L228M208p241J847P310o291k033O758m299m033
1445b646P507j190n032N488M97o808K884L265m305K064L246m472q10K324j644
1460C68m08J858o1j09q41j308P43j74k41K411p12l608K625O05m316K926L540m857
1478a559N05L752m952j456O961k604l488N584j872n369M736J845m487K915K306
1493B817m922L08L433k836J19M068k068k058J471j150j98K284l99o9O04k551N87
$$ plain form
1510 -560 631 -1351 656 3117 -255 -1064 1278 -1693 -2482 2454 1294 -2877 1505 476 -5266 161
1526 161 2456 -3262 -283 2631 -3813 -3604 1400 -2347 -3049 2101 -277 -4928 -1389 -395 -4738 -652
1542 -652 1836 -2892 -2826 -781 -3503 -3054 29 -853 -1988 -1044 -1565 -2801 -2689 -981 170 -708 -751 -760
1560 -760 -2263 -1980 -33 489 -504 67 1005 -1507 -1571 1457 290 49 2982 1242 -1445 733 1725
1577 1725 270 2015 3563 1061 -73 2115 1625 49 3035 4171 1380 1599 2881 308 569 3890
1593 3890 3453 867 2375 2743 -662 1054 3982 1268 741 4214 1159 -1591 1925 2113 -519 2527
1609 2527 3089 -1564 -857 2428 -1049 -835 2813 445 -1855 817 -333 -2401 504 914 -1060 -614
1625 -614 -160 -1767 -1804 -146 -389 -252 -335 -1130 -1380 -1623 -1352 425 -243 -1771 46 -867 -3140 -222
$$ packed form
1510e60J191j982K007K461l372q09K342k971p89M936j160m171M382j029n742N427
1526A61K295n718K979K914o444K09N004l747p02N150k378m651L539R94m343M086
1542f52K488m728O6K045k722M49L083q82j135R44n21j236J12J708J151q78m3r
1560g60j503K83J947N22r93N71R38k512o4L028j167k41K933j740k687K178R92
1577A725j455J745J548k502j134K188m90j576K986J136k791K19J282k573K61L321
1593C890m37k586J508L68l405J716K928k714n27L473l055k750L516J88k632L046
1609B527N62m653P07L285l477K14L648k368k300K672j150k068K905M10j974M46
1625f14M54j607l7J658k43J37q3p95k50k43K71J777o68j528J817r13k273K918
$$ plain form
1643 -222 967 -1610 -108 1706 -2358 -2576 1250 -780 -1748 2353 517 -3654 305 1019 -2656 451
1659 451 2769 -1640 -601 2190 -1807 -2015 2120 777 -1479 900 118 -2833 -232 1455 -598 -163
1675 -163 1051 -819 -1406 -160 -124 -838 130 677 -927 -1935 -1215 -368 -947 -400 544 -1173 -2294 -238
1693 -238 -669 -2342 -211 1068 -1905 -1342 449 -2448 -1992 1636 74 -2079 661 -444 -2731 294
1709 294 1469 -1089 -178 1346 -1518 -1363 1230 237 205 2158 1282 -867 -79 1022 626 1046 2101
1726 2101 1586 399 219 1233 1634 1227 2981 2952 319 772 2095 -40 1316 4279 1939 -259 2351
1743 2351 1140 -1502 2749 3950 -170 1499 3002 -1617 -515 3501 419 -563 3161 801 -2572
1758 -2572 1292 1297 -1571 1401 2336 -1995 -1318 1062 -1338 -776 1597 -887 -2196 -539 -1583 -1950 36
$$ packed form
1643b22J189k577J502J814m064k18L826k030r68M101j836m171L959P14l675L107
1659D51K318m409J039K791l997k08M135j343k256K379p82k951K601J687k053M35
1675a63J214j870n87J246L6p14R68N47j604j008P20Q47n79N47R44j717j121K056
1693b38m31j673K131J279k973N63J791k897M56L628j562k153K740j105k287L025
1709B94J175k558R11J524k864J55K593r93l2J953q76k149P88J101l96M20J055
1726B101n15j187j80J014M01m07J754k9k633M53J323k135J356K963k340k198K610
1743B351j211k642M251J201m120J669J503m619J102M016l082r82L724k360l373
1758b572L864Nk868K972R35m331O77K380k400N62K373k484j309J657j044l67J986
$$ plain form
1775 36 -456 -710 -57 -1877 -2592 -942 -1569 -1063 737 -1809 -2713 -492 -1931 -2483 925 489 -2620 185
1793 185 -45 -3892 -587 2055 -2302 -661 2363 -2756 -3154 2087 -299 -2222 2633 935 -3273 594
1809 594 1264 -2795 542 3071 -1353 -1012 1849 -1481 -1291 2553 496 -1163 1168 179 -1506 740
1825 740 888 -40 524 432 -711 -567 -11 -95 1233 499 -352 346 -642 -1463 819 495 -1252 802 470
1844 470 -2759 -562 1054 -1387 -384 2271 -1139 -1995 1479 -554 -1947 1582 1043 -2482 218 711
1860 711 -1996 79 2315 -1 -196 1450 -54 -1173 1249 1470 20 1014 1323 -161 99 1368
1876 1368 1076 966 1552 1930 882 530 1763 1555 234 2286 2085 -421 506 1934 611 686 2888
1893 2888 1201 -524 1832 1336 -934 1379 2452 -415 214 1384 -957 -892 1487 671 -601 776
$$ packed form
1775C6m92k54O53j820p15J650o27N06J800k546r04K221j439n52L408m36l109K805
1793A85k30l847L305K642m357J641L024n119l98N241k386j923M855j698m208L867
1809E94O70m059L337K529m424L41K861l330J90L844k057j659K331r89j685K246
1825G40J48r28N64r2j143J44N56q4J328p34q51O98r88q21K282l24j747K054l32
1844D70l229K197J616k441J003K655l410q56L474k033j393L529n39l525K700M93
1860G11k707K075K236k316j95J646j504j119K422K21j450R94L09j484K60J269
1876A368k92j10N86L78j048l52J233k08j321K052k01k506R27J428j323P5K202
1893B888j687j725K356m96k270K313J073k867O29J170k341O5K379q16j272J377
$$ plain form
1909 776 21 -1669 -384 537 -604 -515 170 -1276 -2096 -1213 -691 -1054 -379 46 -1387 -2266 -1459 -808 -1608
1928 -1608 -802 -171 -1816 -2197 -931 -1625 -2235 -105 126 -1826 -1367 -223 -2402 -1760 718 -199 -1740
1945 -1740 320 -375 -2443 -260 940 -925 -483 1500 -799 -1765 975 701 -1339 1405 1159 -1413
1961 -1413 -96 1777 -564 -58 2393 648 -868 1338 931 -830 1412 1673 -214 348 1185 -478
1977 -478 -132 1278 670 131 904 243 -508 -31 212 283 350 315 439 -102 -727 80 719 -99 622 1166 -1062
1998 -1062 -1130 827 -105 -935 1678 546 -1927 538 756 -1799 459 2166 -1312 -671 1676 -1117
2014 -1117 -1454 2187 962 -1383 1126 968 -1553 671 2157 -753 707 2538 -205 -265 1268 344
2030 344 160 1719 1224 -442 590 666 22 1004 1426 987 467 349 227 497 313 721 1292 214 -389
$$ packed form
1909G76p55j690J285R21j141Q9O85j446q20Q83N22l63O75M25j433q79Q07O51q00
1928a608Q06O31j645l81J266o94o10K130K31j952M59J144k179O42K478r17j541
1945a740K060o95k068K183J200j865M42J983k299r66K740k74k040K744k46k572
1961a413J317J873k341N06K451j745j516K206m07j761K242K61j887N62Q37j663
1977d78L46J410o08n39P73o61p51M77K43P1O7l5J24n41o25Q07O39q18P21N44k228
1998a062o8J957r32q30K613j132k473K465K18k555K258J707l478O41K347k793
2014a117l37L641j225k345K509j58k521K224J486k910J460J831k743o0J533r24
2030C44j84J559m95j666J032P6o44R82M22m39n20j18j22K70j84M08N71j078o03
$$ plain form
2049 -389 628 -481 -803 1405 803 -1008 292 32 -1846 -229 1046 -1042 -661 359 -1710 -2055
2065 -2055 191 -592 -1635 34 -294 -2455 -1561 -564 -1639 -948 -25 -1244 -2083 -1029 -726 -1518 -659
2082 -659 105 -994 -1630 -894 -911 -1380 -692 488 -1312 -1159 -72 -795 -1356 662 524 -1274 114 506
2100 506 -1343 -371 1437 -282 -270 1592 52 -1008 1043 1119 -143 1432 1454 -469 311 1530 251
2117 251 804 1801 806 250 886 428 389 1268 1155 993 526 375 288 851 399 1143 1253 -27 427 789
2137 789 -497 -266 1361 223 -307 1295 -123 -1415 839 789 -1122 238 1113 -1837 -623 1477
2153 1477 -724 -974 1698 -315 -1651 713 238 -1358 389 1287 -1136 -467 835 -1005 -506 1291
2169 1291 107 -595 729 330 -725 198 703 -213 293 755 -312 -232 218 294 539 237 480 250 -291
$$ packed form
2049c89J017j109l22K208o02j811J300k60j878J617J275k088L81J020k069l45
2065b055K246p83j043J669l28k161Q94R97j075O91R23j219q39J054L03p92Q59
2082f59P64j099o36P36j7m69O88J180j800J53J087p23n61K018j38j798J388L92
2100E06j849R72J808j719J2J862j540j060K051P6j262J575K2j923P80J219j279
2117B51N53R97r95n56O36m58l9Q79j13j62m67j51q7N63m52P44J10j280M54L62
2137G89j286K31J627j138n30J602j418j292K254n0j911J360Q75k950J214K100
2153A477k201k50K672k013j336K364m75j596J747Q98k423O69J302j840M99J797
2169A291j184p02J324l99j055R23N05r16N06M62j067Q0M50P6K45l02K43k30n41
$$ plain form
2188 -291 -43 824 167 90 840 48 -711 -174 409 -487 308 866 -424 -789 431 -594 -996 745 272
2207 272 -1163 -186 101 -1428 -730 755 -1139 -980 37 -852 -1857 104 -38 -1468 -647 47 -1625
2224 -1625 -1796 -50 -958 -1449 216 -478 -1953 -698 120 -1088 -681 218 -808 -999 -94 -311 -907 265
2242 265 558 -758 -466 118 -349 -478 869 309 -14 207 431 -209 -82 1084 880 446 925 643 159
2261 159 699 1146 603 942 1468 865 42 793 1268 667 1067 1425 760 137 1093 837 404 911 1380 -10
2281 -10 159 831 50 45 1298 702 -315 615 689 -523 83 1070 -166 -426 605 -467 -1080 392 530
2300 530 -971 -298 361 -1075 -888 575 -553 -1093 810 -314 -1716 -370 101 -1053 104 1186
2316 1186 -704 -905 35 -531 -894 622 229 -527 104 -29 -773 -246 377 -246 146 164 34 -264 -83
$$ packed form
2188b91K48Q67o57p7P50p92p59N37N83q96P95N58j290l65J220j025m02J741m73
2207B72j435R77K87j529O98J485j894J59J017q89j005J961j42j430Q21O94j672
2224a625j71J746r08m91J665o94j475J255Q18j208M07Q99j026j91R05k17n96J172
2242B65K93j316K92N84m67j29J347n60l23K21K24o40J27J166k04m34M79k82m84
2261A59N40M47n43L39N26o03q23P51M75o01M00L58o65o23R56k56m33N07M69j390
2281a0J69O72p81nJ253n96j017R30P4j212O06R87j236k60J031j072o13J472J38
2300E30j501O73O59j436J87J463j128n40J903j124j402J346M71j154J157J082
2316A186j890k01R40n66l63J516l93p56O31j33p44N27O23o23L92J8j30k98J81
$$ plain form
2335 -83 -73 426 395 28 457 -58 -654 179 713 -426 298 633 -957 -433 978 -574 -671 1166 -347
2354 -347 -1444 823 74 -1507 727 966 -1809 -466 1015 -1994 -736 1209 -959 -1474 805 -760
2370 -760 -1896 295 -36 -1654 208 522 -1612 -650 386 -1012 -528 383 -847 -875 -243 -583 -698 475
2388 475 -283 -80 7 -744 -473 569 -321 129 1104 -343 -127 1219 -127 -77 1878 635 -366 1270
2406 1270 1062 -800 1410 1962 -433 950 1900 -512 36 1971 509 183 2075 878 -507 1389
2422 1389 1017 -198 1145 1272 -198 533 876 -58 320 1046 250 195 317 207 152 110 352 491 -137 -630
2442 -630 -213 -250 -838 494 164 -1152 -52 87 -1718 -321 637 -932 -925 768 -988 -1684 482 -273
2460 -273 -1402 265 32 -1507 -389 188 -1317 -266 795 -984 -776 -138 -727 -549 228 -139 -253
$$ packed form
2335h3J0M99l1l67M29n15n96Q33N34j139P24L35j590N24J411j552r7J837j513
2354c47j097K267p49j581K234K39k775J343J481l009J258J945k168n15K279j565
2370g60j136K191l31j618J862L14k134R62J036j398M84R11j230k8O32l40j15J173
2388D75p58K03Q7p51K71J042q90M50R75j447K16J346j346N0J955j243j001J636
2406A270k08j862K210N52k395J383R50k412N48J935j462l26J892j197j385J896
2422A389l72j215J343J27j470P31L43r34L78P26p96n5J22j10n5m2K42J39o28m93
2442f30M17l7n88J332l30j316J100J39j805J397R58j569PJ693j756o96K166p55
2460b73j129J667k33j539J118N77j505J051J061j779K08O38n89J78P77l67j14
$$ plain form
2477 -253 -162 -385 -442 158 -339 22 498 -398 -355 250 -530 -99 862 -39 -702 624 -217 -1235 923 583
2497 583 -849 384 895 -1277 30 1194 -1134 -462 1549 -568 -1257 877 -261 -1086 1009 412
2513 412 -1436 186 557 -1330 -167 853 -849 -467 458 -664 -1069 174 -285 -360 449 -154 -837 -312
2531 -312 -221 -495 439 31 -293 -218 -476 -485 480 97 -149 585 -50 -791 635 514 -286 801 818 -332 40
2552 40 1096 -206 464 1457 465 -91 1307 664 -165 953 1040 153 927 1419 72 126 1233 640 223
2571 223 883 349 -230 429 889 114 115 934 -191 -578 470 113 -268 93 692 -316 -490 243 -490 -760
2591 -760 144 -89 -630 -216 -138 -845 -435 -298 -249 -706 -254 -650 -932 -857 -360 -321 -690 -568 -651 -1027 -818 -236
2613 -236 -398 -634 14 -54 -830 -354 124 -819 -255 226 -748 -570 394 -369 -686 806 97 -873 96 413
$$ packed form
2477b53R1k23n7O00m97L61M76q96M3O05p80M31R61r01o63J326q41j018K158l40
2497E83j432J233N11k172J307J164k328O72K011k117o89K134j138q25K095n97
2513D12j848J622L71j887J163J020j702L82R25j122m05J243m59p5Q09o03o83N25
2531c12R1k74R34m08l24P5k58rR65l83k46P34o35p41J426j21q00J087J7j150L72
2552D0J056j302O70R93r92n56J398o43q29J118Q7q87P74M92j347N4J107n93m17
2571B23O60n34n79O59M60p75JQ19j125l87J048l57l81L61N99j008j74P33p33k70
2591g60R04k33n41M14P8p07M10J37M9m57M52l96k82P5M97L9l69J22q3l76K09N82
2613b36j62k36O48o8p76M76M78r43N64M81r74J78R64p63l17J492p09r70R69L17
$$ plain form
2633 413 -418 244 965 -28 -389 817 -118 -464 1021 567 -172 545 532 -379 -270 604 269 286 470 -45
2653 -45 -144 318 48 325 408 427 110 -402 -176 365 -195 -121 513 96 -462 9 254 -794 321 386 -799
2674 -799 -380 215 -719 -598 622 -215 -678 336 -383 -890 244 347 -203 16 337 -296 -106 174 11
2693 11 365 422 8 26 -120 -59 694 331 461 602 8 -703 455 848 -525 798 988 -323 104 961
2713 961 -286 159 1538 128 -522 1263 75 -676 1290 857 -596 654 950 -1011 -23 1005 -584
2730 -584 -203 799 -463 -479 663 -508 -677 645 -244 -761 84 -321 -649 28 -40 -795 58 -534 -1101
2749 -1101 -19 -673 -759 65 -398 -1503 -212 -429 -1343 -188 74 -1571 -473 430 -1147 -897 611
2766 611 -532 -784 842 -513 -1109 542 306 -961 384 662 -804 41 617 -564 -92 900 43
$$ packed form
2633D13q31O62P21r93l61J206r35l46J485m54p39P17j3r11J09Q74l35J7J84n15
2653d5r9M62k70K77Q3J9l17n12K26N41n60P4O34m17n58M71K45j048J115O5j185
2674g99M19N95r34J21J220q37m63J014p19n07J134J03n50K19L21o33J90K80j63
2693A1L54N7m14J8j46O1P53l63J30J41n94p11J158L93j373J323J90j311M27Q57
2713I61j247M45J379j410o50J785j188p51J966m33j453J250K96j961R88J028j589
2730e84L81J002j262j6J142j171j69J322q89n17Q45m05l28O77o8p55Q53n92n67
2749a101J082o54q6Q24m63j105J291k17r14J155K62j645J098R03j577K50J508
2766F11j143k52J626j355n96J651k36j267J345K78j466Q45N76j181M72R92q57
$$ plain form
2783 43 -132 727 -85 -296 671 451 221 380 478 434 418 596 362 608 193 477 280 -359 350 807 -42
2804 -42 147 835 -2 -56 823 -82 -534 729 836 -473 70 411 -459 83 540 -209 -379 285 -469 -504
2824 -504 173 44 -327 -99 -265 -518 -48 -199 97 78 -358 -135 -285 -358 199 330 -545 -141 507 -612
2844 -612 -229 910 31 -226 829 189 -547 601 271 -739 626 612 -531 -142 686 -248 77 853
2862 853 175 -51 726 167 -319 506 461 -126 285 346 -327 -197 369 115 -35 217 -178 -191 -475 -410 -84
2883 -84 -104 -302 -120 -251 -813 -199 -166 -599 -64 62 -1025 -631 102 -868 -614 15 -398 -1295 -108 -271
2903 -271 -832 -5 -39 -899 -579 227 -856 -534 -130 -331 -589 -65 -383 -730 -411 162 -55 -213 418 -21
2923 -21 -387 -17 364 16 -33 506 192 -564 328 269 -9 450 876 33 268 615 137 16 579 264 -234
$$ packed form
2783D3j75Q59q12k11R67k20k30J59R8m4j6J78k34K46m15K84j97o39P09M57q49
2804d2J89O88q37n4Q79r05m52J263J07j309N43L41q70N42M57p49j70O64p54l5
2824e04O77j29l71K28j66k53M70j51K96j9m36K23j50p3N57J31q75M04O48j119
2844f12L83J139q79k57J055o40p36J148l30j010J365j4j143L89Q28r34L25P76
2862H53o78k26P77n59m86Q25m5n87M11O1o73J30N66k54j50K52l95j3k84O5L26
2883h4k0j98J82j31n62O14L3m33N35J26j087L94P33r70K54O29m13q97J187j63
2903b71n61Q27l4q60L20Q06j083L22M04k01k58N24l18l47L19N73k17j58O31m39
2923b1l66L70L81l48m9N39l14p56Q92n9k78M59M26q43K35L47m78j21N63l15m98
$$ plain form
2944 -234 691 508 -270 299 504 255 641 586 -93 69 351 365 129 190 24 460 97 156 55 -146 205
2965 205 146 -277 -344 219 -120 -323 492 373 -684 -474 199 -442 -250 375 -277 -736 -65 -269 -653 42
2985 42 147 -466 -273 8 -517 -374 344 -132 -455 119 -88 -603 132 191 -37 -44 210 -169 -395 151 400
3006 400 41 185 246 -95 -385 332 135 7 497 664 -148 213 359 -219 135 507 161 -38 351 -74
3026 -74 -197 272 290 -289 -15 6 -250 -223 40 -164 -188 -175 -154 -320 -526 -290 60 -417 -216 -217 -819 -665 18
3049 18 -122 -629 -27 -23 -679 -413 126 -374 -461 549 -471 -641 400 -529 -836 343 331 -411 211 398
3069 398 -366 -24 404 -118 -197 480 27 68 416 370 162 165 569 6 455 128 512 367 344 549 578 452
3091 452 530 640 188 109 746 281 -25 448 79 136 373 501 274 265 435 -209 -22 579 -59 -121 179 -12
$$ packed form
2944b34R25j83p78N69K05k49L86n5o79J62K82J4k36O1j66M36l63N9j01k01L51
2965B05n9m23o7N63l39k03Q15j19j057K10O73o41J92O25o52m59O71k04l84O95
2985D2J05o13J93K81n25J43P18m76l23N74k07n15P35N9k28pK54l79k26N46K49
3006D00l59J44O1l41k90P17j97j28M90J67q12L61J46n78L54L72l46j99L89m25
3026g4j23M69J8n79K74K1k56K7K63k04k4J3K1j66k06K36L50m77K01jo02J54O83
3049A8j40n07O02Mo56K66N39n00q7J010j020j70J041r29l07J179j2p42O22J87
3069C98p64L42M28n22p9O77m53M1L48m6k08LM04n63M49l27L84j45k3K05K9j26
3091D52P8J10m52p9O37m65l06M73l69N7K37J28k27rJ70o44J87O01o38o2L00j91
$$ plain form
3113 -12 -429 87 133 -233 104 194 -347 -315 92 -79 -501 -42 0 -702 -153 -43 -587 -646 169 -30 -705 -7
3135 -7 -88 -401 -79 157 -459 -136 130 -315 -400 -43 -84 -357 94 24 -553 -126 179 -352 96 155 -41 28 95
3158 95 -3 129 196 -35 -27 106 34 130 80 81 404 150 -118 230 309 -413 142 521 -250 -500 340 -102 -318 409
3182 409 120 -480 125 -12 -485 132 260 -392 -111 406 -499 -606 2 -293 -456 10 97 -79 -485 -148
3202 -148 -250 -117 -213 -100 -367 -503 -90 45 -415 21 53 -476 -51 484 -289 -5 489 -135 -96 661 -56
3223 -56 -300 452 324 -137 412 407 -399 363 591 17 110 502 296 21 585 -162 249 417 423 458 362 -8 335
3246 335 452 377 525 613 90 -76 675 313 -185 922 21 -287 523 22 -564 433 512 -818 240 281
3266 281 -748 -54 798 -572 -470 562 -501 -882 310 -104 -841 176 -3 -692 -16 64 -753 -96
$$ packed form
3113a2m17N16M6l66L37R0n41L2M07j71m22M59M2p02N49J10n44n9Q15j99o75O98
3135gq1l13L22K36o16L23K66m45q5L57m1k73M51p0n77M27L05n31M48N9j96O9O7
3158I5r8J32O7k31QJ33p2R6n0JL23k54k68L48P9p22N55L79p71k50Q40m42k16P27
3182D09k89o00O05j37m73O17J28o52K81N17r05j07O08k95j63M66Q7j76m06L37
3202a48j02J33r6J13k67j36M13J35m60M36L2n29M25N35p73K84M94o24L9P57p17
3223e6k44P52j28m61N49nq06P62K28n74R3L92k06k75N64p47M11J68OL5r6l70L43
3246C35J17p5J48Q8n23j66P51l62m98J107r01l08Q10n01n86R97P9j330J058M1
3266B81j029O94Q52j370J02J032j063l81J192m14p37J017j79o89O76Q0q17O57
$$ plain form
3284 -96 61 -697 -334 -10 -370 -255 123 -305 -149 -85 -402 -215 -37 -305 -15 271 -66 -177 112 -374 -37
3305 -37 557 20 -139 365 33 -252 524 196 -407 524 249 -359 136 695 -11 129 799 -48 -251 251
3325 251 233 -50 400 31 124 169 218 -281 -168 141 6 -224 -19 222 -240 -319 65 87 -277 185 -36 -459
3347 -459 -203 274 -553 -157 356 -335 -577 286 -153 -351 -4 -303 -445 -171 124 -354 -25 137 -169 -118
3367 -118 235 -162 -239 113 172 136 314 69 66 3 -80 276 471 -189 368 326 -77 313 390 109 28 486 21
3390 21 -253 663 277 -220 555 384 -445 312 834 -295 212 895 -160 147 792 -281 -270 261 215 -41
3410 -41 -139 13 -42 -128 138 -166 -122 -212 63 -324 -364 -55 -101 -212 -442 135 -816 -333 59 -528 -735 114 -351
3433 -351 -666 -436 91 -606 -350 -4 -657 -56 51 -374 -367 -116 -381 -342 24 -396 -459 397 -65 -150 -98 245
$$ packed form
3284i6J57p58L63L24l60J15L78m28J56O4l17J87J78k68K90K86l37j11K89m86L37
3305c7N94n37j59N04l32k85P76l28o03R31k75o08M95N59p06J40O70q47k03N02
3325B51j8k83M50l69R3M5M9m99J13L09j35k30K05K41m62p9L84K2l64M62k21m23
3347d59K56M77q27L96N13o91k42Q63m39j98L47k99j42K74K95m78L29J62l06N1
3367a18L53l97p7L52N9l6J78k45lo3q3L56J95o60N57m2m03L90P7k81q1M58m65
3390B1k74R16l86m97P75j71q29P57N22j129N07O83j055L07O45j073J1N31m6k56
3410d1r8J52n5q6K66l04M4r0K75l87m0L09m6j11k30N77r51M83L92n87k07Q49m65
3433c51l15K30N27o97K56L46o53O01J07m25PK51k65L9L66m20o3Q56m62q5N2L43
$$ plain form
3455 245 -276 338 113 18 302 -96 -82 361 208 152 781 229 28 586 -43 -246 646 354 -454 426 403
3476 403 -397 39 598 -320 22 635 -258 -311 436 -116 -260 685 317 -317 159 360 -233 190 231 -410 -284
3497 -284 231 -228 -336 -148 -173 -30 -70 -143 -346 0 -208 -249 -111 -483 -122 239 -429 -261 248 -54 119
3518 119 223 -231 -164 263 150 -111 321 441 -76 -108 595 3 243 648 55 -177 490 375 -74 167 288
3539 288 -8 245 531 -84 178 291 232 125 316 396 -118 -26 342 -318 -15 270 69 -345 303 106 -272
3560 -272 -82 354 -94 -112 57 -388 -436 142 -9 -466 -213 -82 -587 -39 -278 -270 -186 -155 -249 -387 -66 -459
3582 -459 -153 -211 -217 -138 -288 -604 -218 -103 -345 -100 -114 -387 -188 130 -319 -229 369 -234 -17 511 24 -382
3604 -382 402 237 -94 477 379 -223 115 701 -95 114 414 209 -23 413 102 -7 450 170 115 358 309
$$ packed form
3455B45n21O14k25r5K84l98J4M43j53n6O29n52k01N58o29k03Q92k92q08Q80k3
3476D03q00M36N59r18L42O13q93n3P47n52j44R45l68o34M76K01n93M23M1o41J26
3497b84N15m59j08J88k5J43m0p3k03L46k08m1J38l72L61L61o68J68N09l02J73
3518A19J04m54O7M27j13k61M32J20n17l2P03n92K40M05n93k32O67j15m49K41J21
3539B88k96K53K86o15K62J13n9j07J91Q0n14R2L68o60L03K85k01m14O48j97l78
3560b72J90M36m48j8J69m45m8N78j51m57K53J31n05N48k39QQ4L1r4j38L21l93
3582d59L06n8oP9j50l16L86J15k42K45j4k73J99L18m49R0N98o03K17N28m87m06
3604c82P84j65l31N71r8o02L38N86p96K09L00k05k32M36l11j09M57k80n5K43m9
$$ plain form
3625 309 -92 90 377 277 128 116 195 292 92 146 442 36 137 354 33 28 160 -57 -65 311 42 -402 210
3648 210 83 -355 -159 -223 -267 -144 -43 -218 161 7 -139 -338 93 96 -287 200 -45 -200 -78 -70 -232 -223 -249
3671 -249 461 255 -12 -273 286 -35 -88 437 94 55 529 246 -290 555 105 -46 217 354 -461 -80 432
3692 432 -58 70 525 -100 -17 277 38 -174 332 150 -148 437 75 -345 -17 305 26 -3 149 -358 -252
3713 -252 -125 -29 -63 -86 -178 -130 -134 -327 -275 100 -612 -74 -19 -332 -168 14 -32 -314 16 -468 -660 96 -216
3736 -216 -236 -210 171 -398 -494 140 -222 -226 9 -39 -474 52 155 -204 171 234 -86 -60 155 -27 80 436 122
3759 122 12 96 227 37 592 289 178 -12 357 194 68 344 419 383 226 394 96 -42 215 189 148 137
3781 137 421 372 71 -16 62 -45 233 -105 -178 -92 15 171 21 28 -21 -270 -162 -193 -62 78 -18 -233 32
$$ packed form
3625C09m01J82K87j00j49j2P9R7k00N4K96m06J01K17l21nJ32k17qL76k69m44O12
3648B10j27m38J96o4m4J23J01j75L79j54j46j99M31Ll83M87k45j55J22Qj62Rk6
3671b49P10k06k67k61N59l21n3N25l43l9M74k83n36Q45m50j51K63J37q15L81N12
3692D32m90J28M55o25Q3K94k39k12N06j82k98N85l62m20L28L22k79k9J52n07J06
3713b52J27R6l4k3r2M8mj93N2L75p12N38N5l13J64J82m6k82L30m84j92P56l12
3736b16k0K6L81n69r6O34l62mK35m8m35N26J03l59L75O3l20K6K15j82J07L56l14
3759A22j10Q4J31j90N55l03j11j90L69j63j26K76P5l6j57J68k98j38K57k6m1j1
3781A37K84m9l01q7P8j07K78l38p3Q6J07J56j50Pm9k49J08l1J31J40r6k15K65
$$ plain form
3804 32 12 -267 -397 -341 121 34 -425 -54 -244 -384 197 -174 -227 -10 9 -407 -159 3 -283 -5 16 59 -453
3827 -453 59 -78 -69 -57 532 -216 -141 216 -207 -8 306 405 84 133 166 -50 137 182 -30 348 162 30 153
3850 153 145 217 14 0 -135 -39 230 -300 244 -30 -117 146 76 -263 135 -249 -450 -154 57 -38 -204 -43 -201
3873 -201 -461 -73 -278 -477 -242 137 -504 -517 231 -152 -230 203 -498 -488 361 183 -294 102 313 -306 -72
3894 -72 224 -125 15 248 17 -190 25 119 67 105 79 -26 -121 378 424 -47 108 362 12 130 406 259
3916 259 124 637 499 -27 170 430 116 218 471 234 172 409 191 -156 229 65 195 197 119 -120 -100 29
3938 29 -38 -224 179 55 -100 -132 207 -105 93 -232 5 -268 -483 -360 -304 -75 75 -8 -220 45 26 -290
3960 -290 -107 214 -255 -326 -23 -325 -383 74 -164 -496 -84 -89 -353 209 55 -273 -323 93 -63 -65 45 -6 -40
$$ packed form
3804C2k0k79j30N6M62q7m59L71j90j40N81l71n3K17J9m16K48J62k86K78K1M3n12
3827d53N12j37RJ2N89p48P5L57m23J99L14R9l21M9L3k16J87M5k12L78j86j32J23
3850A53qP2k03j4j35R6K69n30N44k74q7K63p0l39L98l84k01K96K11r5j66J61j58
3873b01k60L88k05j99K35L79o41j3P48l83p8M33p01J0Q49j78m77L96K11o19K34
3894g2K96l49J40K33k31k07K15R4n2L8k6j05r5M99M6m71J55K54l50J18K76j47
3916B59j35N13j38n26J97K60l14J02K53k37o2K37k18l47L85j64J30Kp8k39K0J29
3938B9o7j86M03j24j55l2L39l12J98l25K37k73k15J23N6K29J50q3k12K65j9l16
3960b90J83L21m69p1L03l02n8M57k38l32M12nk64N62j54l28n0M16j56kJ10n1l4
$$ plain form
3983 -40 193 101 -193 -19 29 98 188 0 76 197 -4 80 340 -140 6 163 18 -47 414 110 83 358 192
4006 192 -142 170 129 -353 438 352 -355 185 11 -110 -179 100 -45 -60 -77 -65 -236 -131 40 6 -247 -142
4028 -142 16 -20 -233 -234 -96 -39 -116 -211 -106 -55 -64 -265 46 428 -170 -196 253 -174 -307 -133 214 -229 165
4051 165 84 -174 18 451 5 159 560 165 83 466 -225 197 461 -80 145 195 52 -17 463 360 -103
4072 -103 363 272 -92 256 478 -218 588 161 -275 447 219 -448 187 331 -620 413 458 -416 -345 441 -529
4093 -529 -61 139 -433 -295 82 -329 -463 65 28 -471 -44 -78 -762 73 -106 -280 -108 -52 -377 -445 10
4114 10 -210 -108 -16 -261 62 -132 -321 -89 34 -381 -65 26 -277 -97 174 -145 -279 107 142 -339 314
4135 314 149 -247 594 302 -239 487 127 -24 220 362 -238 50 506 -87 20 510 145 -72 218 80
$$ packed form
3983d0K33r2k94J74M8O9R0j88P6J21k01Q4K60m80J46J57j45o5M61l04k7K75j66
4006A92l34L12m1m82P91q6p07N40j74j21o9K79j45j5j7J2j71J05J71l4k53J05
4028a42J58l6k13jJ38N7p7r5J05N1rk01L11L82n98k6M49m27j33J74L47m43L94
4051A65q1k58J92M33m46J54M01l95q2L83o91M22K64n41K25N0j43o9M80j03m63
4072a03M66r1l64L48K22o96Q06m27m36P22k28o67O35J44r51J033M5q74P1P86r70
4093e29M68K00n72J38L77m11j34N28l7m99M27l4o84Q35j79j74J72N6l25o8M55
4114A0k20J02R2k45L23j94j89K32J23m15L16R1l03J80K71l19j34L86L5m81O53
4135C14j65l96Q41k92n41P26l60j51K44J42o00K88M56n93J07M90l65k17K90j38
$$ plain form
4155 80 -25 300 138 139 199 216 114 25 -40 21 151 146 -24 -28 100 140 132 -120 -311 135 -67 -541 -248 250 -257
4180 -257 -215 264 -278 -181 -35 -170 -121 295 -300 -279 422 -160 -183 272 277 -27 200 73 -281 100 122 3 169
4203 169 168 -313 75 284 61 157 204 175 117 186 81 206 179 147 223 447 140 51 176 66 -194 296 170 -37
4227 -37 380 -92 -114 45 124 -270 -158 -24 -102 -314 79 -11 -277 -64 -5 -558 -291 -42 -171 -197 23 -76 -375
4250 -375 -139 -179 -673 -96 123 -280 -258 -105 -300 -219 234 -278 -191 -384 -221 -393 28 -350 -411 -215 165 -324
4272 -324 -56 -97 -144 -78 -281 -215 159 -127 -96 78 24 69 88 36 14 250 317 -59 93 606 -26 -273 305 141
4296 141 -62 478 1 -219 105 63 -190 304 473 -3 -97 484 -75 -178 509 176 -194 146 47 -82 127
4317 127 87 -184 253 36 -332 3 53 94 -233 89 131 -12 -45 30 -173 94 -139 64 -161 -214 -41 -19 -142
$$ packed form
4155H0j05L25j62JO0J7j02q9o5O1J30nj70mJ28M0qk52j91M46k02m74K93M98n07
4180b57M2M79n42R7J46j35M9M16n95K1P01n82k3M55Nl04K27j27l54L81K2j19J66
4203A69jm81L88K09k23R6M7k9n8O9j05J25k7l2P6K24l07q9J25j10k60M90j26k07
4227c7M17m72k2J59P9l94J12J34p8k12L93r0k66K13N9n53K67K49j29k6K20r9k99
4250c75K36m0m94N77K19m03K2J53j95Q1M53n12Q7j93J63j72M21l78o1J96L80m89
4272c24K68m1m7O6k03O6L74k86L1J74n4M5J9n2k2K36O7l76J52N13o32k47N78j64
4296A41k03N40m77k20L24m2k53M94J69m76r4N81n59j03O87l33l70L40r9j29K09
4317A27m0k71M37k17l68L35N0M1l27L22M2j43l3P5k03K67k33K03k25n3J73K2j23
$$ plain form
4340 -142 -219 -49 -325 -161 177 -39 -183 185 -27 -29 177 1 -454 -167 387 9 168 300 36 -159 251
4361 251 -180 89 249 227 173 178 230 181 189 207 384 55 -147 114 134 76 293 159 -162 161 98 -369 173 57
4385 57 -165 -54 134 -197 -150 -30 -177 -222 230 16 -139 -109 127 -250 -243 -331 -452 -267 -142 -158 -369 -449 -84
4408 -84 -150 -142 -116 36 -94 -255 162 -89 -337 -129 -244 -52 262 43 3 -52 -43 -105 -108 13 73 -121 -41 67 -111
4433 -111 189 109 -34 22 91 61 243 163 332 -49 70 369 162 -138 422 183 57 226 415 236 140 335
4455 335 135 -5 468 220 -185 316 234 -177 221 199 -555 -19 197 -116 -54 227 -136 -33 348 -304 -328
4476 -328 99 -132 -62 -7 47 -257 68 -498 12 -345 -135 -245 198 104 -393 185 120 -168 68 -84 2 208
4498 208 -51 -381 -22 264 -198 -18 341 -418 -167 298 -114 -233 342 -82 -300 190 132 -330 200 163 -176
$$ packed form
4340a42p7J70k76J64L38k16j44L68k12kK06j76m55K87N54l78J59J32k64j95M10
4361B51m31K69J60k2n4NN2m9QJ8J77l29k02K61K0n8K17j34l21L23o3m67N42j16
4385E7k22J11J88l31M7J20j47m5M52k14j55L0K36l77Pq8j21J85J25j6k11q0L65
4408h4o6QK6J52j30j61M17k51k48K08j15J92L14k19m0n5Ro2lJ21O0j94Q0J08j78
4433a11L00q0j43N6O9l0J82q0J69l81J19K99k07l00N60k39j26J69J89j79r6J95
4455C35k00j40M73k48m05N01q2m11L98k2p54N36K16l13O2K81l63J03L81o52k4
4476c28M27k31P0N5N4l04L25n66N10l57K10j10M43r4m97N78o5k88K36j52Q6K06
4498B08k59l30L59K86m62J80L59p59K51M65m12j19N75m24k18M90n8m62N30l7l39
$$ plain form
4519 -176 82 251 -79 259 91 -267 241 51 -212 207 83 -28 203 203 -10 82 -175 -74 140 -38 -339
4540 -339 -210 142 -287 37 230 -262 -314 -111 -395 -414 2 -151 -450 233 -16 -114 -83 22 -430 -229 121
4561 121 -426 -184 143 -263 111 137 -118 113 -10 -389 387 7 -224 -19 112 -131 68 323 146 -100
4581 -100 254 -271 -58 323 312 141 415 -35 17 494 87 -320 296 410 -117 316 280 -38 -9 307 -197
4602 -197 204 258 85 128 294 107 71 105 157 -41 390 -169 18 27 -183 -43 100 -225 38 -158 -132 134 -132
4625 -132 36 -477 -126 66 -73 -299 -1 -585 -91 130 -241 -199 21 -178 -222 191 -311 -153 -91 -197 -100
4646 -100 34 103 -209 16 147 57 -50 96 -104 345 38 -114 -11 105 146 162 -78 33 111 -90 -1 5 -44
4669 -44 -361 291 -364 78 258 125 -240 112 242 -321 -129 -20 23 -102 239 3 -187 44 -286 -255 60
$$ packed form
4519a76K58J69l30L38j68l58N08j90k63M19j24j11K31%k13R2k57J01K14j78l01
4540c39J29L52m29L24J93m92n2K03k84j9M16j53k99O83k49r8L1J05m52K01L50
4561A21n47K42L27m06L74K6k55K31j23l79P76l80k31K05J31k43J99K55j77k46
4581a00L54n25K13L81j1j71K74m50N2M77m07m07O16J14n27M33l6l18K9L16n04
4602a97M01N4j73M3J66j87l6L4N2j98M31n59J87Rk10J40J43l25K63j96K6K66k66
4625a32J68n13L51J92j39k26K98n84M94K21l71M2K20j99m4M13n02J58O2j06R7
4646a00J34O9l12K25J31r0j07J46k00M49l07j52J03J16M1J6k40J11P8k01Q9Om9
4669d4l17O52o55M42J80j33l65L52J30n63J92J09M3j25L41k36j90K31l30L1L15
$$ plain form
4690 60 -9 -52 -142 -102 -337 -31 -134 21 -78 -165 -478 47 -222 -252 -171 -119 -397 -114 -162 -32 -28 214 -231 -269 177
4715 177 -247 -36 92 -45 -220 195 -28 -15 75 -61 -109 195 262 -114 334 424 -117 239 244 -75 132 177 20
4738 20 163 179 -76 3 121 56 210 244 96 4 -54 61 388 257 -191 166 242 -78 87 138 -8 -85 59
4761 59 -123 -274 204 -121 -119 354 -136 -354 112 -5 -114 -167 -30 -189 -11 -85 -306 -8 -256 -175 -13 -221
4783 -221 -184 -84 35 -231 16 -209 -417 77 -182 -194 -11 126 -402 -396 75 67 -34 141 -162 -265 -35 106
4805 106 -232 -27 -113 -261 206 14 -568 135 178 -265 79 365 126 34 205 3 -70 33 -213 -129 290 130
4827 130 -21 94 76 45 133 -50 -20 78 -22 3 221 299 -143 160 19 -206 313 291 -500 -211 -22 -259 -194
4850 -194 -58 -171 -42 77 179 -175 120 -209 -301 411 202 21 -13 40 -80 46 -204 96 223 -93 -32
$$ packed form
4690F0o9m3r0M0k35L06j03J55r9q7l13N25k69l0Q1N2k78K83m8J30MK42m45l8M46
4715A77m24K11J28j37j75M15k23J3R0j36m8L04O7l76M48R0n41L56Nl19K07M5j57
4738B0J43J6k55P9J18o5J54L4j48r2n8J15L27j31m48L57P6l20J65N1j46p7J44
4761E9j82j51M78l25KM73m90k18M66j17j09n3J37j59J78p4k21K98k48Q1J62k08
4783b21L7J00J19k66K47k25k08M94k59j2J83J37n28OM71qj01J75l03j03K30J41
4805A06l38K05q6j48M67j92n82P03M3m43L44K86k39r2J71k02p3J03k46Q4M19j60
4827A30j51J15j8l1Q8j83L0R8j00K5K18P8m42L03j41k25N19k2p91K89J89k37O5
4850a94J36j13J29J19J02l54K95l29r2P12k09j81l4N3j20J26k50L00J27l16O1
$$ plain form
4871 -32 -77 -20 299 273 -37 147 76 184 121 145 267 82 328 326 -66 297 170 -54 -335 199 -237 11 61
4894 61 289 60 347 58 222 315 -88 346 267 82 26 118 134 -93 -140 -47 77 145 -259 3 -50 -85 -164 70
4918 70 -33 -32 39 -61 -290 -246 -134 -150 -382 -264 2 -449 -233 -275 4 186 -155 -416 -94 68 -85 -192
4940 -192 145 -254 -83 85 -55 -99 11 102 -55 -104 -161 -286 -80 203 -103 214 141 -75 2 -249 37 131
4962 131 25 131 34 137 57 55 4 37 196 357 1 208 57 12 162 212 75 -27 -113 182 185 32 245 148
4986 148 111 124 260 45 23 101 0 -14 85 -119 -105 -89 -215 -26 -247 54 -385 13 -56 -262 -164 59 -227
5009 -227 -180 195 -149 -139 159 -137 -268 225 362 -198 132 53 -67 203 111 -191 116 78 69 73 264 -56 30
5032 30 227 6 193 280 20 -74 36 31 85 209 183 -4 -32 160 -127 253 125 -441 273 -57 -121 -7 221
$$ packed form
4871c2m5N7L19k6l10J84p1J08o3K4J22j85K46kl92L63j27k24k81N34m36K48N0
4894F1K28k29K87k89J64R3m03M34p9j85n6R2J6k27m7R3J24O8m04K62n3l5p9K34
4918G0j03JP1j00k29M4J12j6k32J18K66m51K16m2K79J82l41k61L22J62j53j07
4940a92L37l99J71J68j40m4J10R1j57m9n7j25K06K83l06L17p3k16P7k51K86R4
4962A31j06J06r7J03q0kn1L3J59J61l56K07j51m5J50N0j37j02q6K95Lj53K13r7
4986A48l7J3J36k15k2P8j01j4R9k04J4J6j26J89k21L01m39L98o9k06R8K23k86
5009b27M7L75l44J0K98k96j31M93J37n60L30p9j20K70r2l02L07l8rMJ91l20Q6
5032C0J97k21J87Q7k60r4J10nN4J24k6j87k8J92k87L80j28n66P14l30o4J14K28
$$ plain form
5055 221 -245 41 314 -254 -116 151 152 -259 177 20 -235 78 106 -121 -112 -100 -110 -41 236 -341 -115 171 -38
5078 -38 -195 -55 -219 -374 -160 -74 -131 42 -273 -70 -399 -175 -111 -183 79 9 20 -135 -41 -16 -232 -234 121 -44
5102 -44 -34 79 191 -75 54 96 93 -36 419 -35 370 261 -42 -133 262 184 56 173 159 145 223 384 65
5125 65 101 237 73 -83 -101 306 298 -15 -28 328 13 38 189 -23 88 127 124 -250 -1 -73 -118 253 -56 98
5149 98 9 12 -271 -220 -20 -103 -82 15 43 -175 327 -91 -187 -113 -24 118 15 123 -81 -104 -187 -100 -257 70 -13
5174 -13 126 172 -46 108 -123 162 74 -10 61 215 10 86 343 -54 155 122 48 2 65 -99 -128 171 -66 150
5198 150 -29 75 60 124 -143 -186 26 -109 15 70 -178 -126 115 -173 112 83 -100 -148 7 -70 1 18 -140
5221 -140 -303 23 161 -45 -86 -177 -165 -121 2 -194 -236 -315 41 -349 -52 -63 -156 -115 -378 -125 -198 -196 91 -63
$$ packed form
5055B21m66K86K73n68J38K67Jm11M36j57k55L13K8k27RJ2j0O9K77n77K26K86k09
5078c8j57J40j64j55K14Q6n7J73l15K03l29K24O4p2K62p0J1j55R4K5k16kL55j65
5102d4J0J13J12k66J29M2lj29M55m54M05j09l03r1L95p8j28J17j4j4P8J61l19
5125F5L6J36j64j56j8M07ql13j3L56l15K5J51k12J11L9ll74K49p2m5L71l09J54
5149I8q9Lk83N1K00q3K1R7K8k18N02m18r6P4Q9J42j03J08k04k3q3Q7j57L27q3
5174a3J39M6k18J54k31K85q8q4P1J54k05P6K57l97K09l3p4m6O3j64k9K99k37K16
5198A50j79J04j5O4k67m3K12j35J24N5k48N2K41k88K85k9j83m8J55p7P1J7j58
5221a40j63L26J38k06m1r1J2M4J23j96m2p9L56l90K97j1r3M1k63K53p3KK87j54
$$ plain form
5245 -63 6 259 133 16 -201 7 -163 136 256 175 -268 178 -12 154 207 156 139 -131 374 28 183 389
5267 389 179 240 -55 263 36 38 176 -84 86 -7 109 -42 -103 144 -134 -63 338 -75 -172 209 12 -78 26
5290 26 49 -284 129 216 -303 -29 -133 184 -83 38 -80 -46 95 175 -163 -42 -37 -108 188 93 -49 82 59
5313 59 -234 91 21 -176 190 74 167 -91 -73 -28 -130 163 88 15 -128 -72 -359 55 -233 39 17 -173 -143
$$ packed form
5245f3O9K53j26j17k17K08j70K99J20q1m43M46j90J66N3n1j7k70N05l46J55K06
5267C89k10O1k95L18k27KJ38k60J70r3J16j51o1K47k78P1M01m13r7L81j97r0J04
5290B6K3l33M13Q7n19K74j04L17k67J21j18L4J41Q0l38J21Np1K96r5j42J31k3
5313E9k93L25p0j97L66j16R3k58J8M5j02K93p5p3j43N6k87M14k88K72k2j90L0
$$ [...]
8191A62
##END NTUPLES=NMR FID
##END=
