##TITLE=1H_LR-715-K1
 CDCl3, 8 sc, 
 20.10.2020
##JCAMPDX= 6.0         $$ Bruker NMR JCAMP-DX V2.0
##DATA TYPE= NMR FID
##DATA CLASS= NTUPLES
##ORIGIN= UXNMR, Bruker Analytische Messtechnik GmbH
##OWNER= root
$$ XWIN-NMR		Version 3.5
$$ Tue Oct 20 12:55:40 2020 Russian Standard Time (UT+4h)  she@DPX200
##.OBSERVE FREQUENCY= 200.1315066352
##.OBSERVE NUCLEUS= ^1H
##.DELAY= (6, 6)
##.ACQUISITION MODE= SIMULTANEOUS
##.ACQUISITION SCHEME= undefined
##.AVERAGES= 8
##.DIGITISER RES= 18
##SPECTROMETER/DATA SYSTEM= spect
##.PULSE SEQUENCE= zg30
##.SOLVENT NAME= CDCl3
##.SHIFT REFERENCE= (INTERNAL, CDCl3, 0, 15.7039)
##AUDIT TRAIL= $$ (NUMBER, WHEN, WHO, WHERE, WHAT)
$$ ##TITLE= Audit trail, XWIN-NMR		Version 3.5
$$ ##JCAMPDX= 5.01
$$ ##ORIGIN= Bruker BioSpin GmbH
$$ ##OWNER= she
$$ F:/spectra/data/she/nmr/H-F/1/audita.txt
$$ ##AUDIT TRAIL=  $$ (NUMBER, WHEN, WHO, WHERE, WHAT)
(   1,<2020-10-20 12:54:42.40 +0400>,<she>,<DPX200>,
      <created by zg, POWCHK disabled, PULCHK disabled
       configuration hash MD5:
       00 E9 B6 7A A2 85 ED C7 34 08 36 98 17 FE 4E 26
       data hash MD5: 16K
       C5 56 0A D4 99 C9 7D 6E 0C E8 AE 60 CC 11 5D A6>)
$$ ##END=
$$ 
$$ hash MD5
$$ 11 4E 4A 5C 37 01 C1 2E 6D EF 85 18 86 F5 01 19
##$RELAX= 
##$RELAX= 
##$RELAX= 
##$RELAX= 
##$RELAX= 
##$RELAX= 
$$ Bruker specific parameters
$$ --------------------------
##$DU= <F:/spectra>
##$EXPNO= 1
##$NAME= <H-F>
##$PROCNO= 1
##$TYPE= <nmr>
##$USER= <she>
##$AMP= (0..31)
100 100 100 100 100 100 100 100 100 100 100 100 100 100 100 100 100 100 
100 100 100 100 100 100 100 100 100 100 100 100 100 100 
##$AQSEQ= 0
##$AQ_mod= 1
##$AUNM= <au_zg>
##$AUTOPOS= <>
##$BF1= 200.13
##$BF2= 200.13
##$BF3= 200.13
##$BF4= 200.13
##$BF5= 200.13
##$BF6= 200.13
##$BF7= 200.13
##$BF8= 200.13
##$BYTORDA= 1
##$CFDGTYP= 0
##$CFRGTYP= 5
##$CHEMSTR= <none>
##$CNST= (0..31)
1 1 145 1 1 1 1 1 1 1 1 1 1 1 1 1 1 1 1 1 1 1 1 1 1 1 1 1 1 1 1 1 
##$CPDPRG= <>
##$CPDPRG1= <>
##$CPDPRG2= <>
##$CPDPRG3= <>
##$CPDPRG4= <mlev>
##$CPDPRG5= <mlev>
##$CPDPRG6= <mlev>
##$CPDPRG7= <mlev>
##$CPDPRG8= <mlev>
##$CPDPRGB= <>
##$CPDPRGT= <>
##$D= (0..31)
0 1.2 0 0 0 0 0 0 0 0.06 0 0.03 0 0 0 0 0.0002 0 0 0 0 0 0 0 0 0 0 0 0 
0 0 0 
##$DATE= 1603184081
##$DBL= (0..7)
120 120 120 120 120 120 120 120 
##$DBP= (0..7)
150 150 150 150 150 150 150 150 
##$DBP07= 0
##$DBPNAM0= <>
##$DBPNAM1= <>
##$DBPNAM2= <>
##$DBPNAM3= <>
##$DBPNAM4= <>
##$DBPNAM5= <>
##$DBPNAM6= <>
##$DBPNAM7= <>
##$DBPOAL= (0..7)
0.5 0.5 0.5 0.5 0.5 0.5 0.5 0.5 
##$DBPOFFS= (0..7)
0 0 0 0 0 0 0 0 
##$DE= 6
##$DECBNUC= <off>
##$DECIM= 32
##$DECNUC= <off>
##$DECSTAT= 4
##$DIGMOD= 1
##$DIGTYP= 9
##$DL= (0..7)
0 120 120 120 120 120 120 120 
##$DP= (0..7)
150 150 150 150 150 150 150 150 
##$DP07= 0
##$DPNAME0= <>
##$DPNAME1= <>
##$DPNAME2= <>
##$DPNAME3= <>
##$DPNAME4= <>
##$DPNAME5= <>
##$DPNAME6= <>
##$DPNAME7= <>
##$DPOAL= (0..7)
0.5 0.5 0.5 0.5 0.5 0.5 0.5 0.5 
##$DPOFFS= (0..7)
0 0 0 0 0 0 0 0 
##$DQDMODE= 0
##$DR= 18
##$DS= 0
##$DSLIST= <SSSSSSSSSSSSSSS>
$$ [...]
##$SUBNAM2= <"">
##$SUBNAM3= <"">
##$SUBNAM4= <"">
##$SUBNAM5= <"">
##$SUBNAM6= <"">
##$SUBNAM7= <"">
##$SUBNAM8= <"">
##$SUBNAM9= <"">
##$SW= 16.880792210976
##$SWIBOX= (0..15)
0 0 2 0 0 0 0 0 0 0 0 0 0 0 0 0 
##$SW_h= 3378.37837837838
##$TD= 16384
##$TD0= 1
##$TE= 0
##$TE2= 300
##$TE3= 300
##$TEG= 300
##$TL= (0..7)
0 120 120 120 120 120 120 120 
##$TP= (0..7)
150 150 150 150 150 150 150 150 
##$TP07= 0
##$TPNAME0= <>
##$TPNAME1= <>
##$TPNAME2= <>
##$TPNAME3= <>
##$TPNAME4= <>
##$TPNAME5= <>
##$TPNAME6= <>
##$TPNAME7= <>
##$TPOAL= (0..7)
0.5 0.5 0.5 0.5 0.5 0.5 0.5 0.5 
##$TPOFFS= (0..7)
0 0 0 0 0 0 0 0 
##$TUNHIN= 0
##$TUNHOUT= 0
##$TUNXOUT= 0
##$USERA1= <user>
##$USERA2= <user>
##$USERA3= <user>
##$USERA4= <user>
##$USERA5= <user>
##$V9= 5
##$VALIST= <valist>
##$VCLIST= <CCCCCCCCCCCCCCC>
##$VD= 0
##$VDLIST= <DDDDDDDDDDDDDDD>
##$VPLIST= <PPPPPPPPPPPPPPP>
##$VTLIST= <TTTTTTTTTTTTTTT>
##$WBST= 1024
##$WBSW= 4
##$XGAIN= (0..3)
0 0 0 0 
##$XL= 0
##$YL= 0
##$YMAX_a= 195887
##$YMIN_a= -143412
##$ZGOPTNS= <>
##$ZL1= 120
##$ZL2= 120
##$ZL3= 120
##$ZL4= 120
##$ABSF1= 10
##$ABSF2= 0
##$ABSG= 5
##$ABSL= 3
##$ALPHA= 0
##$AQORDER= 0
##$ASSFAC= 0
##$ASSFACI= 0
##$ASSFACX= 0
##$ASSWID= 0
##$AUNMP= <proc_1d>
##$AZFE= 0.1
##$AZFW= 0.1
##$BCFW= 1
##$BC_mod= 2
##$BYTORDP= 1
##$COROFFS= 0
##$CY= 11.3945322036743
##$DATMOD= 1
##$DC= 2
##$DFILT= <>
##$DTYPP= 0
##$F1P= 16.9975609425685
##$F2P= -3.02152046262296
##$FCOR= 0.5
##$FTSIZE= 0
##$FT_mod= 4
##$GAMMA= 1
##$GB= 0.15
##$INTBC= 1
##$INTSCL= 1
##$ISEN= 128
##$LB= 0.24
##$LEV0= 0
##$LPBIN= 0
##$MAXI= 10000
##$MC2= 0
##$MEAN= 0
##$ME_mod= 0
##$MI= 1.114404
##$NCOEF= 0
##$NC_proc= 0
##$NLEV= 6
##$NOISF1= 3.799351
##$NOISF2= 2.8
##$NSP= 1
##$NTH_PI= 0
##$NZP= 0
##$OFFSET= 15.70392
##$PC= 1
##$PHC0= -10688.09
##$PHC1= 9.600892
##$PH_mod= 1
##$PKNL= yes
##$PPARMOD= 0
##$PSCAL= 0
##$PSIGN= 0
##$REVERSE= no
##$SF= 200.130013532006
##$SI= 16384
##$SIGF1= 3
##$SIGF2= 2
##$SINO= 400
##$SIOLD= 16384
##$SREGLST= <1H.CDCl3>
##$SSB= 0
##$STSI= 0
##$STSR= 0
##$SW_p= 3612.71676300578
##$SYMM= 0
##$S_DEV= 0
##$TDeff= 0
##$TDoff= 0
##$TI= <>
##$TILT= no
##$TM1= 0
##$TM2= 0
##$TOPLEV= 0
##$USERP1= <user>
##$USERP2= <user>
##$USERP3= <user>
##$USERP4= <user>
##$USERP5= <user>
##$WDW= 1
##$XDIM= 8192
##$YMAX_p= 0
##$YMIN_p= 0
$$ End of Bruker specific parameters
$$ ---------------------------------
##NTUPLES= NMR FID
##VAR_NAME=  TIME,          FID/REAL,        FID/IMAG
##SYMBOL=    X,             R,               I
##VAR_TYPE=  INDEPENDENT,   DEPENDENT,       DEPENDENT
##VAR_FORM=  AFFN,          ASDF,            ASDF
##VAR_DIM=   8192,          8192,            8192
##UNITS=     SECONDS,       ARBITRARY UNITS, ARBITRARY UNITS
##FACTOR=    0.000296,      1,               1
##FIRST=     0,             0,               0
##LAST=      2.424536,      0,               0
##MIN=       0,             -143412,         0
##MAX=       2.424536,      195887,          0
$$ Real data points
##PAGE= N=1
##DATA TABLE= (X++(R..R)), XYDATA
0@%%%%%%%%%%%%%%Lj1J6j6J6j6K4l2L3m1M9n7P1q0Q9j04J20j38J60j83K07k33
$$ 0 0 0 0 0 0 0 0 0 0 0 0 0 0 0 3 -8 8 -8 8 -8 16 -16 17 -24 25 -32 39 -41 48 -56 64 -74 86 -97 110 -123
36a23K61k93L30l70M10m55N07n64O26o91P62q42R28j022J127j241J365j506J663
$$ -123 138 -155 175 -195 215 -240 267 -297 329 -362 400 -442 486 -536 591 -650 715 -791 872
55H72j837K033k257K516k817L169l591M113m771N631o812Q559j1439J7366n5875
$$ 872 -965 1068 -1189 1327 -1490 1679 -1912 2201 -2570 3061 -3751 4808 -6631 10735 -45140
70d5140P5428l8816q7814J18591n8548j07113R6080P7519p6618M0617O4187r0874
$$ -45140 30288 -8528 -96342 22249 -36299 -143412 -47332 30187 -46431 -5814 58373 -32501
82c2501m9587Q5356M228j6885P1883J2967q3328m242M3229j2424O044O8779J816
$$ -32501 -82088 3268 7496 -9389 62494 75461 -7867 -12109 31120 18696 24740 93519 95335
95I5335o6245l9L2725l7619J1483R3269j3769p4488L4490O864p3345M9697R2075
$$ 95335 29090 29051 61776 24157 35640 128909 115140 40652 75142 82006 8661 58358 150433
108A50433o0405l3901O4832n6864p0404R5989L6714p0386M0431L1921j03845j5260
$$ 150433 90028 56127 120959 64095 -6309 89680 126394 56008 96439 128360 24515 9255
120I255Q7288k2873k9769P3095j8058r5051K5828M0972m6792K1902O7701m7308
$$ 9255 96543 73670 43901 116996 98938 3887 29715 70687 23895 45797 113498 66190
132F6190o1911L2548J150m1845M5495N2353n4008l4187L5414l0359m0356O7883
$$ 66190 4279 36827 37977 -3868 41627 93980 39972 5785 41199 10840 -29516 38367
144C8367L5439o0177L019K6833o6100j6990Q0522k138m6962M2620l151q4787K0852
$$ 38367 73806 13629 16648 43481 -22619 -39609 40913 38775 -8187 34433 31282 -53505 -32653
157c2653O2436l7405k080N7662m5823o6744M3388J9971m0523L8428M1948o5884
$$ -32653 29783 -7622 -9702 47960 2137 -64607 -21219 -1248 -41771 -3343 38605 -27279
169b7279l3775M2342j8415k5977O0487J9080o2032m755K4747m2537o946O8721
$$ -27279 -61054 -18712 -37127 -63104 -2617 16463 -45569 -50324 -25577 -68114 -75060 -6339
181f339j102n1911K0362M249o0179J9258O5288k7125k2786M0917k9710n9019M4816
$$ -6339 -7441 -59352 -38990 -34741 -94920 -75662 -10374 -37499 -60285 -19368 -49078 -108097 -63281
194f3281L9754l8480J7813L8789o1018l3712N6112J30k6072N2526J4266o6203
$$ -63281 -23527 -62007 -44194 -5405 -66423 -100135 -44023 -43893 -69965 -17439 -3173 -69376
206f9376j583L8540k7030J11O4274r675n3838K0847J2787m0113K6743N9618k7505
$$ -69376 -70959 -32419 -59449 -59338 4936 -4739 -58577 -37730 -24943 -65056 -38313 21305 -6200
219f200k9470L1937j6002m0636M7378M3312l7984J384L3140m6694k7124O1851
$$ -6200 -35670 -3733 -19735 -60371 -12993 30319 -7665 -6281 26859 -19835 -46959 14892
231A4892J2536l1940L5308J2527o3314J357N1753j7670o949N2749j6200n6284
$$ 14892 27428 -4512 30796 43323 -19991 -18634 33119 15449 8500 61249 45049 -11235
243a1235K3417K2650l0169K4474M6922l4894l4372K7824n711k7338M2670L3852
$$ -11235 12182 34832 4663 29137 76059 41165 6793 34617 28906 1568 44238 78090
255G8090m1210j1675K5006l0833j8534N4278J5468l8901J3210J2797n0839k110
$$ 78090 36880 25205 50211 19378 844 55122 70590 31689 44899 57696 6857 4747
267D747N7256r889k5133L7706j2015n9766K5041L8734l2218R024M2926m2456m1993
$$ 4747 62003 52114 26981 64687 52672 -7094 17947 56681 24463 33487 76413 33957 -8036
280h036L8925L197l0099M0144K4975n5012j2561K9909k6085j0293N1988J523m4695
$$ -8036 30889 34086 3987 44131 69106 14094 1533 31442 5357 -4936 47052 48575 3880
293C880Q034Q692l8058Q198M8473j3085k8027J9623j1333m2346K3262L8193k3714
$$ 3880 11914 20606 -17452 -9254 39219 26134 -1893 17730 6397 -35949 -12687 25506 1792
306A792o729K6044l1286l8435L6228J9385k9598K0193K2723n1968j9111M0768
$$ 1792 -4937 21107 -10179 -48614 -12386 6999 -22599 -2406 20317 -31651 -50762 -9994
318i994j0479j8123M4646J749n4811P164K3774l1896P447N0553k1514l8355K3452
$$ -9994 -20473 -38596 6050 7799 -47012 -39848 -16074 -47970 -40523 10030 -11484 -49839 -26387
331b6387l847l5355L1622L6976l0911j1931K2910k6980k5874M1828K0011k8521
$$ -26387 -30234 -65589 -33967 3009 -27902 -39833 -16923 -43903 -69777 -27949 -7938 -36459
343c6459J0440J4909m2039j1787M3394R75j8381K9863J428m8612N791L4907j8149
$$ -36459 -26019 -11110 -53149 -64936 -21542 -20567 -38948 -9085 -7657 -56269 -50478 -15571 -33720
356c3720M36M2340j8854m1923K3341J2439k7036K6540L7151l4964j9979K8374
$$ -33720 -33284 9056 -9798 -51721 -28380 -15941 -42977 -16437 20714 -14250 -34229 -5855
368e855j5046k0598M4987J9128l6296N758J6890l4781k552M7529k71k2855K1330
$$ -5855 -20901 -41499 3488 22616 -13680 -7922 8968 -25813 -28365 19164 18893 -3962 17368
381A7368o87m0341J2546L8652j3286n079K9581j8622l7319K4349K2138k0132J5718
$$ 17368 16681 -23660 -11114 27538 14252 9173 38754 20132 -17187 7162 29300 9168 24886
394B4886K8685l3987k5271K9902n90j8603L6216J6978m2105m437K3369k3584m387
$$ 24886 53571 19584 -5687 24215 23625 5022 41238 58216 16111 11674 35043 11459 7072
407G072M6360l020l4860J5426M134l6186J5517M0984j9311j5287K3876j9345l2989
$$ 7072 53432 50412 15552 30978 35112 -1074 14443 55427 36116 20829 44705 25360 -7629
420g629K9654K3257k3812P912J9231l5903k0750L2948L533j8405K6069P950m3537
$$ -7629 22025 45282 21470 29382 48613 12710 -8040 24908 28441 10036 36105 44055 518
433E18m457K6199j4576m742L6454p506l9443J0093J1611k6545J2698L6430k1706
$$ 518 -3939 22260 7684 2942 39396 31890 -7553 2540 14151 -12394 304 36734 15028
446A5028k4859J9037j0011k6863K9295K4958k8420m006J7211k9234j7417L7538
$$ 15028 -9831 9206 -805 -27668 1627 26585 -1835 -5841 11370 -17864 -35281 2257
458B257P151k3538J5721N720l9988j896L3129r562r048K8137j0016l9545J2467
$$ 2257 9408 -14130 1591 7311 -32677 -34573 -1444 -11006 -20054 8083 -1933 -41478 -29011
471b9011J9434k0390J0206L0514k5220k8063K1325p03k0871K7798K2537l2538
$$ -29011 -9577 -29967 -19761 10753 -14467 -42530 -21205 -21908 -42779 -14981 7556 -24982
483b4982r995J9921k0179j2081L8888P052k9447R757P892l2996L381L7882p735
$$ -24982 -34977 -15056 -35235 -47316 -8428 -1376 -30823 -21066 -13174 -46170 -42789 -4907 -12642
496a2642j5709K1919q248l4262J7520K6194j7167M119K4323k4353k5057K5379
$$ -12642 -28351 -6432 -14680 -48942 -31422 -5228 -22395 -18276 6047 -18306 -43363 -17984
508a7984Q657j6868K2379J7407l2793j0697K4105r491p886L4528N115l2575N474
$$ -17984 -9327 -26195 -3816 13591 -19202 -29899 -5794 -15285 -23171 11357 16472 -16103 -10629
521a0629J2883k2323O411L6861q295k2238J6965l461k6898K0237K9596j7810m679
$$ -10629 2254 -20069 -13658 23203 14908 -7330 9635 6174 -20724 -487 29109 11299 6620
534F620J9935k0484k2246K9620J4313j9064J3526J4544l2897r695K9889l778j1060
$$ 6620 26555 6071 -16175 13445 27758 8694 22220 36764 3867 -5828 24061 20283 9223
547I223K7975J216l5734M640J9798j7309L691L2915j3536k7906J5419K343k2631
$$ 9223 37198 38414 2680 7320 27118 9809 13500 46415 32879 4973 20392 22735 104
560A04K0117K6456k3025j1796J7131j6612j7247L0225J3507k3979N202J0413k9610
$$ 104 20221 46677 23652 11856 28987 12375 -4872 25353 38860 14881 20083 30496 886
573H86o366L1886k310j4874J8455k667l3242N692K3573j3110j118K4423j5645
$$ 886 -5480 26406 24096 9222 27677 25010 -8232 -2540 21033 7923 6805 31228 15583
586A5583k9268J5471R121j7823J4467K1579k5435j7233J8363p635j4729K6960
$$ 15583 -13685 1786 10907 -6916 7551 29130 3695 -13538 4825 -2810 -17539 9421
598I421J2311k8726j978J3458k2371m887L2926j524k2370J2354L69k9194Q307
$$ 9421 21732 -6994 -8972 4486 -17885 -22772 10154 8630 -13740 -1386 -1017 -30211 -21904
611b1904K8292j2598q153J9505j5418k6890J9870J5058j7084R437J7130k6802
$$ -21904 6388 -6210 -14363 5142 -10276 -37166 -17296 -2238 -19322 -9885 7245 -19557
623a9557j6124K2672r54j2935K3077Q228l0551k363J7164j5119j870L0404m302
$$ -19557 -35681 -13009 -13963 -26898 -3821 4407 -26144 -28507 -11343 -26462 -28332 2072 -2230
636b230k5455J0020M836k2351J1409K8002j3900j3294J6583j0998k0715K2413
$$ -2230 -27685 -17665 -12829 -35180 -23771 4231 -9669 -22963 -6380 -17378 -38093 -15680
648a5680J8170j7334K700J3712k2628j2816K6817M894j3785J6612O274k9142j310
$$ -15680 2490 -14844 -12144 1568 -21060 -33876 -7059 -2165 -15950 662 6936 -22206 -23516
661b3516K2734p542l650K5078m853k7640R835J2191j5891J0161K5787j5777j7929
$$ -23516 -782 -8324 -11974 13104 8251 -19389 -9554 2637 -13254 -3093 22694 6917 -11012
674a1012J6279l654j6819K3023J8389k1475k747J4748j8334r385K8884N986j8465
$$ -11012 5267 1613 -15206 7817 26206 4731 1984 16732 -1602 -10987 17897 23883 5418
687E418J1355N192k6398J545K6431o562p300J9254p150k6534J1436J6578j3156
$$ 5418 16773 21965 -4433 -2888 23543 16981 9681 28935 21785 -4749 6687 23265 10109
700A0109N438K0200j7749j9775J6947K012j3733J8280J4632k4409p745J5524j1654
$$ 10109 15547 35747 17998 -1777 15170 17182 3449 21729 36361 11952 4207 19731 8077
713H077q412K6824L830k3614N464O757k2104K831K7048p700j4164J4220o312k3776
$$ 8077 -335 26489 30319 6705 12169 18926 -3178 -347 26701 19001 4837 19057 12745 -11031
727a1031J3468J8943j4269l18J5391j8653j8010J9102O059j3662J2774J0502k5303
$$ -11031 2437 21380 7111 6793 22184 3531 -14479 4623 10682 -2980 9794 20296 -5007
740e007q318J7644o061p898K2474J084k5838K464J0948j6054K469K5611q619j9621
$$ -5007 -13325 4319 -1742 -9640 12834 13918 -11920 -9456 1492 -14562 -12093 13518 4899 -14722
754a4722J1267j172j9901J4008K1090j6392o908J4174j4939j5822K2186R507j6564
$$ -14722 -3455 -4627 -24528 -10520 10570 -5822 -12730 1444 -13495 -29317 -7131 2376 -14188
767a4188P766R032k4241o141K2593l027r417J8114j268k5857M859J5010j1560
$$ -14188 -6422 2610 -21631 -27772 -5179 -8206 -17623 491 -777 -26634 -21775 -6765 -18325
780a8325K326K0860j0548k0220J1419L801j4157J3466J8219j7277r935J3279q672
$$ -18325 -15999 4861 -5687 -25907 -14488 -10687 -24844 -11378 6841 -10436 -20371 -7092 -15764
793a5764j1622K2167J0248j8180K170R422j8869l965K5313j32j3223J2966L53
$$ -15764 -27386 -5219 5029 -13151 -10981 -1559 -20428 -24393 920 788 -12435 531 884
806H84k3462O174K0156q608k159J8055j0426k0443J4211R738j2501J0379J6483
$$ 884 -22578 -16404 3752 -4856 -7015 11040 614 -19829 -5618 4120 -8381 1998 18481
819A8481j9412j1231J6155l002r540K0772Q044k1311L3J1859j3865j524K4828
$$ 18481 -931 -12162 3993 991 -8549 12223 20267 -1044 -1011 10848 -3017 -4541 20287
832B0287j614j7092R834J280j9022Q722K1434r975o267J3818j0638j7319J6275
$$ 20287 18673 1581 11415 12695 -6327 2395 23829 13854 7587 21405 10767 -6552 9723
845I723J2002j2869N793J1826j9343j0462J7894M09r381J5357N427k2567j992
$$ 9723 21725 8856 14649 26475 7132 -3330 14564 14973 5592 20949 26376 3809 1817
858A817J4094r207k321K0749l606k0514O825N064j4929O783K0196j1572j2274
$$ 1817 15911 6704 4383 25132 21526 1012 7837 12901 -2028 4755 24951 13379 1105
871A105J1471o347j5567J6083J3425j5648n03J0465j7277r695K0810K105j2605
$$ 1105 12576 6229 -9338 6745 20170 4522 4019 14484 -2793 -12488 8322 10427 -2178
884b178J0909L230k2883L18J7191p378m118J7070o366k1260Q285Q552j2129O363
$$ -2178 8731 11961 -10922 -10604 6587 -791 -4909 12161 5795 -15465 -7180 1372 -10757 -4394
898d394J6451j3746j3773J1422j978j1874J5290J1595j7044m244J0416j2294p073
$$ -4394 12057 -1689 -15462 -4040 -6018 -17892 -2602 8993 -8051 -12295 -1879 -14173 -21246
911b1246K0782L614j5849O119M602j9277J817J9948n644q154J3219n301j9503
$$ -21246 -464 3150 -12699 -6580 -1978 -21255 -19438 510 -5134 -13288 -69 -5370 -24873
924b4873R876J2828j0567L339J3803j4518j3877J4469K332r896J3821Q528j8841
$$ -24873 -14997 -2169 -12736 -9397 4406 -10112 -23989 -9520 -7188 -17084 -3263 5265 -13576
937a3576m351J2315p470m102J8927J892j7302L993O357j3963L118K0095n060j1494
$$ -13576 -17927 -5612 -13082 -17184 1743 3635 -13667 -9674 -3317 -17280 -14162 5933 873 -10621
951a0621J0072k519j5936J0879J5839j0764j538J2372j2119j2517J6826O534j1131
$$ -10621 -549 -3068 -19004 -8125 7714 -3050 -4588 7784 -4335 -16852 -26 6508 -4623
964d623R748Q039j9108m446J6523l932n117J7268m07j9404M851R961j1167L997
$$ -4623 5125 13164 -5944 -10390 6133 2201 -2916 14352 13945 -5459 -608 9353 -1814 2183
978B183J8151q251j3197R648m09j2165J2206J3987j2523m512R798r601r258J7222
$$ 2183 20334 12083 -1114 8534 8125 -4040 8166 22153 9630 5118 14916 5315 -3943 13279
992A3279O726j2492M839N801j6378l419J7352j389q075J1896j285j8821M199J3316
$$ 13279 20005 7513 12352 18153 1775 -1644 15708 14319 6244 18140 16855 -1966 2233 15549
1006A5549q851J29J5054r360j5745R729M205j1291R590J2512j5203q332J0890
$$ 15549 6698 6827 21881 12521 -3224 6505 10710 -581 9009 21521 6318 -2014 8876
1019H876o116q372J6347N784j5901R97O668j3781k092J8462k015j1675Q284q14
$$ 8876 2760 -5612 10735 16519 618 1615 8283 -5498 -7590 10872 8857 -2818 5466 4652
1033D652j6953N416J5127q475l143J1549r302j5098J2147O550j0623O647R935
$$ 4652 -12301 -6885 8242 -233 -3376 8173 -1129 -16227 -4080 2470 -8153 -1506 8429
1046H429j5853q008J2880k747p223J4453L147j7052N94Q153r770k95J7083l610
$$ 8429 -7424 -15432 -2552 -5299 -12522 1931 5078 -11974 -11380 -3227 -12997 -13292 3791 181
1060A81j3179O426J070j2942O965J4750q147n997Q700o440j2137J2142R766j0474
$$ 181 -12998 -6572 -5502 -18444 -11479 3271 -4876 -10873 -2173 -8613 -20750 -8608 1158 -9316
1074i316K272Q488j3648p599J5080J483q471J0777L600j7567Q3J2460o831j339
$$ -9316 -7044 1444 -12204 -19803 -4723 -3240 -11711 -934 2666 -14901 -14818 -2358 -9189 -10528
1088a0528J5339l771j5564O721N416j0951P244J4151r812q530R867m579r127J3754
$$ -10528 4811 1040 -14524 -7803 -2387 -13338 -6094 8057 -1755 -10285 -418 -4997 -14124 -370
1102c70Q785j1807R5P478j1274m139J5871K460r771P159K393j5089J485J4298
$$ -370 8415 -3392 -3297 4181 -7093 -11232 4639 7099 -2672 4487 6880 -8209 -6724 7574
1116G574l902l666J2095m293j5326P511Q996q640M525J2728j1207j0352J0617
$$ 7574 3672 6 12101 7808 -7518 -7 8989 349 4874 17602 6395 -3957 6660
1129F660j54q185J2362Q136j4276k325Q804q555l271J5679J248j1775M523K802
$$ 6660 6506 -1679 10683 18819 4543 2218 11022 2467 -804 14875 16123 4348 8871 11673
1143A1673j3033L016J4484m343o578Q651m241j3639Q303J0360q313R20R433j1059
$$ 11673 -1360 1656 16140 11797 5219 13870 9629 -4010 4293 14653 6340 7260 16693 5634
1157E634j0447J1431L089q521Q343O626j5326m508J1109n171m458J4392j97j5666
$$ 5634 -4813 6618 9707 1186 9529 16155 829 -3679 7430 2259 -2199 12193 11996 -3670
1171c670L593N544j1090K775J4860o743r736P926k923j1378R281J0195r837j340
$$ -3670 -77 5467 -5623 -2848 12012 5269 -4467 3459 536 -10842 -1561 8634 -1203 -2543
1185b543P283j0177p971J2633L652q408N229M173j3728k984J1786k181m567J0346
$$ -2543 4740 -5437 -13408 -775 2877 -5531 -302 3871 -9857 -12841 -1055 -3236 -7803 2543
1199B543p64j4939K797Q012o993J371J2857o672j2000P424J620r966Q900J0895
$$ 2543 1779 -13160 -10363 -2351 -9344 -7973 4884 -1788 -13788 -6364 -4744 -14710 -5810 5085
1213E085j1184n136Q829o927o910J3888M439j0867L151M443j2103q61J3813j759
$$ 5085 -6099 -11235 -2406 -9333 -16243 -2355 2084 -8783 -5632 -1189 -13292 -14153 -340 -2099
1227b099o413Q453j229j3798M688J0360o050K6J0337o972j1188Q026M728p508
$$ -2099 -8512 -59 -1288 -15086 -10398 -38 -6088 -6062 4275 -2697 -13885 -5859 -1131 -8639
1241h639O608Q884j1138o057R248k746n867J3206L927j2752J421O435r719R7J5008
$$ -8639 -2031 6853 -4285 -10342 -1094 -3840 -9707 3499 7426 -5326 -3905 2530 -7189 -7092 7916
1256G916k284r498P216l69j1789O672J1393o493j951Q754p555r536J0451N679
$$ 7916 5632 -3866 3350 2981 -8808 -2136 9257 2764 813 9567 2012 -7524 2927 8606
1270H606p088M676O311j1193n007J0019k77m920R425L222j2837l01P792n559o09
$$ 8606 1518 6194 12505 1312 -3695 6324 6047 1127 10552 13774 937 636 8428 2869 2260
1285B260J2257k042j1252M520K884r697N216J2259p564o449Q241m792r618J1189
$$ 2260 14517 12475 1223 5743 8627 -1070 4146 16405 8841 2392 10633 5841 -3777 7412
1299G412O944r863J861N955j1647m193J2682n03o794Q266L63j3758J471R523n594
$$ 7412 14356 4493 6354 12309 662 -3531 9151 8648 1854 10120 10483 -3275 -1804 7719 2125
1314B125q69J0219m930j1536N115L834p347M766R260q303p409O549k116o934R335
$$ 2125 1256 11475 6545 -4991 124 3958 -3389 1377 10637 2334 -5075 1474 -642 -7576 1759
1329A759O158r854j841N818q331l576J2319J300r345M668J905j2194J849J1703
$$ 1759 7917 -1937 -3778 2040 -6291 -9867 2452 3752 -5593 -925 980 -11214 -9365 2338
1343B338m674l909Q608m452j1507O494O800p289K978Q483r588p164Q345K0n779
$$ 2338 -2336 -6245 2363 -2089 -13596 -7102 -302 -7591 -4613 3870 -5718 -12882 -4537 -4517 -10296
1358a0296Q697N066j1135k218O946n555k424J1752N76j0075L042L188r380K403
$$ -10296 -1599 3467 -7668 -9886 -2940 -8495 -10919 833 1409 -8666 -5624 -2436 -11816 -9413
1372i413J1996l991o354O712k266r932P295Q582p263K03P509q676o738J0350K282
$$ -9413 2583 -1408 -7762 -1050 -3316 -13248 -5953 2629 -4634 -4431 3078 -5598 -12336 -1986 296
1387B96o378P058L658j1981j262R211l491k345J0592j213j0637L008M685o752
$$ 296 -6082 976 4634 -7347 -8609 602 -2889 -5234 5358 4145 -6492 -3484 1201 -5551
1401e551K894J0747m840p478N927q57p229P324Q267p130k430O072n993n350J0122
$$ -5551 -2657 8090 3250 -4228 1699 842 -6387 937 9204 2074 -356 5716 -277 -5627 4495
1416D495M083p367L735L903j0811j404J1038j681m273Q373j057j1502L474P433
$$ 4495 8578 1211 4946 8849 -1962 -3366 7672 5991 1718 10091 9034 -2468 1006 8439
1430H439o084J563R838o577q518O747J228o610O971O790q835l580O463m807l914
$$ 8439 2355 3918 13756 7179 -1339 5408 6636 26 6997 13787 4952 1372 7835 3028 -886
1445h86J0217K276q620J503L337q501m63J0735j626o233N581j051j0401L759Q619
$$ -886 9331 11607 2987 4490 7827 -674 -1137 9598 7972 1739 7320 6269 -4132 -373 8246
1460H246n551q84P470o455r061P398L440o723M931N819j0046m226P507k884m108
$$ 8246 2695 1811 9281 2826 -6235 1163 4603 -2120 2811 8630 -1416 -5642 1865 -1019 -5127
1475e127R328J629j0500Q29M627o819R5J0478k762p738M568k49q073M438Q620
$$ -5127 4201 5830 -4670 -3841 786 -6033 -5938 4540 1778 -5960 -1392 -1641 -9714 -5276 3344
1490C344n583l005N865n253p234P833M900o309K111M920q979m402R193k53m706
$$ 3344 -2239 -5244 621 -4632 -11866 -4033 867 -5442 -3331 1589 -7390 -11792 -2599 -2852 -7558
1505g558P549J465j1111Q08O982m674n06R929l158r405M694K336p104N133Q624
$$ -7558 -9 1456 -9655 -8847 -1865 -6539 -7045 2884 -274 -9679 -4985 -2649 -9753 -4620 4004
1520D004p029m325O228l311n908Q922M544p347J034M187p666k382R901K24n314
$$ 4004 -3025 -7350 -1122 -4433 -10341 -1419 3125 -4222 -3188 999 -6667 -9049 852 1076 -4238
1535d238M995J317r890J461Q154l063j461P707l287q800M587M506n412L470P705
$$ -4238 757 2074 -7816 -6355 1799 -1264 -2725 4982 1695 -7105 -2518 1988 -3424 46 7751
1550G751o920n861O625r76m972Q103M529q418p69N121n617j805J0112L69p428
$$ 7751 831 -5030 1595 619 -4353 3750 8279 -139 -908 4213 -1404 -3209 6903 7272 -156
1565a56L790J592q448K380R382l509l163O144l182q219N946N770n647J464O427
$$ -156 3634 5226 -3222 -842 8540 5031 1868 8012 4830 -3389 2557 8327 2680 4144 10571
1580A0571p376n761P619R19n065O709L222r198j552O429m018k026R254p95q718
$$ 10571 3195 -2566 5053 5972 907 7616 10838 1640 88 6517 2499 473 9727 8932 214
1595B14K967K645o958K238Q909m274m817M372k093p057O085N740n642n39M148
$$ 214 3181 5826 -1132 1106 10015 5741 924 5296 3203 -3854 2231 7971 2329 1790 5938
1610E938o294m750P994J896n757M169K300q930j415P079k435k643P162j189r206
$$ 5938 -356 -5106 2888 4784 -973 3196 5496 -3434 -4849 2230 -205 -2848 4314 3125 -6081
1625f081K355M571n586J624Q168n055o756N236p14n834N961O033p422j933N268
$$ -6081 -3726 845 -4741 -3117 5051 -4 -6760 -1524 -2238 -8072 -2111 3922 -3500 -5433 -165
1640a65n380m261R018J966o797L228K265q071k25Q208j750l478N571j408q466
$$ -165 -5545 -9806 -788 1178 -5619 -2391 -126 -8197 -8422 -214 -1964 -5442 129 -1279 -9745
1655i745L593N354m166R15O330m810o611N146J716m602M932N420p523k705N416
$$ -9745 -6152 -798 -4964 -4049 2281 -2529 -9140 -3994 -2278 -6880 -1948 3472 -4051 -6756 -1340
1670a340k620l105P724K180p624J444L492o488j9R503k126m949M742p59p542M406
$$ -1340 -3960 -7065 659 2839 -4785 -3341 151 -6337 -6356 3147 1021 -3928 814 55 -7487 -3081
1686c081O951m793r20N963m998o072O664K976m750L853M046p514k869O593j283
$$ -3081 3870 -923 -1843 4120 -878 -6950 -286 2690 -2060 1793 5839 -1675 -4544 2049 766
1701G66k790O797R89p790R50M636m758L67Q096k144o190L784Q03o153M080P198
$$ 766 -2024 4773 5762 -2028 -1078 3558 -1200 -833 7263 5119 -1071 2713 3516 -2637 1443 8641
1717H641m857k912M788l413n148O987L691n879K117L868p353k402P854q06l758
$$ 8641 3784 872 5660 2247 -2901 4086 7777 1898 4015 7883 530 -1872 5982 5176 1418
1732A418N895K83q694J400N898m137k7P211l649o783M069J670m956L658N738n818
$$ 1418 7313 7596 -1098 302 6200 2063 2036 9247 5598 -1185 2884 4554 -402 3256 8994 3176
1748C176l709M399k205l870O230L141o387K09K889n518j880P837j50n138L053
$$ 3176 -533 3866 1661 -2209 4021 7162 775 984 3873 -1645 -3525 4312 4162 -976 2077
1763B077P77p405J013P020l337k066N614k822p631M506L350m789K489N373o699
$$ 2077 2854 -4551 -3538 3482 145 -1921 3693 871 -6760 -2254 1096 -3693 -1204 4169 -2530
1778b530m668O327j060m442O685K552q130j6M214m606j068Q003j120o159L382
$$ -2530 -7198 -871 -1931 -6373 312 2864 -5266 -5282 -1068 -5674 -6742 1261 141 -6018 -2636
1793b636J020o683K726P013l660k820M633k852n645M919M401m730J195M442n745
$$ -2636 -1616 -8299 -5573 1440 -2220 -5040 -407 -3259 -8904 -3985 416 -4314 -3119 1323 -4422
1808d422l663O067R08l916M546K429p133r05N262k341j354O625n98p108K433L156
$$ -4422 -8085 -2018 -1110 -5026 -480 1949 -5184 -6089 -827 -3168 -4522 2103 1505 -5603 -3170 -14
1824a4n117K201O982m015m220M680r89n561N650M868n499m64M531n204l037P194
$$ -14 -5131 -2930 4052 37 -4183 497 -492 -6053 -403 4465 -1034 -1498 3033 -2171 -5208 1986
1840A986J315m738L736J728p231L30O277j909k303N889j066o679K475L908m057
$$ 1986 3301 -1437 2299 4027 -3204 -2874 3403 1494 -809 5080 4014 -2665 -190 3718 -339
1855c39J379O085m227m839M503L78m325M775M511n825j594M240l661k793P192
$$ -339 1040 7125 2898 -1941 2562 2940 -1385 3390 7901 2076 482 4722 1061 -1732 5460
1870E460J365n707K160K094o032L22P192k283l212M515q77o851L579M506l839
$$ 5460 6825 1118 3278 5372 -660 -338 6854 4571 1359 5874 4997 -1854 1725 6231 2392
1885B392K89M963m671m813M780J398m176L769L246o177k179M593k105k180N813
$$ 2392 2681 7644 2973 -1840 2940 4338 162 3931 7177 1000 -1179 3414 1309 -871 4942
1900D942O37o210J019K654m942L34O533k230m435L009j41n813L267N285m186j575
$$ 4942 5579 -631 388 3042 -1900 -1566 4967 2737 -1698 1311 1170 -4643 -1376 3909 -277 -1852
1916a852M196l530m993N192K686m787K455K699o324j848N629j308k881N199K78
$$ -1852 2344 -1186 -6179 -987 1699 -3088 -633 2066 -4258 -6106 -477 -1785 -4666 533 811
1931H11o842J406L619l624o3O286k551n406L526L15m521L813M940m821j975M404
$$ 811 -6031 -4625 -1006 -4630 -4693 1593 -958 -6364 -2838 -2523 -7044 -3231 1709 -3112 -5087 -683
1947f83l309l433N784K273m625J171K931n304j538O211j9l409L803N38o356J489
$$ -683 -3992 -7425 -1641 632 -3993 -2822 109 -5195 -6733 -522 -541 -3950 -147 391 -5965 -4476
1963d476N024k896m36N087k556n255L436K134l790K706M972m914l152M589j207
$$ -4476 548 -2348 -2784 2303 -253 -5508 -2072 62 -3728 -1022 3950 -964 -4116 473 -734
1978g34l416N407K943n947O73L329m567q42O880p89m272L402K53n540J994N407
$$ -734 -4150 1257 4200 -1747 -1074 2255 -2312 -3154 3726 2937 -1335 2067 2320 -3220 -1226 4181
1994D181k800j542M865k792n082M173K962l843K018L731n083k871M879n52k812
$$ 4181 1381 -161 4704 1912 -3170 1003 3965 122 2140 5871 788 -2083 2796 2244 -568
2009e68M916J535n771Q2L625l008p31N626n17m980K262J458m779J812N816l111
$$ -568 4348 5883 112 194 3819 811 80 5706 5189 209 2471 3929 -850 962 6778 3667
2025C667k930L637j480m832M640L204m226M94L568m895k822N346P05l924L658
$$ 3667 737 4374 2894 -1938 2702 5906 1680 2174 5742 847 -1975 3371 4076 152 3810
2040C810J604o339j25M437k337j327N275j206n906K272K244m024J510N217l769
$$ 3810 5414 -925 -1050 3387 1050 -277 4998 3792 -2114 158 2402 -1622 -112 5105 1336
2055A336l723L934j221l829L787L171m618p42L145l425k497N132J126m196J771
$$ 1336 -2387 1547 326 -3503 284 3455 -1163 -1905 1240 -2185 -4682 450 1576 -2620 -849
2070h49J798n567k29N276j853j967M097j211n752K870L079l641P54M651l500m004
$$ -849 949 -4618 -4847 429 -1424 -3391 706 -505 -6257 -3387 -308 -3949 -3195 1456 -2044 -6048
2086f048L972j39l450L782L137n071q85L802k957j770N371N76m494J663J763m359
$$ -6048 -2076 -2215 -5665 -1883 1254 -3817 -4702 -900 -3857 -5627 -256 320 -4174 -2511 -748 -5107
2102e107M70N505j721k991L610m49n075K461M174k933m1L875l030l999M372J786
$$ -5107 -4637 868 -853 -3844 -234 -683 -5758 -3297 877 -2056 -2097 1778 -1252 -5251 -879 907
2118I07l610K793K947n186j363M421j388k414N519L86n336J393K858l957O10N474
$$ 907 -2703 90 3037 -2149 -3512 909 -479 -2893 2626 3012 -2324 -931 1927 -2030 -1420 4054
2134D054j923l920L503j04m512L408L915l737n23L470l049l017M549J462l260
$$ 4054 2131 -1789 1714 1610 -2902 506 4421 684 161 3631 582 -2435 2114 3576 316
2149C16J639K353m605j022M515p40k261L833K80n008Q23L626k903j51N005k142
$$ 316 1955 4308 -297 -1319 3196 2456 195 4028 4308 -700 123 3749 846 695 5700 3558
2165C558m269K871J020l797K628L889l691k006L648j720l414M593K128m600Q84
$$ 3558 -711 2160 3180 -617 2011 5900 2209 203 3851 2131 -1283 3310 5438 838 1722
2180A722K616m534r22N278r25l101L471L1n239J366L959k640q86L937k100m387
$$ 1722 4338 -196 -1118 4160 3235 134 3605 3636 -1603 -237 3722 1082 196 4133 2033 -2354
2196b354K929J849l661K148L518m248k514L571j016k891M186J760n280L45K783
$$ -2354 575 2424 -1237 911 4429 181 -2333 1238 222 -2669 1517 3277 -2003 -1658 1125
2211A125l405j033N324q25m086K490L09m570J704M248k677j541L284j772m469
$$ 1125 -2280 -3313 2011 1186 -2900 -410 -101 -4671 -2967 1281 -1396 -2937 347 -1425 -5894
2226e894L663K130l415J361K975m127k347M033m16k291L414J205m317k22L274
$$ -5894 -2231 -101 -3516 -2155 820 -3307 -5654 -1621 -2037 -4328 -914 291 -4026 -4248 -974
2241i74k190j318M836m64m550K060J632l584J396M274k219k743L134p79l636L353
$$ -974 -3164 -4482 354 -110 -4660 -2600 -968 -4552 -3156 1118 -1101 -3844 -710 -1489 -5125 -1772
2257a772L277l669K21L104l502k036M421O33k952K707J264m735N43M064j970j099
$$ -1772 1505 -2164 -1943 1161 -2341 -4377 44 677 -2275 432 1696 -3039 -2496 1568 -402 -1501
2273a501M022p93m266K056K105l116J180L970k550k857L302n15k768L358K482
$$ -1501 2521 1728 -2538 -482 1623 -1493 -313 3657 1107 -1750 1552 1037 -1731 1627 4109
2288D109l421p02K884k512j968M577N29l321J741J442m214K07M591j827j980L660
$$ 4109 688 -14 2870 358 -1610 2967 3496 175 1916 3358 -856 -649 3942 2115 135 3795
2304C795r35m211K501K681l082O24L628k954k900L091L65k689K846K030l710j303
$$ 3795 2860 -1351 1150 3831 749 1373 5001 2047 -853 2238 2603 -86 2760 4790 1080 -223
2320b23L375j845j782M096P34m035J059J844l616j42M991j795k462K576n09m170
$$ -223 3152 1307 -475 3621 4355 320 1379 3223 -393 -535 4456 2661 199 2775 2266 -1904
2336a904K444L198k824n42L063k626k979L336P06k546J844K111m481n70L291j438
$$ -1904 540 3738 914 372 3435 809 -2170 1166 1872 -674 1170 3281 -1200 -1770 1521 83
2352H3j967L752Q9m367J088J928k658J41L803j452l454K257M66l501K115L094
$$ 83 -1884 1868 1957 -2410 -1322 606 -2052 -1911 1892 440 -3014 -757 -291 -3792 -1677 1417
2368A417k920r38K414j940k619L503J483l223J003K051l874q82M052p56k124K779
$$ 1417 -1503 -2441 -27 -1967 -4586 -1083 400 -2823 -1820 231 -3643 -4525 -473 -1229 -3353 -574
2384e74M70m674J224K881k190l62L944k138l181K600Q90k616J957L097l344r71
$$ -574 -104 -4778 -3554 -673 -2863 -3225 719 -1419 -4600 -2000 -1110 -3726 -1769 1328 -2016 -2987
2400b987K484j331k092L541J581l443P23K206l216m88M040n09k687K462N30l829
$$ -2987 -503 -1834 -3926 -385 1196 -2247 -1524 682 -2534 -3022 1018 509 -2178 284 814 -3015
2416c015J527L158j828r13L394j631l547L072J427k561J215K812l056j592L111
$$ -3015 -1488 1670 -158 -1071 2323 692 -2855 217 1644 -917 298 3110 54 -1538 1573
2431A573l79k454L457J037l733N99K280k470o80M220o63l003J881O60l288J495
$$ 1573 1194 -1260 2197 3234 -499 100 2380 -90 -770 3450 2787 -216 1665 2325 -963 532
2447E32L336j987j342K547j447k756K492J911k323L59K524k988j956L521K51k444
$$ 532 3868 1881 539 3086 1639 -1117 1375 3286 963 1322 3846 858 -1098 2423 2674 230
2463B30K471J077l828M9K848j666j226L508n14l351J417J409l278J507L417k530
$$ 230 2701 3778 -50 -1 2847 1181 -45 3463 2949 -402 1015 2424 -854 653 4070 1540
2479A540k015K848r59k756K814J878l375K29K396k787j263L294J15k628J990P79
$$ 1540 -475 2373 1414 -1342 1472 3350 -25 204 2600 -187 -1450 1844 1959 -669 1321 2100
2495B100l539J78K634j507q23K628p13l438J532J744k236N58K518j993k267K153
$$ 2100 -1439 -1261 1373 -134 -957 1671 958 -2480 -948 796 -1440 -882 1636 -357 -2624 -471
2511d71o3k114K058K229l397p89K719k378j571L614N78l274J334J551l731K27
$$ -471 -534 -2648 -590 1639 -1758 -2547 172 -2206 -3777 -163 415 -2859 -1525 26 -3705 -3478
2527c478L572j330j821K570m92l672K259K679k646J2K638k041k383K541O53k215
$$ -3478 94 -1236 -3057 -487 -979 -4651 -2392 287 -2359 -2347 291 -1750 -4133 -1592 -939 -3154
2543c154K295J664l261n18K399j044j314L274P2k790R53J593k607K65L656j217
$$ -3154 -859 805 -2456 -2974 -575 -1619 -2933 341 413 -2377 -1424 169 -2438 -2173 1483 266
2559B66k116K050N9k808J792K667k335l70K608j857k022K628J082k484J575J959
$$ 266 -1850 200 259 -2549 -757 1910 -425 -795 1813 -44 -2066 562 1644 -840 735 2694
2575B694l414o34L163j143j222K833J04l393J116K142k396j80L580j499k379K111
$$ 2694 -720 -1354 1809 666 -556 2277 2381 -1012 104 2246 -150 -330 3250 1751 -628 1483
2591A483K64k389J804K403k507p25K181j648j877K861Q51k422J100J649l058l48
$$ 1483 1747 -642 1162 3565 1058 333 2514 866 -1011 1850 2701 279 1379 3028 -30 -378
2607c78K919n79j888K474j3l403J415J801j273o26K807j503k654K167Q50k271
$$ -378 2541 1962 74 2548 2535 -868 547 2348 1075 449 3256 1753 -901 1266 2116 -155
2623a55J306K335k952q34K320r93k050K844R07l004L40J814k575k32K938m77k263
$$ -155 1151 3486 534 -300 2020 1027 -1023 1821 2728 -276 64 1878 -697 -929 2009 1532 -731
2640g31J764K75l061R89K399j839r26K662j340k662K215J077k159Q01K197k952
$$ -731 1033 1308 -1753 -764 1635 -204 -1130 1532 192 -2470 -255 822 -1337 -536 1661 -1291
2656a291j344K454l07j755K197R01k995K0K008j989m02L172p07k692J501N51k491
$$ -1291 -2635 -181 -488 -2243 -46 855 -2140 -2120 -112 -2101 -2503 669 -38 -2730 -1229 -678 -3169
2673c169R84K783j895j233K165j084k262K253J668k541O31J792k394j122K710
$$ -3169 -2185 598 -1297 -2530 -365 -1449 -3711 -1458 210 -2331 -1700 92 -2302 -3424 -714
2688g14p5j867K212R55l417O32K352j737m55K753p15k584J655J002k348J363K415
$$ -714 -789 -2656 -444 511 -2906 -2274 78 -1659 -2114 639 -76 -2660 -1005 -3 -2351 -988 1427
2705A427k014j435K310n45j647K102J309k303K46J753j866q78K559L77k124J600
$$ 1427 -587 -2022 288 -257 -1904 198 1507 -796 -550 1203 -663 -1541 1018 1395 -729 871
2721H71R43k646J29K487j004q85K354n22k745J311J783k324P16K572j931j824
$$ 871 1814 -832 -703 1784 780 -105 2249 1727 -1018 293 2076 -248 468 3040 1109 -715
2737g15K261%j941K089J357k735j79K034j789j104L067j04k081R86R90k603L19
$$ -715 1546 1546 -395 1694 3051 316 137 2171 382 -722 2345 2241 160 1146 2136 -467 -148
2754a48K733j244j427K447n82k528J358J665k019N58J603j885j461K522J47j855
$$ -148 2585 1341 -86 2361 1779 -749 609 2274 255 813 2416 531 -930 1592 1739 -116
2770a16J266J421k618j92K166j504j276K684J07k942J271J195k219K11K735j128
$$ -116 1150 2571 -47 -239 1927 423 -853 1831 1938 -1004 267 1462 -757 -546 2189 1061
2786A061k017J963l18k647J814K106k099m29K089j808j726K402P04k385J068J245
$$ 1061 -956 1007 689 -1958 -144 1962 -137 -566 1523 -285 -2011 391 1095 -1290 -222 1023
2802A023k728l07K189n65j363K201K49k898Q35J444k011L45K290j092k147J857
$$ 1023 -1705 -2012 177 -388 -1751 450 699 -2199 -1364 80 -1931 -1586 704 -388 -2535 -678
2818f78K35k259J297J884j932r30K379j561j675K846K85k265J016J090k045m99
$$ -678 -443 -2702 -1405 479 -1453 -2383 -4 -1565 -3240 -394 -109 -2374 -1358 -268 -2313 -2812
2834b812L024q83j615K096O6k777R78K211j585m26K592j588j885J881P51j769
$$ -2812 212 -671 -2286 -190 -124 -2901 -1923 288 -1297 -1723 869 -719 -2604 -723 28 -1741
2850a741J282J643k122q53K288o63j389J870J041k065r4J972j973l48K891n37
$$ -1741 -459 1184 -938 -1791 497 -166 -1555 315 1356 -709 -803 1169 -804 -1152 1739 1202
2866A202k112J738O97k767J355J892j684o04K212j105k136K136J059j945Q63J796
$$ 1202 -910 828 1525 -1242 113 2005 321 -283 1929 824 -1312 824 1883 -62 801 2597
2882B597k309j064K456o79j174K051M63k415L13J843j715m06K369n74k019J459
$$ 2597 288 -776 1680 1001 -173 1878 2341 -74 239 2082 367 -39 2330 1756 -263 1196
2898A196L70j850P37J988j535p04J727o72k051J973J337k228J96J602k107r55
$$ 1196 1566 -284 453 2441 906 202 1929 1257 -794 1179 2516 288 484 2086 -21 -976
2914i76K652l26j456J468N05k484N67J465j165m92J925k27k411J351O83j841R95
$$ -976 1676 1350 -106 1362 1867 -617 -50 1415 250 -242 1683 1456 -955 396 1079 -762 233
2931B33J688j639j397K096o72j662J725J233k143O2J333j555p89K326j25j763
$$ 233 1921 282 -1115 981 309 -1353 372 1605 -538 -476 857 -698 -1487 839 714 -1049
2947a049J182P92k597K61K285j303r70K001p59k467J706J477k151N82J706j739
$$ -1049 133 925 -1672 -1411 874 -429 -1399 602 -157 -2624 -918 559 -1592 -1010 696 -1043
2963a043j322K058m94j628J750J052k070k30J810j350p42K446n06j501Q55Q32
$$ -1043 -2365 -307 -801 -2429 -679 373 -1697 -1927 -117 -1467 -2209 237 -269 -1770 -915 -83
2979h3j932L90J958p94j362J643k40k040J588J189j562P8J713j509j297K236K43
$$ -83 -2015 -1625 333 -461 -1823 -180 -420 -2460 -872 317 -1245 -1167 546 -963 -2260 -24 219
2996B19j493J288Q34k104k04K011q01q68K103nk148Q00J204j481J66K137j039
$$ 219 -1274 14 848 -1256 -1460 551 -250 -1118 985 980 -1168 -368 836 -645 -479 1658 619
3013F19j269J475Mk028J686J288j580k12J647j432j048K119K39j567J116O27j726
$$ 619 -650 825 829 -1199 487 1775 195 -17 1630 198 -850 1269 1508 -59 1057 1684 -42
3030d2l84J996o94r50K257m12k339Q67J263j311K50J460r52j295J781m66j336
$$ -42 -426 1570 876 -74 2183 1771 -568 299 1562 251 501 1961 1009 -286 1495 1029 -307
3047c07J071J325j596l89J462r66j329K174M63k011N48Q71j420j66J704l59j409
$$ -307 764 2089 493 104 1566 600 -729 1445 1908 -103 445 1316 -104 -270 1434 1075 -334
3064c34J510J32k187O65J482j167k89J790j184j512J477M60j330R27J198k058
$$ -334 1176 1308 -879 -214 1268 101 -188 1602 418 -1094 383 843 -487 440 1638 -420
3080d20l46J616r25r36K030J3j959M79J309j562j29J872o24j351J040J93j859
$$ -420 -766 850 -75 -1011 1019 1032 -927 -448 861 -701 -830 1042 418 -933 107 300 -1559
3097a559N84J702j123m08J264q12j396J228J005j661N02J414j946p21J872m73
$$ -1559 -975 727 -396 -804 460 -352 -1748 -520 485 -1176 -674 740 -1206 -1927 -55 -528
3113e28j104J478L12j716J63J298j400k0J825p23j545J133L10j309R32J348j189
$$ -528 -1632 -154 158 -1558 -1395 -97 -1497 -1517 308 -415 -1960 -827 -517 -1826 -894 454 -735
3130g35p36J561q30j168J383P84j723N81J081j409p05J981j5j338J381L67j598
$$ -735 -1471 90 -740 -1908 -525 259 -1464 -883 198 -1211 -1916 65 50 -1288 93 460 -1138
3147a138K84J449r64q64K071l37j719J103P80j603Q93J684j283j107J322j47j264
$$ -1138 -854 595 -369 -1233 838 501 -1218 -115 665 -938 -45 1639 356 -751 571 424 -840
3164h40J550J221k207O12J033j543m78K335l55j489R70M31j580J87J676p16p28
$$ -840 710 1931 -276 336 1369 -174 -652 1683 1328 -161 809 1240 -340 -153 1523 807 79
3181G9J547p60j434R57J154j394J20J744j387r60J523j60j265J408M30j682j09
$$ 79 1626 866 -568 389 1543 149 269 2013 626 -334 1189 1029 -236 1172 1602 -80 -189
3198a89J372j079m96J861j42j688J010L62j623O43J676j005j057J428k71j392
$$ -189 1183 104 -392 1469 1327 -361 649 1011 -612 31 1707 702 -355 1073 802 -590
3214e90O63J239j562K66J342j404q31J569M3j243R60R81k189k2J927j137q52J641
$$ -590 73 1312 -250 16 1358 -46 -877 692 735 -508 452 1433 -756 -778 1149 12 -840 801
3232H01j34j520M62J111j826L00J844r12j231J455l39j439J316R48j430k13J257
$$ 801 667 -853 -391 720 -1106 -806 1038 126 -1105 350 11 -1428 -112 836 -594 -807 450
3249D50r96n84J214K34j226O29O38j523o8J143k78q22J267j05j606N18J132r16
$$ 450 -546 -1130 84 318 -908 -279 359 -1164 -1232 -89 -367 -1189 78 -27 -1633 -1115 17 -899
3267h99j40J326o65j411J394K59j565J125R38j263k80J326r79p66J481L79j437
$$ -899 -1039 287 -378 -1789 -395 -136 -1701 -576 362 -901 -1181 145 -834 -1600 -119 260 -1177
3284a177P92N44j472J29J660l41j050R68k4j524R53J068r77k3J314o59j191J342
$$ -1177 -385 159 -1313 -1184 476 135 -915 53 29 -1495 -542 526 -451 -474 840 181 -1010 332
3302C32K35j245J009O93j147n36J567o16r74J641M06j603J32J330j444J47J771
$$ 332 567 -678 331 1024 -123 -659 908 292 -682 959 1365 -238 -106 1224 -220 -73 1698
3319A698r67j116J312K30j518P48J388j434p8Q77m83j213J552L03j112N03P85
$$ 1698 731 -385 927 1157 -361 387 1775 341 263 1140 657 -556 996 1299 187 690 1475
3336A475j261n60J343l33q14J221K93j537J8R56p14k83J762o24j589J059K41j136
$$ 1475 214 -346 997 664 -150 1071 1364 -173 -155 801 87 -196 1566 942 -647 412 653 -483
3354d83M69J230q08q11J395o10j197J226O05j475M94J065j331o21J594n00o34
$$ -483 -14 1216 408 -403 992 382 -815 411 1016 -459 35 1100 -231 -852 742 242 -392
3371c92J041J5j204J67J176j117m51J695n24j349R81N16j251K35J347r77q60J409
$$ -392 649 664 -540 -373 803 -314 -765 930 406 -943 38 554 -697 -462 885 -92 -952 457
3389D57m48j103J437L58j384L0J076q39q34J476J22j631J121M99j754M12J678
$$ 457 9 -1094 343 701 -683 -653 423 -416 -1250 226 348 -1283 -162 337 -1417 -1005 673
3406F73j176l35J130m73j127P10Q25j130K94J146j396l33J142j10j091R66P01
$$ 673 -503 -838 292 -181 -1308 -598 227 -903 -609 537 -859 -1192 -50 -160 -1251 -285 416
3423D16j575l00J411m42q13J494K47j530P13M21r98R5J350m40j041J301j43j515
$$ 416 -1159 -1459 -48 -490 -1303 191 438 -1092 -379 42 -956 -861 489 49 -992 309 166 -1349
3441a349J201Q53j478J79J349r33r13J481J02j239J211N06j324j50J348p63k50
$$ -1349 -148 705 -773 -594 755 -178 -1091 390 492 -747 464 970 -354 -504 844 81 -169
3458a69R35p6r43K09N74q29L74J104n22r63J026q7r58R09P97j081j93Q84p48p67
$$ -169 766 690 -253 -44 530 -299 75 1179 657 -306 720 633 -325 584 1381 300 107 991 243 -524
3478e24J428K19j191O11O68j582j82J771o73o81J078Q6j498L43J044r77N2J232
$$ -524 904 1123 -68 543 1211 -371 -553 1218 545 -136 942 1028 -470 -127 917 -60 -8 1224
3496A224q55q54J042J39j151P78Q68j372j51P02k61n65J079J05j290N09O53p86
$$ 1224 369 -485 557 696 -455 323 1191 -181 -332 370 109 -456 623 728 -562 -53 600 -186
3514a86k41J224l61j125J119K35j285L89J150r71k19R43o93j021J172L67j008
$$ -186 -427 797 436 -689 430 665 -620 -231 919 -52 -271 672 -21 -1042 130 497 -511
3531e11N44Q09j112o38J332o34m99J248K90j706M31O61j004J50J360q50q49Q31
$$ -511 33 842 -270 -908 424 -210 -709 539 829 -877 -446 215 -789 -639 721 -129 -978 -147
3549a47K71j206L81J286q64o10R24m94o34P66M48p71K43Q50j189m97J346p2j173
$$ -147 124 -1082 -701 585 -279 -889 35 -459 -1093 -327 121 -650 -407 443 -746 -1243 103 31 -1142
3568a142J226L20j677O84P54r27k02J403n45j013J028L98j240P07N09p16o49J329
$$ -1142 84 404 -1273 -589 165 -762 -964 439 -106 -1119 -91 307 -933 -226 283 -433 -1082 247
3586B47n12n93R30L6r29O95M67j080mJ177k68p20J038j65j046K54J154p38j93
$$ 247 -265 -858 72 108 -821 -126 341 -739 -743 434 166 -554 484 319 -727 -473 681 -57 -250
3605b50J013k33j135P92O43j258O68Q93j050k52J020k07j313J285O57j368L52
$$ -250 763 530 -605 187 830 -428 240 1133 83 -169 851 644 -669 616 1273 -95 257
3622B57O10p99l59J460l87j146R87L34j264K43J232q00l77R70m66q29N00O39r60
$$ 257 867 68 -291 1169 782 -364 623 957 -307 -64 1168 368 -9 961 495 -334 166 805 -155
3641a55L36P02p34p28J072J09j154J025O62j389L12N14n76l50J259m29j132O30
$$ -155 181 883 149 -579 493 602 -552 473 1135 -254 58 572 -4 -354 905 476 -656 -26
3659b6M08j046M25R41o78n28O09K12j048Q33M61r66J30O82o38o68J090J52r33
$$ -26 382 -664 -239 702 24 -504 105 317 -731 102 563 -403 -273 409 -229 -897 193 345 -588
3678e88M30O00q84j36R33l66n47J001J5j238N99M18l75j44R11o03r84J019j9q21
$$ -588 -158 442 -442 -578 355 -11 -558 443 458 -780 -181 237 -138 -282 629 26 -958 61 42 -779
3698g79N89Q33j149J84N00o00n58J354j80q83N32N53j135N9P35l87l86O71J44
$$ -779 -190 643 -506 -322 178 -422 -980 374 194 -689 -157 396 -739 -680 55 -332 -718 -47 97
3717I7j145N19Q07q18O9Q07q76o23Q63L10r68P33P65r79k99Q55k87o56R43J49
$$ 97 -1048 -529 278 -540 -471 336 -540 -1163 -300 10 -958 -225 540 -439 -738 117 -170 -826 117 266
3737B66j006L88Q36j015K17J082q38m84P53J29j097O34P96p61O2J023o97p92O46
$$ 266 -740 -352 484 -531 -314 768 -70 -554 199 328 -769 -135 661 -100 -38 985 288 -504 142
3756A42L91o58K86P69q39k04O37p9p18J043K02r49J9Q27j057J95Q69j33r49R39
$$ 142 533 -125 161 930 91 -113 524 445 -273 770 972 23 42 869 -188 7 876 743 -206 733
3776G33J7q29M87P63p74m86Q49n15o40P62N07r86M97N14q23m24R61n42k51O82
$$ 733 750 -79 408 1171 397 -89 760 245 -395 367 874 -112 385 899 76 -348 613 71 -180 502
3796E02K63j342K49R77n54k99P68k21q97N34L48p50J77J068j081PO02k49p56J052
$$ 502 765 -577 -328 649 95 -204 564 343 -554 -20 328 -422 -245 823 -258 -251 351 102 -654 398
3816C98N3q20M09N70j059n16J406l17p42P50J84r40K27R25p36j51P82m37p17R52
$$ 398 451 -369 40 610 -449 -965 441 124 -618 132 316 -624 -397 528 -208 -359 423 -14 -731 221
3836B21J10q93L60Q15j103j11O85j7o48P41L39j001K99P03q99j63P48j27p15O06
$$ 221 331 -562 -202 613 -490 -601 84 67 -581 160 499 -502 -203 500 -399 -562 186 59 -656 -50
3856e0K03r32N03N45k12n44P95k62r62P03K75m95P9O84q44m72Q51J01n36N15M87
$$ -50 153 -779 -276 269 57 -487 308 46 -916 -213 62 -433 -354 330 -514 -986 -135 -34 -570 -55 432
3877D32q55l25J126q98j30J224j76j134N37P36r99J30Q65n68m60P35K2q09Q15
$$ 432 -423 -748 378 -520 -650 574 398 -736 -199 537 -462 -332 533 -35 -495 240 262 -547 268
3896B68K90q53M38N38r84k72J136n0p98P10J96p43k10J106p68p5Q71k04r13N82
$$ 268 558 -295 143 681 -303 -575 561 511 -287 423 619 -124 -334 772 4 -71 800 596 -317 265
3916B65K73m91J30O44k68q01P25L05j044O34M83q74J55L11n04l84R72p5o60O32
$$ 265 538 47 177 821 553 -248 477 782 -262 372 855 -19 136 447 -57 -441 531 456 -204 428
3936D28J44q37J28P06l47m52O18k06p57P59M00q14L25O92p22o14N79k1m79M51
$$ 428 572 -265 -137 569 222 -230 388 182 -575 184 584 -230 95 787 65 -549 30 9 -470 -19
3956a9M31m37l71P52l85o74Q48K13p52J62N92o91J38O17o18k68P05qj035M92P29
$$ -19 412 -25 -396 356 -29 -703 145 358 -394 -232 360 -331 -193 424 -194 -462 243 235 -800 -308 421
3977D21q29L41M98o92n12P93M44r16L28M71q47q4O48n7o61Q91J01r23J90M95m23
$$ 421 -408 -67 431 -261 -773 20 464 -452 -124 347 -500 -584 64 7 -654 237 338 -585 -395 100 -323
3998c23KP62k93o68P48j74r22O24N10o46j89P14n38k89N22K25n50J97M56n93j39
$$ -323 -321 441 148 -520 228 54 -868 -244 266 -380 -569 145 -393 -682 -160 65 -485 -288 168 -425 -564
4019e64P06l28m18P47P1q65J04N42k79k47P44k99n66P41K9q22N20R51r82l84Q00
$$ -564 142 -186 -604 143 214 -651 -547 -5 -284 -531 213 -86 -652 89 118 -704 -184 767 -215 -599 201
4040B01r3m44M60P1k55J02L39p62M5R44m45m49J045l57p71L55N77m93l53R00l85
$$ 201 108 -336 124 195 -60 42 381 -381 -336 608 163 -286 759 402 -369 -14 563 70 -283 617 232
4061B32n24O93N2n56K03P10o62k46N32k12m42M71L02n45J84N66m71l17Q18l47
$$ 232 -292 401 453 -103 100 810 148 -98 434 222 -220 251 553 8 192 758 287 -30 788 441
4081D41o53L93L40r59L36P05m92p7N16k40q35Q66L8p84K58O98n65l55P56l21n79
$$ 441 -212 181 521 -438 -102 603 111 34 550 310 -525 341 379 -405 -147 551 -14 -369 387 66 -513
4102e13Q58J63o35o5M12k46k80P49n3r94M31M31m70O0P42o54n73P24l02o27O33
$$ -513 345 508 -127 -192 220 -26 -306 443 390 -604 -173 258 -212 -152 590 -64 -637 87 -215 -842 -209
4123b09M28j92l86P31p03j88Q47N0r70O55M90p92p6M92k53l26P08m91k76L83M52
$$ -209 219 27 -359 372 -331 -519 328 378 -592 63 553 -239 -315 177 -76 -402 306 -185 -461 -78 374
4144C74q51K64P35o84m64N40J6l70M52M22o88j75N43n41k53R00L5o80M30J43l77
$$ 374 -477 -213 522 -162 -626 -86 -70 -440 12 434 -254 -429 114 -427 -680 220 255 -425 5 148 -229
4165b29j70N31r8m54P11k72n59L35N99o37k5M37l74n13Q44K58q32O30K47p13o
$$ -229 -399 132 34 -420 291 19 -540 -205 394 -243 -268 169 -205 -718 126 384 -448 182 429 -284 -290
4186b90Q09p91jO86O5p02N14l1o67K80P58l89l41L45J07l87K22M53o33J74J83
$$ -290 519 -272 -273 413 478 -224 290 259 -408 -128 630 241 -100 245 352 -35 187 640 7 181 364
4207C64j72j46L55K2n35K96N54q32n2Q72l70m52M28K42p69M50K86q44L26P71o16
$$ 364 192 46 401 423 -112 184 738 -94 -146 726 356 -96 332 574 -195 255 541 -303 23 794 178
4228A78k74N43l70n94M44O90k86l93N70o21n03O68N33q40K22N26p37M6M24m18
$$ 178 -96 447 77 -517 -73 617 331 -62 508 -113 -616 52 585 -255 -33 493 -244 -198 226 -192
4248a92o9M98K4n68N7N76n48k4N66j85o13N50K3l84J75M60o39l72P50j43o79O28
$$ -192 -261 237 261 -307 -250 326 -222 -246 320 135 -478 72 95 -289 -114 346 -293 -665 85 -58 -737 -109
4270a09K79m62j14O11o54o7O19j4k68K30J69n61Q5L10m6k13J91L22o67L07R6l99
$$ -109 170 -292 -406 205 -449 -516 103 89 -179 51 220 -341 -256 54 8 -205 -14 308 -359 -52 44 -355
4292c55K62N78p47k24N03Qm75M85L65p83Q5N68m78p5O66l65n58P09L1o90K84O08
$$ -355 -93 485 -262 -486 17 25 -450 35 400 -383 -298 270 -208 -283 383 18 -540 169 200 -490 -206 402
4314D02l70n14R26l95p23O15M85p07k0O60m08m20P46m1l95M16J9m74l3O17n99
$$ 402 32 -482 444 49 -674 -59 426 -281 -301 359 -49 -469 277 236 -159 257 276 -198 -231 386 -213
4335b13o3O53n3m24j2M60p04N18K48j46p32Q38l81k91O22K91q71J62K96j94l06
$$ -213 -276 377 324 -100 -112 348 -356 162 410 264 -468 370 -11 -302 320 611 -260 -98 198 4 -302
4356c02Q16j85k78M40P3p68L35L57k62QL63L0p31K10K4O4j05P24n94m05O18k85
$$ -302 514 329 51 491 564 -204 131 488 226 234 597 627 -104 106 130 194 89 813 219 -186 432 147
4378A47j09K7M18o56J0N55n33l69Q36p4l58J98K16o78j68Q25l38k18O43j31n24
$$ 147 38 65 483 -173 -163 392 -141 -510 326 252 -106 92 308 -370 -538 287 -51 -269 374 243 -281
4399b81L00N1n71K67O13n41m20P08L1k97Q9L29m64j95M99k47l23P40k57n40N07
$$ -281 19 70 -501 -234 379 -162 -582 126 157 -140 -51 278 -186 -381 118 -129 -452 288 31 -509 -2
4420bj10k08MN30k34j66L98j95n26L17M31m35J33L93o96MN46J4m74L79K06o85
$$ -2 -112 -320 -316 214 -20 -186 212 17 -509 -192 239 -196 -63 330 -366 -362 184 198 -276 103 309 -376
4442c76R5M64j01l09N89j86l23j9L58m35JN43k01m17K72r6k96L22M45p26O9M19
$$ -376 -281 183 82 -227 362 176 -147 -166 192 -243 -242 301 100 -317 -45 -141 -437 -115 330 -396 -327 92
4464I2k56k96O00Q3o59L52K49m59N3L62j81l47M18k08j16L30J43k62j79M86j77
$$ 92 -164 -460 140 223 -436 -84 165 -294 -241 121 -60 -407 11 -197 -313 17 160 -102 -281 205 28
4485B8l00L83K35q00N54L60n26k51P01m12l38O02J86n28N4L74l70O2M15j29l96
$$ 28 -272 111 346 -454 100 460 -66 -317 384 -28 -366 236 422 -106 -52 322 -48 14 429 300 -96
4506i6L83P1n02M12K42k24j98K79m6n82L27L30l23L76n4l13k37M62j27l72M21
$$ -96 287 358 -144 268 510 286 88 367 321 -261 66 396 73 449 395 82 -155 307 180 -192 229
4527B29O9m10K13K86o87J43M73k28l75L97n2l09J68N49n11p9N12k78n74L71K40
$$ 229 298 -112 101 387 -300 -157 316 88 -287 110 58 -251 -83 466 -45 -124 388 110 -464 -93 147
4548A47k18j14M98n25j86N72l72l6K87J31n38J72J62L5n89P58k73k54K98j56j09
$$ 147 -71 -185 313 -212 -398 174 -198 -234 53 184 -354 -182 -20 15 -574 184 -89 -343 -45 -201 -310
4569c10K4O98j76m77K4N03o39L89Q1j16l31M97l8p32R24l52l11L61K76q32M68
$$ -310 -286 412 236 -241 -217 286 -353 36 117 1 -330 167 129 -603 321 -31 -342 19 295 -537 -69
4590f9L22m50k2K58j4m17L49J00k58K99p0q1l88N16j83m6Q4K38m83O1N15l20j61
$$ -69 253 -197 -219 39 25 -392 -43 57 -201 98 28 -53 -441 75 -108 -154 -70 168 -315 -254 261 -59 -220
4613b20K12J78l82J39J02j59j51N32l66j70M83j98l48N11O5m54m9P20n12k94L21
$$ -220 -8 170 -212 -73 29 -130 -281 251 -115 -285 198 0 -348 163 228 -226 -275 445 -67 -361 -40
4634d0R9k22J88k6j70n6M72m54j3N21q1l14K70Rk23J34M69o26R9J67j15j15j49
$$ -40 59 -163 25 -1 -171 -227 245 -209 -222 299 218 -96 174 183 -40 94 563 -63 36 203 88 -27 -176
4657a76O50n62J68K33mm66L59K28m73J74L95k86j53K87l36j27L77J5n96L46L25
$$ -176 474 -88 80 313 309 -157 202 430 -43 131 526 240 87 374 38 -89 288 303 -293 53 378
4678C78m42k4P10m90l48J45L78p83N11K63m50J5M91k78k15J16L43o31J88K38l66
$$ 378 -64 -88 622 132 -216 -71 307 -476 35 298 -152 -137 354 76 -139 -23 320 -311 -123 115 -251
4699b51n2M44j2n86M09J03n82L84K67m82J85L69n25r0K94J04j24n5M75p00J62
$$ -251 -303 141 129 -457 -48 55 -527 -143 124 -358 -173 196 -329 -419 -125 -21 -145 -200 275 -425 -263
4720b63M43l23j12M23l2n79N77N2o15J69M38j36j49K96r2l26M0M06o6k82L64k67
$$ -263 180 -143 -255 168 136 -443 134 186 -429 -260 178 42 -107 189 97 -229 -189 217 151 -131 233 -34
4742c4l89N26n8k36P1N99o54r9L67j12LR5n4l72M69k5j19l8K89r5k75J53o3k96
$$ -34 -423 103 45 -191 -120 479 -175 -274 93 -19 -16 79 25 -347 122 97 -22 -60 229 134 -141 12 -51 -347
4766c47KN00j42l15N45j13k84J66J45l37K34k5j05k20M30l7k94K93K58n05J92
$$ -347 -345 155 13 -302 243 130 -154 12 157 -180 54 29 -76 -296 134 97 -197 96 354 -151 41
4787D1J59j42j72K95J07m30K68J49l67K68lj55l10M58k27k44M25M8m80L00K18
$$ 41 200 58 -114 181 288 -142 126 275 -92 176 173 18 -292 166 -61 -305 120 168 -312 -12 206
4808B06k27M0K47J11m74L72m7k31N2J28J07k85J35K90m82K32L50p09J74N16n03
$$ 206 -21 19 266 377 -97 275 228 -3 49 177 284 -1 134 424 -58 174 524 -185 -11 505 2
4829Bj5M59m20k64K51J15k40k36M77K1l88M90j72k65J42K68l76J63n2n4L9M10
$$ 2 -13 446 26 -238 13 128 -112 -348 129 150 -238 252 80 -185 -43 225 -151 12 -40 -94 -55 355
4851C55k55n81L54K79m18J85L38m80J88J36j00j15K8K28m78K9K18j3l44N26Ql36
$$ 355 100 -481 -127 152 -266 -81 257 -223 -35 101 1 -114 -86 142 -336 -307 -89 -102 -446 80 88 -248
4873b48K72L6l95J41M90l54k77K69j32m1J09K20l41J73M90m57KK23j8l10M00j32
$$ -248 24 60 -335 -194 296 -58 -335 -66 -198 -239 -130 90 -251 -78 412 -45 -43 180 162 -148 252 120
4895A20l13J58M5j73j6N11l84k64L39m5m17L25K33j36k66K92J60o52M32J67j55
$$ 120 -193 -35 10 -163 -179 332 -52 -316 23 -22 -439 -114 119 -17 -283 9 169 -483 -51 116 -39
4916c9j09j0k8m9N69r2m26K78L15m96j16N27k04m60L52J25l26K86J37n24J43M88
$$ -39 -148 -158 -186 -235 334 242 -184 94 409 -87 -203 324 120 -340 12 137 -189 97 234 -290 -147 341
4938C41l46m99N94J23k86L27j3n35K03K91l6j05J92j09k61P3J95J57k42L52j65
$$ 341 -5 -504 90 213 -73 254 241 -294 -91 200 164 59 251 142 -119 -46 149 306 64 416 251
4959B51k64J58J49n96L85L26l99j6K36j58l74N62kj97QM26n86j38O06j84l91L97
$$ 251 -13 145 294 -302 83 409 10 -6 230 72 -302 260 258 61 69 495 -91 -229 377 193 -198 199
4981A99k06p6J23M9k08k45Q05m09k15J96Qj63J03J06l13K5L8K32l79J26M64p9
$$ 199 -7 -83 40 89 -119 -364 441 32 -183 13 21 -142 -39 67 -246 -221 -183 49 -330 -204 260 181
5003A81l71M30k98n2JJ79l02M56l49k85J40Q4J17j95M06k28l01N79J07m65J13
$$ 181 -190 240 -58 -110 -109 70 -232 224 -125 -410 -270 -186 -69 -264 142 -86 -387 192 299 -166 -53
5024e3K91j16k02L76n98j84M74Q4l92M41R3k55k69L46n2k76O51j05m70P6L37k49
$$ -53 238 122 -80 296 -302 -486 -12 72 -320 121 214 -41 -310 36 -16 -292 359 254 -216 -140 197 -52
5046e2q9L06j05k12J70J53l18m2J07J40r6L18j27l13K36k18L6m8J90k55J25K77
$$ -52 -141 165 60 -152 18 171 -147 -189 -82 58 -38 280 153 -160 76 -142 -106 -154 36 -219 -94 183
5068A83j99m9q5L36k89j90N96l12j89K59K8j38l6K83j97r6K97k55n0M76k42l73
$$ 183 -16 -65 -150 186 -103 -293 303 -9 -198 61 89 -49 -85 198 1 -95 202 -53 -103 373 131 -242
5090b42L59K09l57k2M13n35K48mJ41k92J01K38l47K48K5J1k78M20l03J13l2J89
$$ -242 117 326 -31 -53 360 -175 73 69 210 -82 19 257 -90 158 183 194 -84 336 33 146 114 303
5112C03l66M9L35j04j93K41q9j92j15L42l16O3K31R0l37J57N3l67K39K42j54l18
$$ 303 -63 -14 321 217 24 265 176 -16 -131 211 -105 -42 189 279 -58 99 152 -215 24 266 112 -206
5134b06M81k38K4L5k5l97K09M68l28q6O8k9k67K31L6j43J36k28J05k57M16k27
$$ -206 275 37 61 96 71 -326 -117 351 23 -63 5 -24 -291 -60 -24 -167 -31 -259 -154 -411 5 -222
5156b22J91n7K35l85l5L77l46J87K68k57PL5j56r7K60O4l87K96J52k35j99K50
$$ -222 -31 -88 147 -238 -273 104 -242 -55 213 -44 -37 -2 -158 -255 5 69 -318 -22 130 -105 -304 -54
5178e4J31J01l63L41j54p5J13j12R7j14K27k71k0L16j92L8R0j33o2L41j63l43
$$ -54 77 178 -185 156 2 -73 40 -72 25 -89 138 -133 -153 163 -29 9 99 -34 -96 245 82 -261
5200b61Q4Q7j12R4L30Qm24K56P2j80o5Q9k02L4N20q5n06J50J85l03j03N52j70
$$ -261 -177 -90 -202 -108 222 230 -194 62 134 -46 -111 -22 -224 -190 330 245 -261 -111 74 -229 -332 220 50
5223E0j8L20j75l07M5L19j17r8N7J7l28N62j88r8K60l50r9J67K45m07k67O95k84
$$ 50 32 352 177 -130 -85 234 117 19 76 93 -235 327 139 41 301 -49 -148 19 264 -143 -410 285 1
5246An5J60J02m14K90K05k28j33K75k86K0L02L5k57K60j25k77R2L59l71q1M00
$$ 1 -54 106 208 -206 84 289 61 -72 203 -83 -63 239 274 17 277 152 -125 -33 326 -45 -126 274
5268B74j68q4JK22l11RL17P5l93O2J87L6l2o4k99mJ50j97K84o6J00k35j07L54
$$ 274 106 22 23 245 -66 -57 260 335 -58 4 191 227 195 131 -168 -172 -22 -219 65 -1 99 -136 -243 111
5292A11j30k73N54l57p2M4L09l99J11J33l1N3j14Q0k14J24K54k34l31O45m83l0
$$ 111 -19 -292 262 -95 -167 -123 186 -213 -102 31 0 53 -61 19 -195 -71 183 -51 -382 263 -220 -250
5314b50K73j75n9M56R1n56l2M14k16j6l1P6r3J26j05Nl5J94m5o2J97k42k94M80
$$ -250 23 -152 -211 245 336 -220 -252 162 -54 -70 -101 -25 -118 8 -97 -92 -127 67 22 -40 157 -85 -379 101
5338A01N4k56J24P3j63j33L20%q2J6J7k66J3K87r1j81L52n1j62l8J07k25J63Q2
$$ 101 155 -101 23 96 -67 -200 120 120 38 54 71 -195 -182 105 14 -167 185 134 -28 -66 41 -184 -21 61
5362F1k89J9K14P8j48K06j23Q8j72J25l57M05J66j80k40J28J05o4j93K29j8j41
$$ 61 -228 -209 5 83 -65 141 18 106 -66 59 -298 107 273 93 -147 -19 86 22 -171 58 40 -101
5384a01L47j45k07Q6L11j97Oj39J59l14K07K36J20k17Q1j49k14j8J75J15m9K83
$$ -101 246 101 -106 -20 291 94 100 -39 120 -194 13 249 369 152 233 84 -130 -148 27 142 93 376
5406C76m25Q2O0N0Q9l0k21j49L71q2l12L19J71k84j38J03K22l53L23l5k40K10
$$ 376 -49 33 93 143 232 202 -19 -168 203 121 -191 128 299 15 -123 -20 202 -151 172 137 -103 107
5428A07L16m28k24K23j81J17R7J68k79%Q7q7j10J54J5o1J84J45o23K84J8M7j80
$$ 107 423 -5 -229 -6 -187 -70 27 195 -84 -84 3 -84 -194 -40 -25 -86 98 243 -380 -96 -78 -31 -211
5451b11J05P6qK9j23j07M01Qk72l54N93l8n68M06p6j19O7J45J14k67K08j4l00
$$ -211 -106 -30 -38 -9 -132 -239 162 170 -102 -456 137 99 -469 -63 -139 -258 -191 -46 68 -199 9 -5 -305
5474c05K73J28k82K11J60m39K04J71k20R4q5J79k97L15j61J61k24K07j55L1l7
$$ -305 -32 96 -186 25 185 -254 -50 121 -99 -5 -90 89 -208 107 -54 107 -117 90 -65 -34 -71
5495g1p5K9J06L1j45R0K36k41k24K59J59Nj55J6O3k56J82O6m4rJ96k25P3J45l70
$$ -71 -146 -117 -11 20 -125 -35 201 -40 -264 -5 154 159 4 20 83 -173 9 75 31 22 218 -7 66 211 -159
5520a59J06L42k98lN0o9J46n0L16n53J32J20K17m66L29J92m97J21O5k8k37J82
$$ -159 -53 289 -9 -12 38 -31 115 65 381 -172 -40 80 297 -169 160 352 -145 -24 41 13 -224 -42
5542d2J27k02K63J85k31J54l47J7K3M69l02j36o9K54m76M11j14l1j20K26Q1k11
$$ -42 85 -117 146 331 100 254 -93 -76 -53 416 114 -22 -91 163 -313 98 -16 -47 -167 59 140 -71
5564g1L2J91j55J12R8k59L0L03j67l96L62K05j28k24nn2oJ01K1j50K17j1n3k39
$$ -71 -39 152 -3 109 207 -52 -22 281 114 -282 80 285 157 -67 -72 -124 -130 -29 -8 -158 59 48 -5 -244
5588b44K19J10j04J10p4j37nJ74k6r0J63j93j41L16m7k73K62j18k30L84q1j19
$$ -244 -25 85 -19 91 17 -120 -125 49 23 -67 96 -97 -238 78 31 -242 20 -98 -328 56 -25 -144
5610a44k23L23L85k91m8L23k36j90K52k21j02P5K85l87Q0K29l38m5K45j9LJ88
$$ -144 -367 -44 341 50 2 325 89 -101 151 -70 -172 -97 188 -199 -119 110 -228 -273 -28 -47 -44 144
5632A44k2k58J76Q3m85L71k5j9k18K80o3k18K04L52l88r8K58j90O8R5K41k38j06
$$ 144 122 -136 40 123 -362 9 -16 -35 -253 27 -36 -254 -50 302 -86 -184 74 -116 -48 47 288 50 -56
5655e6K21k78M4R6j45K07M4j9j23l5j19K40q8O6j35R7J61j46l96L77N1j7M7m2
$$ -56 165 -113 -69 27 -118 89 133 114 -9 -44 -163 77 -11 55 -80 17 178 32 -364 13 64 47 94 52
5679E2j46J0J03j07j30J73K34j41j47L17k69p0L2J20k04J00L42j62j1Q6qj76J7
$$ 52 -94 -84 19 -88 -218 -45 189 48 -99 218 -51 -121 -89 31 -173 -73 269 107 96 182 174 -2 15
5702A5K87j77M8K10m24Q1R7p6k00N0J75k4L4n2r4r9L46k3j04j15K01k37J18K04
$$ 15 302 125 173 383 -41 40 137 61 -139 -89 86 62 96 44 -50 -149 197 174 70 -45 156 -81 37 241
5726B41k20k88N73l42j91M23l6j64k6Q5p0l2Q4j70P7r2J96l6o8J11q1L5k65J56
$$ 241 21 -267 306 -36 -227 196 160 -4 -30 55 -15 -47 37 -133 -56 -148 48 12 -56 55 -26 9 -256 -100
5750a00j02P1M9j31m2K75p0K47j96K0j23K1K81l39J22q9q7q6K92M1r5P9J02k15
$$ -100 -202 -131 -82 -213 -255 20 -50 197 1 21 -102 -81 200 -139 -17 -106 -193 -279 13 54 -41 38 140 -75
5774g5J13J00k04Q5k15J08J13K04j52k86lL23m6k81J31N5r7K58L24m51K33j24
$$ -75 38 138 -66 19 -196 -88 25 229 77 -209 -212 111 65 -216 -85 -30 -127 131 455 4 237 113
5796A13k83m2O8L80m21K06r1j8j5K45q9j46K69k12l4J05Nm2j60L11o6j40j12Q8
$$ 113 -170 -212 -144 236 -185 21 -70 -88 -103 142 53 -93 176 -36 -70 35 40 -2 -162 149 83 -57 -169 -81
5820h1m8JJ87p1j55J89k18J56L0P0l4R7j47J26r6N9J9l0J7j88J0Q8M4%j29K25
$$ -81 -129 -128 59 -12 -167 22 -196 -40 -10 60 26 123 -24 102 6 65 84 54 71 -117 -107 -19 25 25 -104 121
5846A21p0j07J28J30l08J12K44m28L2K80r4N8K98k88p0j86M86l85Q7J34j23J24
$$ 121 51 -56 72 202 -106 6 250 -178 -146 134 40 98 396 108 38 -148 338 -47 40 174 51 175
5868A75j95J46J92l09jO8j60L58k08p2k0K8j65K19J48l54K9J28n4N7M9J6m4J94
$$ 175 -20 126 318 9 8 76 -84 274 66 -6 -26 2 -163 56 204 -150 -121 7 -47 10 59 75 31 225
5892B25j48k88J23K31j75l68K67p9J25%j25L85m51Q9P4O8j95N07m56J80k4J04
$$ 225 77 -211 -88 143 -32 -400 -133 -212 -87 -87 -212 173 -278 -189 -115 -47 -242 265 -191 -11 -35 69
5914F9M3j13j39J23n7k80L35J31j92j23L14j88j37p6M55J42l12QN0k17J8K74J90
$$ 69 112 -1 -140 -17 -74 -354 -19 112 -80 -203 111 -77 -214 -290 165 307 -5 3 53 -164 -146 128 318
5937C18m96J51J18j12k08K25j77J22N19m97L7jr7J71j90L51j16j88J71j55j63
$$ 318 -178 -27 91 -21 -229 -4 -181 -59 460 -37 0 -1 -98 73 -117 234 118 -70 101 -54 -217
5958b17J65N3J92k08LJ4m4R6j89J02Q8O8l27L87j13K3j4k99L09j55P0K40j95k0
$$ -217 -52 1 193 -15 -12 2 -42 54 -135 -33 55 123 -204 183 70 93 79 -220 89 -66 4 244 49 29
5982B9K18k98l2J21j51k07M38m9j62L14k48P4R6j36j96OK13j17l3J26K75j46j54
$$ 29 247 -51 -83 38 -113 -320 118 69 -93 221 -27 47 143 7 -189 -183 30 -87 -120 6 281 135 -19
6005a9P9L2m15J58L67j74k12J40J7j35L29j30p2J85k90q6K63K56m18Q0l0PL6K05
$$ -19 60 92 -323 -165 202 28 -184 -44 -27 -162 167 37 -35 150 -140 -226 37 293 -125 -45 -75 -68 -32 173
6029A73n3k40O0K29k51J67j7j07n5m8K96l15L18l84J86p9K62l33k6L28l98K67
$$ 173 120 -120 -60 169 -82 85 68 -39 -94 -142 154 -161 157 -227 -41 -120 142 -191 -217 111 -287 -20
6051b0j92M78k66P8k80N51q19M17J92k84P0p3K14j36J69q1k69K52j86J41qL6k87
$$ -20 -212 266 0 78 -202 349 -470 -53 139 -145 -75 -148 66 -70 99 18 -251 1 -185 -44 -52 -16 -303
6074c03K41K7L9r7k0R7j20J22J72l74J68K42j51q8m13L59J44j39K59l7o6J32k59
$$ -303 -62 -35 4 -93 -113 -16 -136 -14 158 -216 -48 194 43 -45 -458 -99 45 -94 165 128 62 194 -65
6097f5J21k4M38o03J41J5m1j37J17K40k77k6K38k02J60K5k51J47N8K5j10j2r4
$$ -65 56 32 470 -133 8 23 -18 -155 -38 202 -75 -101 137 -65 95 120 -131 16 74 99 -11 -23 -117
6120a17Q4j07M76n03OJ62J15n64N17R6j33J53qr3k03m5M19k53O3l5Pj7J29k11
$$ -117 -33 -140 336 -167 -161 1 116 -448 69 165 32 185 177 84 -119 -164 255 2 65 30 37 20 149 -62
6144f2j2J86P1j71J48nk6o5L85m16o7J55k0j71K20k49J13J67j37j15q8J4O2L54
$$ -62 -74 112 183 12 160 155 129 64 449 33 -34 121 101 -70 150 -99 14 181 44 -71 -159 -145 -83 271
6168B71m44K73K38m81J70K47l92M9P6k9j64M84k69l45M43j00j73ML46k64j74L82
$$ 271 -173 100 338 -143 27 274 -118 -69 7 -22 -186 298 29 -316 127 27 -146 -142 204 -60 -234 148
6190A48j05j48K7K6j41J92n8N1j92L65l38J31O1k7k43Q8Q3j14J38P6r3M4J16j02
$$ 148 43 -105 -78 -52 -193 -1 -59 -8 -200 165 -173 -42 19 -8 -251 -163 -80 -194 -56 20 -73 -29 87 -15
6214a5k32L11K69k71j18j53QJ06L19l09N9j52K18k31J04J38j47J17N9r6O3p5l6
$$ -15 -247 64 333 62 -56 -209 -201 -95 224 -85 -26 -178 40 -191 -87 51 -96 21 80 -16 47 -28 -64
6237f4J44q2K41l07J7Q0o0J32K3o9n0J85k81n0K33p0%R6o6q5n4P7P5J1J1Q2j87
$$ -64 80 -2 239 -68 -51 29 -31 101 124 55 5 190 -91 -141 92 22 22 118 52 -33 -87 -10 65 76 87 169 -18
6264a8qJ32J52m54J72K62k90p8J17j73J59Q8j23k15K43Kj33J20J38j46Mj15K94
$$ -18 -26 106 258 -196 -24 238 -52 -130 -13 -186 -27 61 -62 -277 -34 -32 -165 -45 93 -53 -49 -164 130
6287A30J08k58K34j53k64Q3K48l15K99j20K3P1k4J4Oj10J01J18k69N2J42k06L7
$$ 130 238 -20 214 61 -203 -120 128 -187 112 -8 15 86 62 76 82 -28 73 191 -78 -26 116 -90 -53
6310e3l2J63k4k0J04k57k0J1J23L15j58m0j18M0l6J08l8l56L71K3j74j82K75k80
$$ -53 -85 78 54 34 138 -119 -139 -128 -5 310 152 112 -6 34 -2 106 68 -288 83 106 -68 -250 25 -255
6334b55J43O8O0Qk8K44k84N8JK5k46J86r9l2r9L92k91P9K0Oj11O0K53m7j39oj89
$$ -255 -112 -44 16 24 -4 240 -44 14 15 40 -206 -20 -119 -151 -250 142 -149 -70 -50 -44 -155 -95 158 111 -28 -34 -223
6361b23O4M8J86J20j96p9j42J63J59n4Qk35L05k11K96k60LJ33P5k31R7J5J29j31
$$ -223 -159 -111 75 195 -1 -80 -222 -59 100 46 54 -181 124 -87 209 -51 -48 85 160 -71 26 41 170 39
6385C9k6l30K60J37j96J19K0mJ19l85J39M6o1J21L8J2J8O6l6m0Pl5Q7k35l7J38
$$ 39 13 -317 -57 80 -116 3 23 19 138 -247 -108 -62 -123 -2 36 48 66 132 96 56 63 28 115 -120 -157 -19
6411a9n8L56j19j87k7O8l73L55j12L40l00n6J89l02J32R5m5K06m0k63Q1K19m08
$$ -19 -77 279 160 -27 -54 14 -359 -4 -116 224 -76 -132 57 -245 -113 -18 -63 143 103 -160 -79 140 -268
6434b68K88J17n4k00j11K70l6j60L15o0l20K90r3Q1k56M90R0l10k32K80j69o1
$$ -268 20 137 83 -117 -228 42 6 -154 161 101 -219 71 -22 59 -197 293 383 73 -159 121 -48 -109
6456a09K41k10N6J15j16lJ17m1j52R3j8P0j85K30j64K0N2P2k33NK11Rj49pJ60
$$ -109 132 -78 -22 93 -23 -26 91 50 -102 -9 -27 43 -142 88 -76 -56 -4 68 -165 -160 51 60 -89 -96 64
6481F4K1j7j11rJ76k19L5O0R8j55k47L46j7p2J87k24j12N2j66M52k52K29lj38
$$ 64 85 68 -43 -52 124 -95 -60 0 98 -57 -304 42 25 -47 140 -84 -196 -144 -310 142 -110 119 116 -22
6505b2M8po4j46M46m06k47L48P8l21J27J91j5r7k9LJ51N9J24j98j28J4M9j93J41
$$ -22 26 19 -45 -191 255 -151 -398 -50 28 -293 -166 25 10 -87 -116 -113 38 97 221 23 -105 -91 -42 -235 -94
6530i4L17k59Q7J6j13q7J6q1J49j73J99j37J82l20L28%R8pk50K18N9j03J02l01
$$ -94 223 -36 51 67 -46 -133 -117 -198 -49 -222 -23 -160 22 -298 30 30 128 121 -129 89 148 45 147 -154
6554a54j40N3k9K16K2K82k95J01O6o0j73J62j93K56j95L30l96L7J96q2n7%l2M17
$$ -154 -294 -241 -270 -54 -32 250 -45 56 122 62 -111 51 -142 114 -81 249 -147 -110 86 4 -53 -53 -85 332
6578C32l74J3J69J1rl4J62k09J27j29j65L7n1j9J27O7k04J15K50q9p2P4K6l83
$$ 332 -42 -29 140 151 142 108 270 61 188 59 -106 -69 -120 -139 -12 55 -149 -34 216 127 55 129 155 -228
6602b28K99N7j68J21j56J84k76J05OK50l25O6J05O0L8j97K34J7r9k22J10j49k0
$$ -228 71 128 -40 81 -75 109 -167 -62 -56 194 -131 -65 40 100 138 -59 175 192 93 -129 -19 -168 -188
6625a88J18J58Qp2J28l38J99p1J5J08j47J07j92q3L00J11q9k34Q3R5k52L50q9
$$ -188 -70 88 96 24 152 -186 13 -58 -43 65 -82 25 -167 -250 50 161 72 -162 -79 16 -236 114 25
6648B5J54m3ql57J34J72N3j99K77k35q8n0J94r9o1K00j67o9O1j18K04l8K16j55
$$ 25 179 136 128 -229 -95 77 130 -69 208 -27 -115 -165 29 -70 -131 69 -98 -167 -106 -224 -20 -58 158 3
6672CMJ71k07K75r4j93Q1J1k0j46JK41J5k21l6K83k00J13k27L37k53N38l83j98
$$ 3 7 178 -29 246 152 -41 40 51 31 -115 -114 127 142 -79 -115 168 -32 81 -146 191 -62 476 93 -105
6696a05J92k66K76j57L06j74O3n9j02l8K35k56J48q7l7%K4Oj36Q1J33n2j13RJ88
$$ -105 87 -179 97 -60 246 72 135 76 -26 -64 171 -85 63 -24 -61 -61 -37 -31 -167 -86 47 -5 -118 -109 79
6721G9p8J23lk86L8K09j21L18k48j59k8J16Po5M5J40j96K78n7l13K50q5J25M3
$$ 79 1 124 121 -165 -127 82 -39 279 31 -128 -156 -40 -33 -98 -53 87 -109 169 112 -201 49 -36 89 132
6745A32k82K62k41j2J09R7j6o0KJ03j51k2J25N8r0J7o3M7R4j79K54m71M97n3K2
$$ 132 -150 112 -129 -141 -32 65 49 -11 -9 94 -57 -79 46 104 14 31 -32 15 109 -70 184 -287 210 157 179
6770A79o5N2j34j13L3j0J87k67J07J11j66o0K01j8k31K12m9p6j93K50J68k94K75
$$ 179 114 166 32 -81 -48 -58 129 -138 -31 80 -86 -146 55 37 -194 18 -31 -107 -300 -50 118 -176 99
6793I9k05J95j27J93l45k7K62j76J59l0k33J90p3L16j51j1k16R1p4M52o47L0j2
$$ 99 -106 89 -38 155 -190 -217 45 -131 28 -2 -235 -45 -118 198 47 36 -180 -89 -163 289 -358 -328 -340
6816c40L77j3j39K5J64k47J14J67j89J56o3k6N0n6n1J20l17J42Q6K2j31K52j27
$$ -340 37 24 -115 -90 74 -173 -59 108 -81 75 12 -14 36 -20 -71 49 -268 -126 -40 -18 -149 103 -24
6839b4K31r9j01j46J97K1J68m06K95j3Q5o8j80R7j82M8k30L15M0K9l2k11N2J44
$$ -24 207 108 7 -139 58 79 247 -159 136 123 208 140 -40 57 -125 -77 -307 8 48 77 45 -166 -114 30
6863C0J32j86J24l0j07j59L81j92J38j5r6L6n5K84k83P7j62J2R7j51J14N2j06
$$ 30 162 -24 100 70 -37 -196 185 -7 131 116 20 56 1 285 2 79 -83 -71 26 -125 -11 41 -65
6886f5J78j5l9k12K89M1k48rJ25q2J50k50J66J5R2j61j27m5K28K3J40P6k08q3
$$ -65 113 98 59 -153 136 177 -71 -80 45 -37 113 -137 29 44 136 -25 -152 -197 31 54 194 270 62 -21
6910b1o4J75j57K98k64O2l3J36l29K79k67j0L63n7j5o2J7J15l02M01k41j73K94
$$ -21 -85 90 -67 231 -33 29 -4 132 -197 82 -185 -195 168 111 96 34 51 166 -136 265 24 -149 145
6933A45k23J4j72K12J50m63K77J73k13J61j07P2p7j65L19l27k2K82j05m9K2j00
$$ 145 -78 -64 -236 -24 126 -337 -60 113 -100 61 -46 26 -51 -216 103 -224 -246 36 -69 -118 -96 -196
6955a96J83k01O7L4J9N1j01L32j07j55rM1J00j14p9L32j9l15J99o7J2j0N3j77
$$ -196 -13 -214 -147 -113 -94 -43 -144 188 81 -74 -83 -42 58 -56 -135 197 178 -137 62 -5 7 -3 50 -127
6979a27J53j09J12q8Q5N1k84L58k13N1j8K22J2j82j86J76l54K53P1o2k26K64K23
$$ -127 26 -83 29 -59 26 77 -207 151 -62 -11 -29 193 205 23 -163 13 -341 -88 -17 -79 -305 -41 182
7002A82k03j35J07j53K52j85J27j26K71J60m98K80p5J45l05J52k40J53l6J17K13
$$ 182 -21 -156 -49 -202 50 -135 -8 -134 137 297 -201 79 4 149 -156 -4 -244 -91 -127 -10 203
7023B03j24M3j09p5R2j1K7pj76K90k05M2L9j07J38j05R0nj91N2K08k38L44j11
$$ 203 79 122 13 -62 30 19 46 39 -137 153 -52 -10 29 -78 60 -45 45 40 -151 -99 109 -129 215 104
7047A04O1j31J1J74j3k85j6K25k90J27P7k9M4nK1K3o7R7l62K28n5j49L19J3n0
$$ 104 165 34 45 219 206 -79 -95 130 -160 -33 44 15 59 54 75 98 31 128 -234 -6 -61 -210 109 122 72
7072G2j13j23M64k36O5j12R3q9M4l0k08J71j25j77O55l75j6j12l6N9R4n1j23K59
$$ 72 -41 -164 300 64 129 17 110 21 65 35 -173 -2 -127 -304 351 -24 -40 -152 -188 -129 -35 -86 -209 50
7096E0k61J98K7k05M20l59r1L07j77O1qN6P1j58j15K27j91j75L22j20J38j87n0
$$ 50 -211 -13 14 -191 229 -130 -221 86 -91 -30 -38 18 89 -69 -184 43 -148 -323 -1 -121 17 -170 -220
7119b20K34j09Q3L4R1o6j29jK0QO0K06j94n0J96j96J38j70R0k06K90k1j37J02
$$ -220 14 -95 -12 22 113 47 -82 -83 -63 -55 5 211 17 -33 163 -33 105 -65 25 -181 109 88 -49 53
7143E3O1k64L53J38j33q6l05j8K73j40K38P0k21K2ql41J77J18R6k77M0K60l02
$$ 53 114 -150 203 341 208 122 -183 -201 72 -68 170 240 19 41 33 -308 -131 -13 83 -194 -154 106 -196
7166a96RK62j07M4L3o5O1r3K15J0J9j53N4q9J40j49k2J76k0j32P5p8j2r3K40j98
$$ -196 -187 75 -32 12 45 -20 41 -52 163 173 192 39 93 4 144 -5 -27 149 129 -3 72 -6 -18 -111 129 -69
7192f9m0J7N5K95p3k57M61m28q8J47%j48L16j45L8j0j41J30R0j62L9J62j78N4
$$ -69 -109 -92 -37 258 185 -72 389 -39 -127 20 20 -128 188 43 81 71 -70 60 150 -12 27 189 11 65
7216F5K5K39l00%J13J2n0k8j77j95K29j47K49J41l78J67P4k01K61j76k61N45j62
$$ 65 90 329 29 29 142 154 104 76 -101 -296 -67 -214 35 176 -202 -35 39 -162 99 -77 -338 207 45
7239D5M7j57p2j52L63Pk77J52j80L00l9R9j50k5k1K22l05J06k78J48J27j73K88
$$ 45 92 -65 -137 -289 74 81 -196 -44 -224 76 37 136 -14 -39 -60 162 -143 -37 -315 -167 -40 -213 75
7262G5k39K85k05LJ54q2Jnp8n6P1j6J87j83J10j2R6j05L0O3n6j84p4K79k56j59
$$ 75 -164 121 -84 -81 73 -9 -8 -13 -91 -147 -76 -92 95 -88 22 10 106 1 31 94 38 -146 -220 59 -197 -356
7288c56L64k0Kk36J37J78O6j38k2Rj58L04k12qK6N9k20L00k3j03J8j68OQJ78p0
$$ -356 8 -12 -10 -246 -109 69 135 -3 -25 -16 -174 130 -82 -90 -64 -5 -225 75 52 -51 -33 -201 -195 -187 -9 -79
7314g9k2r3J08P2J42k43M0K22j38LQl09L62O2j47Q3j39L61J1k80R7O8J2M4l40
$$ -79 -101 -194 -86 -14 128 -115 -75 147 9 12 20 -289 73 135 -12 71 -68 293 304 24 121 189 201 245 -95
7339i5j33L22j57Q1J50l7m2J13q4pj17k3L0J28Jj19k51N26j24J16j99k47L10k6
$$ -95 -228 94 -63 18 168 131 89 202 118 111 -6 -29 1 129 130 11 -240 286 162 278 79 -168 142 116
7363A16k5j46J64R1o5q3p5Q1j10J07k92J24K23l38M11k43J7K12m53M11oj36Lj39
$$ 116 91 -55 109 200 135 52 -23 58 -52 55 -237 -113 110 -228 183 -60 -43 169 -284 127 121 -15 -12 -151
7387a51M5Lk42K78M0j7P6J10l8Nk96P7J66j84K72l12L02k66q8K5K56k27L28l4
$$ -151 -106 -103 -345 -67 -27 -44 32 142 104 109 -187 -110 56 -128 144 -168 134 -132 -220 -195 61 -166 162 128
7411A28j85M4j92K22j99M6L54J43m14Q3P8l71L55k30L28j91j9j19K10m9J43P2
$$ 128 -57 -13 -205 17 -182 -136 218 361 -53 30 108 -263 92 -138 190 -1 -20 -139 71 22 165 237
7433B37l02L27k93j85J10J11J02m4o8J71O2j55K88k68Q5k00k05M0J38K55l02J23
$$ 237 -65 262 -31 -216 -106 5 107 63 -5 166 228 73 361 93 178 -22 -227 -187 -49 206 -96 27
7455B7n4l2K12j65j07L9J15P0j70N7o7Q9J48j91J6K18j02l3o9jj33p0L05J68j72
$$ 27 -27 -59 153 -12 -119 -80 35 105 -65 -8 -75 14 162 -29 -13 205 103 70 1 0 -133 -203 102 270 98
7480I8K0j61R1k06K07J84l35J54J57j46P1lj60r1J15Q2j5j18N9m7p3qL25k47J47
$$ 98 118 -43 48 -158 49 233 -102 52 209 63 134 131 -29 -120 -5 77 62 -56 3 -44 -117 -125 200 -47 100
7505A00r8J94k50qo2K46k14L1oK07k31K1j16K58k89qM17k12J07k37O9N4J35k00
$$ 100 2 196 -54 -62 -124 122 -92 -61 -67 140 -91 -70 -186 72 -217 -225 192 -20 87 -150 -81 -27 108 -92
7529i2K13k97J36J44k24L22M8o15O06m10L45j69J2n4K59l76K16O5j55j6M1J49
$$ -92 121 -176 -40 104 -120 202 250 -365 241 -169 176 7 19 -35 224 -152 64 129 -26 -42 -1 148
7551A48k00j7m6j22J97m7J93j27P8l4O9j42J00J94m46J39k3J77J17k9k35lPJ22
$$ 148 -52 -69 -115 -237 -40 -87 106 -21 57 23 92 -50 50 244 -202 -63 -86 91 208 179 -56 -59 -52 70
7575G0mq0J67j8k3p6K03l5m29N1K29m3J40j56j38J44R4r0K9r8K36l40K43j26J26
$$ 70 66 -14 153 135 112 36 239 204 -225 -174 55 12 152 -4 -142 2 96 6 35 -63 173 -167 76 -50 76
7600G6j89n4K74ln9o9nj17J91K0l6K53j74k10J44K6j23J50j21Q0M2r2p5j70K51
$$ 76 -113 -167 107 104 45 -24 -29 -146 45 65 29 282 108 -102 42 68 -55 95 -26 54 96 4 -71 -241 10
7625A0J43k45N6j6m6J62r2J6m0R2J04k82L13q1lP4k68R8j35r8K01K69k20m1j9
$$ 10 153 -92 -36 -52 -98 64 -28 -12 -52 40 144 -138 175 94 91 165 -103 -5 -140 -238 -37 232 12 -29 -48
7650d8J96j01L8k11J69J1J1r8J91k10R1p7M0j8J80k59J23q0P3KM3q8J05j67qK76
$$ -48 148 47 85 -126 43 54 65 -33 158 -52 39 -38 2 -16 164 -95 28 -52 21 23 66 -22 83 -84 -92 184
7676A84k25K8J17J00k30j46k9L44r3M9j55J29j26NJ83k48J89r7m0j17J50j42J92
$$ 184 -41 -13 104 204 -26 -172 -201 143 50 99 -56 73 -53 -48 135 -113 76 -21 -61 -178 -28 -170 22
7699B2k28J54j62L1L7K36j0O6m04L08Q2k2m9j48j6M4J00j37L13l75O7J19J43l06
$$ 22 -206 -52 -214 -183 -146 90 80 146 -258 50 132 110 61 -87 -103 -59 41 -96 217 -158 -91 28 171 -135
7723a35Q2j35J58q1q3L45p3q2J06l3n4kr9J82J43k44J79j61j76K13k8m1q6j15
$$ -135 -53 -188 -30 -111 -194 151 78 -4 102 69 15 13 -86 96 239 -5 174 13 -163 50 22 -19 -105 -220
7747b20M85l05k01L34j33m7Q5n9Q5J61j07j3l74K26j43L69M1k10N5m6J18k20P8
$$ -220 265 -40 -241 93 -40 -87 -2 -61 24 185 78 65 -309 -83 -226 143 184 -26 29 -17 101 -119 -41
7770d1J17k82K20p1l8J76m4j83J58l6J13j20J00j22J14q9j63K3Q8J94M3j53L7
$$ -41 76 -206 14 -57 -95 81 37 -146 12 -24 89 -31 69 -53 61 -28 -191 -168 -80 114 157 4 41
7793D1j43J12P2j24K12r3q4n6j03J34PJ46j06L3j0k53R6O4j86K98k49K16K4j58
$$ 41 -102 10 82 -42 170 77 -7 -63 -166 -32 -25 121 15 48 38 -215 -119 -55 -241 57 -192 24 48 -110
7817a10P2l8j49K04K59k04p4M3j2%j28n6J70O7k05J18J13l8L6J03j99L79o57L27
$$ -110 -38 -76 -225 -21 238 34 -40 3 -9 -9 -137 -193 -23 44 -161 -43 70 32 68 171 -28 351 -306 21
7841B1N7j21N0q4J36j05L1J16p9J20j68kk19J38J51j4j99r4L79j25q9K09r3J40
$$ 21 78 -43 7 -77 59 -46 -15 101 22 142 -26 -28 -247 -109 42 28 -171 -265 114 -11 -100 109 16 156
7865A56k72J12J43m9k10K73J32m31J40l30L25N0k4J88m45K19J67k15J89r2k1J18
$$ 156 -116 -4 139 90 -120 153 285 -146 -6 -336 -11 39 15 203 -242 -23 144 -71 118 26 5 123
7887A23k38q8J33J50k7J6pj18n6J36J44j69j09q4R8L16m33M37l44Q1K5Q2J22j91
$$ 123 -115 -203 -70 80 53 69 62 -56 -112 24 168 -1 -110 -194 -96 220 -213 224 -120 -39 -14 68 190 -1
7911am14K39J38j73N9L94l30Oj69L84k84J64r4P6J19l0l0j35J97l31K16p7J37
$$ -1 -415 -176 -38 -211 -152 242 -88 -82 -251 133 -151 13 -81 -5 114 84 54 -81 116 -215 1 -76 61
7934F1j08j00L16k13J73k20j0Q2J82K29o25K77j76J69Q0n4K01k44j16k03L57j74
$$ 61 -47 -147 169 -44 129 -91 -101 -19 163 392 -233 44 -132 37 117 63 264 20 -96 -299 58 -116
7956a16J79J7j15N5k90M74j69P1j78K20o1j8k00L8K68p1j38L1j6j12J23Pn8J65
$$ -116 63 80 -35 20 -270 204 35 106 -72 148 87 69 -131 -93 175 104 -34 -3 -19 -131 -8 -1 -59 106
7980A06%n5l7J07J5j64j02J74J00k15m2N7n3J12L4P7k06J09j76L5K05J76m37R0
$$ 106 106 51 14 121 136 -28 -130 44 144 -71 -113 -56 -109 3 37 114 -92 17 -159 -124 81 257 -180 -90
8004i0K52j02j38%j2oQ3R7j44J46n7o0K72l39J7n7Q8j3o1J78j14J4n7J29m9J34
$$ -90 162 60 -78 -78 -90 -96 -13 84 -60 86 29 -31 241 -98 -81 -138 -50 -63 -124 54 -60 -46 -103 26 -23 111
8030A11j72j4O1p8L96k61N8J96m15O6J21J90k42j00M6L3m1K92j31j17o4J33j44
$$ 111 -61 -75 -14 -92 304 43 101 297 -118 -52 69 259 17 -83 -37 -4 -45 247 116 -1 -65 68 -76
8053g6K27k32K7K66l86K66j53J51P1j12j18k4M7j29J85n1J02k07J97j12Jj86M06
$$ -76 151 -81 -54 212 -174 92 -61 90 161 49 -69 -93 -46 -175 10 -41 61 -146 51 -61 -60 -246 160
8076A60o0j98J33j31o7J69k1L0Q1j64j39J23K06j34k52N1J62J36k40K39j32J10
$$ 160 100 -98 35 -96 -163 6 -15 15 96 -68 -207 -84 122 -12 -264 -213 -51 85 -155 84 -48 62
8098F2j96L36k46J53N0k6p2lM6k77J91K50k85j0p6J90k80J27M4L1L1J73j47j45
$$ 62 -134 202 -44 109 159 133 61 58 104 -173 18 268 -17 -27 -103 87 -193 -66 -22 9 40 213 66 -79
8122g9n2J63J52k40K35k3r8j38M09l29j33J61J19k75J85j83R3J27J6j79O0j18
$$ -79 -131 32 184 -56 179 156 58 -80 329 0 -133 28 147 -128 57 -126 -33 94 110 -69 -9 -127
8144a27K58l60K06j1k09n2J33K21l14M77l87K01r9LK36j70K7j65J51k07M42k13
$$ -127 131 -229 -23 -34 -243 -295 -162 59 -255 222 -165 36 -63 -60 176 6 33 -132 19 -188 254 41
8166D1j57J15J36p0j96K42j02J22J16j44M6q9l2K23l10o0L92l08M5L9m9N3j61
$$ 41 -116 -1 135 65 -131 111 9 131 247 103 149 60 28 251 -59 -119 273 -35 10 49 0 53 -108
8189a08M30k35
$$ -108 322 87
8191H7
$$ Imaginary data points
##PAGE= N=2
##DATA TABLE= (X++(I..I)), XYDATA
0@%%%%%%%%%%%%qJ6j6J6j7K5l2M0m8N6o6P4q8J04j21J40j63J88k15K46k79L17
$$ 0 0 0 0 0 0 0 0 0 0 0 0 0 -8 8 -8 8 -9 16 -16 24 -24 32 -34 40 -48 56 -65 75 -88 100 -115 131 -148 169
34A69l60M05m55N09n68O34p06P84q71R67j071J184j305J440j587J748j926K120
$$ 169 -191 214 -241 268 -300 334 -372 412 -459 508 -563 621 -684 756 -831 917 -1009 1111
52A111k337K581k851L153l498L893m350M888n530O312p293Q560j0270J2715j6519
$$ 1111 -1226 1355 -1496 1657 -1841 2052 -2298 2590 -2940 3372 -3921 4639 -5631 7084 -9435
67i435K3309l9071J44167P4851j75293J07747j1533j05712P7833J09024r9006
$$ -9435 13874 -25197 118970 193821 18528 126275 114742 9030 86863 195887 96881
78I6881j5545N9678p2945o7038R9019K6812m9295L0289Q490r2759j0656O2976
$$ 96881 81336 141014 68069 1031 100050 126862 77567 107856 116346 23587 12931 75907
90G5907J04j7783M0688j0370p6629q813N2201j6131p979O7091j6387r6457J9369
$$ 75907 76011 58228 98916 88546 11917 3104 55305 39174 31195 98286 81899 -14558 4811
103D811M0303n3593K4962Q8801o0457p3164N9465j4399p1275Q4910N8789r0121
$$ 4811 45114 -8479 16483 105284 44827 -28337 31128 16729 -54546 30364 89153 -968
115i68l019M6808q1260k5196J03390j963o1846M5896j451r4368K1932P2559l6145
$$ -968 -3987 42821 -38439 -63635 39755 37792 -24054 21842 20391 -73977 -52045 20514 -15631
128a5631q904N6238m3582p4329L8255L2638l6064K4025M7030n6805n2391M1826
$$ -15631 -24535 31703 -11879 -86208 -47953 -15315 -51379 -27354 19676 -37129 -89520 -47694
140d7694K149l7618N3418L9589p1389k2617M0986l7162k0674Q0240R325o9456
$$ -47694 -45545 -83163 -29745 9844 -61545 -84162 -43176 -80338 -101012 -20772 -11447 -80903
152h0903J9480J9473o8287J5349Q2394k7890l3871M8004k7099o6572M9714N0276
$$ -80903 -61423 -41950 -110237 -94888 -12494 -40384 -74255 -26251 -53350 -119922 -70208 -19932
164a9932l9085J2072M2180n7726m0475N9035J2423k9676M5590K2979o5788j3866
$$ -19932 -59017 -46945 -4765 -62491 -102966 -43931 -31508 -61184 -15594 7385 -58403 -72269
176g2269M6306j5498j0231O2697M576o4290R376K9847l8925J3800P0974k1816
$$ -72269 -25963 -41461 -51692 11005 15581 -48709 -39333 -9486 -48411 -34611 36363 14547
188A4547m6611L3918m091n0423M4076N7299m0565j0988L8890m2537l7490O5708
$$ 14547 -32064 1854 -2237 -52660 -8584 48715 8150 -2838 36052 -6485 -43975 21733
200B1733K3289l9180K9072J9468o4640p881N7716q730j5377M9585o273o4131J4884
$$ 21733 45022 5842 34914 54382 -10258 -18139 39577 30847 15470 65055 58782 -5349 9535
213I535L6365k7584J2084N4752k9169m9295K9469P307l4984L7425M7092m5296
$$ 9535 45900 18316 30400 85152 55983 6688 36157 43464 8480 45905 92997 47701
225D7701k4234L4618k6370k9817O0794K3049m8820R924J9708n4481n731O2991
$$ 47701 23467 58085 31715 1898 62692 85741 36921 46845 66553 12072 6341 69332
237F9332p396l0817L4707q781o1032J9988M2873k6435J619L8696l5837m6903L0125
$$ 69332 61936 31119 65826 57045 -3987 16001 58874 32439 34058 72754 36917 -9986 20139
250B0139J5189k7356K6425L0415m8022k8862L0929j0665k1780M5693J7119n2145
$$ 20139 35328 7972 34397 64812 16790 -12072 18857 8192 -13588 32105 49224 -2921
262b921o033K2673l5239p403N8261m128m5850K0601K501n3480J9517N3345k9372
$$ -2921 -8954 13719 -21520 -28923 29338 25210 -20640 -39 2462 -51018 -31501 21844 -7528
275g528j6977L5875l0957m7788M2657K5739l5254J9114K6571n4090k2163M3961
$$ -7528 -24505 11370 -19587 -67375 -24718 1021 -34233 -15119 11452 -42638 -64801 -20840
287b0840o079j8698M1838M864n4170N40K6712k3057K613M7316j1496m2910J4598
$$ -20840 -26919 -45617 -3779 1085 -53085 -52545 -25833 -48890 -46277 1039 -10457 -53367 -38769
300c8769P205l1639K0960M4567k3404k5118K3088j4247l3675L7701L3842l2823
$$ -38769 -31564 -63203 -42243 2324 -21080 -46198 -23110 -37357 -71032 -33331 511 -32312
312c2312l26K5674m0252k1555N1135P742k8115K9495Q688n3821K154M3447j6898
$$ -32312 -32638 -6964 -47216 -68771 -17636 -9894 -38009 -8514 174 -53647 -51493 -8046 -24944
325b4944n557M4867j6073m8187K3418J9101k7069K2410M0086l2776k6676K7126
$$ -24944 -30501 14366 -1707 -49894 -26476 -7375 -34444 -12034 28052 -4724 -31400 -4274
337d274p000k2480L9892K7455l6019n892K1332k6958j1456M8569J0321l0538J4699
$$ -4274 -11274 -33754 6138 33593 -2426 -8318 13014 -13944 -25400 23169 33490 2952 17651
350A7651Q877m1727M107M7357q585j6217L1835j1626m5353K2990L1091k3265J0269
$$ 17651 26528 -15199 -11092 36265 27680 11463 43298 31672 -13681 9309 40400 17135 27404
363B7404L4073l3435l1894L2848M427k2592L3891K1385m4312r348K6533k0597
$$ 27404 61477 28042 -3852 28996 33423 10831 44722 66107 21795 12447 38980 18383
375A8383p842M5932J776l8485R074R315l2523Q152M3352j2678k4035J9716j0089
$$ 18383 10541 56473 58249 19764 28838 38153 5630 13782 57134 44456 20421 40137 30048
388C0048l6475K3184L2872k2429l868K2662k9440l0413L2888J4294k4525J9066
$$ 30048 -6427 16757 49629 27200 23332 45994 16554 -13859 19029 33323 8798 27864
400B7864J6520m5090j3862L3161r554j3425L7227j071m5891O110J8584k6858P024
$$ 27864 44384 -706 -14568 18593 9039 -4386 32841 31770 -14121 -8011 10573 -16285 -9261
413i261M1070j9445l1971J8877m556l0294K7109L0448k8552j0159J9229k5340
$$ -9261 31809 12364 -19607 -730 -5286 -35580 -8471 21977 -6575 -16734 2495 -22845
425b2845k1784L6915J3957k6763J0639J0701l9037p521L7144l579j5284K6203
$$ -22845 -44629 -7714 6243 -20520 -9881 820 -38217 -45738 -8594 -12173 -27457 -1254
437a254l667m2314P373K7226j6957K327L3035j9927l4671J9911P915k2224K2643
$$ -1254 -4921 -47235 -39862 -12636 -29593 -27266 5769 -14158 -48829 -28918 -21003 -43227 -20584
450b0584K8223l0814j7467K2146j3387j6606L7595J4344l2077L132J4220l0657
$$ -20584 7639 -23175 -40642 -18496 -31883 -48489 -10894 3450 -28627 -25495 -11275 -41932
462d1932k306M1078j849k1235J8814j604l6653J2810L3928j4570l875K6858j9561
$$ -41932 -44238 -3160 -5009 -26244 -7430 -9034 -45687 -32877 1051 -13519 -17394 9464 -10097
475a0097l1731K4651J6930j9165J6969K3278l2465j8382K7728l301j3842L3833
$$ -10097 -41828 -17177 -247 -19412 -2443 20835 -11630 -30012 -2284 -5585 -19427 14406
487A4406J1080l6373J07J9389k1240O92L9876m289k7736J4094L257k8950J6265
$$ 14406 25486 -10887 -10780 8609 -12631 -11939 27937 23648 -4088 10006 13263 -15687 578
500E78L4690j6183j1522K1096j6327k5673K7755K0591j9910P641J7338l0352j5625
$$ 578 35268 19085 7563 28659 12332 -13341 14414 35005 15095 22736 40074 9722 -5903
513e903L1019L125j5015K4249O136l6958j145K4150j3295j380L2291q154l3295
$$ -5903 25116 28241 13226 37475 43611 6653 5508 29658 16363 14983 47274 39120 5825
526E825J1622R320k2312J4000L1133k0713j9675J7732r882k2021K7434K0301k5895
$$ 5825 17447 26767 4455 18455 49588 28875 9200 26932 17050 -4971 22463 42764 16869
539A6869j994J4885k6039j3546L3694M515k1697J5216L908l6018P01K9601j0858
$$ 16869 14875 29760 3721 -9825 23869 28384 6687 21903 25811 -10207 -9506 20095 9237
552I237p813K4895j1192l4668J3054J5967j8811R705K5284k4599k2711J9052k877
$$ 9237 1424 26319 15127 -19541 -6487 9480 -9331 374 25658 1059 -21652 -2600 -5477
565e477j7820K5842J5886l0022o695J5831j9219p939L3431K582k5449Q784M373
$$ -5477 -23297 2545 18431 -11591 -18286 -2455 -21674 -29613 3818 6400 -19049 -10265 -5892
578e892k8815N270L0855q904j2871J7876r587k9453J6253K1477j6074K945K0344
$$ -5892 -34707 -29437 1418 -7486 -20357 -2481 -12068 -41521 -25268 -3791 -19865 -16920 3424
591C424k2757k1982K2506O314j5806J9149J4556l0702r169K1685r947p511L0616
$$ 3424 -19333 -41315 -18809 -12495 -28301 -9152 5404 -25298 -34467 -12782 -22729 -30240 376
604C76K102k9922N915J1276k1464O515L2022j0296j9223J5573m818k4054K0226
$$ 376 2478 -27444 -21529 -10253 -31717 -25202 6820 -3476 -22699 -7126 -11944 -35998 -15772
617a5772K3909j7578k712J6857j9951j7367K7486R960j6624J3371J0749k9564
$$ -15772 8137 -9441 -12153 4704 -15247 -32614 -5128 4832 -11792 1579 12328 -17236
629a7236n604K6188m521q095K5149j614l0019P152J6060j4821N749K7908j3217
$$ -17236 -22840 3348 -1173 -9268 15881 14267 -15752 -8600 7460 -7361 -1612 26296 13079
642A3079k2532J5041J751j7947J9555K2294k0363q605J5368j3339j3262K7597
$$ 13079 -9453 5588 7339 -10608 8947 31241 10878 2273 17641 4302 -8960 18637
654A8637J1445k0274N377R645k4753l613K8875j670j2729J6714j726k8703P242
$$ 18637 30082 9808 15185 24830 77 -3536 25339 23669 10940 27654 25928 -2775 4467
667D467K2185j1839k21K2219j5075k4547J5867Q482j6349J5227J8396k4201j2921
$$ 4467 26652 14813 14592 36811 21736 -2811 13056 21538 5189 20416 38812 14611 1690
680A690J7237p823j1653K5606Q052k5932J207J0665k0482j634K8498l984j8222
$$ 1690 18927 11104 -549 25057 33109 7177 8384 19049 -1433 -3067 25431 21447 3225
693C225J1662j758k5219R552K3243j2285o171J5929j4773k2379J8065J2224j5738
$$ 3225 14887 13129 -12090 -2538 20705 8420 2249 18178 3405 -18974 -909 11315 -4423
706d423Q329J3597k4599j3285K0049j581j1653K0355N561k8230j133J5038j4521
$$ -4423 3906 17503 -7096 -20381 -332 -1913 -13566 6789 12350 -15880 -17013 -1975 -16496
719a6496r44K6211n873k3022R887K658j9996J1359K3511j4484j0964J3943j0836
$$ -16496 -17440 8771 2898 -20124 -10237 -7579 -27575 -16216 7295 -7189 -18153 -4210 -15046
732a5046j7900K0428J4319j6870L426J0865k1140j0297K3334K686j2440J4817
$$ -15046 -32946 -12518 1801 -15069 -11643 -778 -21918 -32215 -8881 -6195 -18635 -3818
744c818M000k6758j26K0234q692k845K2361o291k4866R862R797j5313R396K2671
$$ -3818 182 -26576 -26702 -6468 -15160 -18005 4356 -1935 -26801 -16939 -7142 -22455 -13059 9612
758I612j5947j5420J5021m165j4597K1260J4459j9984j707J2766j7434o488K6200
$$ 9612 -6335 -21755 -6734 -10899 -25496 -4236 10223 -9761 -11468 1298 -16136 -22624 3576
771C576K558j5821J1030L257k3285L612K2970o961n168J6821p654k2039J1781
$$ 3576 6134 -9687 1343 4600 -18685 -15073 7897 936 -4232 12589 4935 -17104 -5323
784e323J3701j1476O464J7583j7001j5658J6326J356j1284J7851J2167k1479n328
$$ -5323 8378 -3098 3366 20949 3948 -11710 4616 5972 -5312 12539 24706 3227 -2101
797b101J4299j0535n419K4644K628k0143N954O351j8885M419K4311o897j1768
$$ -2101 12198 1663 -3756 20888 23516 3373 9327 15678 -3207 1212 25523 18626 6858
810F858J3358n401k0516J3381J7177j2587N46J4181j6811j5119J8354N464j2509
$$ 6858 20216 14815 -5701 7680 24857 12270 12816 26997 10186 -4933 13421 18885 6376
823F376J2942Q727k3268n510J6877o907n829K0894p18k3500M605R023j5470N052
$$ 6376 19318 28045 4777 -733 16144 9237 3408 24302 23584 84 4689 13712 -1758 3294
837C294K1789j0411j5748J0634l141j6706J4510J6203j5560m228J0863j4281j2402
$$ 3294 25083 14672 -1076 9558 6417 -10289 4221 20424 4864 636 11499 -2782 -15184
850a5184J9662O459j3899P123N807k1675l959J8980l292q161J4941j683k2985
$$ -15184 4478 10937 -2962 4161 9968 -11707 -15666 3314 22 -8139 6802 5119 -17866
863a7866M005J3542j0670J329J8494j0667j8446J0839L423j4507J3181J5323j7430
$$ -17866 -13861 -319 -10989 -9660 8834 -1833 -20279 -9440 -6017 -20524 -7343 7980 -9450
876i450q401J2561r627r814K1081P268j8208L665P587j8492j221K2029k684j1221
$$ -9450 -17851 -5290 -14917 -24731 -3650 3618 -14590 -10925 -3338 -21830 -23051 -1022 -3706 -14927
890a4927J2414k520k0871P961J6461r056n63J4781j1325j6619J3177P043j0750
$$ -14927 -2513 -5033 -25904 -17943 -1482 -10538 -11101 3680 -7645 -24264 -11087 -4044 -14794
903a4794R949J2170j7437r026J4263l676p721J8556O128j9263K85J0250j2572
$$ -14794 -4845 7325 -10112 -19138 -4875 -8551 -16272 2284 8412 -10851 -10566 -316 -12888
916a2888m48K1925k816j4963R326R00j7091R050J8544r791n219J2896r966j4808
$$ -12888 -13336 8589 5773 -9190 136 1036 -16055 -7005 11539 1748 -3471 9425 -541 -15349
930a5349J6374R693j1529O606R171j7581p448J6822j01p384J4594L377j9715L93
$$ -15349 1025 10718 -811 5795 14966 -2615 -10063 6759 6658 -726 13868 17245 -2470 -2077
944b077J2501q313l93J8872m444j7256P378M635j3225Q348J7889j1154r960J1320
$$ -2077 10424 2111 1718 20590 16146 -1110 6268 10903 -2322 6026 23915 12761 2801 14121
958A4121n518j3107J6441J1106j4727J126R558j6019o935J9767J105j1318J1016
$$ 14121 8603 -4504 11937 23043 8316 9442 19000 2981 -3954 15813 16918 5600 16616
971A6616J530k0168J972J5604p220k807J5328p338j7880Q418O661j0677P203J3914
$$ 16616 18146 -2022 -50 15554 8334 5527 20855 13517 -4363 4055 10716 39 7242 21156
985B1156j3982j1282J0649k793r676J4317Q619j6345k562Q211j1245m828J8067
$$ 21156 7174 -4108 6541 3748 -5928 8389 17008 663 -1899 6312 -4933 -9761 8306
998H306J166j3587N630K371j7394K582J7673o399p075J1465o454j6925R795J0548
$$ 8306 9472 -4115 1515 3886 -13508 -10926 6747 348 -6727 4738 -1716 -18641 -8846 1702
1012A702j0145K669J1756j3916j1617J3169J371r421J2138P105j8040l539J1498
$$ 1702 -8443 -5774 5982 -7934 -19551 -6382 -5011 -14432 -2294 4811 -13229 -16768 -5270
1025e270p316l961J7554o2j6316M561N081j3064M237J7639o947j0049J0100m022
$$ -5270 -12586 -16547 1007 945 -15371 -10810 -5729 -18793 -14556 3083 -3864 -13913 -3813 -7835
1039g835j4347J2044J2593j1020j64J0226j2549r639J6100L447r684R626N000
$$ -7835 -22182 -10138 2455 -8565 -8729 1497 -11052 -20691 -4591 -1144 -10828 -1202 3798
1052C798j7203j677J3647m329l157J4525j684j6535M552Q124r109M033J5146p772
$$ 3798 -13405 -15082 -1435 -5764 -8921 5604 3920 -12615 -8063 61 -9048 -5015 10131 2359
1066B359j1390Q578l41j0365J0965J2574j1654m265R370q292q118J5917O131j2117
$$ 2359 -9031 -453 -794 -11159 -194 12380 726 -3539 5831 -2461 -10579 5338 11469 -648
1080f48N043N766j5257j699J6591k420o613J1713j631j7027N974J1389q580K145
$$ -648 4395 10161 -5096 -6795 9796 7376 763 12476 10845 -6182 -208 11181 2601 4746
1094D746J3601r874j2591J0555K127q746R968R989j3780n393R911o037n510J5262
$$ 4746 18347 8473 -4118 6437 8564 -182 9786 19775 5995 602 10513 4476 -1034 14228
1108A4228M054j3878K092N248j1739k36J6565k539r626P717j389j4713O323J3256
$$ 14228 18282 4404 6496 11744 5 -231 16334 13795 4169 11886 10497 -4216 2107 15363
1122A5363q013j924J0078r308j2414J1035N390q804O176P981j4600o602J1726
$$ 15363 7350 5426 15504 6196 -6218 4817 10207 1403 7579 15560 960 -5642 6084
1135F084l286n960J3188J846j5641J057O789r121N56J4626m189j1835N608N26
$$ 6084 2798 -3162 10026 11872 -3769 -2712 4077 -5044 -4488 10138 5949 -5886 -278 248
1149B48j1726O801J2601q334n911Q087o746j0844J1708P679j0026K036P473j3864
$$ 248 -11478 -4677 7924 -410 -6321 1766 -4980 -15824 -4116 3563 -6463 -4427 3046 -10818
1163a0818o143J4324l3p748J0343J431j6345J027J1366p344p20J4204n795j3538
$$ -10818 -16961 -2637 -2670 -10418 -75 1356 -14989 -13962 -2596 -9940 -10660 3544 -2251 -15789
1177a5789O959L503r617P419J1704j0324o494Q410m788p280J2504O923j0769M41
$$ -15789 -8830 -5327 -14944 -7525 4179 -6145 -12639 -4229 -9017 -16297 -3793 3130 -7639 -7198
1191g198O001j0451l448J4546J018q061O415J496j3593K008J2978m408k933J0517
$$ -7198 -1197 -11648 -15096 -550 468 -7593 -1178 318 -13275 -11267 1711 -2697 -5630 4887
1205D887m627j3378P338P785q130M694J1028j0967q819J0617o29p260J1715O468
$$ 4887 260 -13118 -5780 2005 -6125 -1431 9597 -1370 -10189 428 -201 -7461 4254 10722
1219A0722j3482p96P757p956j994J4915l04j0756N205K282j1558L684J3089m320
$$ 10722 -2760 -3556 4201 -3755 -5749 9166 8862 -1894 3311 5593 -5965 -2281 10808 6488
1233F488n380Q073m127j1503Q503R159p522J629Q220j0088q136J1070K373p379
$$ 6488 1108 9181 5054 -6449 2054 11213 3691 5320 13540 3452 -4684 6386 8759 1380
1247A380Q831M904j4105k093J0093n099k713J3638j299j3447M357M286r491L977
$$ 1380 10211 15115 1010 -1083 9010 3911 1198 14836 13537 90 4447 8733 -758 3219
1261C219J3040o820p949P497l286r553R674Q486r057n39O030r017o239J1507K959
$$ 3219 16259 9439 1490 8987 5701 -3852 5822 14308 5251 4712 10742 1725 -4514 6993 9952
1276I952p609M782L073j2396k414J1031k554m119R096j122j3759K911P379p163
$$ 9952 2343 7125 10198 -2198 -4612 6419 3865 -254 8842 7720 -6039 -3128 4251 -2912
1290b912J675J1423p322j1016P922J86r161Q774Q921j1488l828P515p340n375
$$ -2912 -1237 10186 2864 -8152 -230 -44 -9205 -431 8490 -2998 -6826 689 -6651 -12026
1304a2026J3386K368j0740L875L230j2211O36J2255l196n350P786k540j2456N239
$$ -12026 1360 3728 -7012 -3137 93 -12118 -11482 773 -2423 -7773 13 -2527 -14983 -9744
1318i744Q529o002P57Q395p098r807Q010L127o739O701O832j0778m557Q241l187
$$ -9744 -1215 -7217 -6460 1935 -5163 -14970 -6960 -3833 -10572 -3871 2961 -7817 -12374 -4133 -7320
1333g320m692J1604L019j1483J156N516q368M82J3050k812p888N935l85j0188
$$ -7320 -12012 -408 2611 -8872 -7716 -2200 -10568 -10086 2964 152 -7736 -1801 -2186 -12374
1347a2374O075J0402o509j848P587o936p779R641M525o334M693N271j1043l623
$$ -12374 -6299 4103 -2406 -4254 3333 -3603 -11382 -1741 2784 -3550 1143 6414 -4629 -8252
1361h252R775q48m531R475J647j1907Q49P368n976K62J2178l680r732N159K108
$$ -8252 1523 675 -3856 5619 7266 -4641 -3792 3576 -2400 -2138 10040 6360 -3372 1787 3895
1376C895q603N518J0955p523m774P444m798p540J0911N475q773K404M532r630
$$ 3895 -4708 810 11765 4242 -532 6912 2114 -5426 5485 10960 2187 4591 9123 -507
1390e07k866J1492m59n262P128J20j1535K002Q312m321m77Q982m405r919N003
$$ -507 -3373 8119 7660 2398 9526 9646 -1889 113 8425 4104 3627 12609 8204 -1715 3288
1405C288L504n872M568Q283q013o111O487k011n927R242N320r758q12N433p925
$$ 3288 6792 920 5488 13771 5758 -353 6134 4123 -1804 7438 12758 3000 2188 7621 -304
1420c04k786J2081N3q565M800J108j0888K080J0716n081l000P932n216j0161O459
$$ -304 -3090 8991 9044 479 5279 6387 -4501 -2421 8295 3214 214 8146 2930 -7231 -772
1435g72N374o435L104O972r555o227P810n22n293P945L397j0413j550N909n170
$$ -772 4602 -1833 1271 8243 -1312 -7539 271 -251 -5544 2401 5798 -4615 -6165 -256 -5426
1450e426j999J0405o91r328L175K116q741K707J0402m553n550O544l401q968P315
$$ -5426 -7425 2980 2289 -7039 -3864 -1748 -10489 -7782 2620 -1933 -7483 -939 -4340 -13308 -5993
1465e993P122p212Q47N937q662n389R740J021n483O825K020j0454j023Q302l525
$$ -5993 1129 -6083 -5236 701 -7961 -13350 -3610 -2589 -8072 -1247 773 -9681 -10704 -2402 -5927
1480e927j551R199j596r848L040M264o005L000R081m585o822N822j269o211O692
$$ -5927 -7478 1721 125 -9723 -6683 -2419 -8424 -5424 3657 -928 -7750 -1928 -3197 -9408 -2716
1495b716P409p118j718N844o113m898J0516K812o882L747L027r721m13R997k416
$$ -2716 4693 -2425 -4143 1701 -4412 -9310 1206 4018 -2864 883 3910 -5811 -6224 3773 1357
1510A357l308Q012j958j0517M299O394n700K432Q401o543o994O314L71n303P272
$$ 1357 -1951 6061 4103 -6414 -2115 4279 -1421 1011 9412 2869 -4125 2189 2560 -2743 4529
1525D529N422q399k120N557m494k859R631J991q071K303K752p860M58R819j684
$$ 4529 9951 1552 -568 4989 495 -2364 7267 9258 1187 3490 6242 -1618 -1160 8659 6975
1540F975n120N145j099r121M340P301m577k71N997n437p537P322K834n577M948
$$ 6975 1855 7000 5901 -3220 1120 8421 3844 3573 9570 4133 -3404 3918 6752 1175 6123
1555F123M825r022l415O910k053l723Q722R17r483J448M106o235P23R651l210
$$ 6123 10948 1926 -1489 5421 3368 -355 8367 9284 -199 1249 5355 -880 -157 9494 6284
1570F284p025M292k68p566M868P499n722k584N556n246o433P836L713o419K813
$$ 6284 -741 3551 3283 -4283 585 8084 2362 -222 5334 88 -6345 1491 5204 -1215 1598
1585A598L709q894k907Q163j175l997O685K31r917J282N760n043N05P961l773
$$ 1598 5307 -3587 -6494 1669 494 -3503 3182 3413 -6504 -5222 538 -4505 -4000 3961 188
1600A88p649M111J260o000M526P004o661l638M910l340m589P307M099p085P82
$$ 188 -7461 -3350 -2090 -8090 -3564 3440 -3221 -6859 -1949 -5289 -9878 -2571 1528 -5557 -4775
1615d775L730p162j735Q518K67n112M888N26r052J774P737l825r85P109l624q345
$$ -4775 -1045 -8207 -9942 -1424 -1157 -6269 -1381 -855 -9907 -8133 -396 -4221 -5206 1903 -1721 -10066
1631a0066N218L485n335M061O621p175m615O487j544m295P828L384q182N91M545
$$ -10066 -4848 -1363 -6698 -2637 3984 -3191 -7806 -1319 -2863 -7158 670 4054 -4128 -3537 1008
1646A008n884j084R639q76n879L867Q39p661L075P945l681k263N517l323o900
$$ 1008 -4876 -5960 3679 2803 -3076 791 1630 -6031 -2956 4989 1308 -955 4562 1239 -5661
1661e661N419N005m872K086N138o958m150O716O88m517O423K693q756m02N948
$$ -5661 -242 4763 -109 1977 7115 157 -3993 2723 3411 -1106 5317 8010 -746 -1148 4800
1676D800m129j396Q508q10p642L034K049o265K642Q711m780m190N011k374o145
$$ 4800 671 -725 7783 6973 -669 2365 4414 -1851 791 9502 4722 532 5543 3169 -2976
1691b976O447M998n693M78M103o271l555P436J042m679M505J530q259k18O539
$$ -2976 3471 8469 2776 3254 7357 1086 -2469 4967 6009 1330 5835 7365 -894 -1112 5427
1706E427k549j760O576j556p950K381M064m834J638P296m835o181N080o95n560
$$ 5427 2878 1118 7694 6138 -1812 569 4633 -201 1437 8733 3898 -2283 2797 2102 -3458
1721c458N837N368p059j534M619n275l203Q375J135o596L323J297p868N99P668
$$ -3458 2379 7747 688 -846 3773 -1502 -4705 3670 4805 -1791 1532 2829 -5039 -4440 3228
1736C228k850l102N577k377p624L679M737m584J135N648n722n158M729P82l883
$$ 3228 378 -2724 2853 476 -7148 -3469 1268 -3316 -2181 3467 -2255 -7413 -2684 -1902 -5785
1751e785M470L754o877k167M564k807k314O979J028o473Q01K863n866R38P599
$$ -5785 -1315 2439 -4438 -6605 -2041 -4848 -7162 -183 845 -5628 -4827 -1964 -7830 -6892 707
1766G07j885m744M249j018o704M088O361m682p66N223m801n126O699K100m652
$$ 707 -1178 -5922 -1673 -2691 -9395 -5307 1054 -3628 -4394 829 -3972 -9098 -2399 -299 -4951
1781d951L886L533p433j662O402k022k202O781L8p624K067L963m785J497P087
$$ -4951 -1065 2468 -4965 -6627 -225 -2247 -4449 2332 2370 -5254 -3187 776 -4009 -2512 4575
1796D575k889n339M080J96n486M744N724m860j790M191l416m088O438L129m670
$$ 4575 1686 -3653 427 623 -4863 -119 5605 745 -1045 3146 -270 -4358 2080 5209 539
1811E39J703K806o380j503P030r80l026N350kp650J408N619l597p1O419k915o586
$$ 539 2242 5048 -1332 -2835 4195 3215 189 5539 5537 -2113 -705 4914 1317 1246 7665 4750 -1836
1828a836M138J765m622L792N368o073k827M805k358l787O662K639o210R22K725
$$ -1836 2302 4067 -555 3237 8605 2532 -295 4510 2152 -1635 5027 7666 1456 2378 5103
1843E103n562p50P509j009m270L875j7o812J797N841l369j133N129l189n801M041
$$ 5103 -459 -1209 6300 5291 1021 4896 4879 -1933 -136 5705 2336 1203 6332 3143 -2658 1383
1859A383K868m034K282M315o029l378N030j078l293N359K355p071q5M059m511
$$ 1383 4251 217 2499 6814 785 -2593 2437 1359 -1934 3425 5780 -1291 -1376 2683 -1828
1874a828r43P144j161n915L262N23n916K446O027l604k470M152k852n407M800
$$ -1828 -2771 4373 3212 -2703 559 1082 -4834 -2388 3639 35 -2435 1717 -1135 -6542 -1742
$$ [...]
8191B9
##END NTUPLES=NMR FID
##END=
