##TITLE=1H_LR-713_CR9
 CDCl3, 8 sc, 
 9.7.2020
##JCAMPDX= 6.0         $$ Bruker NMR JCAMP-DX V2.0
##DATA TYPE= NMR FID
##DATA CLASS= NTUPLES
##ORIGIN= UXNMR, Bruker Analytische Messtechnik GmbH
##OWNER= root
$$ XWIN-NMR		Version 3.5
$$ Thu Jul  9 10:15:58 2020 Russian Standard Time (UT+4h)  she@DPX200
##.OBSERVE FREQUENCY= 200.1315
##.OBSERVE NUCLEUS= ^1H
##.DELAY= (6, 6)
##.ACQUISITION MODE= SIMULTANEOUS
##.ACQUISITION SCHEME= undefined
##.AVERAGES= 8
##.DIGITISER RES= 18
##SPECTROMETER/DATA SYSTEM= spect
##.PULSE SEQUENCE= zg30
##.SOLVENT NAME= CDCl3
##.SHIFT REFERENCE= (INTERNAL, CDCl3, 0, 15.7039)
##AUDIT TRAIL= $$ (NUMBER, WHEN, WHO, WHERE, WHAT)
$$ ##TITLE= Audit trail, XWIN-NMR		Version 3.5
$$ ##JCAMPDX= 5.01
$$ ##ORIGIN= Bruker BioSpin GmbH
$$ ##OWNER= she
$$ F:/spectra/data/she/nmr/H-F/1/audita.txt
$$ ##AUDIT TRAIL=  $$ (NUMBER, WHEN, WHO, WHERE, WHAT)
(   1,<2020-07-09 10:15:06.71 +0400>,<she>,<DPX200>,
      <created by zg, POWCHK disabled, PULCHK disabled
       configuration hash MD5:
       00 E9 B6 7A A2 85 ED C7 34 08 36 98 17 FE 4E 26
       data hash MD5: 16K
       4F 3F 28 30 52 E9 6F 3C 23 09 4A EF A7 58 CE AA>)
$$ ##END=
$$ 
$$ hash MD5
$$ A1 82 92 34 DB CA 69 E4 39 49 C2 2B C8 DF 9C 24
##$RELAX= 
##$RELAX= 
##$RELAX= 
##$RELAX= 
##$RELAX= 
##$RELAX= 
$$ Bruker specific parameters
$$ --------------------------
##$DU= <F:/spectra>
##$EXPNO= 1
##$NAME= <H-F>
##$PROCNO= 1
##$TYPE= <nmr>
##$USER= <she>
##$AMP= (0..31)
100 100 100 100 100 100 100 100 100 100 100 100 100 100 100 100 100 100 
100 100 100 100 100 100 100 100 100 100 100 100 100 100 
##$AQSEQ= 0
##$AQ_mod= 1
##$AUNM= <au_zg>
##$AUTOPOS= <>
##$BF1= 200.13
##$BF2= 200.13
##$BF3= 200.13
##$BF4= 200.13
##$BF5= 200.13
##$BF6= 200.13
##$BF7= 200.13
##$BF8= 200.13
##$BYTORDA= 1
##$CFDGTYP= 0
##$CFRGTYP= 5
##$CHEMSTR= <none>
##$CNST= (0..31)
1 1 145 1 1 1 1 1 1 1 1 1 1 1 1 1 1 1 1 1 1 1 1 1 1 1 1 1 1 1 1 1 
##$CPDPRG= <>
##$CPDPRG1= <>
##$CPDPRG2= <>
##$CPDPRG3= <>
##$CPDPRG4= <mlev>
##$CPDPRG5= <mlev>
##$CPDPRG6= <mlev>
##$CPDPRG7= <mlev>
##$CPDPRG8= <mlev>
##$CPDPRGB= <>
##$CPDPRGT= <>
##$D= (0..31)
0 1.2 0 0 0 0 0 0 0 0.06 0 0.03 0 0 0 0 0.0002 0 0 0 0 0 0 0 0 0 0 0 0 
0 0 0 
##$DATE= 1594275306
##$DBL= (0..7)
120 120 120 120 120 120 120 120 
##$DBP= (0..7)
150 150 150 150 150 150 150 150 
##$DBP07= 0
##$DBPNAM0= <>
##$DBPNAM1= <>
##$DBPNAM2= <>
##$DBPNAM3= <>
##$DBPNAM4= <>
##$DBPNAM5= <>
##$DBPNAM6= <>
##$DBPNAM7= <>
##$DBPOAL= (0..7)
0.5 0.5 0.5 0.5 0.5 0.5 0.5 0.5 
##$DBPOFFS= (0..7)
0 0 0 0 0 0 0 0 
##$DE= 6
##$DECBNUC= <off>
##$DECIM= 24
##$DECNUC= <off>
##$DECSTAT= 4
##$DIGMOD= 1
##$DIGTYP= 9
##$DL= (0..7)
0 120 120 120 120 120 120 120 
##$DP= (0..7)
150 150 150 150 150 150 150 150 
##$DP07= 0
##$DPNAME0= <>
##$DPNAME1= <>
##$DPNAME2= <>
##$DPNAME3= <>
##$DPNAME4= <>
##$DPNAME5= <>
##$DPNAME6= <>
##$DPNAME7= <>
##$DPOAL= (0..7)
0.5 0.5 0.5 0.5 0.5 0.5 0.5 0.5 
##$DPOFFS= (0..7)
0 0 0 0 0 0 0 0 
##$DQDMODE= 0
##$DR= 18
##$DS= 0
##$DSLIST= <SSSSSSSSSSSSSSS>
$$ [...]
##$SUBNAM2= <"">
##$SUBNAM3= <"">
##$SUBNAM4= <"">
##$SUBNAM5= <"">
##$SUBNAM6= <"">
##$SUBNAM7= <"">
##$SUBNAM8= <"">
##$SUBNAM9= <"">
##$SW= 24.9337058887773
##$SWIBOX= (0..15)
0 0 2 0 0 0 0 0 0 0 0 0 0 0 0 0 
##$SW_h= 4990.01996007984
##$TD= 16384
##$TD0= 1
##$TE= 0
##$TE2= 300
##$TE3= 300
##$TEG= 300
##$TL= (0..7)
0 120 120 120 120 120 120 120 
##$TP= (0..7)
150 150 150 150 150 150 150 150 
##$TP07= 0
##$TPNAME0= <>
##$TPNAME1= <>
##$TPNAME2= <>
##$TPNAME3= <>
##$TPNAME4= <>
##$TPNAME5= <>
##$TPNAME6= <>
##$TPNAME7= <>
##$TPOAL= (0..7)
0.5 0.5 0.5 0.5 0.5 0.5 0.5 0.5 
##$TPOFFS= (0..7)
0 0 0 0 0 0 0 0 
##$TUNHIN= 0
##$TUNHOUT= 0
##$TUNXOUT= 0
##$USERA1= <user>
##$USERA2= <user>
##$USERA3= <user>
##$USERA4= <user>
##$USERA5= <user>
##$V9= 5
##$VALIST= <valist>
##$VCLIST= <CCCCCCCCCCCCCCC>
##$VD= 0
##$VDLIST= <DDDDDDDDDDDDDDD>
##$VPLIST= <PPPPPPPPPPPPPPP>
##$VTLIST= <TTTTTTTTTTTTTTT>
##$WBST= 1024
##$WBSW= 4
##$XGAIN= (0..3)
0 0 0 0 
##$XL= 0
##$YL= 0
##$YMAX_a= 139283
##$YMIN_a= -52945
##$ZGOPTNS= <>
##$ZL1= 120
##$ZL2= 120
##$ZL3= 120
##$ZL4= 120
##$ABSF1= 10
##$ABSF2= 0
##$ABSG= 5
##$ABSL= 3
##$ALPHA= 0
##$AQORDER= 0
##$ASSFAC= 0
##$ASSFACI= 0
##$ASSFACX= 0
##$ASSWID= 0
##$AUNMP= <proc_1d>
##$AZFE= 0.1
##$AZFW= 0.1
##$BCFW= 1
##$BC_mod= 2
##$BYTORDP= 1
##$COROFFS= 0
##$CY= 11.3945322036743
##$DATMOD= 1
##$DC= 2
##$DFILT= <>
##$DTYPP= 0
##$F1P= 16.9975609425685
##$F2P= -3.02152046262296
##$FCOR= 0.5
##$FTSIZE= 0
##$FT_mod= 4
##$GAMMA= 1
##$GB= 0.15
##$INTBC= 1
##$INTSCL= 1
##$ISEN= 128
##$LB= 0.24
##$LEV0= 0
##$LPBIN= 0
##$MAXI= 10000
##$MC2= 0
##$MEAN= 0
##$ME_mod= 0
##$MI= 1.114404
##$NCOEF= 0
##$NC_proc= 0
##$NLEV= 6
##$NOISF1= 3.799351
##$NOISF2= 2.8
##$NSP= 1
##$NTH_PI= 0
##$NZP= 0
##$OFFSET= 15.70392
##$PC= 1
##$PHC0= -9788.539
##$PHC1= 7.20085
##$PH_mod= 1
##$PKNL= yes
##$PPARMOD= 0
##$PSCAL= 0
##$PSIGN= 0
##$REVERSE= no
##$SF= 200.130013532006
##$SI= 16384
##$SIGF1= 3
##$SIGF2= 2
##$SINO= 400
##$SIOLD= 16384
##$SREGLST= <1H.CDCl3>
##$SSB= 0
##$STSI= 0
##$STSR= 0
##$SW_p= 3612.71676300578
##$SYMM= 0
##$S_DEV= 0
##$TDeff= 0
##$TDoff= 0
##$TI= <>
##$TILT= no
##$TM1= 0
##$TM2= 0
##$TOPLEV= 0
##$USERP1= <user>
##$USERP2= <user>
##$USERP3= <user>
##$USERP4= <user>
##$USERP5= <user>
##$WDW= 1
##$XDIM= 8192
##$YMAX_p= 0
##$YMIN_p= 0
$$ End of Bruker specific parameters
$$ ---------------------------------
##NTUPLES= NMR FID
##VAR_NAME=  TIME,          FID/REAL,        FID/IMAG
##SYMBOL=    X,             R,               I
##VAR_TYPE=  INDEPENDENT,   DEPENDENT,       DEPENDENT
##VAR_FORM=  AFFN,          ASDF,            ASDF
##VAR_DIM=   8192,          8192,            8192
##UNITS=     SECONDS,       ARBITRARY UNITS, ARBITRARY UNITS
##FACTOR=    0.0002004,     1,               1
##FIRST=     0,             0,               0
##LAST=      1.6414764,     0,               0
##MIN=       0,             -52945,          0
##MAX=       1.6414764,     139283,          0
$$ Real data points
##PAGE= N=1
##DATA TABLE= (X++(R..R)), XYDATA
$$ [...]
$$ plain form
2082 -395 -85 -230 -318 -566 -354 -225 -387 -920 -597 -304 -470 -343 -314 -607 -275 -258 -736 -988 -560 -209 -407
2103 -407 -571 -499 -362 -445 -632 -874 -543 -657 -408 -620 -690 -402 -467 -477 -788 -637 -130 -117 -400 -612 -606 -50 -219
2126 -219 -689 -283 -200 -112 -229 -400 -449 -209 298 58 -224 -60 29 162 -35 -72 -43 30 410 -157 65 411
2148 411 570 131 123 263 463 425 612 394 399 655 616 596 309 452 938 305 116 345 395 934 774 364 474
2171 474 720 721 689 652 687 742 422 -47 125 380 570 480 540 377 508 399 317 -166 298 396 600 114 -77
2194 -77 117 75 93 239 119 40 5 -189 -211 -169 296 -52 -438 -421 -60 148 -108 -462 -480 -378 -18 -163 -366
2217 -366 -490 -466 -197 -446 -655 -823 -369 -387 -474 -670 -567 -527 -201 -685 -736 -448 -492 -743 -491 -609 -661 -581 -530
2240 -530 -642 -435 -429 -676 -507 -891 -429 -490 -251 -712 -714 -180 -520 -474 -447 -420 206 -47 -272 -161 -124 -76 -108 92
$$ packed form
2082c95L10j45q8k48K12J29j62n33L23K93j66J27K9k93L32J7m78k52M28L51j98
2103d07j64P2J37q3j87k42L31j14K49k12p0K88o5j0l11J51N07J3k83k12ON56j69
2126b19m70M06Q3Q8j17j71m9K40N07k40k82J64Q9J33j97l7K9P3L80n67K22L46
2148D11J59m39qJ40K00l8J87k18NK56l9k0k87J43M86o33j89K29N0N39j60m10J10
2171D74K46Jl2l7L5N5l20m69J72K55J90r0O0j63J31j09q2m83M64R8K04m86j91
2194g7J94m2J8J46j20p9l5j94k2M2M65l48l86J7L61K08k56l54j8J02L60j45k03
2217c66j24K4K69k49k09j68M54j8q7j96J03M0L26m84n1K88m4k51K52j18n2Q0N1
2240e30j12K07Ok47J69l84M62o1K39m61kN34l40M6K7K7O26k53k25J11L7M8l2K00
$$ plain form
2264 92 -76 -79 40 306 -124 29 122 218 78 -214 244 505 126 471 126 419 331 595 209 244 202 842 656
2287 656 410 191 602 538 571 364 610 391 701 410 125 533 505 540 -59 408 790 604 556 304 500 747
2309 747 695 507 12 434 572 646 75 -17 378 579 326 186 413 135 415 93 140 154 318 320 255 -114 -229
2332 -229 -50 26 -111 -240 125 -150 -56 -324 -248 141 -188 -280 -322 -344 -471 -412 -595 -626 -556 -534 -583 -629 -491 -349
2356 -349 -489 -776 -648 -548 1 -662 -449 -650 -456 -401 -743 -632 -607 -526 -473 -453 -576 -485 -239 -425 -385 -523
2378 -523 -641 -276 -405 -540 -384 -501 -63 -379 -304 -221 0 -106 -201 -291 -230 50 109 -279 -237 200 -13 197
2400 197 -41 -215 471 168 117 265 52 -33 211 572 155 364 401 418 551 479 591 522 519 298 250 507 477
2423 477 545 295 218 388 676 255 419 278 492 527 181 437 570 757 362 435 340 523 287 300 156 247
$$ packed form
2264I2j68lJ19K66m30J53R3R6j40k92M58K61l79L45l45K93q8K64l86L5m2O40j86
2287F56k46k19M11o4L3k07K46k19L10k91k85M08k8L5n99M67L82j86m8k52J96K47
2309G47n2j88m95M22J38P4n71r2L95K01k53j40K27k78K80l22M7J4J64Ko5l69j15
2332b29J79P6j37j29L65k75R4k68P6L89l29r2m2k2j27N9j83l1P0K2m9m6J38J42
2356c49j40k87J28J00N49o63K13k01J94N5l42J11K5Q1N3K0j23R1K46j86M0j38
2378e23j18L65j29j35J56j17M38l16P5Q3K21j06r5r0O1K80N9l88M2M37k13K10
2400A97k38j74O86l03n1J48k13q5K44L61m17K09L7J7J33p2J12o9lk21m8K57l0
2423D77O8k50p7J70K88m21J64j41K14L5l46K56J33J87l95P3r5J83k36J3j44R1
$$ plain form
2445 247 358 374 90 -88 85 193 142 232 222 306 286 270 28 -262 -200 -77 -299 -172 -82 206 33 -251 -28
2468 -28 164 -105 -182 -622 -664 -209 -75 -365 -620 -575 -275 -422 -277 -635 -250 -459 -518 -528 -470 -365 -323 -232 -775
2491 -775 -862 -401 -460 -350 -614 -335 -430 -459 -295 -537 -351 -375 -505 -474 -406 -204 -281 -450 -131 -422 -115 -120 -131 -514
2515 -514 -182 -55 -234 -112 104 78 312 11 -367 33 214 258 64 -38 232 93 243 163 -78 101 636
2536 636 346 152 360 298 553 100 166 315 544 564 621 293 374 593 860 484 381 415 694 679 374 37
2558 37 602 509 523 774 487 559 420 274 372 481 407 799 454 42 297 185 242 31 410 737 450 0
2580 0 111 54 231 76 -104 -124 237 272 230 -88 53 -346 -134 63 -483 -459 -25 -60 -529 -190 -480 58 -207
2603 -207 -320 -282 -93 -342 -163 -566 -124 -152 -191 -538 -659 -515 -387 -426 -656 -398 -394 -320 -319 -548 -500 -219 -215 -504
$$ packed form
2445B47J11J6k84j78J73J08n1R0j0Q4k0j6k42k90O2J23k22J27R0K88j73k84K23
2468b8J92k69p7m40m2M55J34k90k55M5L00j47J45l58L85k09n9j0N8J05M2R1n43
2491g75q7M61n9J10k64K79r5k9J64k42J86k4j30L1O8K02p7j69L19k91L07nj1l83
2515e14L32J27j79J22K16k6K34l01l78M00J81M4j94j02K70j39J50q0k41J79N35
2536F36k90j94K08o2K55m53O6J49K29K0N7l28Q1K19K67l76j03L4K79j5l05l37
2558C7N65r3J4K51k87P2j39j46R8J09p4L92l45m12K55j12N7k11L79L27k87m50
2580@J11n7J77j55j80k0L61L5m2l18J41l99K12J97n46K4M34l5m69L39k90N38k65
2603b07j13L8J89k49J79m03M42k8l9l47j21J44J28l9k30K58MP4Jk29M8K81Mk89
$$ plain form
2627 -504 -687 -564 -187 -233 -558 -328 -396 -197 -477 -546 -480 -463 121 206 -45 -255 -373 -246 -183 -429 -124 45
2649 45 -251 -93 -362 63 470 -296 -256 297 248 -60 -16 259 10 305 138 7 144 261 344 359 21 1
2671 1 410 514 496 438 484 375 534 330 449 323 330 311 263 378 383 568 296 121 271 487 516 453 291 309 609
2696 609 403 421 355 182 398 423 383 184 222 377 282 -245 155 246 131 -110 103 168 278 -56 -45 -16 23 -81
2720 -81 -43 140 -80 -153 207 -289 -260 -446 -158 155 -253 -12 -185 -379 -304 -364 -357 -214 -302 -212 -468 -532 -185 -435
2744 -435 -246 -330 -283 -291 -405 -557 -569 -704 -386 -267 -408 -770 -445 -394 -233 -164 -553 -349 -278 -307 -517 -155 -223
2767 -223 -250 -162 -219 6 -179 -288 -164 -82 -18 -10 -67 -140 -47 -79 6 197 150 -13 251 267 109 -2 -97 154 -58
2792 -58 208 69 289 445 6 117 439 564 444 327 164 282 613 486 493 427 419 180 220 452 132 640
$$ packed form
2627e04j83J23L77m6l25K30o8J99k80o9O6J7N84Q5k51k10j18J27O3k46L05J69
2649D5k96J58k69M25M07p66M0N53m9l08M4K75k49K95j67j31J37J17Q3J5l38k0
2671AM09J04j8n8M6j09J59k04J19j26Pj9m8J15NJ85k72j75J50K16K9o3j62J8L00
2696F09k06J8o6j73K16K5m0j99L8J55r5n27M00R1j15k41K13O5J10l34J1K9L9j04
2720h1L8J83k20p3L60m96K9j86K88L13m08K41j73j94P5o0PJ43q8R0k56o4L47k50
2744d35J89q4M7qj14j52j2j35L18J19j41l62L25N1J61O9l89K04P1k9k10L62o8
2767b23k7Q8n7K25j85j09J24Q2O4Qn7p3R3l2Q5J91m7j63K64J6j58j11r5K51k12
2792e8K66j39K20J56m39J11L22J25j20j17j63J18L31j27Po6qk39M0K32l20N08
$$ plain form
2814 640 663 314 344 255 391 364 421 94 716 372 513 545 382 289 594 161 122 115 231 398 34 149 217 392
2838 392 160 42 0 405 220 200 -176 -27 -41 172 209 -253 27 42 -78 -95 95 134 -166 -266 91 -111
2860 -111 -212 -169 -288 -476 -366 -60 -407 -363 -503 -511 -230 -257 -187 -443 -347 86 -336 -423 -391 -649 -115 -382 -299
2883 -299 -348 -422 -227 -435 -676 -154 -355 -153 -426 -562 -33 -220 -353 -396 -387 55 -289 -388 -327 -278 -265 -218 -321
2906 -321 -184 60 126 30 -46 -5 97 -20 122 25 80 137 103 79 177 342 364 276 109 214 -207 58 188 143
2930 143 347 604 402 142 540 134 454 252 380 500 444 488 119 331 498 512 751 439 72 151 226 293
2952 293 263 557 252 352 323 292 349 257 411 26 -215 382 172 95 286 9 10 -7 279 225 365 -55 43 -39
2976 -39 -62 -37 -198 55 94 -386 -270 21 -156 -298 -470 25 -261 -158 -65 -223 -37 51 -290 -302 -411 -160
$$ packed form
2814F40K3l49L0q9J36k7N7l27O22l44J41L2j63r3L05m33l9pJ16J67l64J15O8J75
2838C92k32j18m2M05j85k0l76J49j4K13L7m62K80J5j20j7J90L9l00j00L57k02
2860a11j01M3j19j88J10L06l47M4j40qK81k7P0k56R6M33m22q7L2k58N34k67Q3
2883b99m9p4J95k08k41N22k01K02k73j36N29j87j33m3RM42l44r9O1M9J3M7j03
2906c21J37K44O6r6p6M1J02j17J42r7N5N7l4k4R8J65K2q8j67J05m21K65J30m5
2930A43K04K57k02k60L98m06L20k02J28J20n6M4l69K12J67J4K39l12l67P9P5O7
2952B93l0K94l05J00k9l1N7r2J54l85k41N97k10p7J91k77Jj7K86n4J40m20R8q2
2976c9k3K5j61K53L9m80J16K91j77j42j72M95k86J03R3j58J86Q8l41j2j09K51
$$ plain form
2998 -160 116 -516 -328 -529 -343 -322 -540 -383 -446 -177 -100 -646 -425 -137 -97 -62 -444 -296 -313 -176 9 -523
3020 -523 -329 126 -404 -310 -567 -23 -32 -304 -332 -208 -164 -2 -231 -276 56 -29 -192 147 -129 -28 143 126 -84
3043 -84 160 487 39 260 79 6 173 371 205 250 445 119 507 144 -108 372 676 231 -20 36 354
3064 354 520 329 83 220 223 490 535 -47 169 683 370 301 185 304 529 444 111 282 379 292 455 119
3086 119 60 193 312 145 272 168 255 193 2 -61 364 60 28 157 -190 -65 67 171 -136 145 101 171
3108 171 -371 -172 -33 24 -105 -311 -309 -202 85 -358 -325 -480 -182 -286 -591 -334 -67 -370 -204 -495 -698
3129 -698 -185 -308 -355 -262 -371 -85 66 -311 -391 -155 -278 -392 -162 -425 -431 13 -262 -242 -271 -102 -196 34 -366
3152 -366 -367 -181 -290 -385 -131 -253 -174 -102 68 104 -148 18 -196 119 -112 -2 -23 -13 -131 353 -32 57 68
$$ packed form
2998a60K76o32J88k01J86K1k18J57o3K69P7n46K21K88M0L5l82J48j7J37J85n32
3020e23J94M55n30R4k57N44rk72k8J24M4J62k29m5L32q5j63L39k76J01J71j7k10
3043h4K44L27m48K21j81p3J67J98j66M5J95l26L88l63k52M80L04m45k51N6L18
3064C54J66j91k46J37LK67M5n82K16N14l13o9j16J19K25q5l33J71R7q7J63l36
3086A19n9J33J19j67J27j04Q7o2j91o3M25l04l2J29l47J25J32J04l07K81m4P0
3108A71n42J99J39N7j29k06KJ07K87m43L3j55K98j04l05K57K67l03J66k91k03
3129f98N13j23m7R3j09K86J51l77q0K36j23j14K30k63oM44k75K0k9J69r4K30m00
3152c66jJ86j09r5K54j22P9P2J70L6k52J66k14L15k31J10k1J0j18M84l85Q9J1
$$ plain form
3175 68 -257 155 12 208 29 405 40 267 198 67 225 368 467 452 230 239 432 461 135 174 375 493 507
3198 507 525 358 462 446 159 379 199 294 247 94 184 382 305 356 349 150 99 384 413 77 209 268 312 381 4
3223 4 123 220 -148 -75 28 242 347 -156 232 -116 -19 -187 -307 -87 67 162 -228 56 -287 -151 -59 -160
3245 -160 -259 -338 -388 -214 -307 -229 -414 98 -443 -365 -758 -514 -162 -304 -549 -193 -465 -216 -13 -361 -168 -94
3267 -94 225 -107 -504 -92 -384 -153 -312 -437 -340 8 -136 -554 -426 -275 117 -9 -392 -259 -154 -139 -179
3288 -179 -11 -334 58 -33 -357 48 -170 -66 25 271 -72 128 332 109 -320 -101 118 450 459 38 235
3309 235 145 321 -227 168 305 305 465 136 236 290 486 292 267 261 328 327 347 -28 249 244 104 1 172 364
3333 364 189 345 133 -68 352 290 324 39 41 484 411 -173 -35 152 158 29 311 126 291 -66 10 143 93
$$ packed form
3175F8l25M12j43J96j79L76l65K27o9j31J58J43R9j5k22RJ93K9l26L9K01J18J4
3198E07J8j67J04j6k87K20j80R5m7j53R0J98p7N1pj99n1K85K9l36J32N9M4O9l77
3223DJ19R7l68P3J03K14J05n03L88l48R7j68j20K20J54R5l90K84l43J36R2j01
3245a60r9p9n0J74r3P8j85N12n41P8l93K44L52j42k45L56k72K49K03l48J93P4
3267i4L19l32l97M12k92K31j59j25R7L48j44m18J28J51L92j26l83J33J05J5m0
3288a79J68l23L92r1l24M05k18J04R1K46l43K00K04k23m29K19K19L32Rm21J97
3309B35r0J76n48L95J37%J60l29J00N4J96j94k5oO7jK0l75K77nj40j03J71J92
3333C64j75J56k12k01M20o2L4k85KM43p3n84J38J87Oj29K82j85J65l57P6J33n0
$$ plain form
3356 93 143 93 55 -96 17 253 257 -88 -198 -118 -126 16 -78 99 -49 -142 -252 -150 -59 -193 76 -192 -471 -79
3380 -79 -100 -212 -318 -419 -104 -547 -253 -83 -518 -224 -444 -433 -556 -494 -288 -434 -95 -365 -435 -330 -446 -222
3402 -222 -329 -214 -198 -73 -314 -333 -81 -148 -301 -12 -58 28 -99 -281 -271 220 -166 -442 -91 83 -255 105
3424 105 -130 -36 -111 14 -148 -299 -260 300 -198 282 -41 -27 115 165 -49 -32 125 262 463 431 280 -48
3446 -48 474 521 44 196 247 -14 -114 258 438 249 -211 118 443 86 480 -13 121 543 412 284 215
3467 215 309 356 84 433 364 60 226 257 572 336 226 188 292 52 215 -324 476 274 184 59 307 104
3489 104 103 119 -166 -2 69 -246 -163 -204 -356 166 -1 -51 -256 -268 -13 -129 -340 -106 49 -24 -75 -438 -278
3512 -278 -91 -219 -523 -333 -160 -448 -487 -420 -353 -271 -407 -440 -186 -307 -339 92 -392 -427 -136 -397 -68 -406
$$ packed form
3356I3N0n0l8j51J13K36Ml45j10Q0qJ42r4J77j48r3j10J02R1j34K69k68k79L92
3380g9k1j12j06j01L15m43K94J70m35K94k20J1j23O2K06j46L39k70p0J05j16K24
3402b22j07J15J6J25k41j9K52o7j53K89m6Q6j27j82J0M91l86k76L51J74l38L60
3424A05k35R4p5J25j62j51L9N60m98M80l23J4J42N0k14J7J57J37K01l2j51l28
3446d8N22M7m77J52N1k61j00L72J80j89m60L29L25l57L94m93J34M22j31j28o9
3467B15R4M7k72L49o9l04J66L1L15k36j10l8J04k40J63n39Q00k02r0j25K48k03
3489A04jJ6k85J64P1l15Q3m1j52N22j67n0k05j2K55j16k11K34J55p3n1l63J60
3512b78J87j28l04J90J73k88l9O7O7Q2j36l3K54j21l2M31m84l5K91k61L29l38
$$ plain form
3534 -406 -398 30 115 -265 -301 -250 -336 23 -389 -153 -27 179 -151 -155 -13 -70 -249 98 -119 -200 114 220 220 -211
3558 -211 -30 130 19 26 49 445 464 270 -25 -14 302 -91 184 64 32 -211 86 309 281 257 469 147 129
3581 129 485 131 745 316 403 232 574 208 127 58 -208 280 136 -43 217 26 372 260 249 4 140
3602 140 359 69 61 -84 294 17 41 13 285 448 50 -43 -6 64 81 1 52 99 226 143 -158 -92 47 -268
3626 -268 33 -167 -27 -98 274 -228 -418 48 -170 -329 -179 -247 -458 60 4 -129 -445 -257 -2 -306 -187
3647 -187 -481 -193 -219 -269 -259 -258 -244 -139 -522 -367 -232 -263 -70 -157 -120 -36 -95 -264 -143 -295 99 377 -218 -14
3671 -14 -323 109 85 -135 -330 -246 288 -287 116 -176 -163 141 244 -41 -51 375 180 48 28 239 -104 269
3693 269 183 162 -94 80 -16 120 62 385 421 456 -223 23 161 179 -54 114 153 213 230 82 252 369 222
$$ packed form
3534d06QM28Q5l80l6N1q6L59m12K36J26K06l30mJ42n7j79L47k17q1L14J06%m31
3558b11J81J60j11PK3L96J9j94k95J1L16l93K75j20l2k43K97K23k8k4K12l22j8
3581A29L56l54O14m29Q7j71L42l66q1o9k66M88j44j79K60j91L46j12j1k45J36
3602A40K19k90qj45L78k77K4k8K72J63l98r3L7P0J7q0N1M7J27q3l01O6J39l15
3626b68L01k00J40p1L72n02j90M66k18j59J50o8k11N18n6j33l16J88K55l04J19
3647a87k94K88k6n0J0JJ4J05l83J55J35l1J93q7L7Q4n9j69J21j52L94K78n95K04
3671a4l09M32k4k20j95Q4N34n75M03k92J3L04J03k85j0M26j95j32k0K11l43L73
3693B69q6k1k56J74r6J36n8L23L6L5o79K46J38J8k33J68L9O0J7j48J70J17j47
$$ plain form
3716 222 403 319 -77 290 200 -6 58 113 170 253 -67 -33 534 407 123 -13 159 535 224 8 136 73 174
3739 174 311 115 189 54 -62 -73 -122 51 78 -157 -119 -93 120 137 -1 -57 -228 -255 -27 -41 266 -89 -101 -432
3763 -432 -194 -307 -592 -33 -203 -282 -338 -227 -265 -302 58 -133 -406 -149 -41 27 -140 -148 -208 -314 -194 -227 -473
3786 -473 -237 -321 -251 -259 -359 -41 -188 -194 -263 -173 -156 261 -110 -152 -90 -46 37 -321 -538 -6 -255 15 -190 -106 268
3811 268 187 348 -84 196 93 25 -138 186 207 71 242 -97 174 76 146 -13 61 316 69 -189 137 607
3833 607 33 228 70 99 245 425 346 346 -90 369 196 204 162 38 277 445 208 365 -348 -19 269 130
3855 130 72 24 425 179 20 -15 163 330 154 -138 123 373 1 177 124 152 -167 -28 -168 -85 -125 212
3877 212 17 -75 -84 90 26 -53 -43 213 -66 -122 -191 -83 64 109 -138 -14 -309 -42 32 -215 -218 -224 -5 -143 -92
$$ packed form
3716B22J81q4l96L67r0k06O4N5N7Q3l20L4N67j27k84j36J72L76l11k16J28o3J01
3739A74J37j96P4j35j16j1m9J73K7k35L8K6K13J7j38n6j71k7K28j4L07l55j2l31
3763d32K38j13k85N59j70p9n6J11l8l7L60j91k73K57J08O8j67qo0j06J20l3k46
3786d73K36q4P0qj00L18j47oo9R0J7M17l71m2O2M4Q3l58k17N32k49K70k05Q4L74
3811B68q1J61m32K80j03o8j63L24K1j36J71l39K71r8P0j59P4K55k47k58L26M70
3833F07n74J95j58K9J46J80p9%m36M59j73Qm2j24K39J68k37J57p13L29K88j39
3855A30n8m8M01k46j59l5J78J67j76k92K61K50l72J76n3K8l19J39j40Q3m0L37
3877B12j95r2rJ74o4p9J0K56k79n6o9J08J47M5k47J24k95K67P4k47loK19j38N1
$$ plain form
3902 -92 -214 -227 -479 -195 -503 -656 -222 -315 124 -454 -100 -26 326 -231 -293 181 -255 -27 -270 -117 99 53
3924 53 -64 -464 -51 89 148 -189 -189 -3 84 86 -79 75 343 254 -22 -129 -10 89 -27 -104 138 -130 42
3947 42 260 -411 390 61 196 204 -28 282 318 238 320 158 362 322 281 130 414 96 230 320 277 322 227 52
3971 52 -92 118 16 473 425 210 47 291 335 157 320 -122 364 -42 99 171 326 208 142 107 157 107 -51
3994 -51 327 72 -97 205 -56 158 -48 4 -81 212 -18 -17 -298 223 22 3 -100 -106 -64 -109 43 -42 -214 47
4018 47 -7 -389 63 45 118 -161 -366 -300 -2 -173 -21 -76 -126 -148 -7 -95 -190 -328 -167 -240 -53 -203 -278 -132
4042 -132 -115 -355 -266 -178 -83 -456 -43 -342 -70 -379 -396 -373 -269 198 -16 -145 6 -374 -80 -127 -210 -83 16
4065 16 -428 -81 -36 -165 -168 -240 -26 88 211 -211 -309 56 3 213 -124 -95 71 185 -34 373 384 74 325
$$ packed form
3902i2j22j3k52K84l08j53M34r3M39n78L54P4L52n57o2M74m36K28k43J53K16m6
3924E3j17m00M13J40N9l37%J86Q7Kj65J54K68q9k76j07J19R9j16p7K42k68J72
3947D2K18o71Q01l29J35Qk32L10L6q0Q2j62K04m0m1j51K84l18J34R0m3M5r5j75
3971E2j44K10j02M57m8k15j63K44M4j78J63m42M86m06J41P2J55j18o6l5N0n0j58
3994e1L78k55j69L02k61K14k06N2q5K93k30Jk81N21k01j9j03oM2m5J52q5j72K61
4018D7n4l82M52j8P3k79k05O6K98j71J52n5n0k2J41q8r5j38J61p3J87j50p5J46
4042a32J7k40Q9Q8R5l73M13k99K72l09j7K3J04M67k14j29J51l80K94m7q3J27R9
4065A6m44L47M5j29lp2K14J14J23m22r8L65n3K10l37K9J66J14k19M07J1l10K51
$$ plain form
4088 325 208 157 -237 226 160 362 142 83 147 342 98 248 80 92 215 240 345 51 268 138 184 122 51
4111 51 158 233 470 5 247 316 96 94 -61 114 152 269 -36 -187 108 300 -76 -41 152 114 304 136 -284
4134 -284 20 -24 95 79 62 73 -86 -14 9 -236 196 39 125 -152 -290 -40 3 -103 -81 159 -254 -490 172
4157 172 -478 29 102 -83 -659 -120 191 -512 -104 -195 -170 -247 -211 -203 -448 -238 -101 -59 -112 214 -139 -499 -150
4180 -150 -296 -85 70 -132 -2 140 45 2 91 -165 -409 -25 -75 114 -100 -135 -47 -161 5 14 -361 257 -38
4203 -38 55 -24 160 -117 464 318 -131 64 513 -20 21 109 67 114 324 -136 -144 344 270 125 62 205 52 344
4227 344 167 255 125 -24 298 -57 265 49 690 106 5 64 178 70 6 137 134 66 27 -187 -176 -218 96
4250 96 46 40 -63 335 175 -50 86 99 32 -79 64 86 300 234 71 23 -217 -77 38 -329 -333 -39 304 19
$$ packed form
4088C25j17n1l94M63o6K02k20n9O4J95k44J50j68J2J23K5J05k94K17j30M6o2p1
4111E1J07P5K37m65K42O9k20kj55J75L8J17l05j51K95J92l76L5J93l8J90j68m20
4134b84L04m4J19j6j7J1j59P2K3k45M32j57Q6k77j38K50M3j06K2K40m13k36O62
4157A72o50N07P3j85n76N39L11p03M08r1K5p7L6Qk45K10J37M2n3L26l53l60L49
4180a50j46K11J55k02J30J42r5m3Q9k56k44L84n0J89k14l5Q8j14J66Rl75O18k95
4203c8R3p9J84k77N81j46m49J95M49n33M1Q8m2M7K10m60qM88p4j45o3J43j53K92
4227C44j77Q8j30j49L22l55L22k16O41n84j01N9J14j08o4J31lo8l9k14J1m2L14
4250I6n0oj03L98j60k25J36J3o7j11J43K2K14o6j63m8k40J40J15l67mK94L43k85
$$ plain form
4274 19 -329 -442 -191 -90 -140 127 -19 -128 -84 -340 -203 -66 -28 75 -23 -21 -58 23 -414 -216 -104 -239 -107
4297 -107 131 -204 111 -21 8 -284 -236 -430 39 49 -125 -315 -281 22 -234 -452 -26 234 2 106 140 -193
4319 -193 -87 -318 -317 -107 -37 1 -150 -166 455 102 -51 138 -122 301 39 82 19 249 -340 52 299 -18
4341 -18 153 234 277 227 197 92 170 8 176 113 123 101 92 49 2 292 192 -217 -9 75 352 124 137 -48 279
4366 279 377 -15 548 239 96 7 13 -47 203 350 355 57 78 -53 -6 4 -41 7 -50 85 27 -183 -5 -186 18
4391 18 -195 -78 -112 50 -173 -64 179 -181 68 -88 69 -180 41 -40 9 -180 41 -442 -27 -38 -2 -226
4413 -226 260 166 -266 -281 -413 -108 -127 -293 -276 -212 -110 -288 121 -304 68 -100 -173 -119 -101 -247 59 -432 -252
4436 -252 -144 -240 4 -115 -104 -66 -15 -128 -27 -101 -132 125 -86 -39 -155 -305 -156 193 -48 -24 -103 -140 160
$$ packed form
4274A9l48j13K51J01n0K67j46j09M4k56J37J37L8J03r8Kl7Q1m37J98J12j35J32
4297a07K38l35L15j32K9k92M8j94M69J0j74j90L4L03k56k18M26K60k32J04L4l33
4319a93J06k31JK10P0L8j51j6O21l53j53J89k60M23k62M3o3K30n89L92K47l17
4341a8J71Q1M3n0l0j05P8j62J68o3J0k2rm3m7K90j00m09K08Q4K77k28J3j85L27
4366B79R8l92N63l09j43q9Oo0K50J47Nk98K1j31M7J0m5M8n7J35n8k10J78j81K04
4391A8k13J17l4J62k23J09K43l60K49j56J57k49K21q1M9j89K21m83M15j1L6k24
4413b26M86r4m32j5j32L05j9j66J7O4J02j78M09m25L72j68p3N4J8j46L06m91J80
4436b52J08r6K44j19J1L8N1j13J01p4l1K57k11M7j16j50J49L49k41K4p9l7L00
$$ plain form
4459 160 141 370 38 -304 46 43 -41 -17 -102 120 88 247 268 40 392 279 295 177 49 52 474 72 227 115
4483 115 219 283 244 62 140 229 5 391 -20 181 89 -178 -52 -227 -6 158 -13 -99 -32 -142 120 144 -90
4506 -90 75 116 136 293 -27 223 -29 160 112 10 -101 122 -150 160 -17 72 -165 -20 39 -214 -8 164
4528 164 -160 344 -398 51 -138 -157 -14 -319 -283 -204 -158 -183 -268 -271 -162 207 -189 355 -209 -416 -16 -189 -325
4551 -325 -50 -46 -70 -28 242 94 -158 -263 -56 -227 -245 -187 202 -231 -218 -199 -1 206 -92 128 -412 -174 -131
4574 -131 -85 220 419 -102 -31 -207 56 -79 42 -141 -118 -144 225 197 -95 124 63 207 36 26 13 6 401
4597 401 -226 140 76 106 89 35 136 28 56 304 104 346 99 -99 118 389 -12 30 303 82 355 106
4619 106 59 33 417 54 -79 -88 -87 304 210 -12 104 -61 288 -40 354 -26 -9 402 108 164 51 194 222
$$ packed form
4459A60j9K29l32l42L50lq4K4q5K22l2J59K1k28L52j13J6j18j28LM22m02J55j12
4483A15J04O4l9j82P8Q9k24L86m11K01r2k67J26j75K21J64j71q6O7j10K62K4k34
4506i0J65M1K0J57l20K50k52J89m8j02j11K23k72L10j77Q9k37J45N9k53K06J72
4528A64l24N04p42M49j89j9J43l05L6P9M6k5q5lJ09L69l96N44n64k07M00j73j36
4551c25K75Mk4M2K70j48k52j05K07j71j8N8L89m33J3J9J98K07k98K20n40K38M3
4574a31M6L05J99n21P1j76K63j35J21j83K3k6L69k8k92K19o1J44j71j0j3pL95
4597D01o27L66o4L0j7n4J01j08K8K48k00K42k47j98K17K71m01M2K73k21K73k49
4619A06m7k6L84l63j33rJL91r4k22J16j65L49l28L94l80J7M11k94N6j13J43K8
$$ plain form
4642 222 265 147 248 322 -281 100 23 415 -140 -54 151 -34 -13 -100 -42 -152 -138 44 8 -245 -97 -289 96
4665 96 -356 34 -200 -192 -299 -178 -61 -182 -125 -180 -183 -496 137 -48 -206 -170 -461 -376 1 -24 -76 -21 -301 194
4689 194 100 -302 108 -114 -336 -147 170 24 347 -309 -277 98 -282 -31 -246 -138 -18 184 162 159 139 -225
4711 -225 -131 -59 -315 -143 -92 165 157 -170 70 -147 -207 316 81 225 -89 230 -140 4 123 -171 114 177
4733 177 33 139 -325 81 464 154 298 390 -138 -10 88 284 226 231 108 274 256 289 283 439 153 -17 -28
4756 -28 6 -27 22 32 138 -2 294 205 280 34 79 28 30 72 -97 188 177 -89 -67 327 -126 22 -200 -300 -271
4781 -271 -103 275 -235 -144 184 -110 197 -66 -271 -187 306 -17 -60 -194 -64 189 143 -158 1 -336 -191
4802 -191 -259 -134 -50 120 34 -134 -59 -312 -241 90 -250 -244 -438 -47 -524 149 11 -318 -597 8 82 -608 195
$$ packed form
4642B22M3j18J01P4o03L81p7L92n55Q6K05j85K1q7N8j10J4J82l6k53J48j92L85
4665I6m52L90k34Qj07J21J17j21N7n5ll13O33j85j58L6k91Q5L77k5n2N5k80M95
4689A94r4m02M10k22k22J89L17j46L23o56L2L75l80K51k15J08J20K02k2lk0l64
4711b25R4P2k56J72N1K57ql27K40k17o0N23k35J44l14L19l70J44J19k94K85O3
4733A77j44J06m64M06L83l10J44R2n28J28R8J96n8Nj23J66j8L3oJ56k86j70j1
4756b8L4l3M9J0J06j40K96q9P5k46M5n1KM2j69K85j1k66K2L94m53J48k22j00K9
4781b71J68L78n10R1L28k94L07k63k05Q4M93l23m3j34J30K53m6l01J59l37J45
4802a91o8J25Q4J70q6j68P5k53P1L31l40Oj94L91m77O73j38l29k79O05P4o90Q03
$$ plain form
4825 195 77 246 -342 -55 -80 -19 29 -160 -255 67 -157 0 -1 305 -55 -265 75 41 -81 -26 75 -82 55
4848 55 223 -50 88 169 371 191 -48 -85 168 305 98 127 -11 343 168 142 -335 -55 69 -51 208 450
4870 450 -12 -121 345 370 13 260 366 226 -138 104 229 112 136 -118 91 218 13 -45 153 -95 379
4891 379 681 269 67 321 184 114 -247 42 158 148 13 -87 -180 77 342 -12 39 -118 279 56 35 -29
4913 -29 127 176 -37 -162 -96 -86 94 86 55 66 100 2 -167 -312 136 -117 -214 -232 -170 -175 131 91 -151 -37 -253
4938 -253 -277 93 -91 -351 -36 36 -8 -90 -4 93 -565 -148 -4 -39 -165 -209 113 -76 53 101 -270 124 88
4961 88 -62 -75 -183 317 -52 -250 14 -144 -56 -96 -143 -134 11 -89 106 513 74 -64 330 353 173 96 76
4984 76 -60 -35 -17 -46 -19 -105 302 483 23 129 -79 9 -125 178 150 -132 264 22 104 16 212 407 87
$$ packed form
4825A95j18J69n88K87k5O1M8j89r5L22k24J57jL06l60k10L40l4j22N5J01j57J37
4848E5J68k73J38Q1K02j80k39l7K53J37k07K9j38L54j75k6m77K80J24j20K59K42
4870D50m62j09M66K5l57K47J06j40l64K42J25j17K4k54K09J27k05n8J98k48M74
4891C79L02m12k02K54j37p0l61K89J16j0j35j00r3K57K65l54N1j57L97k23k1o4
4913b9J56M9k13j25O6J0J80ql1J1L4r8j69j45M48k53r7j8O2nL06m0k42J14k16
4938b53k4L70j84k60L15P2m4q2Q6R7o58M17J44l5j26m4L22j89J29M8l71L94l6
4961H8j50j3j08N00l69j98K64j58Q8m0m7RJ45j00J95M07m39j38L94K3j80p7k0
4984G6j36K5J8k9K7q6M07J81m60J06k08Q8j34L03k8k82L96k42Q2q8J96J95l20
$$ plain form
5007 87 -91 280 -102 -105 -35 -141 318 303 229 156 -140 28 -170 27 290 284 -133 -156 27 60 6 -12 -85 260 114
5032 114 5 -263 182 -52 -79 96 40 23 -117 -75 81 -39 135 100 -35 -273 -262 -110 -417 217 -2 -144
5054 -144 -248 -112 -74 -117 -156 131 -142 17 -218 -329 -314 -352 -330 -345 -327 -87 3 132 -207 90 109 -155 -448
5077 -448 -402 -14 313 -105 -153 129 -52 -111 -186 -231 -46 -46 216 -289 -200 -57 -76 263 2 -85 107 -48 92
5100 92 -94 -27 -122 -31 155 -5 307 -90 -32 55 148 280 92 62 -117 185 155 -18 185 88 206 233 -171 141
5124 141 211 54 322 64 107 58 253 -175 -6 -185 -77 138 -49 42 131 96 -134 93 437 376 123 190 -193
5147 -193 93 -71 -48 176 260 -173 -119 -89 167 -80 -149 -258 100 29 245 12 -25 242 95 32 198 86 137
5170 137 269 -320 222 128 -12 100 33 19 -14 94 80 -49 3 -234 3 -86 -171 -63 -163 -194 49 -6 -164
$$ packed form
5007H7j78L71l82lP0j06M59j5p4p3k96J68j98J97K63om17k3J83L3n4j8p3L45j46
5032A14j09k68M45k34k7J75n6j7j40M2J56j20J74l5j35k38J1J52l07O34k19j42
5054a44j04J36L8m3l9K87k73J59k35j11J5l8K2j5J8K40R0J29l39K97J9k64k93
5077d48M6L88L27m18m8K82j81n9p5m5J85%K62n05Q9J43j9L39k61q7J92j55J40
5100I2j86O7r5R1J86j60L12l97N8Q7R3J32j88l0j79L02l0j73K03r7J18K7m04L12
5124A41P0j57K68k58M3m9J95m28J69j79J08K15j87R1Q9l5k30K27L44o1k53O7l83
5147a93K86j64K3K24Q4m33N4L0K56k47o9j09L58p1K16k33l7K67j47o3J66j12N1
5170A37J32n89N42r4j40J12o7j4l3J08j4j29N2k37K37q9q5J08j00l1K43n5j58
$$ plain form
5193 -164 -245 180 -1 156 68 -282 -485 -113 -168 6 100 -287 -309 -117 -210 -111 58 110 93 -12 -399 49 -70
5216 -70 -274 -238 203 -51 -240 -44 -177 128 -213 20 194 -85 144 -56 111 477 -178 213 213 68 -172
5237 -172 -195 -27 -21 55 111 -115 -12 -175 120 406 -106 -75 69 306 418 232 551 196 -1 38 219 -30
5259 -30 296 120 -237 117 35 185 -116 67 -51 144 178 165 71 2 188 -97 -2 22 84 135 20 -123 63
5282 63 256 272 -101 -217 -74 0 -75 16 127 247 49 134 -27 72 45 7 -340 -68 58 -45 -178 19 -182
5305 -182 -181 71 32 21 -413 141 -86 118 59 -171 79 147 -39 41 22 -301 43 127 -177 28 138 -169 -240
5328 -240 -117 51 -240 -24 -142 -40 39 -127 -5 -480 24 83 73 -123 -174 92 -65 -149 52 -44 -183 36
5350 36 -282 -106 -72 109 -21 -242 175 -126 79 34 10 -228 189 237 345 244 60 311 -172 -329 198 140
$$ packed form
5193a64q1M25j81J57q8l50k03L72n5J74R4l87k2J92r3R9J69N2j7j05l87M48j19
5216g0k04L6M41k54j89J96j33L05l41K33J74k79K29k00J67L66o55L91%j45k40
5237a72k3J68OP6N6k26J03j63K95K86n12L1J44K37J12j86L19l55j97L9J81k49
5259c0L26j76l57L54q2J50l01J83j18J95L4j3r4o9J86k85R5K4O2N1j15j43J86
5282F3J93J6l73j16J43P4p5R1J11J20j98Q5j61R9k7l8l47K72J26j03j33J97k01
5305a82JK52l9j1m34N54k27K04n9k30K50O8j86Q0j9l23L44Q4l04K05J10l07p1
5328b40J23J68k91K16j18J02P9j66J22m75N04N9j0j96n1K66j57q4K01r6j39K19
5350C6l18J76L4J81j30k21M17l01K05m5k4k38M17M8J08j01j84K51m83j57N27n8
$$ plain form
5372 140 39 123 86 -232 -16 145 128 -123 57 268 188 254 127 8 -102 393 10 82 164 222 -102 284 189
5395 189 325 176 -142 -272 364 338 12 355 -205 86 219 -362 -91 -224 -1 -55 -73 117 39 -117 -7
5416 -7 -118 235 -133 193 100 -16 -140 10 -113 -334 130 140 -42 5 52 -122 128 126 -183 -157 -97 -105 134 -71
5440 -71 6 269 -107 -187 -189 -269 -112 -200 -223 -114 -124 19 31 -56 -133 -96 -119 -223 -115 -59 -204 -327 1 158 -72
5465 -72 -286 -200 20 105 -92 -37 78 -160 -92 -43 91 -33 51 -22 111 259 -39 84 -160 -41 -195 -30 -174
5488 -174 19 238 -56 258 200 144 -37 -221 392 186 44 -85 7 117 107 58 -3 114 131 306 -20 212
5510 212 34 142 34 40 107 -67 -91 251 -112 118 7 57 495 -169 147 -53 130 -22 220 -145 -176 -143
5532 -143 58 59 -257 -267 56 -97 -87 366 -197 24 84 -18 40 -143 224 -364 -2 -201 190 187 134 -330 -41
$$ packed form
5372A40j01Q4l7l18K16J61j7k51J80K11q0O6j27j19j10M95l83P2Q2N8l24L86r5
5395A89J36j49l18j30O36k6l26L43n60K91J33n81K71j33K23n4j8J90p8j56J10
5416gj11L53l68L26r3j16j24J50j23k21M64J0j82M7M7j74K50kl09K6O0qK39k05
5440g1P7K63l76q0kq0J57q8k3J09j0J43J2q7p7L7k3j04J08N6j45j23L28J57k30
5465g2k14Q6K20Q5j97N5J15k38O8M9J34j24Q4p3J33J48k98J23k44J19j54J65j44
5488a74J93K19k94L14n8n6j81j84O13k06j42j29R2J10j0m9o1J17J7J75l26K32
5510B12j78J08j08OO7j74k4L42l63K30j11N0M38o64L16k00J83j52K42l65l1L3
5532a43K01Jl16j0L23j53J0M53n63K21O0j02N8j83L67n88L62j99L91ln3m64K89
$$ plain form
5555 -41 41 -219 233 -88 106 -166 1 106 -253 200 -79 -168 78 -147 99 -163 19 -41 -83 -369 -56 25
5577 25 224 -213 -135 -192 -63 -142 -290 22 -130 -84 -318 184 57 -124 -111 -138 125 37 -195 -162 -116 -173 -217 -293
5601 -293 -42 -441 -174 1 16 -112 -195 146 -199 295 -207 193 -258 240 -164 64 37 108 -243 -70 -126 245
5623 245 173 122 15 -98 -264 -56 101 -141 -44 293 -144 -91 33 170 62 -121 104 -49 258 -352 -32
5644 -32 238 77 -230 30 -121 -208 -36 63 82 121 -176 145 -123 -245 147 201 102 202 -31 93 112 0 24
5667 24 -103 -22 130 -116 29 33 -66 19 -48 -130 -67 230 -180 86 -72 -16 108 -61 143 -16 -169 -259 -152 -129
5691 -129 -356 29 -95 -625 144 -211 -72 37 -160 -364 -4 62 -124 -34 -277 -167 -114 -74 -280 -308 -137 -17
5713 -17 -9 54 -89 -239 50 -5 -389 -26 85 -95 -60 -147 55 204 -234 -71 -96 -27 -102 -188 -123 278 111 -59
$$ packed form
5555d1Q2k60M52l21J94k72J67J05l59M53k79q9K46k25K46k62J82o0m2k86L13Q1
5577B5J99m37P8n7J29p9j48L12j52M6k34N02j27j81J3k7K63q8k32L3M6n7m4p6
5601b93K51l99K67J75J5j28q3L41l45M94n02M00m51M98m04K28k7P1l51J73n6L71
5623B45p2n1j07j13j66K08J57k42R7L37m37N3J24J37j08j83K25j53L07o10L20
5644c2K70j61l07K60j51q7J72R9J9L9k97L21k68j22L92N4r9J00k33J24J9j12K4
5667B4j27Q1J52k46J45Mr9Q5o7q2O3K97m10K66j58N6J24j69K04j59j53r0J07K3
5691a29k27L85j24n30P69l55J39J09j97k04L60O6j86R0k43J10N3M0k06k8J71J20
5713a7QO3j43j50K89n5l84L63J11j80L5q7K02J49m38J63k5O9p5q6O5M01j67j70
$$ plain form
5737 -59 22 -170 311 150 277 -358 108 76 14 -185 22 -14 25 -55 -306 -43 -64 53 -71 87 -69 -212 -78
5760 -78 235 42 35 31 282 25 -84 184 223 241 43 -32 506 53 53 -257 336 72 331 -104 28 115 -233 107
5784 107 -33 120 177 227 8 -131 172 -167 3 0 -69 108 253 -48 228 -45 10 318 119 90 -96 -282
5806 -282 20 -220 -72 160 -96 -202 -39 -117 -263 307 -249 -32 147 67 -8 4 -167 -23 7 -309 146 4
5828 4 48 119 -26 73 20 -127 123 -296 30 -47 166 54 -223 -135 44 -94 -330 16 128 -317 -228 -247 165
5851 165 -284 -50 103 -116 54 121 13 73 124 -198 131 -120 213 -157 -234 -75 -12 317 -147 40 234 111
5873 111 116 34 -179 31 -138 -153 92 140 -3 131 299 174 92 36 151 49 19 -49 105 17 -235 209 219 169
5897 169 221 -17 21 237 104 -265 239 4 -91 137 -72 -47 193 451 132 112 18 78 15 -39 240 88 105
$$ packed form
5737e9Q1j92M81j61J27o35M66l2o2j99K07l6L9q0k51K63k1J17j24J58j56j43J34
5760g8L13j93pmK51k57j09K68L9J8j98p5N38m53%l10N93k64K59m35J32Q7l48L40
5784A07j40J53N7N0k19j39L03l39J70lo9J77J45l01K76k73N5L08j99k9j86j86
5806b82L02k40J48K32k56j06J63p8j46N70n56K17J79q0p5J2j71J44L0l16M55j42
5828DM4P1j45R9n3j47K50m19L26p7K13j12k77Q8J79j38k36L46J12m45Q9j9M12
5851A65m49K34J53k19J70O7j08O0N1l22L29k51L33l70p7J59O3L29m64J87J94j23
5873A11Nq2k13K10j69j5K45M8j43J34J68j25q2n6J15j02l0o8J54q8k52M44J0n0
5897A69N2k38L8K16j33l69N04k35r5K28k09K5K40K58l19k0r4O0o3n4K79j52J7
$$ plain form
5920 105 161 66 78 146 94 23 203 -138 17 -209 121 -23 18 30 -253 289 -147 -65 88 189 -72 -88 -262
5943 -262 -49 -170 -154 -11 -64 -323 -109 87 -72 129 210 -71 183 -106 -50 -197 -300 -177 -34 11 -313 -246
5965 -246 -65 -223 -138 -6 -520 -41 -67 -262 262 8 -154 203 -200 -203 -336 46 -64 -41 9 1 67 -134 -164
5988 -164 218 -143 91 -25 -140 -157 152 280 -157 -145 126 214 39 71 -6 49 -332 -54 162 108 56 56 -132
6011 -132 213 -18 -46 4 202 -89 120 -13 195 206 14 3 69 -83 -195 -71 113 162 -178 226 100 102 129
6034 129 -62 402 66 -65 -128 -53 -266 112 35 -98 -342 -5 82 -195 5 -73 283 189 -11 -26 -39 13 -115
6057 -115 72 -192 -248 293 236 -241 -208 -221 -125 53 41 -373 -428 88 76 304 -55 -89 144 68 -124 -200 -359 -48
6081 -48 -208 -48 68 -104 118 64 -263 169 100 241 -243 -58 -143 112 -269 -138 142 97 -180 -85 131 -80
$$ packed form
5920A05N6r5J2O8n2p1J80l41J55k26L30j44M1J2k83N42m36Q2J53J01k61j6j74
5943b62K13j21J6J43n3k59K14J96j59K01Q1k81K54k89N6j47j03J23J43M5l24O7
5965b46J81j58Q5J32n14M79k6j95N24k54j62L57m03lj33L82j10K3N0qO6k01l0
5988a64L82l61K34j16j15j7L09J28m37J2K71Q8j75L2p7N5l81K78K16n4n2%j88
6011a32L45k31k8N0J98k91K09j33K08J1j92j1O6j52j12J24J84M9l40M04j26KK7
6034A29j91M64l36j31o3P5k13L78p7j33k44L37Q7k77K00p8L56r4k00j5j3N2j28
6057a15J87k64n6N41n7m77L3j3R6J78j2m14n5N16j2K28l59l4K33p6j92p6j59L11
6081d8j60J60J16j72K22n4l27M32o9J41m84J85q5K55l81J31K80m5k77R5K16k11
$$ plain form
6103 -80 -135 32 78 340 -255 84 -157 -231 75 -236 83 -147 92 -188 70 232 31 54 -27 -14 -163 13
6125 13 -215 -188 38 3 -201 143 49 223 137 212 25 108 44 25 -40 6 1 -117 59 15 23 -187 50 26 -173 26
6151 26 290 86 419 -83 -160 -89 -51 119 -115 67 117 -243 -226 12 69 26 61 86 118 48 -78 75 -100 -206
6175 -206 -146 -84 -24 -51 -75 31 65 6 -13 272 90 -318 199 96 -79 53 24 -174 31 -170 -27 -153 -292
6198 -292 -126 -281 -192 146 23 138 -135 -215 44 173 84 -134 -145 -3 66 21 -93 -181 -122 -65 -8 -153 -73 155
6222 155 -2 -194 -60 -72 -179 -191 -47 -6 -123 92 121 -78 -47 -158 -90 -27 51 -257 -383 -161 4 -69 -233
6245 -233 -288 -98 -15 -108 -38 210 -333 -71 -81 -124 -15 170 -155 -80 5 45 74 -149 148 -76 46 -313 35
6268 35 134 143 -174 111 24 59 -52 -32 -212 132 70 51 -23 53 30 -67 352 -5 171 113 -66 114 5 -100 -108
$$ packed form
6103h0n5J67M6K62n95L39k41p4L06l11L19k30K39k80K58J62k01K3q1J3j49J76
6125A3k28K7K26l5k04L44r4J74q6P5j87Q3o4j9o5M6nj18J76m4Qk10K37k4j99J99
6151B6K64k04L33n02p7P1L8J70k34J82N0l60J7K38N7m3L5K5L2p0j26J53j75j06
6175b06O0O2O0k7k4J06L4n9j9K85j82m08N17j03j75J32k9j98K05k01J43j26j39
6198b92J66j55Q9L38j23J15k73q0K59J29q9k18j1J42O9m5j14q8N9N7N7j45Q0K28
6222A55j57j92J34j2j07j2J44M1j17K15K9j99L1j11O8O3P8l08j26K22J65p3j64
6245b33n5J90Q3r3P0K48n43K62j0m3J09J85l25P5Q5M0K9k23K97k24J22l59L48
6268C5R9Rl17K85q7L5j11K0j80L44o2j9p4P6k3r7M19l57J76n8j79J80j09j05q
$$ plain form
6293 -108 72 25 244 175 276 -62 -120 80 -116 -121 199 144 -35 -55 30 297 -99 91 89 91 142 -44 -139 -129 -100
6318 -100 103 -164 -15 -203 339 75 -207 -182 233 -166 -219 82 256 44 138 77 -9 6 -164 164 -183 102
6340 102 -268 -174 -111 -61 -467 -288 139 -93 -92 -116 -217 -198 106 -25 -393 220 -153 162 194 -238 36 -105 -155
6363 -155 -38 0 125 178 23 -158 57 126 -12 -79 194 49 167 317 139 146 -302 -186 31 -76 -67 291 365
6386 365 42 286 -22 -21 113 263 119 -149 141 -29 -46 75 -287 137 -184 205 89 -72 -6 -143 -180 117
6408 117 222 149 -186 -36 207 -91 -8 75 -66 268 82 123 228 129 96 283 93 -164 -7 -234 26 -250
6430 -250 -132 71 -177 213 124 83 96 -356 215 61 -197 -24 119 39 158 -41 367 217 -269 -69 -100 121
6452 121 -93 59 45 -141 5 -51 -91 -141 40 -55 179 250 -189 -184 6 -59 -97 106 -81 182 -575 -30 -151
$$ packed form
6293a08J80m7K19o9J01l38n8K00j96nL20n5j79k0Q5K67l96J90kKN1j86r5J0K9
6318a00K03k67J49j88N42k64k82K5M15l99n3L01J74k12R4o1q6J5j70L28l47K85
6340A02l70R4O3N0m06J79M27k32Jk4j01J9L04j31l68O13l73L15L2m32K74j41n0
6363a55J17L8J25N3j55j81K15O9j38o7K73j45J18J50j78Pm48J16K17j07RL58P4
6386C65l23K44l08JJ34J50j44k68K90j70j7J21l62M24l21L89j16j61O6j37l7K97
6408A17J05p3l35J50K43k98Q3Q3j41L34j86M1J05r9l3J87j90k57J57k27K60k76
6430b50J18K03k48L90q9m1J3m52N71j54k58J73J43q0J19j99M08j50m86K00l1K21
6452A21k14J52j4j86J46n6m0n0J81r5K34P1m39NJ90o5l8K03j87K63p57N45j21
$$ plain form
6475 -151 -6 -53 60 92 -44 -23 34 -458 164 -16 -53 70 -12 -152 284 -182 -315 117 -42 50 -41 -113 -194
6498 -194 -231 76 -80 74 30 174 22 63 -168 168 106 -332 145 19 -77 70 -7 112 67 -27 89 205 145
6521 145 26 -349 -322 -176 94 79 -22 -13 -251 -78 319 -78 -14 251 -208 280 -87 -166 -138 -217 242 -138 252
6544 252 172 243 -104 83 17 -74 184 -103 -119 -248 -232 -37 -10 -83 -8 66 287 78 367 78 -31 31 64 -12
6568 -12 -27 156 41 119 -61 -161 -86 -114 -100 81 -159 -71 78 3 -329 -146 93 -152 18 58 -31 -36 -95 -16 -115
6593 -115 98 168 -155 82 -210 -20 -40 -77 -458 224 4 28 -118 123 68 44 101 -3 28 137 -58 -149 89
6616 89 -323 -298 -92 -12 -35 97 -212 -67 164 50 -153 48 74 -140 20 -72 64 -124 -238 178 246 44
6638 44 64 -124 -15 132 -159 -84 128 -10 169 -7 -10 49 141 17 -144 -87 -16 -234 -49 235 127 -49 -235
$$ packed form
6475a51J45m7J13L2j36K1N7m92O22j80l7J23q2j40M36m66j33M32j59R2r1p2q1
6498a94l7L07j56J54m4J44j52M1k31L36o2m38M77j26r6J47p7J19m5r4J16J16o0
6521A45j19l75K7J46K70j5j01Rk38J73L97l97O4K65m59M88l67p9K8p9M59l80L90
6544B52q0P1l47J87o6r1K58k87j6j29J6J95K7p3P5P4K21k09K89k89j09O2L3p6
6568a2j5J83j15P8j80j00P5k8J4J81k40Q8J49p5l32J83K39k45J70M0q9nn9P9r9
6593a15K13P0l23K37k92J90k0l7l81O82k20K4j46K41n5k4N7j04L1J09j95r1K38
6616H9m12K5K06Q0k3J32l09J45K31j14k03K01K6k14J60r2J36j88j14M16O8k02
6638D4K0j88J09J47k91P5K12j38J79j76lN9R2j24j61N7P1k18J85K84j08j76j86
$$ plain form
6661 -235 -188 -30 121 -4 -238 161 559 274 -136 -242 -15 363 -91 185 76 -11 70 -38 217 -112 294
6682 294 -44 -274 -35 -38 37 -29 -259 -71 -67 -189 -61 -78 180 297 330 210 99 -138 66 169 18 -155 112
6705 112 -89 66 -107 -289 -21 -208 -4 -187 58 145 34 -106 -163 258 152 181 47 -41 -42 370 -21 -231
6727 -231 86 -156 -106 324 -230 -100 56 76 -284 26 133 146 329 136 -67 36 58 -209 -130 6 -1 -3 -59
6750 -59 269 -43 -128 -46 -42 -24 206 11 -111 -325 151 303 -114 -31 -237 229 117 98 22 141 -79 -117 -2
6773 -2 -72 -1 20 -71 222 -80 -148 62 184 170 104 -67 -158 17 322 -134 -239 -82 247 222 226 -69 388 -32
6797 -32 -156 -53 -26 265 297 140 84 366 156 66 -143 181 50 -165 207 225 146 10 -48 123 73 -290 312
6820 312 146 272 -23 145 107 -79 93 -8 -396 391 185 -21 -24 -128 -162 -119 123 -48 309 -135 106 -53
$$ packed form
6661b35M7J58J51j25k34L99L98k85m10j06K27L78m54K76j09q7Q1j08K55l29M06
6682B94l38k30K39lP5o6k30J88Mj22J28j7K58J17L3j20j11k37K04J03j51j73K67
6705A12k01J55j73j82K68j87K04j83K45Q7j11j40n7M21j06K9j34q8jM12l91k10
6727b31L17k42N0M30n54J30J56K0l60L10J07J3J83j93k03J03K2k67P9J36pkn6
6750e9L28l12q5Q2MJ8K30j95j22k14M76J52m17Q3k06M66j12j9p6J19k20l8J15
6773bp0P1K1r1K93l02o8K10J22j4o6j71r1J75L05m56j05J57L29k5Mk95M57m20
6797c2j24J03K7K91L2j57n6K82k10r0k09L24j31k15L72J8p9j36n8J71n0l63O02
6820C12j66J26k95J68l8j86J72j01l88P87k06k06lj04l4M3K42j71L57m44K41j59
$$ plain form
6842 -53 -149 -40 239 29 35 133 30 313 59 80 -404 -157 115 36 -127 2 -159 87 -37 -45 100 -230 -118
6865 -118 -127 -17 -337 -103 -286 -185 -483 -147 -176 80 -33 -202 -11 155 -41 -126 66 -62 -51 -247 -97 307
6887 307 1 -17 -87 35 85 -147 66 37 0 262 37 6 -119 -10 17 -117 69 35 165 285 23 343 -108
6910 -108 68 149 175 -11 51 31 131 250 184 100 357 -16 -226 -4 195 -140 106 95 -115 286 118 208 186
6933 186 126 12 270 127 76 248 155 223 266 -310 279 -94 169 183 -46 -89 15 115 95 322 191 -142 -239
6956 -239 -126 -486 30 -6 135 186 29 3 -38 -162 68 54 -77 -120 -9 121 53 22 -68 150 -279 -147 -135
6979 -135 -98 216 272 -186 -282 -27 -142 46 -8 -310 247 53 -147 -117 59 57 -104 -208 61 12 259 337 -219
7002 -219 84 170 -61 132 -270 33 -222 -21 183 112 72 -254 261 360 -49 16 234 427 43 -316 -188 30
$$ packed form
6842e3r6J09K79k10OR8j03K83k54K1m84K47K72p9j63J29j61K46j24qJ45l30J12
6865a18rJ10l20K34j83J01k98L36k9K56j13j69J91J66j96q5J92j28J1j96J50M04
6887C07l06j8p0J22N0k32K13k9l7K62k25l1j25J09K7j34J86l4J30J20k62L20m51
6910a08J76Q1K6j86O2k0J00J19o6q4K57l73k10K22J99l35K46j1k10M01j68R0k2
6933A86o0j14K58j43n1J72r3O8M3n76N89l73K63J4k29m3J04J00k0K27j31l33r7
6956b39J13l60N16l6J41N1j57k6m1j24K30j4j31m3J11J30o8l1r0K18m29J32J2
6979a35L7L14N6m58r6K55j15J88n4l02N57j94k00L0J76kj61j04K69m9K47P8n56
7002b19L03Q6k31J93m02L03k55K01K04p1m0l26N15R9m09O5K18J93l84l59J28K18
$$ plain form
7024 30 210 92 218 -263 -299 209 -98 -114 -139 -132 235 93 18 -53 -213 183 10 -38 -190 5 -15 231 -67
7047 -67 56 -143 66 -64 -104 157 -236 -5 105 347 145 260 94 -3 -94 105 -49 -121 228 199 212 -432
7069 -432 152 222 33 -72 -172 -34 40 146 -199 -7 227 -128 3 276 175 102 -52 -63 94 -18 85
7090 85 266 -131 -12 -22 -104 419 47 70 134 94 -302 -22 159 -82 -200 -209 -132 -140 262 -81 -162 -89 4 -19 -104
7115 -104 -120 -14 -168 217 59 -188 328 -244 101 -351 48 -9 -54 135 46 -78 -245 -110 98 1 56 -83
7137 -83 -180 -91 180 -68 103 101 101 -100 81 311 59 -37 -201 121 71 409 -79 118 238 11 30 36 -56 95
7161 95 144 -228 -253 -117 144 -17 54 -8 71 30 -135 -74 -1 -170 194 -17 37 -322 -71 359 -16 174 -229
7184 -229 -44 -143 -57 -34 87 105 -96 -12 -334 -182 -217 185 -143 333 187 57 -219 -46 -74 360 0 -120
$$ packed form
7024C0J80j18J26m81l6N08l07j6k5PL67j42p5p1j60L96j73m8j52J95k0K46k98
7047f7J23j99K09j30m0K61l93K31J10K42k02J15j66r7r1J99j54p2L49k9J3o44
7069d32N84P0j89j05j00J38P4J06l45J92K34l55J31K73j01p3j54j1J57j12J03
7090H5J81l97J19j0q2N23l72K3O4m0l96K80J81k41j18rP7qM02l43q1P3R3k3q5
7115a04j6J06j54L85j58k47N16n72L45m52L99n7m5J89q9j24j67J35K08r7N5j39
7137h3r7Q9K71k48J71k%k01J81K30k52r6j64L22n0L38m88J97J20k27J9Or2J51
7161I5M9l72k5J36K61j61P1o2P9m1j65O1P3j69L64k11N4l59K51M30l75J90m03
7184b29J85r9Q6K3J21J8k01Q4l22J52l5M02l28M76j46j30k76J73k8M34l60j20
$$ plain form
7206 -120 120 296 -47 -157 -180 -191 105 35 175 -219 -5 50 281 123 281 118 -4 45 95 95 -42 -295 37
7229 37 138 -126 108 -63 -101 -458 -106 -29 0 14 60 189 -7 -225 118 130 49 97 37 261 -25 146 94 21
7253 21 12 -51 21 132 239 23 151 235 53 -220 -8 -134 -87 92 92 327 172 280 -64 90 54 182 124 311
7277 311 139 51 -4 157 -29 46 -129 -63 -150 -15 16 194 -123 339 80 146 42 -8 226 74 43 -35 47 -2
7301 -2 -77 195 109 356 73 49 -44 61 110 170 -52 -160 27 253 24 -149 106 223 -169 -76 19 116 -134 -409
7325 -409 88 -61 -16 -201 -33 72 39 -209 -102 259 78 -45 120 -127 -4 56 -37 165 -85 47 -525
7346 -525 76 -17 134 -22 150 201 -189 -200 -99 80 86 161 -12 226 -94 -11 309 -74 -87 73 -123 131 143
7369 143 -39 -133 -82 -93 231 -141 -352 -6 20 18 -65 197 -54 200 83 -175 26 112 -120 -61 215 -172 100
$$ packed form
7206a20K40J76l43j10k3j1K96p0J40l94K14N5K31j58J58j63j22M9N0%j37k53L32
7229C7J01k64K34j71l8l57L52P7K9J4M6J29j96k18L43J2q1M8o0K24k86J71n2p3
7253B1ro3P2J11J07k16J28Q4j82k73K12j26M7J79%K35j55J08l44J54l6J28n8J87
7277C11j72q8n5J61j86P5j75O6q7J35L1J78l17M62k59O6j04n0K34j52l1p8Q2m9
7301bp5K72q6K47k83k4r3J05M9O0k22j08J87K26k29j73K55J17l92R3R5R7k50k75
7325d09M97j49M5j85J68J05l3k48J07L61j81j23J65k47J23O0r3K02k50J32n72
7346e25O01r3J51j56J72N1l90j1J01J79OP5j73K38l20Q3L20l83j3J60j96K54J2
7369A43j82r4N1j1L24l72k11L46K6kq3K62k51K54j17k58K01Q6k32N9K76l87K72
$$ plain form
7392 100 134 -122 31 -234 13 -210 -40 -43 123 70 51 173 -32 268 -51 -29 -130 -212 92 89 -53 141 -46
7415 -46 232 -220 81 -70 76 166 -106 -7 -162 172 -87 -127 252 -172 -127 102 -136 -46 49 232 104 -309
7437 -309 219 38 -161 99 145 207 -165 172 -124 211 256 -270 36 119 -221 -112 78 -42 -164 89 11 -20
7459 -20 -14 -127 -112 1 -52 -288 -24 -67 239 -65 -11 -391 -167 -75 -79 108 256 160 49 197 -25 139 4 -363
7483 -363 66 -31 -47 -148 138 -58 72 23 13 62 -166 297 221 343 113 -16 -182 -154 141 -109 -173 -138 -97
7506 -97 -209 -16 94 -125 -305 -214 150 -154 142 -70 85 -96 -115 28 181 95 -243 -102 -45 -80 -34 39 161
7529 161 -50 -167 58 -242 -114 35 -129 93 -117 43 1 -196 -186 -95 -214 141 24 84 -83 -57 179 39
7551 39 161 -68 -144 93 27 -139 142 100 122 -141 177 -57 86 343 72 27 162 6 84 151 -92 -145 95
$$ packed form
7392A00L4k56J53k65K47k23J70lJ66n3j9J22k05L00l19K2j01q2L04lj42J94j87
7415d6K78m52L01j51J46R0k72R9j55L34k59m0L79m24M5K29k38R0R5J83j28m13
7437c09N28j81j99K60M6O2l72L37k96L35M5n26L06Q3l40J09J90j20j22K53p8l1
7459b0Oj13J5J13n3k36K64m3L06l04N4l80K24R2mJ87J48r6j11J48k22J64j35l67
7483c63M29r7j6j01K86j96J30m9j0M9k28M63p6J22k30j29j66K8K95k50o4L5M1
7506i7j12J93J10k19j80R1L64l04K96k12J55j81j9J43J53q6l38J41N7l5M6P3J22
7529A61k11j17K25l00J28J49j64K22k10J60m2j97J0R1j19L55j17O0j67K6K36j40
7551C9J22k29p6K37o6j66K81m2K2k63L18k34J43K57k71m5J35j56P8O7k43n3K40
$$ plain form
7574 95 48 78 -73 -58 -5 -168 -7 15 72 -288 186 0 -145 -34 193 -142 -192 -1 -122 129 -181 103 -26
7597 -26 -41 190 323 -96 188 -165 -187 158 66 36 135 -158 -177 -206 81 132 31 83 -215 195 101 202 66 14
7621 14 76 132 207 -301 20 131 -4 -288 -104 -348 -340 -105 -64 36 -57 26 107 -281 47 -287 -101 185 -39
7644 -39 -85 -164 74 5 343 -462 80 160 -147 98 116 -38 -124 1 -21 9 -87 -123 43 -146 193 -54 -143 -20
7668 -20 -230 78 -55 -65 12 -79 15 256 188 19 169 129 -255 -113 26 -11 265 84 419 4 79 -111 -37
7691 -37 -374 -97 223 110 141 94 214 -26 -2 288 -28 183 -32 79 102 -163 154 178 225 -82 163 52
7713 52 -70 -231 57 154 181 64 6 74 -92 70 -16 11 97 -217 166 -87 85 103 276 19 409 -129 27
7736 27 -158 226 365 -273 87 49 219 64 -91 288 78 -382 146 -200 -58 -287 237 -201 68 163 11
$$ packed form
7574I5m7L0j51J5N3j63J61K2N7l60M74j86j45J11K27l35n0J91j21K51l10K84j29
7597b6j5K31J33m19K84l53k2L45r2l0R9k93j9k9K87N1j01N2k98M10r4J01j36n2
7621A4O2N6P5n08L21J11j35k84J84k44QK35M1J00r3Q3Q1l88L28l34J86K86k24
7644c9m6p9K38o9L38q05N42Q0l07K45J8j54q6J25k2L0r6l6J66j89L39k47q9J23
7668b0k10L08j33j0P7r1R4K41o8j69J50m0l84J42J39l7K76j81L35m15P5j90P4
7691c7l37K77L20j13L1m7J20k40K4K90l16K11k15J11K3k65L17K4M7l07K45j11
7713E2j22j61K88R7K7j17n8O8j66J62q6K7Q6l14L83k53J72J8J73k57L90n38J56
7736B7j85L84J39o38L60l8J70j55j55L79k10m60N28l46J42k29N24m38K69R5j52
$$ plain form
7757 11 -301 -31 20 -308 70 -106 26 -33 -263 -279 -245 -417 -157 214 -233 98 74 -63 -130 -79 -242 -69 1
7780 1 -77 -64 1 -161 234 171 157 -81 -41 167 42 -135 -31 54 -44 41 -45 -58 119 250 66 -141 -35 127
7804 127 -187 32 -76 -61 -80 67 -121 105 79 -193 -148 -37 21 -141 -95 105 242 -67 23 302 -123 -177 -56
7827 -56 251 -50 -153 50 113 -174 -305 -143 -353 32 2 61 55 -223 -37 104 0 165 -112 -31 -14 115 -61
7850 -61 -298 -9 100 -249 48 -290 -207 -58 486 179 -4 62 92 181 44 163 -76 88 -437 53 -197 -56
7872 -56 109 -4 -233 76 -264 256 78 -199 75 -168 -99 -345 -213 24 -140 23 -347 -9 -108 27 112
7893 112 -187 -18 270 108 -85 -98 44 -212 -108 -145 -326 65 153 -47 -113 5 194 61 -288 -104 183
7914 183 -205 157 -287 -60 205 71 -23 -260 -68 75 -78 372 -131 321 215 153 -149 126 93 -29 7
$$ packed form
7757A1l12K70N1l28L78j76J32n9k30j6L4j72K60L71m47L31k4j37o7N1j63J73P0
7780Ap8J3O5j62L95o3j4k38M0K08j25j77J04Q5r8Q5q6j3J77J31j84k07J06J62
7804A27l14K19j08J5j9J47j88K26k6k72M5J11N8j62M6K00J37l09R0K79m25n4J21
7827e6L07l01j03K03O3k87j31J62k10L85l0N9ok78J86J41j04J65k77Q1J7J29j76
7850f1k37K89J09l49K97l38Q3J49N44l07j83O6L0Q9j37J19k39J64n25M90k50J41
7872e6J65j13k29L09l40N20j78k77K74k43O9k46J32K37j64J63l70L38r9J35Q5
7893A12k99J69K88j62j93j3J42k56J04l7j81L91Q8k00o6J18J89j33l49J84K87
7914A83l88L62m44K27K65j34r4k37J92J43j53M50n03M52j06o2l02K75l3j22L6
$$ plain form
7935 7 -226 -12 -213 11 -61 -2 33 -137 -438 -19 -22 122 -380 -254 -129 -374 -2 -135 -12 -19 -229 -354 -10
7958 -10 -4 -167 -72 -87 -180 -112 353 86 -251 -361 18 -118 355 -89 -97 74 -109 216 143 -111 -157 327 135 301
7982 301 -303 252 12 -75 265 -52 -218 -168 -144 -35 -30 -68 -27 -88 -135 -170 -107 -3 13 -238 18 -66 -58 31 104 83
8008 83 -79 -113 -53 -99 164 -158 -96 -209 -107 -46 124 -119 -13 -46 -259 -138 -54 -205 147 -298 -2 -164 26
8031 26 20 100 -199 -154 -266 -256 212 -188 -19 36 -94 151 34 108 -71 -68 158 -235 -222 -123 26 102 143 75 31
8056 31 137 261 -415 18 81 217 194 154 124 -18 277 214 276 132 -82 422 -171 52 134 -503 125 204 21
8079 21 -147 -12 90 -178 127 -236 1 99 208 -17 113 97 51 -201 124 251 -190 250 -88 164 -176
8100 -176 -5 83 -25 -123 -99 232 -261 141 43 0 73 78 -5 -65 166 -141 42 -161 86 23 -108 -134 -56 80
$$ packed form
7935Gk33K14k01K24p2N9L5j70l01M19lJ44n02J26J25k45L72j33J23pk10j25L44
7958a0Oj63R5j5r3O8M65k67l37j10L79j36M73m44qJ71j83L25p3k54m6M84j92J66
7982C01o04N55k40q7L40l17j66N0K4J09Nl8M1o1m7l5O3J04J6k51K56q4QQ9P3k1
8008H3j62l4O0m6K63l22O2j13J02O1J70k43J06l3k13J21Q4j51L52m45K96j62J90
8031B6oQ0k99M5j12J0M68m00J69N5j30K45j17P4j79LK26l93J3R9J49P6M1o8m4
8056C1J06J24o76M33O3J36k3m0l0j42K95o3O2j44k14N04n93K23Q2o37O28P9j83
8079B1j68J35J02k68L05l63K37R8J09k25J30j6m6k52L25J27m41M40l38K52l40
8100a76J71Q8j08r8K4L31m93M02r8m3P3Nq3o0K31l07J83k03K47o3j31k6P8J36
$$ plain form
8124 80 -408 45 -77 -157 8 -22 -249 239 23 -38 -32 -154 -455 -132 119 135 50 41 -370 -163 -22 122 124 61
8148 61 -315 -327 64 -15 132 236 233 -39 -56 -258 179 14 24 179 -199 -40 126 -10 196 56 -308 -234 285
8171 285 -126 -102 178 -60 3 -272 -119 71 76 99 -96 -52 174 -91 0 -4 123 241 -93 -460
$$ packed form
8124H0m88M53j22q0J65l0k27M88k16o1Oj22l01L23K51J6q5rm11K07J41J44Ko3
8148F1l76j2L91p9J47J04lk72j7k02M37j65J0J55l78J59J66j36K06j40l64P4N19
8171B85m11K4K80k38O3k75J53J90NK3j95M4K26k65R1mJ27J18l34l67
8191d60
$$ Imaginary data points
##PAGE= N=2
##DATA TABLE= (X++(I..I)), XYDATA
$$ plain form
0 0 0 0 0 0 0 0 0 0 3 -8 8 -8 8 -15 16 -16 24 -25 32 -36 41 -49 57 -65 76 -88 99 -112 128 -144 163 -184
32 -184 204 -229 253 -285 317 -352 390 -432 480 -529 589 -651 719 -799 888 -990 1107 -1243
50 -1243 1404 -1595 1834 -2135 2529 -3072 3874 -5174 7652 -14091 67549 139283 19696 -26944
64 -26944 1489 53489 24081 -15773 -1115 63500 75641 29686 -9015 18888 61390 59424
76 59424 12263 -10521 10510 39314 33155 19174 31659 60542 55681 15114 -11017 10168 39572
89 39572 32334 3596 7530 43586 56401 21338 -11430 5172 41286 35074 -7367 -20392 18182
102 18182 52998 37091 602 -409 28173 33890 878 -24908 -8035 25574 29551 5556 -5163
115 -5163 12023 24605 7615 -17459 -16400 4191 10448 -4148 -10665 6132 21267 10423 -11688
$$ packed form
0@%%%%%%%%Lj1J6j6J6k3L1l2M0m9N7o8P7r0J06j22J41j64J87k11K40k72L07l47
32a84L88m33M82n38O02o69P42q22R12j009J118j240J370j518J687j878K097k350
50a243K647k999L429l969M664n601O946r048J2826k1743Q1640P1734j19587m6640
64b6944K8433N2000k9408l9854J4658O4615J2141m5955l8701K7903M2502j966
76E9424m7161k2784K1031K8804o159j3981J2485K8883m861m0567k6131K1185K9404
89C9572p238k8738L934L6056J2815l5063l2768J6602L6114o212m2441j3025L8574
102A8182L4816j5907l6489j011K8582N717l3012k5786J6873L3609L977k3995j0719
115e163J7186J2582j6990k5074J059K0591O257j4596o517J6797J5135j0844k2111
$$ plain form
128 -11688 -15880 -3313 -712 -15812 -23343 -9256 10738 9052 -9365 -17985 -7651 -615 -13123
141 -13123 -30274 -26397 -6094 2833 -7922 -17776 -9378 1980 -5073 -23960 -30255 -18631 -8607
154 -8607 -12871 -19465 -13129 -2684 -4508 -17008 -24553 -19677 -14486 -17946 -22587 -17272 -7892 -5439 -11837
169 -11837 -15204 -13133 -11395 -16864 -23090 -21679 -13645 -8004 -9740 -12581 -10000 -7325 -11564 -20215 -22100
184 -22100 -15701 -10160 -11242 -12535 -8086 -2834 -4800 -11510 -14105 -11684 -10635 -13326 -15052 -9696 -3332
199 -3332 -1943 -5112 -6968 -5676 -6647 -11469 -14646 -11790 -5049 -1969 -3379 -3972 -828 519 -4129 -9918
215 -9918 -9743 -5315 -3105 -5468 -5600 -523 4166 1808 -4528 -5529 -2966 -2728 -6560 -7759 -2552 3911
231 3911 4394 913 -390 1498 1363 -3064 -6642 -4286 1190 3415 1609 730 3371 5944 3167 -2368
$$ packed form
128a1688m192J2567K601j5100p531J4087J9994j686j8417q620J0334P036j2508
141a3123j7151L877K0303Q927j0755r854Q398J1358p053j8887o295J1624J0024
154h607m264o594O336J0445j824j2500p545M876N191l460m641N315R380K453o398
169a1837l367K071J738n469o226J411Q034N641j736k841K581K675m239q651j885
184b2100O399N541j082j293M449N252j966o710k595K421J049k691j726N356O364
199c332J389l169j856J292r71m822l177K856O741L080j410n93L144J347m648n789
215i918J75M428K210k363j32N077M689k358o336j001K563K38l832j199N207O463
231C911M83l481j303J888j35m427l578K356N476K225j806q79K641K573k777n535
$$ plain form
247 -2368 -4210 -529 1896 397 -624 3451 8650 7795 2744 -4 1905 3273 965 -932 2359
262 2359 6760 8232 5963 3733 4547 5494 3190 663 512 4157 7233 7509 6503 7498 9263 7558
278 7558 4134 1739 3212 5745 6310 5944 7720 10336 10630 7617 5232 5052 5910 5149 4317 6435 9187
295 9187 10420 9963 9187 9237 8232 6447 5310 5611 7019 8230 9074 10127 10220 10084 8257 6470 5277
312 5277 5854 6028 6511 7584 9300 10658 9514 7946 6801 6996 5277 3744 4270 6608 7757 7883 7046
329 7046 7538 7934 5212 2643 1970 3334 4428 4062 4027 5327 6732 5858 3372 1056 1189 2082 979
346 979 -175 615 3384 4484 2423 -250 -366 625 -746 -4201 -4319 -1040 1309 215 -2258 -1788 -98
363 -98 -1287 -4966 -6693 -4874 -2951 -3334 -4787 -4541 -2045 -1550 -4310 -7520 -7853 -5950 -5580 -7288 -7765
$$ packed form
247b368j842L681K425j499j021M075N199q55n051k748J909J368k308j897L291
262B359M401J472k269k230Q14R47k304k527j51L645L076K76j006R95J765j705
278G558l424k395J473K533N65l66J776K616K94l013k385j80Q58p61q32K118K752
295I187J233m57p76N0j005j785j137L01J408J211Q44J053R3j36j827j787j193
312E277N77J74M83J073J716J358j144j568j145J95j719j533N26K338J149J26q37
329G046M92L96k722k569o73J364J094l66l5J300J405q74k486k316J33Q93j103
346I79j154P90K769J100k061k673j16R91j371l455j18L279K349j094k473M70J690
363i8j189l679j727J819J923l83j453K46K496M95k760l210l33J903L70j708m77
$$ plain form
380 -7765 -5246 -2944 -3877 -6799 -8065 -6429 -6005 -8585 -10627 -8309 -4955 -4839 -6897 -7907 -6061 -5332
396 -5332 -7759 -10389 -9734 -6807 -5977 -6657 -7019 -5515 -4143 -5154 -7687 -8646 -7216 -5768 -6703 -7528 -5837
413 -5837 -3456 -2895 -5150 -6739 -5883 -4270 -5342 -7000 -5983 -2969 -1784 -2816 -3998 -2398 -1964 -2927
429 -2927 -4466 -4510 -2643 -1207 -1071 -1388 -937 360 137 -1302 -2323 -1864 -157 -250 -594 -1 1761 2721
447 2721 1578 394 596 1253 596 83 864 2202 3478 2736 2579 2853 3003 2242 1148 1296 2177 3021
465 3021 2964 2884 3824 3979 3732 2402 2063 2541 2426 2334 2517 3252 4340 4491 3256 2580 2842 2884 1902 1243
485 1243 1764 3369 3924 3106 2459 3034 3353 2081 800 757 2226 2392 1651 1733 2611 3305 2233 983 235
504 235 1025 1273 505 501 1087 2434 2442 1239 151 611 1315 286 -815 -598 1312 1971 719 -71 912
$$ packed form
380g765K519K302r33k922j266J636M24k580k042K318L354J16k058j010J846P29
396e332k427k630O55K927Q30o80l62J504J372j011k533r59J430J448r35q25J691
413e837K381N61k255j589Q56J613j072j658J017L014J185j032j182J600M34r63
429b927j539m4J867J436J36l17M51J297k23j439j021M59J707r3l44N93J762R60
447B721j143j184K02O57o57n13P81J338J276p42j57K74J50p61j094J48Q81Q44
465C021n7q0R40J55k47j330l39M78j15r2J83P35J088J51j235o76K62M2r82o59
485A243N21J605N55q18o47N75L19j272j281m3J469J66p41Q2Q78O94j072j250p48
504B35P90K48p68mN86J347Qj203j088M60P04j029j101K17J910O59j252p90R83
$$ plain form
523 912 1468 570 -1166 -1406 -47 1054 148 -630 324 1504 1561 251 -1088 -672 428 673 -294 -343 1049
542 1049 2031 1485 126 -61 1174 1070 -127 -735 748 2153 1865 614 54 1459 1539 285 -607 409
560 409 1413 1876 1446 1283 1622 2184 1698 876 298 1070 1730 1530 1065 1706 2619 2307 1648 910 1661 1479
580 1479 1347 640 798 2325 2393 1924 937 1439 1549 1198 581 171 829 1245 1237 1120 840 1136 919 826 -269
601 -269 -652 260 555 278 -529 126 399 488 -744 -763 -1263 -841 -1087 -1006 -962 -940 -1166 -1033 -1447 -2108 -2253 -1941
623 -1941 -1964 -2349 -2481 -2224 -1907 -1866 -2380 -2765 -2529 -2855 -3287 -3263 -2832 -2714 -2642 -2833 -2783 -3081 -3237 -3254 -3898 -3368
645 -3368 -3552 -2901 -2796 -2861 -2763 -2404 -2279 -3092 -3883 -3739 -3280 -2665 -3068 -2757 -2435 -1745 -2136 -2455 -2625 -2218 -2581
666 -2581 -2444 -2515 -1995 -1469 -1190 -1364 -1679 -1703 -1106 -1251 -1578 -1704 -1413 -271 46 -698 -439 -149 267 -325
$$ packed form
523I12N56q98j736k40J359J101r06p78R54J180N7j310j339M16J100K45r67m9J392
542A049R82n46j359j87J235j04j197o08J483J405k88j251n60J405Q0j254q92J016
560D09J004M63m30j63L39N62m86q22n78P72O60k00m65O41R13l12o59p38P51j82
580A479j32p07J58J527O8m69r87N02J10l51o17m10O58M16qj17k80K96k17r3j095
601b69l83R12K95k77q07O55K73Q9j232j9n00M22k46Q1M4K2k26J33m14o61j45L12
623a941k3l85j32K57L17M1n14l85K36l26m32K4M31J18P2j91N0k98j56j7o44N30
645c368j84O51J05o5R8L59J25q13p91J44M59O15m03L11L22O90l91l19j70M07l63
666b581J37p1N20N26K79j74l15k4N97j45l27j26K91J142L17p44K59K90M16n92
$$ plain form
686 -325 -720 -100 511 820 469 636 832 1416 1107 589 667 1103 1799 1621 1111 1783 2367 2654 1754 1487 2053
707 2053 2458 2452 1773 2103 3008 3283 2841 2080 2183 2959 2714 2307 2163 2633 2953 2986 2328 2427 2818 3093 2501
728 2501 2040 1588 2059 2865 2490 1804 2237 2687 2723 1671 1234 1893 1962 1834 1238 1307 1646 1968 1291 1018 918
749 918 1128 772 446 244 447 984 816 491 -57 48 415 15 -813 -637 -110 49 -403 -821 -665 -410
769 -410 -603 -1177 -1407 -1178 -1001 -890 -1215 -1250 -999 -584 -1131 -1553 -1745 -1315 -1463 -1262 -2057 -1429 -826 -964 -1661
790 -1661 -1551 -1304 -1208 -1213 -1971 -1647 -906 -783 -891 -1449 -1003 -610 -793 -1483 -1538 -1325 -969 -600 -612 -642 -535 -121
812 -121 -74 -845 -868 -107 112 17 -478 -102 305 411 121 -250 6 634 510 414 89 506 941 993 598 514
834 514 643 959 1137 683 773 1208 1312 968 1145 1210 1014 1084 641 772 707 1355 1022 827 988 879 1206 764
$$ packed form
686c25l95O20O11L09l51J67J96N84l09n18P8M36O96j78n10O72N84K87r00k67N66
707B053M05oo79L30R05K75m42p61J03P76k45m07j44M70L20L3o58R9L91K75n92
728B501m61m52M71Q06l75o86M33M50L6j052m37O59O9j28n96O9L39L22o77k73j00
749I18K10l56l26k02K03N37j68l25n48J05L67m00q28J76N27J59m52m18J56K55
769d10j93n74k30K29J77J11l25l5K51M15n47m22j92M30j48K01p95O28O03j38o97
790a661J10K47R6np58L24P41J23j08n58M46L93j83o90n5K13L56L69j2l0J07M14
812a21M7p71k3P61K19r5m95L76M07J06k90l71K56O28j24r6l25M17M35N2l95q4
834E14J29L16J78m54R0M35J04l44J77O5j96P0m43J31o5O48l33j95J61j09L27m42
$$ plain form
856 764 404 493 560 1143 480 489 643 933 981 456 -43 38 944 130 -394 -108 509 669 -175 -775 -680 -115 186
879 186 -535 -1131 -341 -118 -473 -757 -909 -751 -218 -872 -1647 -1359 -836 -344 -1148 -1748 -1640 -594 -946 -1551
899 -1551 -1935 -1522 -1006 -1087 -1866 -1960 -912 -612 -1721 -2312 -1533 -1020 -1125 -1946 -2008 -1372 -499 -939 -1792 -1857 -576
920 -576 -523 -1047 -1805 -1392 -462 -470 -998 -1421 -899 -147 -592 -1232 -1152 -217 190 -123 -939 -221 378 236 72 -269
942 -269 90 752 665 105 154 879 1400 825 279 398 1176 1345 661 336 1118 1813 1546 960 1067 1594 1931
963 1931 1699 869 1646 2086 2216 1465 1498 1819 2087 2043 1215 1249 1583 2238 1830 1501 1583 1929 1855 1642 1191 1323
985 1323 1678 1853 1309 1156 1898 1379 1514 1025 765 944 1228 1115 695 410 938 982 826 735 318 776 387
1006 387 38 -119 -179 656 122 96 -144 -164 -99 -524 -842 -857 -716 -560 -861 -990 -1037 -815 -796 -1103 -1376 -1393 -1115
$$ packed form
856G64l60Q9O7N83o63RJ54K90M8n25m99Q1R06q14n24K86O17J60q44o00R5N65L01
879A86p21n96P90K23l55k84j52J58N33o54p75K88N23M92q04o00J08J046l52o05
899a551l84M13N16q1p79r4J048L00j109n91P79N13j05q21o2O36Q73m40q53o5J281
920e76N3n24p58M13R30qn28m23N22P52m45o40Q0R35M07l13q16P18N99j42j64l41
942b69L59O62q7n60M9P25N21n75n46J19P78J69o84l25P82O95k67n86J07N27L37
963A931k32q30P77M40J30p51L3L21K68m4q28L4L34O55m08l29Q2L46p4k13m51J32
985A323L55J75n44j53P42n19J35m89k60J79K84j13m20k85N28M4j56r1m17M58l89
1006C87l49j57o0Q35n34k6k40k0O5m25l18j5J41J56l01j29m7K22J9l07k73j7K78
$$ plain form
1029 -1115 -1062 -1555 -1407 -1429 -840 -921 -1819 -1574 -1453 -994 -1346 -1657 -1554 -1336 -1220 -1494 -1935 -1670 -842 -1221 -1755
1050 -1755 -1869 -1562 -893 -832 -1460 -1596 -943 -421 -1071 -1469 -1321 -616 -696 -1161 -1285 -858 -66 -452 -828 -842 -444
1071 -444 240 -76 -775 -630 50 227 48 -446 75 530 449 79 -58 764 893 1017 -39 486 1114 1023
1091 1023 689 258 660 1423 1378 534 725 1245 1735 1004 658 841 1345 1533 1255 647 846 1242 1320 1051
1111 1051 452 972 1747 1357 983 804 1134 1492 962 182 873 1231 1222 602 238 853 1150 654 11 181
1131 181 628 979 43 -158 187 372 391 178 -458 6 273 225 -552 -733 -319 -50 -685 -750 -908 -247 -61
1152 -61 -860 -1027 -987 -712 -607 -1091 -1021 -913 -642 -839 -1355 -1104 -983 -962 -1054 -1266 -1402 -626 -864 -1079 -1203 -1282
1174 -1282 -844 -890 -1099 -1169 -818 -660 -466 -1115 -1148 -658 -299 -515 -855 -1168 -558 -120 -413 -665 -559 -106 130
$$ packed form
1029a115N3m93J48k2N89q1q98K45J21M59l52l11J03K18J16k74m41K65Q28l79n34
1050a755j14L07O69O1o28j36O53N22o50l98J48P05q0m65j24M27P92l86l76j4L98
1071d44O84l16o99J45O80J77j79m94N21M55q1l70j37Q22J29J24j056N25O28r1
1091A023l34m31M02P63m5q44J91N20M90p31l46J83N04J88k78o08J99L96P8k69
1111A051n99N20P75l90l74j79L30L58n30p80O91L58ro20l64O15K97m96o43J70
1131A81M47L51r36k01L45J85J9k13o36M64K67m8p77j81M14K69o35o5j58O61J86
1152f1p99j67M0K75J05m84P0J08K71j97n16K51J21K1r2k12j36P76k38k15j24p9
1174a282M38m6k09p0L51J58J94o49l3M90L59k16l40l13O10M38k93k52J06M53K36
$$ plain form
1195 130 -349 -486 -60 32 343 -459 27 171 216 480 133 269 653 969 539 327 469 1040 601 477 527
1216 527 850 987 1117 290 451 1169 1598 926 693 962 1347 1391 1234 858 1124 1547 1293 889 671 1495
1236 1495 1375 1095 699 849 1049 1362 778 316 793 1374 1216 504 558 823 1044 922 -19 421 891 856
1256 856 418 46 342 640 452 -224 151 -114 242 -13 -32 -496 143 -97 -483 -693 -474 -381 -224 -866 -984
1277 -984 -388 -115 -640 -1150 -1015 -785 -764 -961 -1431 -1004 -932 -884 -1141 -1292 -1089 -677 -1050 -1699 -1319 -1574 -1007
1298 -1007 -1523 -1272 -1402 -1019 -564 -1266 -1603 -1067 -1049 -988 -1207 -986 -1032 -552 -1110 -973 -1247 -719 -580 -724 -861
1319 -861 -648 -574 -337 -398 -735 -505 -191 -235 -391 -341 -354 -348 208 -101 -190 46 308 433 159 582 603 773 709
1342 709 269 226 659 664 1049 686 702 862 1109 640 790 1035 1526 1499 1061 614 917 1255 730 815 948 1418
$$ packed form
1195A30m79j37M26R2L11q02M86J44M5K64l47J36L84L16m30k12J42N71m39j24N0
1216E27L23J37J30q27J61P18M29o72k33K69L85M4j57l76K66M23k54m04k18Q24
1236A495j20k80l96J50K00L13n84m62M77N81j58p12N4K65K21j22r41M40M70l5
1256H56m38l72K96K98j88o76L75k65L56k55j9m64O39k40l86k10K19R3J57o42j18
1277i84N96K73n25n10J35K30K1j97m70M27P2M8k57j51K03M12l73o49L80k55N67
1298a007n16K51j30L83M55p02l37N36J8O1k19K21m6M80n58J37k74N28J39j44j37
1319h61K13P4K37o1l37K30L14m4j56N0j3ON56l09q9K36K62J25k74M23K1J70o4
1342G09m40m3M33NL85l63J6J60K47m69J50K45M91k7m38m47L03L38n25Q5J33M70
$$ plain form
1364 1418 1284 1257 952 1053 1595 1256 1070 712 1015 1411 1288 524 844 929 1435 691 107 641 924 1004 458
1385 458 383 570 1015 847 99 310 725 727 415 -29 2 390 -107 -103 -230 -243 295 117 -798 -459 -193 -32
1407 -32 -338 -719 -743 -304 -635 -758 -981 -555 -336 -554 -1232 -1243 -613 -499 -1070 -1248 -914 -557 -532 -829 -1176
1428 -1176 -1110 -645 -546 -1205 -1201 -1006 -336 -789 -1154 -1076 -466 -565 -868 -1076 -929 -175 -513 -849 -926 -672 -226 -221 -604
1451 -604 -580 -198 88 -505 -316 -359 -172 95 -284 -180 -155 388 403 194 50 321 378 224 219 200 368 621 421
1474 421 282 671 787 569 485 309 763 1125 568 519 539 612 1248 1214 575 747 1116 1197 1005 515 555 1187
1496 1187 1132 948 582 816 1205 1004 737 719 804 1069 682 552 500 967 937 367 171 184 627 556 401 -154
1518 -154 126 373 317 -104 -280 315 318 -59 -555 19 86 -133 -197 -869 -296 39 -303 -507 -593 -322 -323 -918 -978
$$ packed form
1364A418j34k7l05J01N42l39j86l58L03L96j23p64L20Q5N06p44n84N34K83Q0n46
1385D58p5J87M45j68p48K11M15Kl12m44L1L88m97Mj27j3N38j78r15L39K66J61
1407c2l06l81k4M39l31j23k23M26K19k18o78j1O30J14n71j78L34L57K5k97l47
1428a176O6M65R9o59MJ95O70m53l65P8O10r9l03k08J47P54l38l36p7K54M46Nl83
1451f04K4L82K86n93J89m3J87K67l79J04K5N43J5k09j44K71N7j54nj9J68K53k00
1474D21j39L89J16k18q4j76M54L62n57m9K0P3O36l4o39J72L69Q1j92m90M0O32
1496A187n5j84l66K34L89k01k67j8Q5K65l87j30n2M67l0n70j96J3M43p1j55n55
1518a54K80K47n6m21j76N95Ll77m96N74O7k19o4o72N73L35l42k04q6K71jn95o0
$$ plain form
1541 -978 -860 -471 -247 -863 -897 -730 -486 -692 -1094 -1469 -751 -522 -813 -774 -1045 -821 -706 -1175 -1134 -940 -551
1562 -551 -606 -1052 -836 -740 -414 -813 -1050 -788 -568 -333 -564 -664 -651 -293 -262 -782 -714 -171 -53 -444 -637 -116
1584 -116 -90 -154 128 -403 -125 132 301 100 44 353 585 289 180 31 341 640 311 266 328 862 625 456
1606 456 657 795 984 852 774 625 869 1014 811 510 1028 1000 957 584 786 991 986 1104 909 687 906 1044
1628 1044 801 824 946 1002 924 760 673 611 881 831 698 672 557 8 416 542 181 341 390 330 441 310 -30
1651 -30 374 -109 -21 -375 16 -126 59 30 -280 -465 -92 -430 -539 -303 -645 -296 -349 -916 -626 -552 -824 -861
1673 -861 -543 -613 -461 -790 -1169 -688 -791 -508 -865 -1072 -1126 -710 -723 -910 -973 -562 -637 -527 -999 -1113 -820 -571
1695 -571 -807 -835 -1003 -542 -419 -715 -904 -681 -277 -356 -687 -500 -200 -331 -283 -659 -348 -456 -268 77 -202
$$ packed form
1541i78J18L89K24o16l4J67K44k06m02l75P18K29k91L9k71K24J15m69M1J94L89
1562e51n5m46K16R6L26l99k37K62K20K35k31j00J3L58L1n20O8N43J18l91j93N21
1584a16K6o4K82n31K78K57J69k01n6L09K32k96j09j49L10K99l29m5O2N34k37j69
1606D56K01J38J89j32p8j49K44J45k03l01N18k8m3l73K02K05nJ18j95k22K19J38
1628A044k43K3J22N6p8j64q7o2K70n0j33k6j15n49M08J26l61J60M9o0J11j31l40
1651c0M04m83Q8l54L91j42J85k9l10j85L73l38j09K36l42L49n3n67K90P4k72l7
1673h61L18p0J52l29l79M81j03K83l57k07n4M16j3j87o3M11p5J10m72j14K93K49
1695e71k36k8j68M61J23k96j89K23M04p9l31J87L00j31M8l76L11j08J88L45k79
$$ plain form
1716 -202 -395 53 -44 -124 -42 -97 174 161 -43 -41 271 600 372 132 235 636 652 455 423 812 868 661 427
1739 427 544 728 813 736 366 528 975 979 662 549 873 1181 612 623 595 766 1135 734 389 449 874 1007
1761 1007 746 146 482 1001 652 206 343 643 855 552 106 286 441 714 131 182 343 56 241 100
1781 100 -58 -88 211 325 -78 -298 56 -38 -35 -479 -368 -311 -28 -262 -550 -759 -204 -483 -653 -640 -407 -374
1803 -374 -374 -659 -690 -894 -715 -549 -625 -729 -390 -430 -844 -786 -556 -504 -779 -645 -817 -738 -627 -671 -1076 -592 -514
1826 -514 -411 -531 -797 -587 -208 -145 -613 -514 -300 -323 -141 -393 -334 -209 -187 80 -279 -394 87 296 -168 -187
1848 -187 -69 135 248 285 61 257 521 278 446 63 371 423 295 585 207 683 671 465 401 390 954 651
1870 651 626 336 683 815 643 453 558 942 746 990 290 548 840 759 818 612 580 833 786 499 491 611
$$ packed form
1716b02j93M48r7q0Q2n5K71j3k04KL12L29k28k40J03M01J6j97l2L89N6k07k34
1739D27J17J84Q5p7l70J62M47Ml17j13L24L08n69J1k8J71L69m01l45O0M25J33
1761A007k61o00L36N19l49m46J37L00K12l03m46J80J55K73n83N1J61k87J85j41
1781A00j58l0K99J14m03k20L54r4Lm44J11N7K83k34k88k09N55k79j70J3K33L3
1803c74%k85l1k04J79J66p6j04L39m0m14N8K30N2k75J34j72P9J11m4m05M84P8
1826e14J03j20k66K10L79O3m68R9K14k3J82k52N9J25K2K67l59j15M81K09m64j9
1848a87J18K04J13L7k24J96K64k43J68l83L08N2j28K90l78M76j2k06o4j1N64l03
1870F51k5k90L47J32j72j90J05L84j96K44p00K58K92q1N9k06l2K53m7k87qJ20
$$ plain form
1892 611 909 505 187 481 596 668 567 233 28 599 576 110 -133 171 437 449 113 149 198 374 43 -129
1914 -129 -253 -119 -112 -281 -446 -440 88 -254 -500 -641 -442 -378 -533 -555 -650 -247 -343 -507 -938 -679 -462 -800 -358
1937 -358 -660 -685 -480 -415 -1012 -905 -809 -539 -593 -888 -828 -378 -576 -538 -813 -610 -678 -360 -747 -441 -562 -480 -168
1960 -168 -649 -309 -263 -283 -417 -245 -406 -395 -14 -401 -516 -101 47 188 -136 -153 -192 102 44 -251 134 46
1982 46 237 37 247 380 719 353 299 121 490 536 811 487 427 528 772 472 552 578 1018 928 454 192
2004 192 477 930 917 495 623 590 829 929 328 419 600 531 971 288 360 688 780 418 539 642 388 454
2026 454 414 455 570 706 361 118 138 424 390 370 -101 44 51 194 87 -178 -185 212 9 -138 -288 -270 -79
2049 -79 -150 -470 -355 -69 -169 -487 -423 -469 -507 -178 -549 -673 -462 -313 -578 -670 -382 -467 -459 -456 -828 -859 -574 -326
$$ packed form
1892F11K98m04l18K94J15P2j01l34k05N71k3m66k43L04K66J2l36L6M9J76l31j72
1914a29j24J34Pj69j65ON28l42k46j41J99O4j55k2r5M03r6j64m31K59K17l38M42
1937c58l02k5K05O5n97J07R6K70n4k95O0M50j98L8k75K03o8L18l87L06j21Q2L12
1960a68m81L40M6k0j34J72j61J1L81l87j15M15J48J41l24j7l9K94n8k95L85q8
1982D6J91k00K10J33L39l66n4j78L69M6K75l24o0J01K44l00Q0K6M40r0m74k62
2004A92K85M53j3m22J28l3K39J00o01R1J81o9M40o83P2L28R2l62J21J03k54O6
2026D54m0M1J15J36l45k43K0K86l4k0m71J45PJ43j07k65pL97k03j47j50J8J91
2049g9p1l20J15K86j00l18O4m6l8L29l71j24K11J49k65r2K88q5QLl72l1K85K48
$$ plain form
2073 -326 -424 -661 -509 -433 -743 -1065 -678 -445 -550 -381 -305 -686 -474 -290 -666 -688 -313 -225 -577 -301 -720 -152
2095 -152 -247 -179 -362 -550 154 -99 -330 -285 -433 -78 303 -118 271 174 339 326 124 -49 219 684 370 23
2117 23 292 413 825 598 279 511 691 718 264 401 436 813 625 470 20 622 759 474 260 340 629
2138 629 875 262 164 323 476 732 263 437 609 657 681 238 631 437 269 557 10 389 309 213 -201 122
2160 122 550 481 28 15 -65 460 241 171 -406 -308 148 149 -163 -317 45 -49 -88 -492 -60 120 96 -207 -235 -568
2184 -568 240 -145 -515 -354 -291 -360 -481 -516 -781 -526 -726 -627 -669 -690 -296 -237 -742 -830 -468 -514 -571 -519 -584 -584 -459
2209 -459 -412 -727 -563 -294 -273 -343 -443 -471 -247 -285 -229 -464 -281 -347 -378 -299 -107 -170 43 27 -292 -324 -185 207
2233 207 4 -186 98 161 61 -167 54 332 487 298 155 528 236 596 346 286 341 274 672 323 453
$$ packed form
2073c26r8k37J52P6l10l22L87K33j05J69P6l81K12J84l76k2L75Q8l52K76m19N68
2095a52r5O8j83j88P04k53k31M5j48L55L81m21L89r7J65j3k02j73K68M65l14l47
2117B3K69J21M12k27l19K32J80K7m54J37L5L77j88j55m50O02J37k85k14Q0K89
2138F29K46o13r8J59J53K56m69J74J72M8K4m43L93j94j68K88n47L79q0r6m14L23
2160A22M28o9m53j3q0N25k19p0n77R8M56Jl12j54L62r4l9m04M32J80k4l03k8l33
2184e68Q08l85l70J61O3o9j21l5k65K55k00R9m2k1L94N9n05q8L62m6n7N2o5%J25
2209d59M7l15J64K69K1p0j00k8K24l8N6k35J83o6l1P9J92o3K13j6l19l2J39L92
2233B07k03j90K84O3j00k28K21K78J55j89j43L73k92L60k50o0N5o7L98l49J30
$$ plain form
2254 453 582 730 506 669 444 491 441 708 186 297 518 705 735 543 490 561 767 609 493 194 786 739
2276 739 74 330 288 784 788 273 189 416 424 513 327 319 182 268 151 -94 258 334 259 -350 -28 32 371 214
2300 214 -334 -157 -99 51 -296 -271 -170 -452 64 -510 -898 -175 28 -82 -651 -528 -610 -314 -483 -444 -639
2321 -639 -54 -498 -819 -801 -515 164 -602 -481 -374 -474 -254 -445 -688 -766 -172 -224 -658 -640 -520 -75 -358
2342 -358 -621 -300 -290 -94 -560 -362 -282 -421 -137 -377 -646 -450 -42 -93 -215 -297 -85 -42 72 -13 -57 167
2364 167 -76 22 -63 22 -33 423 283 -133 150 345 387 150 100 382 374 488 110 398 653 731 393 340 622
2387 622 608 382 334 140 597 472 475 452 323 439 641 468 473 369 530 219 478 343 158 632 374 493
2409 493 159 256 273 282 292 43 236 551 221 91 328 358 412 38 279 94 10 259 22 -57 195 -298 235
$$ packed form
2254D53J29J48k24J63k25M7n0K67n22J11K21J87L0j92n3P1K06j58j16k99N92m7
2276G39o65K56m2M96Mn15q4K27QQ9j86qj37Q6j17k45L52P6p5o09L22O0L39j57
2300B14n48J77N8J50l47K5J01k82N16n74l88P23K03j10n69J23q2K96j69L9j95
2321f39N85m44l21J8K86O79p66J21J07j00K20j91k43p8N94n2m34J8J20M45k83
2342c58k63L21J0J96m66J98Q0j39K84k40k69J96M08n1j22q2K12M3J14q5m4K24
2364A67k43R8q5Q5n5M56j40m16K83J95M2k37n0K82qJ14l78K88K55P8l38n3K82
2387F22j4k26m8j94M57j25Lk3j29J16K02j73Nj04J61l11K59j35j85M74k58J19
2409D93l34R7J7RJ0k49J93L15l30j30K37L0N4l74K41j85q4K49k37p9K52m93N33
$$ plain form
2432 235 -508 -13 -95 50 -266 -137 -5 -293 -40 -536 -366 -396 -109 -111 -390 -407 -176 -248 -571 -559 -495 -457 -385
2455 -385 -315 -565 -541 -275 -424 -427 -552 -61 -562 -377 -519 -479 -73 -318 -857 -716 -458 -444 -255 -455 -319 25
2477 25 -405 -252 -58 -289 -63 50 -179 -643 -398 -12 -39 -9 -107 -123 -73 515 -342 262 346 131 -144 195
2499 195 334 344 129 128 274 384 326 177 370 386 187 584 327 297 521 164 417 489 258 356 517 788 606
2522 606 528 175 692 541 140 416 621 571 461 351 502 204 554 653 320 418 178 311 464 173 375
2543 375 542 535 160 -19 201 197 -42 -222 -166 161 207 -165 -242 89 8 56 -144 144 -497 -70 -52 -33 -149 -252
2567 -252 -381 -330 -429 -509 -204 -96 -599 -332 -627 -296 -140 -410 -796 -722 -179 -580 -489 -426 -277 -218 -429 -462 -533
2590 -533 -369 -350 -305 -745 -637 -720 -583 -392 -553 -487 -266 -95 -555 -402 -253 -62 47 -774 -369 -193 -118 -242
$$ packed form
2432B35p43M95q2J45l16J29J32k88K53m96J70l0K87kk79j7K31p2l23J2O4L8P2
2455c85P0k50K4K66j49lj25M91n01J85j42M0M06k45n39J41K58J4J89k00J36L44
2477B5m30J53J94k31K26J13k29m64K45L86k7L0r8j6N0N88q57O04Q4k15k75L39
2499A95J39J0k15jJ46J10n8j49J93J6j99L97k57l0K24l57K53P2k31R8J61K71j82
2522F06p8l53N17j51m01K76K05n0j10j10J51k98L50R9l33R8k40J33J53k91K02
2543C75J67pl75j79K20mk39j80N6L27M6l72p7L31q1M8k00K88o41M27J8J9j16j03
2567b52j29N1r9q0L05J08n03K67k95L31J56k70l86P4N43m01R1O3J49N9k11l3p1
2590e33J64J9M5m40J08q3J37J91j61O6K21J71m60J53J49J91J09q21M05J76P5j24
$$ plain form
2612 -242 -549 -217 114 51 -309 -225 -157 367 21 -24 160 -42 -106 109 -206 94 199 334 -37 33 167 604
2634 604 125 -20 496 480 728 367 373 234 345 73 255 395 147 330 685 410 267 632 471 557 425
2655 425 341 537 322 515 260 554 397 542 329 146 287 450 376 196 239 342 296 142 262 118 322
2676 322 74 11 199 293 236 236 143 117 123 -113 -43 -11 -196 100 -193 -379 -247 14 -291 -35 -206 248 -31 -92
2700 -92 -65 -279 -484 -341 -291 -548 -546 -522 -414 -166 -309 -326 -281 -481 -188 -779 -544 -480 -312 -579 -495 -524 -537 -447
2724 -447 -177 -399 -353 -358 -319 -315 -648 -476 -332 -230 -264 -479 -421 -234 -336 36 -276 -114 -156 -94 -134 -78 -126 6
2748 6 210 13 -4 53 -3 -193 187 131 309 136 46 192 146 754 294 252 372 301 550 151 149 510 445 269
2772 269 530 209 565 640 550 114 -68 141 518 453 412 457 399 173 157 499 483 381 399 69 382 449 315
$$ packed form
2612b42l07L32L31o3l60Q4O8N24l46m5J84k02o4K15l15L00J05J35l71P0J34M37
2634F04m79j45N16j6K48l61Oj39J11k72J82J40k48J83L55k75j43L65j61Q6j32
2655D25q4J96k15J93k55K94j57J45k13j83J41J63p4j80M3J03m6j54J20j44K04
2676C22k48o3J88R4n7%r3k6Ok36P0L2j85K96k93j86J32K61l05K56j71M54k79o1
2700i2K7k14k05J43N0k57KK4J08K48j43j7M5k00K93n91K35O4J68k67Q4k9j3R0
2724d47K70k22M6nL9Ml33J72J44J02l4k15N8J87j02L72l12J62m2O2m0N6m8J32
2748FK04j97j7N7n6j90L80n6J78j73r0J46m6O08m60m2J20p1K49l99kL61o5j76
2772B69K61l21L56P5r0m36j82K09L77o5m1M5n8k26j6L42j6j02J8l30L13O7j34
$$ plain form
2795 315 277 33 -79 249 241 282 461 277 104 192 187 -205 265 30 150 -239 -72 -141 -205 113 -227 -209 105
2818 105 -123 -63 -160 -52 -68 -165 -104 -378 -119 2 -523 -335 -326 -147 -217 -101 -451 -177 -435 -407 -522 -355 -396
2841 -396 -402 -345 -775 -217 -454 -114 -362 -737 -297 -470 -271 -346 -484 -248 -275 -353 -432 -459 -69 -159 -204 -127 -249 90
2865 90 -9 -468 -281 -223 -49 89 -145 -140 79 101 -62 -405 -40 261 -52 -177 -258 -99 390 402 -44 223 97
2888 97 373 509 -44 150 273 215 66 109 -42 501 719 549 235 288 395 577 527 484 437 631 262 183 288
2911 288 495 210 398 153 364 507 351 371 164 403 646 446 281 166 441 828 371 -132 3 -23 197
2932 197 32 245 241 1 165 -203 184 -250 302 161 142 173 34 107 -34 -243 -359 30 -204 -370 -520 -229
2954 -229 26 -563 -482 -177 -16 -220 -295 -249 -623 -113 -134 -500 -216 -265 -41 -248 -546 -494 -111 -153 -20 -262
$$ packed form
2795C15l8k44j12L28qM1J79j84j73Q8nl92M70k35J20l89J67o9o4L18l40J8L14
2818A05k28O0r7J08j6r7O1k74K59J21n25J88RJ79p0J16l50K74k58K8j15J67m1
2841c96oN7m30N58k37L40k48l75M40j73J99p5j38K36k7p8p9k7L90r0m5P7j22L39
2865I0r9m59J87N8J74J38k34NK19K2j63l43L65L01l13j25q1J59M89J2m46K67j26
2888I7K76J36n53J94J23n8j49M3j51N43K18j70l14N3J07J82n0m3m7J94l69p9J05
2911B88K07k85J88k45K11J43j56K0k07K39K43k00j65j15K75L87m57n03J35k6K20
2932A97j65K13mk40J64l68L87m34N52j41j9L1j39P3j41k09j16L89k34j66j50K91
2954b29K55n89Q1L05J61k04p5M6l74N10k1l66K84m9K24k07k98N2L83m2J33k42
$$ plain form
2976 -262 -569 -171 -329 -487 -454 -479 47 -9 -648 -502 -261 -320 -397 -265 -221 262 -31 14 -224 -377 -261 27
2998 27 -180 -247 -133 -229 105 -356 -53 221 66 68 -169 -17 -100 63 188 85 168 -259 406 70 -160 -28
3020 -28 243 364 72 275 175 167 438 67 207 363 654 2 594 576 164 730 336 174 244 453 389 274
3042 274 205 319 385 243 304 402 328 109 45 316 208 444 355 44 15 308 331 160 200 272 116 249 74 162
3066 162 14 224 206 374 -135 28 156 -205 -326 -42 35 -437 -299 -68 -165 143 31 -39 -158 -379 27
3087 27 -324 -576 -232 -212 -202 -172 -201 -255 -82 -210 -520 -216 -355 -92 -48 -249 -262 -8 -531 -83 -653 -352 -28
3110 -28 -244 -536 -608 -398 164 -549 -131 -453 -284 -348 -61 -277 -170 4 -378 -120 -80 -38 -226 -119 87 38
3132 38 -10 255 -28 119 -9 111 -12 211 201 69 469 251 -112 217 42 253 215 -46 231 304 467 321
$$ packed form
2976b62l07L98j58j58L3k5N26n6o39J46K41n9p7J32M4M83k93M5k38j53J16K88
2998B7k07o7J14r6L34m61L03K74j55Kk37J52q3J63J25j03Q3m27O65l36k30J32
3020b8K71J21k92K03j00qK71l71J40J56K91o52N92j8m12N66l94j62P0K09o4j15
3042B74o9J14O6j42O1R8p4k19o4K71j08K36q9l11k9K93K3j71M0P2j56J33j75Q8
3066A62j48K10j8J68n09J63J28l61j21K84P7m72J38K31r7L08j12p0j19k21M06
3087B7l51k52L44K0J0L0k9n4J73j28l10L04j39K63M4k01j3K54n23M48n70L01L24
3110b8k16k92p2K10N62p13M18l22J69o4K87k16J07J74l82K58M0M2j88J07K06m9
3132C8m8K65k83J47j28J20j23K23j0j32M00k18l63L29j75K11l8k61K77P3J63j46
$$ plain form
3154 321 490 214 40 363 322 497 86 480 582 117 194 544 399 463 289 393 393 224 304 307 396 261 467
3177 467 363 -26 423 297 437 199 215 560 156 263 219 91 -25 414 229 -51 -99 8 404 -146 -82
3198 -82 -229 85 184 -255 -121 -38 174 -36 -242 -367 -317 -389 -237 -458 -359 -390 -19 -322 -373 -83 191 -342 -55
3221 -55 -186 -172 -289 -362 -516 -502 42 -480 -172 -562 -382 -298 -239 -259 -191 -323 -269 -118 -485 -167 -204 -3 -302
3244 -302 -475 -449 -369 -252 -276 -195 -318 -32 -608 -245 -209 75 -113 -247 -519 -370 303 179 -110 19 -212 -27
3266 -27 -64 -64 -54 230 -16 -53 215 14 282 -87 126 -74 -16 163 104 55 10 377 230 378 54 124 306 300
3290 300 371 150 173 142 279 325 57 204 169 213 -63 408 150 181 94 387 82 178 234 443 45 128 416 246
3314 246 395 38 163 61 250 -236 -51 290 184 18 -72 93 76 295 -144 143 244 228 -108 -154 -232 -160
$$ packed form
3154C21J69k76j74L23m1J75m11L94J02m65P7L50j45O4j74J04%j69Q0LQ9j35K06
3177D67j04l89M49j26J40k38J6L45m04J07m4j28j16M39j85k80m8J07L96n50O4
3198h2j47L14R9m39J34Q3K12k10k06j25N0p2J52k21R9l1L71l03n1K90K74n33K87
3221e5j31J4j17p3j54J4N44n22L08l90J80Q4N9k0O8j32N4J51l67L18l7K01k99
3244c02j73K6Q0J17k4Q1j23K86n76L63L6K84j88j34k72J49O73j24k89J29k31J85
3266b7l7%J0K84k46l7K68k01K68l69K13k00N8J79n9m9m5L67j47J48l24P0J82o
3290C00P1k21K3l1J37M6k68J47l5M4k76M71k58L1q7K93l05R6N6K09l98Q3K88j70
3314B46J49l57J25j02J89m86J85L41j06j66r0J65j7K19m39K87J01j6l36m6p8P2
$$ plain form
3336 -160 -2 112 -242 -249 -119 -44 17 -358 -388 -427 -109 -36 -234 -206 -269 -219 -316 -498 -172 -185 -128 -417 -298 -226 -563
3361 -563 -249 -196 -69 -190 -264 -61 -385 -333 -16 170 -294 -297 -230 -216 -324 -153 -68 -252 -67 -6 14 -270 -248 66
3385 66 -592 -131 146 167 109 -302 -255 377 286 215 20 183 168 -28 -82 96 155 320 69 85 107 198 189 126 59
3410 59 -87 397 16 143 145 526 599 358 404 323 172 323 421 337 272 227 431 285 328 203 402 246 264 288
3434 288 136 323 376 37 105 56 217 95 140 -36 147 418 203 215 -23 206 -137 -61 -60 89 335 166 -39
3457 -39 -62 -153 -471 -229 -50 128 229 81 -123 -119 -280 163 75 -184 -219 -555 -128 -364 -388 -527 -625 -343 -308
3480 -308 -4 -438 -77 33 91 -387 -23 -209 -233 -259 -168 -297 -351 -68 -188 -343 55 -109 -297 -426 -177 148
3502 148 -53 -171 -179 -360 28 40 32 -103 -176 -219 -321 -211 -251 -111 -61 -246 43 68 76 -82 -62 34 400 88 -51
$$ packed form
3336a60J58J14l54pJ30P5O1l75l0l9L18P3j98K8o3N0r7j82L26j3N7k89J19P2l37
3361e63L14N3J27j21p4K03l24N2L17J86m64lO7J4j08J71Q5j84J85O1K0k84K2L14
3385F6o58M61K77K1n8m11M7O32r1p1j95J63j5j96n4J78N9J65k51J6K2R1ro3o7
3410E9j46M84l81J27KL81P3k41M6q1j51J51R8q4o5m5K04j46M3j25J99j56J8K4
3434B88j52J87N3l39O8m9J61j22M5j76J83K71k15J2k38K29l43P6JJ49K46j69k05
3457c9k3r1l18K42J79J78J01j48k04Mj61M43q8k59l5l36M27k36k4j39r8K82L5
3480c08L04m34L61J10N8m78L64j86k4k6R1j29n4K83j20j55L98j64j88j29K49L25
3502A48k01j18qj81L88J2qj35p3m3j02J10m0J40N0j85K89K5Qj58K0R6L66l12j39
$$ plain form
3527 -51 121 -78 270 28 -35 18 256 173 119 286 116 26 332 398 307 232 41 213 267 170 371 292 303 44
3551 44 -45 -78 397 221 226 30 210 146 65 345 301 -149 376 357 -32 232 364 500 479 19 -6 542 20 24
3575 24 329 405 513 346 -194 65 199 -76 -309 70 -174 459 16 -278 -146 -536 28 302 172 -16 -60
3596 -60 -324 -428 -184 -253 17 -250 -503 100 -51 -161 -98 8 -377 -304 61 -366 -283 -89 62 -224 -405 -387
3618 -387 -126 -300 -34 -344 -202 13 -237 -296 -438 -209 -40 -207 -150 -454 -211 -87 -185 -323 -338 -79 -126 -102
3640 -102 -64 -73 -261 16 -27 -52 -127 119 117 -119 32 384 220 418 128 -249 273 -29 212 181 397 -12 255
3663 255 -89 -28 37 232 141 262 257 145 368 392 381 181 78 -92 125 -25 222 105 173 268 212 286 334 336 38
3688 38 47 544 207 218 340 56 -58 317 58 115 86 180 99 217 5 54 31 58 -47 -221 245 465 101 -63
$$ packed form
3527e1J72j99L48k42o3N3K38q3n4J67j70r0L06O6r1p5j91J72N4r7K01p9J1k59
3551D4q9l3M75j76Nj96J80o4q1K80m4m50N25j9l89K64J32J36k1m60k5N48n22M
3575B4L05P6J08j67n40K59J34k75k33L79k44O33m43k94J32l90N64K74j30j88m4
3596f0k64j04K44o9K70k67k53O03j51j10O3J06l85P3L65m27Q3J94J51k86j81J8
3618c87K61j74K66l10J42K15k50n9j42K29J69j67N7l04K43J24r8j38j5K59m7K4
3640a02L8rj88K77m3k5p5K46kk36J51L52j64J98k90l77N22l02K41l1K16m09K67
3663B55l44O1O5J95r1J21nj12K23K4j1k00j03j70K17j50K47j17O8R5n6P4M8Kk98
3688C8RM97l37J1J22k84j14L75k59N7k9R4q1J18k12M9k3K7j05j74M66K20l64j64
$$ plain form
3712 -63 -98 -37 86 -10 -63 -113 78 -66 -18 -229 -90 -345 205 123 -67 -263 -111 -144 -406 -65 -16 -171 -458
3735 -458 -375 -448 -422 -282 -270 -373 -260 -169 -541 -127 -63 -387 -130 -122 -338 24 19 -242 -39 -307 -264 -215 -143 -408
3759 -408 -420 -318 -273 -178 -208 -126 -103 -161 -140 -99 -477 243 -167 -105 -49 -157 141 66 161 15 194 57 49 -65 -238
3784 -238 166 86 -151 149 140 483 335 -57 -138 336 75 102 108 147 407 -109 154 226 2 160 81 240 204 200
3808 200 287 540 290 212 -79 420 547 0 122 76 484 264 250 457 82 230 -268 101 359 175 204 307
3830 307 163 89 206 247 67 206 255 87 -110 45 -6 32 -21 -85 -61 -122 -330 -154 76 -428 2 84 -292
3853 -292 -73 14 121 -311 -432 56 26 -164 -217 -247 -271 -173 -221 -366 -53 -137 -473 407 -127 -270 80 -203 -388
3876 -388 -318 -269 -178 136 -171 -207 -290 150 181 -293 -295 -329 -52 -95 -520 -430 -37 -236 -224 79 -101 -151 -171 44 -79
$$ packed form
3712f3l5O1J23r6n3n0J91j44M8k11J39k55N50q2j90j96J52l3k62L41M9j55k87
3735d58Q3p3K6J40J2j03J13R1l72M14O4l24K57Qk16L62nk61K03k68M3M9P2k65
3759d08j2J02M5R5l0Q2K3n8K1M1l78P20m10O2N6j08K98p5R5j46J79j37qj14j73
3784b38M04q0k37L00rL43j48l92q1M74k61K7OL9K60n16K63P2k24J58p9J59l6m
3808B00Q7K53k50p8k91M99J27n47J22m6M08k20j4K07l75J48m98L69K58j84K9J03
3830C07j44p4J17M1j80J39M9j68j97J55n1L8n3o4K4o1k08J76K30n04M30Q2l76
3853b92K19Q7J07m32j21M88l0j90n3l0k4R8m8j45L13q4l36Q80n34j43L50k83j85
3876c88P0M9R1L14l07l6q3M40L1m74kl4K77m3m25R0L93j99J2L03j80n0k0K15j23
$$ plain form
3901 -79 15 24 41 -16 -133 164 -84 21 9 -47 -6 -86 -150 154 -107 -11 -88 -163 -49 11 224 109 -158 194 -87
3926 -87 425 225 -12 -45 52 56 297 181 56 454 350 143 -9 190 24 134 94 2 148 -27 24 411 62
3949 62 -132 276 195 233 131 264 31 213 198 121 340 26 259 -33 225 2 152 -3 -122 -303 194 -59
3971 -59 -195 107 13 -124 -43 -154 3 -51 16 -236 -233 -70 -89 -11 -126 -519 17 161 -54 -454 116 -238 -397
3994 -397 -78 -151 -287 -239 7 -170 -359 -206 -295 -174 -387 -182 -337 -83 -104 -211 -107 -121 216 -162 -157 -241 -139
4017 -139 -82 -124 183 -13 16 -207 -19 -118 9 190 -275 65 -72 -198 -196 -135 -313 153 253 -279 151 121 20
4040 20 -159 72 101 -11 158 235 123 302 187 11 -12 -10 91 179 258 229 89 196 92 251 225 192 198 597
4064 597 54 141 146 71 253 412 54 482 79 209 374 252 504 -217 311 -73 50 148 -130 37 10 61
$$ packed form
3901g9R4RJ7n7j17K97k48J05j2n6M1q0o4L04k61R6p7p5J14O0K13j15k67L52k81
3926h7N12k00k37l3R7MK41j16j25L98j04k07j52J99j66J10m0r2J46j75N1L87l49
3949F2j94M08q1L8j02J33k33J82j5p7K19l14K33k92K58k23J50j55j19j81M97k53
3971e9j36L02r4j37Q1j11J57n4O7k52LJ63j9P8j15l93N36J44k15m00N70l54j59
3994c97L19p3j36M8K46j77j89J53q9J21k13K05j55K54k1j07J04j4L37l78Nq4J02
4017a39N7m2L07j96K9k23J88r9J27J81m65L40j37j26KO1j78M66J00n32M30l0j01
4040B0j79K31K9j12J69P7j12J79j15j76k3KJ01Q8P9k9j40J07j04J59k6l3OL99
4064E97n43Q7Np5J82J59l58M28m03J30J65j22K52p21N28l84J23R8k78J67k7N1
$$ plain form
4086 61 -10 182 -75 -268 27 -25 -87 73 45 31 -99 272 113 32 85 -43 129 -214 -18 212 -107 -308 -324
4109 -324 33 -151 -131 42 -315 179 -246 -88 -202 220 -40 -215 -395 -209 -151 188 -281 -159 -222 -69 37
4130 37 -45 -227 69 -77 -108 -27 -65 -115 -296 -365 -272 -276 -326 70 -288 -91 -239 -81 -112 -149 -104 -112 23 -43 -252 -107
4156 -107 6 -210 -121 -237 -222 68 204 -285 -172 89 -131 86 -48 -120 142 191 119 -80 189 194 124 110 181
4179 181 265 -232 -19 -25 154 211 53 286 469 -97 159 166 77 54 101 -21 186 87 283 475 87 493 71
4202 71 66 447 116 187 301 32 1 151 440 197 95 46 295 116 43 -55 45 92 -248 39 -26 16 305 221
4226 221 84 -206 -173 76 -214 43 357 -241 -33 -198 47 -255 32 -212 -204 324 241 -291 -195 -332 138 -104
4248 -104 -162 -347 -307 -201 202 14 -34 -360 -299 -365 -329 -297 -329 -78 -121 -223 -344 -268 26 -248 -215 -220 -493 -120
$$ packed form
4086F1p1J92k57j93K95n2o2J60k8j4j30L71j59q1N3j28J72l43J96K30l19k01j6
4109c24L57j84K0J73l57M94m25J58j14M22k60j75j80J86N8L39m69J22o3J53J06
4130C7q2j82K96j46l1Q1l8n0j81o9R3mn0L96l58J97j48J58l1l7M5qJ35o6k09J45
4156a07J13k16Q9j16J5K90J36m89J13K61k20K17j34p2K62M9p2j99K69Np0j4P1
4179A81Q4m97K13oJ79N7j58K33J83n66K56Pq9k3M7j22K07r9J96J92l88M06m22
4202G1nL81l31P1J14k69l1J50K89k43j02m9K49j79p3r8J00M7l40K87o5M2K89q4
4226B21j37k90L3K49k90K57L14n98K08j65K45l02K87k44QN28q3n32R6j37M70k42
4248a04n8j85M0J06M03j88m8l26O1o6L6L2l2K51m3j02j21P6K94k74L3nk73L73
$$ plain form
4272 -120 -379 -428 -183 -414 132 -124 35 -227 -75 -38 -158 72 -65 259 -249 22 101 448 299 81 -11
4293 -11 25 136 -18 -202 -39 7 244 77 -106 82 213 -29 109 -1 32 373 -49 251 0 135 179 296
4315 296 246 117 160 -58 -154 75 316 212 100 108 288 54 353 254 67 10 222 157 240 28 91 384 115
4338 115 272 269 -55 390 301 -32 -98 -8 258 32 167 -160 177 -115 -99 93 -351 153 91 -139 -65 228 125
4361 125 -170 277 93 -335 -41 135 -36 84 -166 -133 259 141 48 35 57 -258 58 -419 -310 -177 -287
4382 -287 -51 -141 -382 -93 -110 -66 -142 -212 -102 -356 -110 -42 -202 -196 -260 -536 -31 -56 -16 -201 -175 -47 -38 -35 35 -277
4408 -277 -78 125 -196 -38 33 24 -215 -145 120 -85 12 -194 -182 -170 -195 92 -237 -12 34 417 274 69 396
4431 396 198 -40 120 -44 -76 272 8 157 -374 74 354 51 110 280 342 312 181 -72 288 246 1 203
$$ packed form
4272a20k59m9K45k31N46k56J59k62J52L7j20K30j37L24n08K71P9L47j49k18r2
4293a1L6J11j54j84J63M6K37j67j83J88J31k42J38j10L3L41m22L00k51J35M4J17
4315B96n0j29M3k18r6K29K41j04j12QJ80k34K99r9j87n7K12o5Q3k12O3K93k69
4338A15J57ll24M45q9l33o6R0K66k26J35l27L37k92J6J92m44N04o2k30P4K93j03
4361A25k95M47j84m28K94J76j71J20k50L3L92j18r3j3K2l15L16m77J09J33j10
4382b87K36r0k41K89j7M4p6p0J10k54K46O8j60Oo4k76N05k5M0j85K6J28RLP0l12
4408b77J99K03l21J58P1rk39P0K65k05R7k06J2J2k5K87l29K25M6L83j43k05L27
4431C96j98k38J60j64l2L48k64J49n31M48K80l03N9J70O2l0j31k53L60m2k45K02
$$ plain form
4453 203 10 -22 345 -47 -18 74 366 153 -59 -73 44 190 96 375 -227 199 184 121 240 336 209 149 278
4476 278 -226 332 157 -18 23 117 99 164 -19 61 -107 188 -129 135 -210 -149 69 -1 -328 -77 -418 -210
4498 -210 189 32 -262 -313 -104 -153 -81 -17 -114 -39 -226 -65 -131 -289 -43 -61 -147 -162 -68 -224 -226 -288 -308 -174 -223
4523 -223 43 -143 -35 -48 -366 -398 122 -304 -284 109 -17 -100 72 -183 -50 -223 -59 11 12 70 -96 -23 273
4546 273 -213 268 -349 -44 86 -505 -36 -142 142 81 -91 -149 -53 -183 100 -41 -208 35 215 384 17
4567 17 6 285 229 228 -153 262 117 60 49 109 117 124 137 173 54 50 246 -77 126 -26 201 -49 -167 451 111
4592 111 234 -32 266 261 195 17 -212 -156 233 -79 -26 75 -324 167 -62 -39 -9 -224 137 -74 -2 57 -6
4615 -6 357 49 -195 -8 107 167 318 116 -314 -74 228 21 -75 27 -104 -176 -4 -412 -101 120 -69 -221
$$ packed form
4453B03j93l2L67l92K9R2K92k13k12j4J17J46r4K79o02M26j5o3J19R6j27o0J29
4476B78n04N58j75j75M1R4j8O5j83Q0j68K95l17K64l45O1K18p0l27K51l41K08
4498b10L99j57k94n1K09m9P2O4r7P5j87J61o6j58K46j8q6j5R4j56ko2k0J34m9
4523b23K66j86J08j3l18l2N20m26K0L93j26q3J72k55J33j73J64P0JN8j66P3K96
4546B73m86M81o17L05J30n91M69j06K84o1j72n8R6j30K83j41j67K43J80J69l67
4567A7j1K79n6jl81M15j45n7j1O0QPJ3L6j19mJ96l23K03j52K27k50j18O18l40
4592A11J23k66K98no6j78k29N6L89l12N3J01l99M91k29K3L0k15L61k11P2N9o3
4615fL63l08k44J87J15O0J51k02m30K40L02k07r6J02j31p2J72m08L11K21j89j52
$$ plain form
4637 -221 -126 -221 -190 3 -9 199 -330 -552 -336 -526 -281 -150 -133 -192 46 -273 -66 -180 -56 51 -148 -211
4659 -211 226 -157 -78 27 -73 -7 -346 -101 -24 31 -58 -152 165 -229 -33 -112 -285 -259 356 87 -28 -117 -420
4682 -420 -42 -166 -187 -1 170 16 7 -29 221 75 133 -121 -119 367 417 30 145 163 21 -90 332 198 0
4705 0 159 47 -185 157 200 -72 332 320 302 -200 245 153 -154 515 132 259 116 203 233 351 161 160 198 237
4729 237 -83 -149 228 -105 232 123 -2 71 -41 109 35 174 127 203 53 -169 -90 -119 -90 138 -305 -275 -162
4752 -162 363 -194 -75 -142 -228 -206 321 -95 -147 40 -269 235 -36 32 164 -135 -224 -101 -216 44 38 -71 76
4775 76 49 -138 -84 -104 -97 -132 -188 -39 -122 123 19 -396 256 -87 124 199 -124 -139 -178 -91 52 -138 -140 58 188
4800 188 -113 -272 -43 -172 -92 41 -482 1 -268 182 16 -60 136 224 -77 -134 171 218 97 55 21 -94
$$ packed form
4637b21R5r5L1J93j2K08n29k22K16j90K45J31J7n9K38l19K07j14J24J07j99o3
4659b11M37l83P9J05j00O6l39K45P7N5q9r4L17l94J96p9j73K6O15k69j15q9l03
4682d20L78j24k1J86J71j54rl6K50j46N8k54KM86N0l87J15J8j42j11M22j34j98
4705@J59j12k32L42M3k72M04j2j8n02M45r2l07O69l83J27j43Q7L0J18j90jL8L9
4729B37l20o6L77l33L37j09j25P3j12J50p4J39m7P6j50k22P9k9K9K28m43L0J13
4752a62N25n57J19o7q6K2N27m16n2J87l09N04k71O8J32k99q9J23j15K60oj09J47
4775G6k7j87N4k0Pl5n6J49q3K45j04m15O52l43K11P5l23j5l9Q7J43j90kJ98J30
4800A88l01j59K29j29Q0J33n23M83k69M50j66p6J96Q8l01n7L05M7j21m2l4j15
$$ plain form
4822 -94 -78 55 79 142 82 86 105 -69 135 311 304 104 -41 25 317 287 -57 -20 126 31 -40 27 204 123 305 387
4848 387 173 5 -77 256 220 -25 101 177 56 -61 81 -69 297 60 124 129 114 130 48 52 73 -20 7 119 58
4873 58 -124 -58 154 170 -115 -44 92 -8 322 28 87 -211 -252 -53 60 -14 -183 -114 -384 81 -131 210 -220
4896 -220 -344 -333 -452 -7 -57 20 -314 -94 11 -51 -43 -345 -40 -110 -191 211 -60 117 -149 -355 -215 117 5
4919 5 -417 153 -170 -114 -133 -181 -196 -10 60 23 -142 -83 -184 131 -102 -249 88 -133 -28 -167 -49 -245 -160
4942 -160 79 -10 173 199 -151 40 312 223 333 220 1 60 234 176 68 267 44 -68 100 123 -83 -294
4964 -294 255 -78 103 359 -71 123 205 457 -266 19 309 96 88 -135 -19 76 -167 4 163 308 268 174
4986 174 55 101 112 149 123 241 -87 -83 157 -108 -288 121 96 134 79 57 32 88 85 -46 -149 44 -100 63 -195
$$ packed form
4822i4J6J33K4O3o0MJ9j74K04J76pk00j45O6K92l0l44L7J46r5p1O7J77q1J82Q2
4848C87k14j68q2L33l6k45J26P6j21j17J42j50L66k37O4Nj5J6q2MK1r3K7J12o1
4873E8j82O6K12J6k85P1J36j00L30k94N9k98m1J99J13p4j69O9k70M65k12L41m30
4896b20j24J1j19M45n0P7l34K20J05o2Ql02L05p0q1M02k71J77k66k06J40L32j12
4919Em22N70l23N6j9m8j5J86P0l7j65N9j01L15k33j47L37k21J05j39J18j96Q5
4942a60K39q9J83K6l50J91K72q9J10j13k19N9J74n8j08J99k23j12J68K3k06k11
4964b94N49l33J81K56m30J94Q2K52p23K85K90k13qk23J16R5k43J71J59J45m0r4
4986A74j19M6J1L7k6J18l28MK40k65j80M09k5L8n5k2k5N6lj31j03J93j44J63k58
$$ plain form
5011 -195 -324 359 -408 58 -19 124 -49 -155 -168 -260 61 -97 62 -53 92 45 -118 27 -20 -242 157 35
5033 35 -274 -239 7 -319 -131 -130 -21 -160 0 -246 4 -62 204 -117 -385 -130 105 54 26 -316 -34 39 -97
5056 -97 -307 -228 -320 -178 -60 -29 109 -57 104 -138 78 209 64 206 -258 194 -90 27 293 -136 105
5077 105 -113 15 -175 124 442 356 148 -61 -150 68 -4 207 110 18 139 344 232 -8 210 472 137 96
5099 96 -82 6 70 229 -7 -101 52 -210 106 103 168 116 -201 21 82 48 76 222 -87 -82 66 174 329 -38
5123 -38 233 266 162 -14 191 -64 286 282 -12 133 -202 -35 123 204 -197 97 -66 -43 -294 -118 -52 -85 32
5146 32 44 223 -271 -24 21 56 -91 50 -35 -206 -150 12 -91 -189 -129 -218 64 -25 -190 -214 -85 -66 -60 -234 25
5171 25 -277 -106 -327 -29 -28 -54 151 99 -65 45 -289 -169 57 -7 391 89 191 -102 -104 11 78 -216 252
$$ packed form
5011a95j29O83p67M66p7J43j73j06j3r2L21j58J59j15J45m7j63J45m7k22L99j22
5033C5l09L5K46l26J88JJ09j39J60k46K50o6K66l21k68K55K35n1k8l42K82P3j36
5056i7k10P9r2J42J18L1J38j66J61k42K16J31j45J42m64M52k84J17K66m29K41
5077A05k18J28j90K99L18q6k08k09q9K18p2K11r7r2J21K05j12k40K18K62l35m1
5099I6j78Q8O4J59k36r4J53k62L16lO5n2l17K22O1l4K8J46l09NJ48J08J55l67
5123c8K71L3j04j76K05k55L50mk94J45l35J67J58Q1m01K94j63K3k51J76O6l3J17
5146C2J2J79m94K47M5L5j47J41q5j71N6J62j03r8O0q9K82q9j65k4J29J9Oj74K59
5171B5l02J71k21K98Jk6K05n2j64J10l34J20K26o4L98l02J02k93kJ15O7k94M68
$$ plain form
5194 252 39 188 158 136 280 510 136 169 -280 172 -14 -102 -18 -61 116 -56 57 114 -153 -51 -253 203
5216 203 304 -8 247 83 46 -180 -37 280 73 -143 171 -104 84 269 159 359 -195 -30 326 -164
5236 -164 -212 171 125 279 306 171 86 78 290 -107 -57 -153 127 -156 33 52 250 -199 79 -250 -53 73 -179
5259 -179 128 -276 139 1 67 -215 -45 0 -7 -42 115 126 38 9 -21 -359 -115 -234 -219 -36 -357 -106 -14 -136
5283 -136 -103 -218 -197 -241 -355 7 -28 -68 -240 44 -116 -32 -203 -284 -200 -121 -194 -237 130 -153 -43 -51 -74 -285 259
5308 259 -200 -338 104 -67 105 -114 -41 12 -101 42 -49 -36 63 -381 -99 -56 -54 263 -21 232 -238 -90 -86
5331 -86 -112 -245 152 39 199 -233 336 -146 -92 12 -283 154 186 30 77 254 71 6 2 104 -5 365 134
5354 134 164 -39 -103 369 -1 138 231 181 -27 34 309 42 169 105 -69 -206 200 132 80 -42 -99 156 187
$$ packed form
5194B52k13J49l0k2J44K30l74L3m49M52j86q8Q4m3J77j72J13N7k67J02k02M56
5216B03J01l12K55j64l7k26J43L17k07k16L14k75J88J85j10K00n54J65L56m90
5236a64m8L83m6J54K7j35q5qK12l97N0r6K80k83J89J9J98m49K78l29J97J26k52
5259a79L07m04M15j38O6k82J70M5pl5J57J1q8k9l0l38K44j19J5J83l21K51R2j22
5283a36L3j15K1m4j14L62l5m0j72K84j60Q4j71q1Q4P9p3m3L67k83J10qk3k11N44
5308B59m59j38M42j71J72k19P3N3j13J43r1J3R9m44K82M3KL17k84K53m70J48M
5331h6k6j33L97j13J60m32N69m82N4J04k95M37L2j56M7J77j83o5mJ02j09L70k31
5354A34L0k03o4M72l70J39R3n0k08O1K75k67J27o4j74j37M06o8n2j22n7K55L1
$$ plain form
5377 187 74 7 66 103 -64 -18 272 -187 -95 157 -34 -9 234 -437 -105 -3 -143 199 -95 -19 -268 133
5399 133 -193 7 -34 4 24 19 10 -2 94 -126 -134 -134 -71 -47 -47 -235 125 70 -124 -437 -194 152 123 89 -38 23 -315
5426 -315 -233 -2 299 -116 84 -111 199 -192 -299 179 -121 315 413 -307 -65 59 -289 -83 -132 -257 194
5447 194 85 -3 -12 195 128 7 82 -105 -107 -5 152 -180 73 116 -73 336 105 26 197 219 395 -5 204
5470 204 -143 59 131 -54 0 90 -109 104 125 89 45 -157 140 136 61 154 -56 -230 252 273 336 146 476 -191
5494 -191 -45 -127 -27 46 -165 -52 -18 -102 266 387 105 -264 194 179 298 -88 40 103 342 -5 4 241 40
5517 40 207 247 28 50 289 272 188 -200 -138 -38 146 25 -86 -201 -67 -59 17 -326 171 177 -78 -94 -5 -186
5541 -186 -329 -18 -83 69 82 124 -124 -214 -311 -68 -74 -26 6 -89 -57 -334 122 -233 -123 -165 -303 234 -190 -33
$$ packed form
5377A87j13o7N9L7j67M6K90m59R2K52j91K5K43o71L32J02j40L42k94P6k49M01
5399A33l26K00m1L8K0nrj2R6k20q%O3K4%j88L60n5j94l13K43L46k9l4j27O1l38
5426c15Q2K31L01m15K00j95L10l91j07M78l00M36R8p20K42J24l48K06m9j25M51
5447A94j09q8rK07o7j21P5j87kJ02J57l32K53M3j89M09k31p9J71K2J76m00K09
5470B04l47K02P2j85N4R0j99K13K1l6m4k02K97mp5R3k10j74M82K1O3j90L30o67
5494a91J46q2J00P3k11J13L4q4L68J21k82l69M58j5J19l86J28O3K39l47RK37k01
5517D0J67M0k19K2K39j7q4l88O2J00J84j21j11j15J34QP6l43M97Ok55j6Q9j81
5541a86j43L11o5J52J3M2k48r0r7K43oM8L2r5L2k77M56l55J10m2j38N37m24J57
$$ plain form
5565 -33 -24 -152 -160 -47 128 31 -165 -244 23 -293 -90 -203 55 229 -102 51 8 277 -90 206 -187 19 95
5588 95 -210 17 -135 -61 -1 -151 -18 -16 76 269 362 -75 17 12 366 -106 -45 516 -176 101 -82 145 90 102
5612 102 -4 445 89 61 222 -150 280 431 114 -81 218 12 147 234 45 73 104 -256 185 -311 63
5633 63 -137 -73 70 -77 -183 -198 -38 71 159 133 -67 -191 -44 236 -79 289 -162 -4 213 3 -50 106
5655 106 -87 -134 -160 204 -66 49 117 -42 256 -22 -95 -356 -40 -41 -271 -43 122 -222 -278 -122 -425 -274
5677 -274 -86 291 -47 235 -422 -218 24 -206 -137 -226 -201 -369 -31 -68 196 110 -71 -370 54 136 -58 -306
5699 -306 -31 -56 -172 -144 92 -72 331 85 -157 -78 61 -39 164 -4 -9 -148 208 167 68 78 104 200 64
5722 64 201 91 183 -39 137 125 -113 373 29 -70 -181 172 -83 12 207 376 55 272 211 -285 -27 14
$$ packed form
5565c3Rj28qJ13J75r7j96p9K67l16K03j13K58J74l31J53m3K69l67K96l93K06P6
5588I5l05K27j52P4O0j50J33KR2J93R3m37R2nL54m72O1N61o92K77j83K27n5J2
5612A02j06M49l56k8J61l72M30J51l17j95K99k06J35Q7j89K8L1l60M41m96L74
5633F3k00O4J43j47j06j5J60J09Q8k6k00j24J47K80l15L68m51J58K17k10n3J56
5655A06j93m7k6L64k70J15O8j59K98k78p3k61L16jk30K28J65l44n6J56l03J51
5677b74J88L77l38K82o57K04K42k30O9q9K5j68L38l7K64q6j81k99M24Q2j94k48
5699c06K75k5j16K8K36j64M03k46k42P9J39j00K03j68nj39L56m1r9J0K6R6j36
5722F4J37j10R2k22J76j2k38M86l44r9j11L53k55R5J95J69l21K17o1m96K58M1
$$ plain form
5744 14 -131 125 28 -203 94 166 -26 -122 128 328 -56 8 -257 -105 211 7 182 48 208 101 1 101
5766 101 20 58 130 -49 -150 -265 -195 33 235 100 -105 202 -188 -155 -457 -348 -128 119 -95 -35 267 -71
5788 -71 -54 -97 -1 -195 -347 -19 -116 173 -31 -58 54 209 -48 165 156 -363 -126 -159 -255 -118 111 -62 -253
5811 -253 339 -32 23 -159 36 0 -94 183 -171 -206 117 -371 -232 143 96 -47 -197 72 353 -16 163 -55
5833 -55 -49 -9 131 -5 -22 27 -83 -104 -27 -54 116 250 -1 135 -86 -3 82 -43 -156 -234 67 293 247 -164
5857 -164 228 197 167 -7 150 109 -56 -220 -25 190 -14 67 25 -38 394 39 48 154 132 256 375 -237 131
5880 131 221 -74 -131 -30 -60 97 -97 -73 -317 -76 229 199 -164 222 -202 8 -190 2 111 211 -180 -14
5902 -14 -41 -35 102 70 82 40 115 -53 32 -506 -160 -104 -299 -34 -87 139 -400 65 205 -446 102 -107 -270 -25
$$ packed form
5744A4j45K56r7k31K97P2j92r6K50K00l84O4k65J52L16k04J75j34J60j07j00J00
5766A01q1L8P2j79j01j15P0K28K02j35k05L07l90L3l02J09K20K47k14O0L02l38
5788g1J7m3R6j94j52L28r7K89k04k7J12J55k57K13rn19K37l3r6J37K29j73j91
5811b53N92l71N5j82J95l6r4K77l54l5L23m88J39L75m7j43j50K69K81l69J79k18
5833e5OM0J40j36j7M9j10k1P7k7J70J34k51J36k21Q3Q5j25j13p8L01K26m6m11
5857a64L92l1l0j74J57m1j65j64J95K15k04Q1m2o3M32l55RJ06k2J24J19o12L68
5880A31R0k95n7J01l0J57j94K4k44K41L05l0l63L86m24K10j98J92J09J00l91J66
5902a4k7OJ37l2J2m2P5j68Q5n38L46N6j95K65n3K26n39M65J40o51N48k09j63K45
$$ plain form
5926 -25 -136 -402 -632 -9 122 50 -236 -203 -120 -59 44 -95 -175 200 -8 90 -2 -50 -293 -83 -138 70 -135
5949 -135 205 -122 -14 168 24 229 298 -163 -1 -248 64 19 195 13 54 -62 -75 -34 4 -48 76 53 -78
5972 -78 339 -172 -29 -389 61 113 336 -11 -220 -48 -110 47 130 157 128 -75 258 -95 243 -15 79 -61
5994 -61 254 -105 -23 115 -137 67 1 59 -167 198 21 -60 66 248 23 -6 -57 154 106 241 130 -46 125
6017 125 -45 142 160 73 162 -142 -184 205 -189 -118 236 68 88 -101 -132 99 -118 79 -21 284 -165 -235 -216
6040 -216 -46 153 -37 -90 -229 12 92 121 -237 -119 -143 -119 105 -114 257 -122 -58 -1 -154 102 9 -189 -74
6063 -74 157 -83 182 -99 220 -193 -9 -148 -41 -213 173 -129 -58 150 -310 211 -107 152 67 -98 -38
6084 -38 -25 -52 -70 -8 -110 5 127 -109 -133 -338 -121 -115 109 188 -240 -29 192 107 92 112 322 149 -94 301
$$ packed form
5926b5j11k66k30O23J31p2k86L3Q3O1J03j39q0L75k08R8r2m8k43K10n5K08k05
5949a35L40l27J08J82j44K05O9m61J62k47L12m5J76j82M1j16j3M1L8n2J24k3j31
5972g8M17n11J43l60M50N2K23l47k09J72o2J57Q3K7k9k03L33l53L38k58R4j40
5994f1L15l59Q2J38k52K04o6N8k26L65j77q1J26J82k25k9n1K11m8J35j11j76J71
6017A25j70J87J8q7Q9l04m2L89l94P1L54j68K0j89l1K31k17J97j00L05m49p0J9
6040b16J70J99j90n3j39K41Q0K9l58J18k4K4K24k19L71l79O4N7j53K56r3j98J15
6063g4K31k40K65k81L19m13J84j39J07j72L86l02P1K08m60N21l18K59q5j65O0
6084c8J3k7j8O2j02J15J22k36k4k05K17OK24P9m28K11K21q5j5K0K10j73k43L95
$$ [...]
8191f6
##END NTUPLES=NMR FID
##END=
