##TITLE=1H_LR-713_CR8
 CDCl3, 8 sc, 
 9.7.2020
##JCAMPDX= 6.0         $$ Bruker NMR JCAMP-DX V2.0
##DATA TYPE= NMR FID
##DATA CLASS= NTUPLES
##ORIGIN= UXNMR, Bruker Analytische Messtechnik GmbH
##OWNER= root
$$ XWIN-NMR		Version 3.5
$$ Thu Jul  9 10:26:29 2020 Russian Standard Time (UT+4h)  she@DPX200
##.OBSERVE FREQUENCY= 200.1315
##.OBSERVE NUCLEUS= ^1H
##.DELAY= (6, 6)
##.ACQUISITION MODE= SIMULTANEOUS
##.ACQUISITION SCHEME= undefined
##.AVERAGES= 8
##.DIGITISER RES= 18
##SPECTROMETER/DATA SYSTEM= spect
##.PULSE SEQUENCE= zg30
##.SOLVENT NAME= CDCl3
##.SHIFT REFERENCE= (INTERNAL, CDCl3, 0, 15.7039)
##AUDIT TRAIL= $$ (NUMBER, WHEN, WHO, WHERE, WHAT)
$$ ##TITLE= Audit trail, XWIN-NMR		Version 3.5
$$ ##JCAMPDX= 5.01
$$ ##ORIGIN= Bruker BioSpin GmbH
$$ ##OWNER= she
$$ F:/spectra/data/she/nmr/H-F/1/audita.txt
$$ ##AUDIT TRAIL=  $$ (NUMBER, WHEN, WHO, WHERE, WHAT)
(   1,<2020-07-09 10:25:33.50 +0400>,<she>,<DPX200>,
      <created by zg, POWCHK disabled, PULCHK disabled
       configuration hash MD5:
       00 E9 B6 7A A2 85 ED C7 34 08 36 98 17 FE 4E 26
       data hash MD5: 16K
       14 53 2C 23 EF 97 AE F2 AE 45 EA 3A 31 89 EF C1>)
$$ ##END=
$$ 
$$ hash MD5
$$ 82 22 C2 E1 8B 20 3F 48 20 F8 3A 76 A6 9E 5A 36
##$RELAX= 
##$RELAX= 
##$RELAX= 
##$RELAX= 
##$RELAX= 
##$RELAX= 
$$ Bruker specific parameters
$$ --------------------------
##$DU= <F:/spectra>
##$EXPNO= 1
##$NAME= <H-F>
##$PROCNO= 1
##$TYPE= <nmr>
##$USER= <she>
##$AMP= (0..31)
100 100 100 100 100 100 100 100 100 100 100 100 100 100 100 100 100 100 
100 100 100 100 100 100 100 100 100 100 100 100 100 100 
##$AQSEQ= 0
##$AQ_mod= 1
##$AUNM= <au_zg>
##$AUTOPOS= <>
##$BF1= 200.13
##$BF2= 200.13
##$BF3= 200.13
##$BF4= 200.13
##$BF5= 200.13
##$BF6= 200.13
##$BF7= 200.13
##$BF8= 200.13
##$BYTORDA= 1
##$CFDGTYP= 0
##$CFRGTYP= 5
##$CHEMSTR= <none>
##$CNST= (0..31)
1 1 145 1 1 1 1 1 1 1 1 1 1 1 1 1 1 1 1 1 1 1 1 1 1 1 1 1 1 1 1 1 
##$CPDPRG= <>
##$CPDPRG1= <>
##$CPDPRG2= <>
##$CPDPRG3= <>
##$CPDPRG4= <mlev>
##$CPDPRG5= <mlev>
##$CPDPRG6= <mlev>
##$CPDPRG7= <mlev>
##$CPDPRG8= <mlev>
##$CPDPRGB= <>
##$CPDPRGT= <>
##$D= (0..31)
0 1.2 0 0 0 0 0 0 0 0.06 0 0.03 0 0 0 0 0.0002 0 0 0 0 0 0 0 0 0 0 0 0 
0 0 0 
##$DATE= 1594275932
##$DBL= (0..7)
120 120 120 120 120 120 120 120 
##$DBP= (0..7)
150 150 150 150 150 150 150 150 
##$DBP07= 0
##$DBPNAM0= <>
##$DBPNAM1= <>
##$DBPNAM2= <>
##$DBPNAM3= <>
##$DBPNAM4= <>
##$DBPNAM5= <>
##$DBPNAM6= <>
##$DBPNAM7= <>
##$DBPOAL= (0..7)
0.5 0.5 0.5 0.5 0.5 0.5 0.5 0.5 
##$DBPOFFS= (0..7)
0 0 0 0 0 0 0 0 
##$DE= 6
##$DECBNUC= <off>
##$DECIM= 24
##$DECNUC= <off>
##$DECSTAT= 4
##$DIGMOD= 1
##$DIGTYP= 9
##$DL= (0..7)
0 120 120 120 120 120 120 120 
##$DP= (0..7)
150 150 150 150 150 150 150 150 
##$DP07= 0
##$DPNAME0= <>
##$DPNAME1= <>
##$DPNAME2= <>
##$DPNAME3= <>
##$DPNAME4= <>
##$DPNAME5= <>
##$DPNAME6= <>
##$DPNAME7= <>
##$DPOAL= (0..7)
0.5 0.5 0.5 0.5 0.5 0.5 0.5 0.5 
##$DPOFFS= (0..7)
0 0 0 0 0 0 0 0 
##$DQDMODE= 0
##$DR= 18
##$DS= 0
##$DSLIST= <SSSSSSSSSSSSSSS>
$$ [...]
##$SUBNAM2= <"">
##$SUBNAM3= <"">
##$SUBNAM4= <"">
##$SUBNAM5= <"">
##$SUBNAM6= <"">
##$SUBNAM7= <"">
##$SUBNAM8= <"">
##$SUBNAM9= <"">
##$SW= 24.9337058887773
##$SWIBOX= (0..15)
0 0 2 0 0 0 0 0 0 0 0 0 0 0 0 0 
##$SW_h= 4990.01996007984
##$TD= 16384
##$TD0= 1
##$TE= 0
##$TE2= 300
##$TE3= 300
##$TEG= 300
##$TL= (0..7)
0 120 120 120 120 120 120 120 
##$TP= (0..7)
150 150 150 150 150 150 150 150 
##$TP07= 0
##$TPNAME0= <>
##$TPNAME1= <>
##$TPNAME2= <>
##$TPNAME3= <>
##$TPNAME4= <>
##$TPNAME5= <>
##$TPNAME6= <>
##$TPNAME7= <>
##$TPOAL= (0..7)
0.5 0.5 0.5 0.5 0.5 0.5 0.5 0.5 
##$TPOFFS= (0..7)
0 0 0 0 0 0 0 0 
##$TUNHIN= 0
##$TUNHOUT= 0
##$TUNXOUT= 0
##$USERA1= <user>
##$USERA2= <user>
##$USERA3= <user>
##$USERA4= <user>
##$USERA5= <user>
##$V9= 5
##$VALIST= <valist>
##$VCLIST= <CCCCCCCCCCCCCCC>
##$VD= 0
##$VDLIST= <DDDDDDDDDDDDDDD>
##$VPLIST= <PPPPPPPPPPPPPPP>
##$VTLIST= <TTTTTTTTTTTTTTT>
##$WBST= 1024
##$WBSW= 4
##$XGAIN= (0..3)
0 0 0 0 
##$XL= 0
##$YL= 0
##$YMAX_a= 219682
##$YMIN_a= -92354
##$ZGOPTNS= <>
##$ZL1= 120
##$ZL2= 120
##$ZL3= 120
##$ZL4= 120
##$ABSF1= 10
##$ABSF2= 0
##$ABSG= 5
##$ABSL= 3
##$ALPHA= 0
##$AQORDER= 0
##$ASSFAC= 0
##$ASSFACI= 0
##$ASSFACX= 0
##$ASSWID= 0
##$AUNMP= <proc_1d>
##$AZFE= 0.1
##$AZFW= 0.1
##$BCFW= 1
##$BC_mod= 2
##$BYTORDP= 1
##$COROFFS= 0
##$CY= 11.3945322036743
##$DATMOD= 1
##$DC= 2
##$DFILT= <>
##$DTYPP= 0
##$F1P= 16.9975609425685
##$F2P= -3.02152046262296
##$FCOR= 0.5
##$FTSIZE= 0
##$FT_mod= 4
##$GAMMA= 1
##$GB= 0.15
##$INTBC= 1
##$INTSCL= 1
##$ISEN= 128
##$LB= 0.24
##$LEV0= 0
##$LPBIN= 0
##$MAXI= 10000
##$MC2= 0
##$MEAN= 0
##$ME_mod= 0
##$MI= 1.114404
##$NCOEF= 0
##$NC_proc= 0
##$NLEV= 6
##$NOISF1= 3.799351
##$NOISF2= 2.8
##$NSP= 1
##$NTH_PI= 0
##$NZP= 0
##$OFFSET= 15.70392
##$PC= 1
##$PHC0= -9790.882
##$PHC1= 13.40085
##$PH_mod= 1
##$PKNL= yes
##$PPARMOD= 0
##$PSCAL= 0
##$PSIGN= 0
##$REVERSE= no
##$SF= 200.130013532006
##$SI= 16384
##$SIGF1= 3
##$SIGF2= 2
##$SINO= 400
##$SIOLD= 16384
##$SREGLST= <1H.CDCl3>
##$SSB= 0
##$STSI= 0
##$STSR= 0
##$SW_p= 3612.71676300578
##$SYMM= 0
##$S_DEV= 0
##$TDeff= 0
##$TDoff= 0
##$TI= <>
##$TILT= no
##$TM1= 0
##$TM2= 0
##$TOPLEV= 0
##$USERP1= <user>
##$USERP2= <user>
##$USERP3= <user>
##$USERP4= <user>
##$USERP5= <user>
##$WDW= 1
##$XDIM= 8192
##$YMAX_p= 0
##$YMIN_p= 0
$$ End of Bruker specific parameters
$$ ---------------------------------
##NTUPLES= NMR FID
##VAR_NAME=  TIME,          FID/REAL,        FID/IMAG
##SYMBOL=    X,             R,               I
##VAR_TYPE=  INDEPENDENT,   DEPENDENT,       DEPENDENT
##VAR_FORM=  AFFN,          ASDF,            ASDF
##VAR_DIM=   8192,          8192,            8192
##UNITS=     SECONDS,       ARBITRARY UNITS, ARBITRARY UNITS
##FACTOR=    0.0002004,     1,               1
##FIRST=     0,             0,               0
##LAST=      1.6414764,     0,               0
##MIN=       0,             -92354,          0
##MAX=       1.6414764,     219682,          0
$$ Real data points
##PAGE= N=1
##DATA TABLE= (X++(R..R)), XYDATA
$$ [...]
2040G00n12r8N41L9J94n51p5L25l5m56m04J39N75L54k60l49J53J65k99m20o0L44
2062A0N78l98n82N7N54J82k61n33j01N90m66l0l68J72L27L01o54r4K73J04l39
2083f78n5k75M09L12n1p37M26J11n5m91P9J48n0N16l79O2l0K98k35p32J33P18
2105e56l84J18N7p9M27O9m35k01L25L73j73m81N5O06L53o56rJ44L84j03m63L38
2127b91k9K79K01k03L9m9K48l37R0r5M62J64k65j06N8N54J33n21k33M86l4k73
2149B78k75Q91K12m7m23j49J99J42j43l5M0J37N07n4k10l88J70K01m58k45K97
2170F47J68K79l95M50m14K96j0o77R2J22K58K15p68M75L60K5l11l11L2K19j67
2191E85j21j87K79K78j58k16m15K27J58k62k25J75J40L21m70m48N94m51L14n48
$$ plain form
2040 700 188 90 631 670 864 313 238 563 528 72 -332 -193 382 736 476 127 280 445 146 -274 -334 10
2062 10 588 190 -392 -335 219 401 140 -393 -494 96 -370 -400 -768 -596 -269 32 -622 -716 -443 -339 -678
2083 -678 -733 -1008 -599 -287 -338 -1075 -649 -538 -593 -1084 -1005 -857 -907 -391 -770 -708 -738 -440 -675 -1407 -1274 -556
2105 -556 -940 -822 -765 -844 -417 -348 -783 -984 -659 -286 -459 -940 -885 -279 74 -582 -591 -447 -63 -166 -629 -291
2127 -291 -320 -41 160 -43 -4 -53 195 -142 -52 -147 315 479 214 108 166 720 853 332 99 585 551 278
2149 278 3 894 1106 1059 636 487 686 828 685 650 690 827 1334 1280 1070 682 852 1053 595 350 647
2170 647 815 1094 699 1149 735 1031 1021 344 436 558 816 1031 263 738 1098 1123 812 501 533 752 585
2191 585 464 277 556 834 676 460 45 272 430 168 -57 118 258 579 109 -339 255 -196 118 -430
2211d30Q7J48K21n55j74M28n7J61m62l08L7P56k92k05j41K02M75l73o57L09P3
2232g57k2K38m05N29q7R2l78J92r9j45m68J05M86J35l9p7j15K53L5J92k85l21
2254i41N49J5J03k67j67K84J06j3l14L86O6r1J90m04O51k01J50j54n6M6L9K77
2276B54n81N11N15l45j96j41M01l03K22n50K79N03l88L58j92NL22j32k58Q6j48
2297B22K10J39n1Q4N0q0J58m68M9k11J51L85k63L28k54M50m58j14l75M73k27O2
2319B60Q0j22J3M59m52J60n11N0L61m74J95J71q9P5j16K8J29k70k78k70L35P6
2341a90L96k5l22J38j35Q4n32J47m5K93k4l09K37j17P2n2j62j39L39J53k38j12
2363e43K42Q4l7j77OQ3K13o06L60J63j63M78l46K58j33L77k65k2l33P1K09R1K20
$$ plain form
2211 -430 -343 -195 26 -529 -703 -275 -332 -171 -633 -941 -904 -148 -440 -645 -786 -584 -109 -482 -1139 -830 -757
2232 -757 -779 -541 -946 -417 -504 -412 -790 -598 -697 -842 -1310 -1205 -719 -584 -623 -700 -815 -562 -527 -335 -620 -941
2254 -941 -392 -377 -274 -541 -708 -424 -318 -331 -645 -259 -193 -284 -94 -498 153 -48 102 -52 -108 -62 -23 254
2276 254 -327 184 699 354 158 17 418 115 337 -213 66 569 181 539 347 352 674 542 284 370 222
2297 222 432 571 520 604 654 574 732 264 313 102 253 638 375 703 449 899 441 327 -48 425 198 260
2319 260 340 218 231 690 238 398 -113 -63 298 -176 19 190 101 176 60 88 217 -53 -331 -601 -266 -190
2341 -190 206 181 -141 -3 -138 -54 -586 -439 -484 -191 -215 -524 -287 -404 -332 -384 -546 -685 -346 -193 -431 -543
2363 -543 -301 -217 -254 -431 -425 -342 -129 -735 -375 -212 -375 103 -243 15 -118 259 -6 -28 -361 -290 -81 10 230
2386B30j81Q5O0k64k57J40N81m37j45K12L93j2n3j53j32K56l32K78k93K92N1O43
2408I62o77J16m9Q8L8l81K80K64m4j99Q6J35J40l14K14l01oJ46L13k63N5kj23
2431D78j19k7r9O9o0J88k25J3P8K45k73qq4k8q0o3j55N03j10k27JJ0j3L5k22j68
2457c41O5L43J57o81K04L2K75m30j29j49J17L99k61n6K20L2j15m25k40L71J54
2478d58m00K30o1K33qk19J52k04L9r6M3j54M80k14M06l28o34N19M7L0l02j58M96
2501e61J57r5l01N52l15L96n83Q4K01k7j03K52J52K08j76l4J77l25j60L14J51
2522c6j65J09M69J42n40j57M91J32l77L06j39o9N82o27K25L95l00J84n49K36J75
2543D87J61M43o19j57L84J21o5l29j10N91j88l8J47O8j28J00o34L11R6M0P9k48
$$ plain form
2386 230 49 134 194 -70 -327 -187 394 -43 -188 24 417 405 352 199 67 323 -9 269 -24 268 319 962
2408 962 285 401 352 440 478 97 377 641 597 398 484 619 759 445 659 358 352 498 811 548 603 601 478
2431 478 359 332 233 302 242 430 205 218 296 541 268 260 176 148 68 5 -150 353 243 16 17 27 14 49 -173 -341
2457 -341 -276 67 224 -457 -253 -221 54 -376 -505 -654 -537 -138 -399 -455 -235 -203 -318 -743 -983 -612 -458
2478 -458 -858 -628 -689 -456 -464 -683 -531 -735 -696 -792 -749 -903 -423 -637 -231 -559 -1193 -674 -627 -597 -899 -1057 -561
2501 -561 -404 -499 -800 -248 -563 -167 -750 -666 -465 -492 -595 -343 -191 17 -159 -193 -16 -341 -501 -187 -36
2522 -36 -201 -92 377 519 -21 -178 313 445 68 374 235 166 748 121 346 741 441 625 76 312 487
2543 487 648 1091 472 315 699 820 755 426 316 907 719 681 828 896 768 868 234 545 641 681 760 512
2565E12j52K16K58j16R5l50K06k84K70k45K33k5K61m57o2L1k22L97m72J01J17
2586C12K21m71K13k43MM6k72j37P7J11K23l09J45j82K38q9j98q3J92P7k1j1k16
2609c73K71J03k41K46n03K0K00m51j24M93J98k34j62k73L38K41M0m43p3N85k76
2630d18j11k30M69k9j81j23j42N96m56L97p1j44J50j0L0l08K29Q9L3l21K77K19
2652e5M44m48k04o2L09J27k05n43R94j86r7n3j38L07O7j11k13P6R8n6K14p7Q4
2675B72J73j25l28m4K30L0L07l25K15j14L36Km80J65L8j73J94k3qL23k47k72j76
2698c0L05lq5k17J18K31k38j0j89K16K45m47K23k63J67K59m19MK20l93K78l96
2720d24l03M70K31K6k99n2NJ21J28j84o7Q0m9N9j63J26K08L1j82j39O2j23O9l62
$$ plain form
2565 512 360 576 834 718 813 463 669 385 655 410 643 618 879 422 360 391 169 566 94 195 312
2586 312 533 62 275 32 36 82 -190 -327 -250 -139 84 -225 -80 -262 -24 -113 -311 -394 -202 -125 -146 -157 -373
2609 -373 -102 1 -240 6 -497 -477 -277 -728 -852 -359 -161 -395 -557 -830 -492 -251 -211 -654 -727 -142 -418
2630 -418 -529 -759 -290 -319 -500 -623 -765 -169 -625 -228 -299 -443 -293 -303 -273 -581 -352 -263 -230 -551 -274 -55
2652 -55 389 -59 -263 -325 -16 111 -94 -637 357 171 74 21 -117 190 257 146 -67 9 107 51 265 188 272
2675 272 445 320 -8 -52 178 208 515 190 405 291 627 629 149 314 352 179 373 350 342 665 418 146 -30
2698 -30 275 272 187 -30 88 319 81 71 -118 98 343 -104 119 -144 23 282 -137 -133 87 -306 -28 -424
2720 -424 -727 -257 -26 0 -299 -351 -346 -225 -97 -281 -348 -268 -317 -258 -421 -295 -87 -56 -238 -377 -315 -438 -369 -731
2744g31L20j20N83j75j87p5J65j42p2j43K16J0j62O0L03l6R8R6l91J70l45M37
2766a21j02L08j52J70J12l57q2M7K36M0J8q5M25j41k03m5j6JK20P9Kl30L71J6
2790D11l7j16Q2J42L4j55j96M10j01O5P4KK65k89j04j64n2L75l23Q0K43k23K00
2813F23J97m21L27m99K52J58p1l95M44j38op3p9P6J2l38J02r0M07M0j96k49J4
2836I7N1k96Q0K2j54M61r0O4l25Q5J81l42p8J39p6j74J92j05K73k77J20j46L4
2859b64J38j76j94j9N6L27j18j67j94o4J70J5J7r3N5j4O2j2P8j62J35k31m0K10
2883d85qQ6o7m80M43J28j21p7J21J40k66K21m16N63k5M0k62N23o43M32m24K10
2905c67l11O03J58l78K74R9l42K12k88K69L1J25M0r8L6R9Q9l3j46O4k54M28m95
$$ plain form
2744 -731 -411 -531 52 -123 -310 -385 -220 -362 -434 -577 -361 -351 -513 -453 -150 -186 -88 8 -383 -213 -558 -121
2766 -121 -223 85 -67 103 215 -142 -224 -177 59 99 117 32 457 316 113 68 52 53 273 352 354 24 395 411
2790 411 374 258 340 482 516 361 165 575 474 539 613 615 880 591 487 323 271 646 323 403 646 423 623
2813 623 820 399 726 227 479 637 566 171 615 477 471 398 319 395 407 69 171 81 488 528 332 83 97
2836 97 148 -148 -68 -46 -200 261 171 235 -90 -5 176 -166 -244 -105 -181 -355 -163 -268 5 -272 -152 -298 -264
2859 -264 -126 -302 -496 -515 -459 -132 -250 -417 -611 -675 -505 -490 -473 -566 -511 -525 -463 -475 -397 -559 -424 -655 -695 -485
2883 -485 -493 -407 -474 -954 -511 -383 -504 -581 -460 -320 -586 -365 -781 -218 -243 -203 -465 58 -585 -153 -577 -367
2905 -367 -678 -75 83 -295 -21 78 -264 -52 -340 -71 -40 85 125 27 63 162 251 218 72 136 -118 310 -185
2928a85K35n9K62L96m47j29M36o0J56k91j04K74R9O6j17l9kj95k62M47l33J56
2950C04j16j13J66p8J71l63J97M2K58k15n1J59jK88j74o1j33j14J81j72j08L1
2972I8M95L0l44j30L8j3m9j62j32J39K17l54J34l35K00K31k68j33L61K73m12J96
2994H0m01J6J21J8j85J50k24K39p4jk05o1L93j08j53L96k70K59k32j49n7K10K54
3017A6k14J2J01L9k2l12M60k41J20J88l21N9r5K28j44j83J66L17j62l81K79o7
3039a57J27l2J4J17j93L95p8r0j42L59l07j29L6j15K19R1K94j74oL12m57l14M04
3062A74j09M06l73NK09k86K07k3m8P2K91m03J53l27L41J44m28J96J11J03k46o2
3084A07M7j09K07j0k46q7J31M49k65P6m17J97L10m03m3L04p2l54P9J34j79J89
$$ plain form
2928 -185 50 -9 253 649 202 73 509 449 605 314 210 484 583 649 532 493 491 296 34 481 148 304
2950 304 188 75 241 163 334 -29 168 210 468 253 202 361 360 648 474 413 280 166 347 175 67 98
2972 98 593 623 279 149 187 174 125 -37 -169 -30 187 -167 -33 -368 -168 63 -205 -338 23 296 -116 80
2994 80 -321 -305 -184 -166 -351 -201 -425 -186 -260 -261 -466 -527 -134 -242 -395 1 -269 -10 -242 -391 -448 -238 16
3017 16 -198 -186 -85 -46 -68 -380 80 -161 -41 147 -174 -115 -210 18 -126 -309 -143 174 12 -369 -90 -157
3039 -157 -30 -62 -48 69 -124 271 193 103 -39 320 13 -116 -80 -195 24 115 409 235 229 541 84 -230 174
3062 174 65 471 98 103 312 26 233 210 162 234 525 122 275 -52 289 433 5 201 312 415 169 107
3084 107 154 45 252 242 -4 -91 40 489 224 300 -117 80 390 -13 -56 248 176 -178 -99 35 -144 45
3106D5j47k46J80QJ89k49J28j66L88k97J5J78k34J32j43j55K01l11M62q6n30K18
3128d20K15j99j01o2K24j85M18l90J41o6k0k56L05Q2K91n4l8k32j37K04J22m17
3150e75N64j17j55K51k33L9K2J12p7L3k2J67k0k6k41L14J61p3l01K54J03k1j41
3173A8k4M1J10J56km18L33R8m40N75k93k4K89M6k13m6J89K57j45k82M5K99k56
3196C13M6l08N37j83o6j45K07J68P2n9k36o3M4j2k9j51P3Q8J49K3r7j6Q6L9l15
3221A65Pr9N82k57l75L48k99L2j7M3J77J13n85R2JP3m5Q5k65L77J14l04k25m02
3245f64O47o5J81k35M6j86L64m11j81L48O8j57O8o26O10j77N2l65j36N86j50P
3267c76k36oK91q2oJ82k8k27M7M7j52M46k74K22j18Q6q9Q6m18K38J74j89K89o2
$$ plain form
3106 45 -102 -348 -168 -160 29 -220 -92 -258 130 -167 -152 26 -208 -76 -219 -374 -173 -484 -22 -108 -638 -420
3128 -420 -205 -404 -505 -567 -343 -528 -110 -500 -359 -425 -445 -701 -396 -314 -23 -77 -115 -347 -484 -280 -158 -575
3150 -575 -11 -128 -283 -32 -265 -226 -204 -92 -169 -136 -158 9 -11 -37 -278 36 197 124 -177 77 180 159 18
3173 18 -6 35 145 301 299 -119 214 312 -128 447 154 130 419 465 252 206 395 652 507 225 270 569 313
3196 313 359 51 588 405 339 194 401 569 641 582 346 283 327 315 286 135 208 296 445 468 371 355 441 480 165
3221 165 172 73 655 398 23 371 72 104 87 130 307 420 -165 -73 -72 1 -44 41 -224 153 267 -37 -262 -664
3245 -664 -17 -82 99 -136 -90 -276 88 -323 -504 -156 -88 -245 -177 -803 -193 -370 -318 -683 -819 -233 -383 -376
3267 -376 -612 -618 -327 -409 -415 -233 -261 -488 -441 -394 -546 -100 -374 -152 -270 -184 -273 -187 -605 -367 -193 -382 -93 -155
3291a55J9J29m2K56m92o8N14Q4j21q0j86Q5R0k1J5J6j26K70N0k81K67K32m50j85
3315a80N03j74k07O8J55j71J12L17N9q0k04L40l60l9J26R7j34j31L22q9r4j6L9
3338B59m0R6m5q5J66J91k84m5K43j90O0k29oJ84l10K24l41J99j7K8pK25k12R8
3362A62j11j20J27O5M4j03P4j60j91J79j8J4J5K16m15L98j27N0j66j18J52k45
3384b78K32k67qP4Q8k2j81J24l3J76j88l6J01j94N88o56O8m2L38l97K63k54M48
3407e6J66m13j5J06ll51J78k64N45J21J43l78n3L02L17m32R0J65k58r9K36k24
3429a77R1J86K45k25j96J67o4O0l6N3J44l6p8K19k27K99j93k08Q6K91J28m84J99
3452B44J28J40m10K06j7k81L60K3j80P0j35q1M43Jl79L5nK17j93j29K94o8J5l74
$$ plain form
3291 -155 -136 -7 -49 207 -285 -353 161 245 124 44 -142 -57 33 12 27 43 -83 187 237 -44 223 455 5 -180
3315 -180 323 149 -58 10 165 -6 106 423 482 402 198 538 178 139 265 362 228 97 419 330 236 220 259
3338 259 219 315 270 185 351 542 258 213 456 266 326 97 91 275 -35 189 -152 47 30 58 51 276 64 162
3362 162 51 -69 58 123 167 64 138 -22 -213 -34 -52 -38 -23 193 -222 176 49 99 -67 -185 -33 -278
3384 -278 -46 -313 -321 -247 -159 -181 -362 -238 -271 -95 -283 -319 -218 -412 176 -480 -412 -454 -116 -513 -250 -504 -56
3407 -56 110 -303 -318 -212 -215 -566 -388 -652 -107 14 157 -221 -274 28 345 -87 3 168 -90 -189 47 -177
3429 -177 -86 100 345 120 -76 91 27 87 51 104 248 212 134 353 126 425 232 24 110 401 529 45 244
3452 244 372 512 102 308 291 10 370 393 213 283 148 67 510 511 132 167 162 379 186 57 351 283 298 -76
3476g6J10R5m2K44l66r6M18n6k0m10K14J63l58L62l06K32k63J49k20J34J29q3
3498d6m6j65M26n0k59o8p7K20m3k11L14j29m9J11j69M6q1K86m35J48k44K17L36
3521C2j26l77K43j3l01L18k34O8J59R7j66k04M43J33j87j49J23M4j25l28K90o3
3543c23k3K02J64o6l92N55p5j00j1Q5j06K33j41L1J28m8j22J9J92Pj30j41J28
3566F6K36M3k51l5J04j29J77j92q0J11K76k8q3p8J41K7K7l33P3L29mQ4j38R1K18
3591F52m35k85M44n4J18R8k30q0J29l17K26Pj28J79j97J96k12j4R9L82m63k1J58
3614B52j96K04k42J56l42o6M29j32J03j59M5lJ63n39K55j12M7K31k84J24L6P8
3636D8l17K13J44l69n7QJ65L7k76J7Q4O3j04N0ql9LM4L9m64N54q4K8j22Q3m1L23
$$ plain form
3476 -76 34 129 87 331 -35 -131 287 231 211 -199 15 178 -180 182 -124 108 -155 -6 -226 -92 37 -46
3498 -46 -92 -257 169 119 -140 -208 -285 -65 -108 -319 -5 -134 -183 -72 -241 -195 -276 10 -425 -277 -521 -304 32
3521 32 -94 -471 -228 -241 -542 -224 -458 -390 -231 -134 -300 -504 -61 72 -115 -264 -141 -97 -222 -550 -260 -323
3543 -323 -346 -144 20 -46 -438 117 42 -58 -69 16 -90 143 2 33 161 113 -9 10 202 209 79 -62 66
3566 66 302 345 94 59 163 34 211 19 -61 50 326 298 215 137 278 305 332 -1 72 401 397 481 343 434 652
3591 652 217 -68 376 322 440 538 308 228 357 40 266 273 145 324 127 323 111 97 196 578 115 94 252
3614 252 56 260 18 174 -168 -234 195 63 166 7 52 49 212 -327 -72 -184 -137 94 -190 -66 -30 48
3636 48 -269 -56 88 -281 -338 -330 -165 -128 -404 -387 -303 -240 -344 -294 -302 -341 -338 -294 -255 -719 -165 -249 -221 -343 -260 -301 22
3663B2l04J36p3k5kl15K89M33%k03j43J40k9l23M28l22R8P6K69n6m93M92j40j8
3687f3J25M1qJ27j97k34O31k54J26p9j09j1L1j35K77m48N13K09k46k37K25Q0K5
3710C89j0k34K41l0j38M7j97O6J32j94l02L62J59Q8k23k78N19l24L00l61k9J58
3732A41k01J72R9O1K1j56o0O3j31J07K6q9j20L0K6N89p69K71j92l5Q5J6j09J05
3756e0R7rk37J03M8j37j12K50k54K10j49J22N2j68R4j30q6L1L39k25K17j50n5
3779a99P4n7j24pQ5J97j77R6k72M99m04L01l50L23l3Nm5j88K60l9L9k22J54R0
3803FK54l98K4m2k09J86K03K08j24k7r3J17P7R6Pml22n0Q4NK48m47L26p8J23N4
3829B24j01mK38j14m2j02K68m45Q3K3Q1J41j88K57m25L86P5l6j97L4K58j58j8
$$ plain form
3663 22 -282 -146 -219 -244 -246 -561 -272 161 161 -42 -185 -45 -74 -397 31 -291 -193 -117 152 96 -397 95 -45 -63
3687 -63 62 103 95 222 25 -209 422 168 294 215 106 95 126 -9 268 -180 333 542 296 59 284 364 389
3710 389 379 145 386 356 218 265 68 134 266 72 -230 132 291 379 156 -122 397 73 373 12 -17 141
3732 141 -60 112 211 272 293 137 77 140 9 116 142 53 -67 -37 -11 578 -191 80 -112 -147 -62 -46 -155 -50
3756 -50 47 38 -199 -96 -48 -185 -297 -47 -301 -91 -240 -118 -66 -234 -140 -270 -356 -325 14 -211 6 -144 -199
3779 -199 -125 -182 -306 -313 -228 -31 -208 -112 -384 115 -289 12 -338 -15 -48 -43 -88 -276 -16 -55 -16 -238 -84 6
3803 6 260 -138 -114 -156 -365 -179 24 232 108 81 -12 105 182 278 285 281 -41 -91 -7 -2 246 -201 125 47 170 224
3829 224 123 119 357 243 201 99 367 -78 5 28 109 250 62 319 -106 280 355 319 122 156 414 256 238
3852B38j59J89m70K88Q9j46J08m05N01J2m17L12J53j09j10l1j4K55l51J11n1M27
3874D20k01k45j01j58J61j26J33k1O1K04k3k62K06l31K01l0l88J66L69k07k80
3895d52M93j80o0q5M6Q8R6%l08L33k82K46k32R8N2P9j1j78N0l0o7nP2J82k89P9
3921b65k7Q2j1K03m91L88J44l61J16K31M7j31k66L61j27P3l4j08J8K89O1l64J63
3944iQ7K77k50j90M3K61k40K1J25M9P3k38J96l06J01J49k1j71J04J59q2k2K99
3967D15j67L5k30QJ56O0P4j92k0L3K40j42Q1l40J81J26M0n7j48K16j42M4j36j37
3991bK04K58k68r6J78j04q2L08%k48J32k27L9L02k42k39j3M53m87N6K93l06l82
4014d73M82l02K71ll06K71j32L26l13MK87n2J9p4l09K71J05l67k6L80R8j45j05
$$ plain form
3852 238 79 268 -202 86 175 29 137 -268 233 245 -172 140 293 184 74 43 29 284 -67 44 -7 420
3874 420 219 -26 -127 -285 -124 -250 -117 -138 -77 127 104 -158 48 -283 -82 -112 -500 -334 35 -172 -452
3895 -452 41 -139 -199 -284 -238 -150 -54 -54 -362 -29 -311 -65 -297 -199 -147 -68 -79 -257 -207 -237 -304 -309 -237 -55 -344 -265
3921 -265 -292 -210 -221 -18 -509 -121 23 -338 -222 9 56 -75 -341 20 -107 -34 -68 -176 -158 131 192 -172 -9
3944 -9 78 355 105 -85 -42 219 -21 0 125 174 247 9 205 -101 0 149 128 -43 61 220 138 116 415
3967 415 248 283 53 61 217 277 351 159 139 172 412 270 351 11 192 318 358 301 153 369 227 271 135 -2
3991 -2 202 460 192 96 274 170 88 396 396 148 280 53 92 394 152 -87 -100 353 -134 -78 215 -91 -473
4014 -473 9 -293 -22 -25 -331 -60 -192 134 -179 -175 112 60 79 5 -304 -33 72 -295 -321 59 157 12 -93
4037i3j11K56L20m52j55l7n2K91k29J57J56k0k58J65k28J41K18k00j86M69j19
4058C3j92J34J82q4j7P0r0j75N9j6M1J39m6j3mP6r5K84j7j11n7j6r0L03n7q1J45
4085C05k72l9n1L5k2L76l8k55O3Mn4K23%J10n12K78K34m42L99m6k07J43q3l15
4109a66K48J81K14m80K31K05m98K83l58K29J03L7k26q2M06k65n3k53L00k3j44
4130a11J63j97K98l2k5R7p4L61n81K2L12k87J9K08o7m55j5K95K6k35J93qn2Lp0
4155b12J75Q0l48j17L0K66K92n97K39J28j42J48k6l37L22j54J39k11M2R2Q6j75
4177b80p9J41Q2j43R1J80k20K63l19p8J20K1Q1n8J90l86M79j3m1K84m68K33J99
4200B79l20K5q3J92q1n1L01l5k17L37k87J91k53J00J7lk38K51K95N6l94M0J12
$$ plain form
4037 -93 -204 52 372 -80 -235 -272 -324 -33 -262 -105 51 31 -227 -62 -290 -149 69 -131 -317 152 33
4058 33 -159 -25 157 73 56 126 36 -139 -80 -96 -55 84 38 25 21 97 2 286 269 158 101 85 -5 298 241 160 305
4085 305 33 -6 -57 -22 -44 332 294 39 102 106 52 275 275 385 -127 151 385 -57 342 296 89 232 149 -166
4109 -166 82 263 477 -3 228 433 -65 218 -140 89 192 229 3 -79 327 62 9 -244 56 33 -111
4130 -111 52 -145 153 121 96 193 119 480 -101 -79 233 -54 -35 173 106 -349 -364 -69 -43 -278 -85 -93 -145 -142 -212
4155 -212 -37 43 -305 -422 -392 -126 166 -431 -192 -64 -206 -58 -84 -421 -99 -253 -114 -325 -283 -191 -105 -280
4177 -280 -359 -218 -136 -279 -188 -8 -228 35 -284 -362 -242 -221 -140 -198 -8 -394 85 72 31 315 -153 80 279
4200 279 -41 -16 -99 93 12 -39 262 227 10 347 60 251 -2 98 115 112 -126 125 420 476 82 122 234
4223B34j49K03l34L76m35L02j27J8j36Q7J49K0j84K45l88K29j56N2o4J42K04R5
4245C83k4j21k02O2k25L26k17r6L04m3k41N36k51m63L68Q7P0O8m51j1K39L5j75
4268d2K41J2j69j59K29k11j13l10J46P3k14O90j58l80J80J89k29K27k04n1K1j40
4290c72J70J80k0j61j05L04j74K3k2j77q2J39O0K4L3K0k43L54k46L11j75R6K52
4313A89n52K90k0K28m1m5q8j18q0J00K06k13j78K5L95l34L9K13j33K22r7K7L2
4336F7r6l3K12K1L35m19J40m77L60j22K0M70n28R7P7j02L91l62J06r2M08l74J35
4359B34k73O8K06k70L1O4J91J04k14j31J44j57j55J82J98k94L04j55lj7R0j34
4381A3P1r7P2l59K72J37j15J68r9k27j42O19J07k91k94K27j96M39l9j19J69k94
$$ plain form
4223 234 85 288 -46 330 -105 197 70 88 -48 39 188 208 24 269 -119 110 -46 6 -58 84 288 383
4245 383 359 238 36 98 -127 199 -18 -114 190 147 -94 442 191 -272 96 183 253 321 -130 -141 98 133 -42
4268 -42 199 211 42 -117 112 -99 -212 -522 -376 -303 -517 173 15 -365 -185 4 -225 2 -202 -253 -232 -372
4290 -372 -202 -22 -42 -203 -308 -4 -178 -155 -177 -354 -436 -297 -237 -213 -180 -160 -403 -49 -295 16 -159 -63 189
4313 189 -363 -73 -93 135 94 49 -39 -157 -237 -137 69 -144 -322 -297 98 -236 -197 16 -117 105 8 35 67
4336 67 -29 -62 150 171 506 87 227 -250 110 -12 8 478 -50 47 124 22 413 51 157 65 473 99 234
4359 234 -39 29 235 -35 -4 60 251 355 141 10 154 -3 -158 24 222 -72 232 77 74 57 147 13
4381 13 84 -13 59 -300 -28 109 -6 162 63 -164 -306 313 420 129 -165 62 -134 305 266 147 316 22
4403B2j4k42K56k21R0J93j86j9p8K49l10K97j54J84j20j93j0P7K28l27J91j76
4425b63j60K60ll9L3P3K00n1q1q0J18k22K76j33J01j60J65p0J06O9J12l3m36L34
4449A16o3J4l47K39M2O0k42J67J08k21M13k7k64P9Pj29R6K02k19J17k33K57r2
4472H0N6j34J70O8j85J53k4j94J12k58J48M6M0J44k4kk72J21J10n4K19k14j36
4495c0K46n5P9k13LL54m05L45q8k94R1K20m18L64k6m2j02K8j02J94l7j68L49m03
4519a10Q2Pk5P1qj4R0Q3k45J10k3J35k20j56K24N6J35k20J38j44o7Q9l80J32o5
4544c25J87l1j20J04q1K14l18K44J53m60K50K70j61k95K79R2j31r4O9r7K23l67
4566c95r8L89J2j21k6K70k79L30k43L51k71M0P1N5k53J24l4K44m35M82m30K95
$$ plain form
4403 22 8 -234 22 -199 -109 84 -102 -121 -199 50 -260 37 -117 67 -53 -246 -256 -179 49 -278 -87 -263
4425 -263 -423 -163 -166 -205 -172 -99 101 50 -31 -111 7 -215 61 -72 29 -131 34 -36 70 139 251 218 -218 116
4449 116 53 67 -280 -41 1 61 -181 -14 94 -127 286 259 -5 74 81 -48 48 250 31 148 -85 172 80
4472 80 136 2 172 240 55 208 184 -10 102 -156 -8 38 78 222 198 196 -76 45 155 101 320 106 -30
4495 -30 216 161 240 27 30 384 -21 324 236 -58 33 253 -165 199 173 131 29 57 -45 149 112 -56 293 -110
4519 -110 -28 -21 -46 25 17 3 93 176 -69 41 18 153 -67 -223 1 57 192 -28 110 -34 -101 -12 -392 -260 -325
4544 -325 -138 -169 -289 -185 -266 -52 -370 -126 27 -433 -183 87 -74 -369 -90 2 -129 -223 -154 -251 -28 -395
4566 -395 -493 -104 -92 -213 -239 31 -248 82 -161 190 -81 -41 30 85 -168 -44 -78 166 -269 213 -217 78
4588G8k57rK57l42J55k4J81p0M6r5J54J53q2K7m5l70L95r9m0j18J96J82k52j31
4612a10L77n9k56J25j31J69J55q8l8J34j85K6j6N7l4M5Q8L2O1k05P9Q5m84L15
4636A42j03Q1l53M5J89N5n9J72np7k79L52j7o2j74j62K3J9K64k66L30k0j24L6
4660Gj63J1O4O3j70J10k17J94n6k37M06q8K1j53J94j84J72j10K28k35j8L20l01
4683a42j35R1J37L3K11q4p0J29k01j70p9J26K92j05j41j51m8N20m00L65l87L2
4705a77K67m12K78kj02j37O0k2K27Q5K49m72k7N26j82k14K2n3J06L31l65K2L21
4728C29r4%k74k31L72l45N89n07p1K29K17j26k8J57Q4m48L65l20K82l08J48j36
4750a16J98J16m8J06k62j2K48j68K0K14p0j67K63k62p4q7L96o7j58j15l66Q43
$$ plain form
4588 78 -179 -188 69 -273 -118 -142 39 -31 15 -80 74 227 145 172 127 -243 152 53 13 -105 91 273 21 -110
4612 -110 267 208 -48 77 -54 115 270 182 144 278 93 119 103 160 126 171 259 291 352 147 226 311 -173 142
4636 142 39 120 -233 -188 1 56 -3 169 164 87 -192 160 143 81 -93 -255 -232 -213 51 -215 115 95 -29 7
4660 7 -156 -145 -81 -18 -188 -78 -295 -101 -157 -394 12 -76 -55 -208 -14 -198 -26 -136 92 -143 -161 159 -142
4683 -142 -277 -186 -49 -16 195 111 41 170 -31 -201 -280 -154 138 33 -108 -259 -307 213 -187 178 -209 -177
4705 -177 90 -322 -44 -46 -148 -285 -225 -247 -20 65 314 -158 -185 341 159 -55 -33 -86 20 351 -14 8 329
4728 329 235 235 -39 -270 102 -243 346 -161 -232 -3 214 88 60 217 301 -147 218 -102 180 -128 20 -116
4750 -116 82 198 150 256 -6 -18 230 62 82 296 226 59 322 60 -14 -101 295 228 70 -45 -411 432
4772D32j64m52O5L92p4n63L75J55l92J2qK44J75j16k62J81o0J4k9K65k18m7J37
4795F2M5j48k01j41L64J5o40L33J26n7J26j30L67j23j03o2k30K25M1k32L10l7
4817i0L5J33l65P6K48j42J47k49j1M09k79P6j49K01Rj48j64L61N1k8m0j85O5J14
4841G5j46O1K7q9L73j88l11N02j11l74n7M24k26j62K68J64j74mM93n27l7K98n7
4864B22L0l27J35J25pJ42j09l6k72K24L8P3k78K12p3J96p8l1l6J21k3R5j05m44
4888b06K90R0Q1k17J88k19K25r2M1kp7J03J3j86J45K02o70L03P1l36M30n71K29
4911a65K17M3O4m56L06J79l1j49N5j61Q7p6N7k86J64J36j38L0m9J80p8m2K32P1
4935A90l70P9p7J31k55K79m18N3N0K95j23J1J28r1o6K60l17r0K70nL67m69K75
$$ plain form
4772 432 268 -184 -119 273 199 -364 11 166 -226 -214 -222 22 197 81 -181 0 -60 -46 -75 190 -28 -75 62
4795 62 107 -41 -242 -383 -19 -4 -644 -311 -185 -242 -116 -246 121 -2 -105 -167 -397 -172 -131 -363 -53 -90
4817 -90 -55 78 -287 -211 37 -105 42 -207 -218 191 -88 -12 -161 40 49 -99 -263 98 149 121 81 -104 -39 75
4841 75 -71 -10 17 -72 301 113 -198 304 193 -181 -238 186 -40 -202 66 230 56 52 545 18 -19 279 222
4864 222 252 -75 60 185 178 320 211 175 -97 127 165 238 -40 172 99 295 217 186 150 271 248 343 238 -206
4888 -206 84 174 255 38 226 7 232 140 181 179 102 205 218 32 177 379 -291 12 83 -253 177 -394 -165
4911 -165 52 95 159 -297 9 188 157 8 63 -98 -11 -87 -30 -316 -152 -16 -154 -124 -173 7 -71 -113 119 190
4935 190 -180 -101 -178 -47 -302 -23 -441 -388 -338 -43 -166 -155 -27 -118 -184 76 -241 -331 -61 -66 301 -168 107
4958A07j67lJ16k01L37l22K08j92J22k41L5K14k99L61k03K67n5j9L1j02J9R3Q0
4981A86j13o9K5nm9Jl4J08j38L14j57Q8j98j41K91j9P5K57l43j04J77l8N1Q6m05
5006a54L5L09J22m87J24J22K71j52j84q4M12k04J02j85NK3l5k73J80K42J2j90
5028A1Q5R8q6j11j29M70n67K51k54N3J33J45L14o05M1J39k39L6L47l40K32j97
5050a73J85P8l52L49l09O4J42n9j79Q5K65k19K56k19K48j05m21N32n31L46j31
5071a48J19j13J30j15o2L43n11K87K23K6j63j7J6j33J53k16K7L52n88N47m99L81
5093C9k64J85K32l41J29k34J6M0L20l35L44l31K11J91N6l36J73k4N0j92K71l56
5115a56L69l46M28n35K28K05J13l88j28O52l78K55r5J00l78J79j23o2J62K68l92
$$ plain form
4958 107 -60 -63 53 -148 189 -133 75 -117 5 -236 -201 13 -286 75 -128 139 84 65 96 -6 13 106 186
4981 186 73 4 29 24 -25 -24 -58 50 -88 226 69 157 -41 -182 109 90 165 422 79 -25 152 114 165 251 -154
5006 -154 -119 190 312 -175 -51 71 342 190 6 -78 334 130 232 47 52 75 40 -233 -53 189 201 11
5028 11 96 194 108 -3 -132 338 -229 22 -232 -179 -46 99 413 -192 -151 -12 -251 -215 132 -208 24 -173
5050 -173 12 90 -262 87 -222 -158 -16 -75 -254 -169 96 -123 133 -86 162 57 -364 168 -363 -17 -148
5071 -148 -29 -142 -12 -127 -189 154 -357 -70 153 179 16 -1 15 -118 35 -181 -154 198 -390 157 -342 39
5093 39 -225 -40 192 -149 -20 -254 -238 -198 122 -213 131 -200 11 202 258 -78 95 71 121 -71 200 -156
5115 -156 213 -133 295 -240 -12 193 306 -82 -210 442 64 319 224 324 -54 125 2 -60 102 370 -22
5136b2r5L39l76N40j98k22J2R2N1k96J93k05K90R4j92J19L2j14k46L41k61M66
5158C42k26k84J56j8k80L06k1J79j33j14K57j42p6Q0k76P5L25kj55j09m2K84j68
5181d2K15l62L24J1j70j28O8K13m86L49j35Pk00K44J97O8l25K48M7k80J02L21
5203B86j44q8Q6k26J8L7K75k12k00n6J59N6j96L48J13l45l4k10L58J06%l08R3
5226h4r9J15m6q5P8R1l6m1m61M02J41K71j07o03O08n1kR2j06lJ53k48k9K7N9Q4
5252A20mJ95q1J13l04qp5m3M99m15j15M3K08k2J23l95K71j09k5J03K03j87j24
5275b9J06K29m96K84k06Q7J6l1J65k64J14J2k91P7N24k93N05m49j95Q5J50J44
5297B44p5k08L16l21q3k20N68m26J58K71j26m11N57m35J97o2k14L39l01j16J28
$$ plain form
5136 -22 -117 222 -154 386 188 -34 -22 70 121 -175 18 -187 103 197 5 124 156 42 -204 137 -124 342
5158 342 116 -168 -12 -30 -310 -4 -25 154 21 -93 164 22 -54 26 -250 -175 150 148 -7 -116 -158 126 -42
5181 -42 173 -189 135 146 -24 -152 -84 129 -357 -8 -143 -136 -336 -92 105 173 -152 96 143 -137 -35 286
5203 286 142 54 140 -86 -68 -31 244 32 -168 -224 -65 -9 -205 143 256 -89 -123 -333 25 131 131 -177 -84
5226 -84 -183 -68 -114 -199 -121 -30 -66 -107 -568 -166 -25 246 139 -464 144 93 91 183 77 74 227 -21 -50 -23 36 120
5252 120 116 311 230 343 39 31 -44 -87 412 -3 -118 -75 133 111 234 -161 110 1 -24 79 282 95 -29
5275 -29 77 306 -190 94 -112 -25 -9 -40 125 -139 -25 -13 -304 -227 297 4 509 60 -135 -50 100 244
5297 244 169 -39 277 -44 -127 -347 221 -205 -47 224 98 -313 244 -191 6 -56 -270 69 -232 -348 -220
5318b20J19m3J30k29P6k3j3O7Rl12M55l75M79l69J98J71j29K04l44J03JJ9q6N5
5342e7j66J53J23l9n8K43j89J70o0n17K89K42n6n8R5j99J66K38k59j71K38k63
5364a35J32K9j17L99j40r3J76o22M84l4K6L4k77L83l27J59J03j88M2k49M77j70
5386I2j46J14M7K8j79Q3J45l09O8J71o2P6k7P8k11K63l20J95J9l6o4jl41L26j1
5411bL11J20m15j63J53R6j1m3n3J23j9KJ97l74k16K11K29k36J62j9K20l45K17
5434A45j49P7J27k96k5k36K11k61L53J7J24o0P4R6k52Q2J33l67K00j81m4pK40
5457Am02L28j9j31M06j87l07J35K31J8j6l2J09k40J0j65K01R6J0M7j80P0l86K51
5481a52K69L1l82n6J62K18qp2O8k11P1K66k55K58J21n08J35L57j39o0n7q7L8J74
$$ plain form
5318 -220 -101 -144 -14 -243 -167 -190 -203 -136 -127 -439 16 -359 120 -249 -51 120 -9 195 -149 -46 -45 -26 -112 -57
5342 -57 -223 -70 53 14 -44 199 10 180 120 -397 -108 134 78 20 115 -84 82 320 61 -110 128 -135
5364 -135 -3 26 -91 308 168 75 251 -371 113 79 105 139 -138 245 -82 77 180 -8 34 -215 262 92
5386 92 -54 60 107 135 -44 39 184 -125 -57 114 52 128 101 179 -32 231 -89 106 125 89 25 24 -317 9 -2
5411 -2 309 429 14 -149 4 100 89 46 -7 116 97 99 296 -78 -294 -83 146 -90 72 53 273 -72 145
5434 145 -4 73 200 -96 -121 -357 -146 -407 -54 -37 87 27 101 197 -55 27 160 -207 -7 -188 -232 -239 1
5457 1 -401 -73 -92 -223 183 -4 -311 -176 55 73 57 25 134 -106 -96 -261 -60 36 46 93 -87 -17 -403 -152
5481 -152 117 148 -234 -290 -128 90 82 10 78 -133 -62 204 -51 207 328 -180 -45 312 173 113 56 -31 7 181
5505A81J32k07q1L1L5Q7j10J13j64J29l28j18O94k78Q5k04K16l56K22M8J89J44
5527D60m36j06P5J79l24J18K81m8o0j89J07K2k01K6lk5J31p9J71j97J08L6K03
5550B49k29n1r4M95k65n05L47M2j05j48K43l01Q9L76Ol60J16J18k36L14J5l2N1
5573A35j51K10k62J54R0m06M3Q0L04M1k66O1q5K2K27l4l50J71j32j07k64N68J0
5596E9k65lK08J58k60L2M4Rj00K04J20l48kJ52m8J54m40M6M6K6J6J92j14N37l19
5621A04l4P6j40J9l2J12j99J28k03R1J2M1K34j45R5j42K0P0j23J16p7j07O1M08
5645C85k33m6p5l2o0K54j15Pj27R3J6o9j9l2K73j57nqNK48l6l8J7l99J41J43j61
5672c0Q8K53l75K96j84j40l5Q6J71K7J1j09Ok01P7M21l39j08K69n73J85L69k20
$$ plain form
5505 181 313 106 25 56 91 178 68 181 17 146 -182 -300 394 116 201 -3 213 -143 79 127 316 460
5527 460 24 -82 -7 172 -152 -34 247 199 139 -50 57 79 -122 -96 -99 -124 7 -72 99 -98 10 46 249
5550 249 20 -31 -125 370 105 -400 -53 -11 -116 -264 -21 -322 -233 143 149 -211 -95 23 -213 101 116 84 135
5573 135 -16 194 -68 86 176 -230 -187 -107 197 238 -28 33 -52 -30 197 163 -187 -16 -148 -255 -519 49 59
5596 59 -206 -209 -1 157 -103 -71 -27 -18 -118 86 206 -142 -144 8 -40 114 -326 -280 -234 -208 -192 0 -114 423 104
5621 104 70 146 6 25 -7 105 -94 34 -169 -78 -66 -25 209 64 159 17 37 107 -16 100 23 -84 -23 385
5645 385 152 106 31 -1 -61 193 78 85 -42 51 67 -2 -21 -53 220 63 58 50 55 303 267 229 246 -153 -12 131 -30
5672 -30 58 311 -64 232 48 -92 -127 -41 130 157 168 59 65 -136 -59 362 23 -85 184 -389 -204 165 -55
5695e5J34r3j8O7J15m40J61K56l18J11J09r6J77j12k55L55l88L37k72O8J63r1
5717h5j11K36j22L85k12k58J46J67j18l54M55J4r6j96O6J55j78J76l54l4L67j0
5739C9O3m16OM55l12K5l2p0J72R1o1R7j67O6J54q0l56L96R1r0Q7j45J56j90N0
5764B9r1J98k16K68k74J3j27J75J16l28K34j10L09l16J24j23Q4ko0L5L88n20L14
5787A20j42j28k8M00k24L14k99P1Q3L4k23k08J73J59P9j03j58kK19k08J0O9K89
5810B97k38m31M74j4K21p3k74l8QL4rR3J02m0J45n08K26k5K29k71J76l63J58K38
5834A17k10j22J42j86K68l2j19K29l12k8K06J62j05J13m27K74m56L68q1N4J52
5855GJ03j02jk2qR6M2j95qO8n2o2J32J27j88j03K42k90O0J00K14q5k77J21p3O29
$$ plain form
5695 -55 79 -14 -32 35 150 -290 -129 127 -191 -80 29 -67 110 -2 -257 98 -290 47 -225 -157 6 -85
5717 -85 -196 40 -82 303 91 -167 -21 146 28 -326 129 143 47 -149 -83 72 -106 70 -284 -318 49 39
5739 39 102 -314 -308 147 -165 -140 -172 -242 -70 21 -40 57 -110 -44 110 30 -326 70 161 71 158 13 169 -21 29
5764 29 -62 136 -80 188 -86 -73 -200 -25 91 -237 -3 -113 196 -120 4 -119 -35 -37 -97 -62 326 -194 120
5787 120 -22 -150 -178 222 -2 312 13 84 167 201 -22 -230 -57 102 181 78 -80 -82 137 -71 -61 8 297
5810 297 59 -372 102 88 309 236 -38 -76 -68 -34 -43 50 152 112 257 -251 -25 -50 179 -92 84 -279 -121 117
5834 117 -93 -215 -73 -259 9 -23 -142 87 -225 -253 -47 115 10 123 -304 -30 -486 -118 -199 -145 7
5855 7 110 8 7 -15 -23 73 115 -80 -88 -20 -72 -134 -2 125 -63 -166 76 -214 -154 -54 160 75 -202 -81 -154 475
5881D75p00L12O7O1k19Q8l21O4L95n4k48K8K50k82k32L05J81Ok71J12j69J29j8
5904d1K00q3m0pR9l99K35L08k67N8K58o8l8l98K90J10j61L4k57J38J65J04j8m52
5928b30L71k60K88k74q6R8Q9p4J57k15p4J72L29m09K29k88J06j14J21J70l14J53
5950e5M4L7m47P37l53n6J9j7k19N10j15l25J91j24J37j43J85k06K64j75M5k32
5972b98K06k82L14KQJ1J38j63l3O5k12M39q9j16o0m4k11M16j65J02j84K62j28
5995b2k18J44N08j89k66R7j05j90O9N2j62K50j44J55J43K50m35P7o2K41j4o7O4
6018A76k14M7Ok88L23L1m8J66o7j45r8J73o1k35L13j4J5j55K35j58J34qR6lp8
6043A43J39l43o5l3P8K90n5o1p6l4J04O4l0LL09k34j56M5j03J26j59j27R2j01
$$ plain form
5881 475 -225 87 154 215 -4 84 -237 -173 222 168 -80 -52 198 -84 -316 -11 170 176 -95 17 -152 -23 -41
5904 -41 159 76 36 29 128 -271 -36 272 5 63 321 253 215 -183 107 217 56 90 -167 -29 136 240 222 -230
5928 -230 141 -119 169 -105 -191 -93 -4 -78 79 -136 -210 -38 291 -118 111 -177 -71 -185 -64 106 -208 -55
5950 -55 -11 26 -421 316 -37 -93 -74 -91 -310 200 85 -240 -49 -173 -36 -179 6 -200 64 -111 -66 -298
5972 -298 -92 -374 -60 -58 -50 -39 99 -64 -97 -32 -244 195 106 -10 -70 -114 -325 91 -74 28 -156 106 -22
5995 -22 -240 -96 412 223 -43 54 -51 -241 -172 -120 -282 -32 -176 -21 122 372 -63 14 -48 193 179 112 176
6018 176 -38 9 15 -273 50 81 33 199 132 -13 -111 62 1 -234 79 65 80 -75 160 2 136 128 224 221 143
6043 143 282 -61 -126 -159 -81 209 154 93 17 -17 87 151 121 124 433 199 43 88 -15 111 -48 -175 -83 -184
6067a84J03k6K3L39k43j41K29K66m09k07K95k8k00K72q8L24k93n9r6K93l7l97
6089b64M20j16m4J62l46J11N6O3N8O8kl81L15l38Q1K11k36M7j60L84n45M09j93
6112b40M19k46n7J71j05J68j08n9K04K06m84L00l29L67m02K26r3j9j75Q3%K32
6134E9L0J39o5k43J99j65j97L61j37J87l2l9j69K05j79l9%K3J82j96J81L01r0
6157C16j07j9J0j45k28K95o4J62j68J01J72k90o2M04n28K23n65N16r6j20j01P07
6179D13m31K36l1j41k24O0j18O7L52j7n9l3J5j93J46Lj87L08l07L5M1J51l01j10
6203c25K71l3lR4q6k79M91l67K45pj11K44oj07K45n02L92k85M12l66J72j13j67
6226a91K30l85J44L44K3l35M1j75K40j80K24p2M04l39J40p8R3j87m8J17r4M98
$$ plain form
6067 -184 -81 -107 -84 255 12 -129 100 366 -43 -250 45 17 -183 89 1 325 32 -27 -123 170 133 -264
6089 -264 156 40 -4 158 -188 -77 -21 42 100 168 166 -215 100 -238 -157 54 -182 -135 -295 89 -456 -47 -240
6112 -240 179 -67 -124 47 -58 110 2 -57 147 353 -131 169 -160 207 -195 31 -62 -81 -256 -173 -173 59
6134 59 89 228 163 -80 119 -46 -243 118 -19 168 136 97 -72 133 -46 -85 -85 -62 120 -76 105 406 316
6157 316 209 190 200 55 -173 122 58 220 52 153 325 35 -27 377 -151 72 -493 23 -73 -193 -294 413
6179 413 -18 218 187 46 -178 -118 -236 -169 183 166 107 74 89 -104 42 45 -142 166 -141 -106 -65 86 -215 -325
6203 -325 -54 -87 -90 4 -82 -361 130 -237 8 1 -110 134 128 21 266 -236 156 -129 283 -83 89 -24 -191
6226 -191 39 -346 -202 142 165 -170 -129 -304 -64 -244 -20 -92 312 -27 113 35 128 -59 -107 10 -84 414
6248D14l27r1K28k32R2j28j55L38j58r4L7J96j07J3j25M1J30j06J9J53k26R5j45
6271a38L4k78M12j62l6J70j07K29l86J26L25l4J2j16RJ81k15p2L4M06l02m91N79
6294A80m4k12K11j6J35m72K80k91J1L54o8oK75j77j10L8J38j34p3o6k4r8j05K75
6318Aj74M33m16K26J71l54rj11J64N0L16k95O4k2j6k2K6J25m54M77o3J0j06QJ8
6343D7j48l4LK56j80j44M06k32j04K10j57J45J12n62L45n2j65J93J9O2Q8m4NQ2
6367A51l05J0L10q0l78M33k3k85m4P0L76k00k40M9q0k02L13R0K30l64Lj7K26j80
6391a37L18J27j24L3n8n8j1K96n81L70j40N5l04J68J89k61L79j98j06J72O5o5
6413A29k8Q0q4m26K04L91l72L34m27L12j65J76J77j97j97Q8M3k88K79J31k25k2
$$ plain form
6248 414 87 -4 224 -8 84 -44 -199 139 -19 -113 -76 120 13 26 -99 -58 72 -34 -15 138 -88 7 -138
6271 -138 -104 -382 30 -132 -168 2 -105 124 -262 -136 189 155 167 51 60 241 26 -46 -12 394 92 -399 180
6294 180 136 -76 135 119 254 -218 62 -229 -218 136 68 62 337 160 50 88 226 92 19 -47 -71 -169 -274 1
6318 1 -173 260 -156 70 241 -113 -122 -233 -69 -19 297 2 66 44 28 6 32 157 -297 180 117 127 21 29 47
6343 47 -101 -135 -132 124 -56 -200 206 -26 -130 80 -77 68 180 -382 -37 -89 -254 -61 -42 20 108 64 69 151
6367 151 -154 -144 166 86 -292 141 118 -167 -211 -141 235 35 -205 -156 -236 -438 -125 -35 195 -169 -166 -183 43 -137
6391 -137 181 308 184 217 159 101 90 386 -195 175 35 90 -214 -46 143 -118 261 63 -43 129 194 129
6413 129 101 181 97 -329 -125 266 -106 228 -199 113 -52 124 301 104 -93 -5 38 -250 29 160 -65 -87
6435h7P6L33k64r9q7J48j05j56K42n7J63m32K22j24L73o1J93k79m32J67N55j14
6457A75j95l37N41m80k2L48k35L5j7L87j18J92j80j14Q9k69j0L35l95K11r1J03
6479d7Ln0k8J38j74J89m12O82m07j99L13o1N1K59j39j36r2n7J40N1k84L92q8J61
6503B05k08lO2j08K40l16J75j92L89j13m96L85j97j89L47J97j20j98L97k01Kj14
6525e6M37n45K72j33K14j42R6oo1j36q7j04M34j45j3J36m20L18k2j58M61l26P7
6548I1k35K98L4j12l40J88L86k27j06J88j31J28j47J12P0m05L54m09M27j30L73
6569D07n18M35k73KL42k77j17j82O7L6J8N5K41k14j1Jn7J09k62J69rj94K45l9
6593b6o6m7J15J5k1j74J40RK01j59o1j3J4J11R7j10q6J67m01M78q4j40j82J24
$$ plain form
6435 -87 -11 322 58 -41 -128 20 -85 -241 1 -56 107 -325 -103 -227 146 85 278 -1 -433 -266 289 175
6457 175 -20 -357 184 -296 -318 30 -205 -170 -187 200 82 274 94 -20 69 -200 -210 125 -270 -59 -150 -47
6479 -47 -44 -94 -122 16 -158 31 -381 301 -106 -305 8 -53 -2 257 118 -18 -110 -167 -27 24 -260 132 44 205
6503 205 -3 -6 56 -52 188 -128 47 -145 244 131 -365 20 -177 -366 -19 178 58 -140 257 56 58 -56
6525 -56 381 -164 108 -25 189 47 143 137 76 -60 -147 -251 183 38 25 161 -259 59 37 -121 340 14 91
6548 91 -144 154 188 76 -264 -76 310 83 -23 165 34 162 15 127 197 -208 146 -263 164 34 407
6569 407 -111 324 51 53 395 118 1 -181 -114 -78 -60 -5 236 22 11 12 -45 64 -198 -29 -38 -232 13 -26
6593 -26 -92 -139 -24 -9 -30 -204 -64 -55 146 -13 -74 -87 -73 38 135 25 -61 106 -295 183 99 -41 -223 -99
6617i9k58M37m2l20L54nj40k19J74j28N9O0J00K37l92J53l1p3O3K16j80l9K88
6640B15k31J16m4l04J61l3j6J54J71l31K52P4p4J60l23L7j31M81r9r8q8l5l7q1
6664a04P3o6j6J28O9K17n00L00k57R1K14l63J24J37o3p6J9L11l05J07K04kL9j90
6688I1n8q6K75l72m0L06j91L53l39N0L6M2J23k43O1J8J15l14K96k10o7J02j75
6711b27K12M0K03l15L02k17p3K52j87J27k53L6J32J07k10k50J56J41Q8J57l11
6732i0m7Q7p9k2L65j48l01K95J30j66o7j26K74k12qL5K7K13j89j40L09k20K78
6755A98m10P9j49L11M9p8j66p5J65o7R7J2p1L13j37j79P1l5J6L8j04J97K36p2
6779B39j89j06j94L66l8k6k09N64k93m8j3j18N47k44J85m87K59j26j56mj58J08
$$ plain form
6617 -99 -357 80 38 -282 72 67 -73 -292 -118 -246 -187 -127 -27 210 -182 -29 -60 -133 -70 146 -34 -73 215
6640 215 -16 100 56 -248 -87 -120 -136 18 189 -142 110 184 110 270 -53 -16 -147 334 235 137 49 14 -23 -104
6664 -104 -31 -97 -113 15 84 301 -199 101 -156 -65 149 -214 -90 47 -16 -92 -73 238 -67 40 244 242 281 91
6688 91 33 -53 222 -150 -190 116 -75 278 -61 -11 25 67 190 -53 8 26 141 -173 123 -87 -154 -52 -227
6711 -227 -15 25 228 -87 215 -2 -75 177 -10 117 -136 -100 32 139 -71 -321 -165 -24 64 221 -90
6732 -90 -137 -50 -129 -151 214 66 -235 60 190 24 -43 -169 105 -107 -115 -80 -53 160 -29 -169 140 -80 198
6755 198 -212 -133 -282 29 78 0 -166 -241 -76 -143 -46 -34 -105 208 71 -108 -37 -72 -56 -18 -122 75 311 239
6779 239 50 -56 -250 116 78 52 -157 407 114 66 53 -65 482 238 423 -64 195 69 -87 -91 -249 -141
6801a41l7M52j32j0l51J12J99j4j20M2K11p2N9N5K24l61k07K14j84j31O05o02
6823a89L06r2o3q3m3L45n1MJ0k41K24k10K98p4J73l9l44K37m10J71P0j91J6r0
6847b66J66P4j3J85l81L52P6m06Q6K0NJ41j96P0J07r4N3n7O7k4K70O6k82K06j22
6872A03l69L40j19J71M4k79Q7q4N9o4K9K78j8l41JK77K7k76j00K95k31LJ54k02
6896b15K12K22l00K60j09n0P2j31J6K34o8M7p0j94R1k3J0N0M3l71K28J47k28r
6920a36L84m36K92k69K45K4M0n2L1j35k6o9M06m35L23n7j63J61j55J8k00K11O0
6943F2J0M5P4j78L9M7j75J34l7j34L05j60M67l45l90K24j38N25m72O5o4J08M5
6966E7j65K15r3M9j34K06m07L32k5j35L02j81k13J00j42J09J60k35J03K20Q9O5
$$ plain form
6801 -141 -178 274 142 132 -219 -107 92 78 -42 0 211 139 198 253 477 116 -91 123 -61 -192 413 -189
6823 -189 117 25 -38 -121 -164 181 130 134 144 -97 127 -83 215 141 314 275 -69 168 -242 -71 -1 -192 -176 -266
6847 -266 -100 -26 -39 146 -235 117 193 -213 -127 -107 -102 39 -157 -87 20 -74 -21 -78 -11 -35 235 301 19 225 103
6872 103 -266 74 -45 126 170 -109 -22 -106 -47 -111 -82 196 178 -163 -162 115 142 -134 -234 61 -170 -167 -13 -215
6896 -215 -3 219 -81 179 70 20 92 -39 -23 211 143 190 120 -74 17 -6 4 54 97 -274 -46 101 -127 -136
6920 -136 248 -188 104 -165 80 104 144 92 123 -12 -38 -107 299 -136 187 130 -33 128 -27 -9 -209 2 62
6943 62 72 117 191 13 52 99 -76 58 21 -113 192 32 499 154 -236 -12 -150 375 -97 -32 -96 12 57
6966 57 -108 107 14 63 -71 135 -272 60 35 -100 202 21 -192 -92 -234 -125 35 -200 -97 123 212 277
6988B77M2m18P4K80m26K83j42K7K4K1j47M8K4l56O06m16J61K6K02k48j37M27l91
7011a59K72Km25L95LK4p5j38L21j45k78J89Q8j2J30j87O0M6j76P9j03o1L38m30
7035b42K8K97J10j18j65J41Q0l59M28k93Q4j61p5K89o5r5J2K71k82K33O0k83M01
7058B96j90j13p7K04J45j2J84l35k2j46q7J41j60J59J43L2j82J78m94J27L85n45
7080c69L61m8J07%mq7j51K76J54j59J41k03k16L43j88q8j00K33j14K05p8L28Q4
7103D27m14J36j05k9p0j88J11k09L04r1J62L45m07Q5m5J37k44K24m16L41J44k25
7125b7J17o4J5j03N2m6k89N66j43o1J3j50p2K11j38M9L05%n18K49K5o5J9L59l14
7150a0M4r7j60K79R9k77Q3j1Q6K47k31p4m6J3Q8K24l41J64M3k50K62j25n9j7K61
$$ plain form
6988 277 319 -99 -25 255 -171 112 -30 -3 21 42 -105 -57 -33 -389 217 -199 -38 -12 190 -58 -195 232 -159
7011 -159 113 115 -310 85 88 112 37 -101 220 75 -203 -14 74 62 192 5 65 111 -65 14 -89 -150 188 -242
7035 -242 -214 83 193 75 -90 51 131 -228 200 -93 -9 -170 -245 44 -21 -116 -104 167 -115 118 178 -105 296
7058 296 106 -7 -84 120 265 253 437 102 80 -66 -153 -12 -172 -13 130 162 -20 158 -336 -209 176 -369
7080 -369 -8 -56 51 51 47 -40 -191 85 239 80 221 18 -198 145 -43 -131 -231 2 -112 93 15 343 427
7103 427 13 149 44 15 -55 -243 -132 -341 -37 -128 34 379 -28 57 12 149 -95 129 -287 54 198 -27
7125 -27 90 26 41 -62 -10 -56 -345 221 78 17 30 -120 -192 19 -119 -70 235 235 -283 -34 -9 -74 -55 304 -10
7150 -10 34 -63 -223 56 155 -122 -39 -50 36 283 52 -22 -68 -55 33 257 -84 80 123 -127 135 10 -49 -66 195
7175A95l67j16pK99j37L89n67L44O5Pj41M5j2j73R5K53J10k70J5j21L52j68k16
7198a26J55J27l61J28o7K57K44k86K0K2k09J66j40J45Mj68J06M78l79l10K79j73
7220h8K31j5l08J85j23K36j6L4k41K30k07k6J39l81M54J35q0q6J44j98j12K13
7242A20o1R9j49K49l13J44J29o7q4l08L42j22M9J91j29j39k3R3J45l61L56l1j01
7265B9p1rj16J56L28l58j06N26m35j45J91m1r1j36O5L51p9m1o5n9J80k06K22j31
7289d1j21J62j59m8O67n49J71j87k6M92j31m6l76K10j10j6k85P17j81J4l57O43
7311D43n20j68L27j51K27l32L02J34Jl30J48l3O1M2j17k44q0L52m73M54R5rJ21
7334B50j15r8m3R2o8K19j08j9q2L13l01k83K62j05K32k6m6N7k82r3L10J14m0n61
$$ plain form
7175 195 -172 -288 -295 4 -133 256 -311 33 98 105 -36 9 -3 -176 -81 172 282 12 27 -94 258 90 -126
7198 -126 29 156 -205 -77 -144 113 357 71 91 113 -96 70 -70 75 79 -89 17 495 116 -194 85 -88
7220 -88 143 128 -180 5 -118 118 102 136 -105 125 -82 -108 31 -350 104 239 159 73 217 19 -93 120
7242 120 59 158 9 258 -55 89 218 151 67 -241 101 -21 28 219 90 -49 -72 21 166 -195 161 130 29
7265 29 -42 -51 -167 -11 317 -41 -147 379 -56 -201 -10 -51 -142 -278 -213 138 59 18 -47 -106 74 -132 90 -41
7289 -41 -162 0 -159 -207 460 -89 82 -105 -131 361 230 184 -192 18 -92 -108 -393 324 143 157 -200 443
7311 443 -77 -245 82 -69 158 -174 128 262 263 -67 81 48 109 151 34 -210 -290 62 -411 43 138 129 250
7334 250 135 37 -6 86 18 237 129 110 28 341 40 -243 19 -86 146 120 74 131 -151 -244 66 180 140 -421
7358d21R7J26K73j63M28k74j70L02ok23K9p3J91j12K05l87p1M18m04J73J73l91
7380b80P8K99k33J90k80K86j3j79Q1J07J11m34L3J19L02l71J98K46j81J13l16
7401a24Q8J38k93J91K29k92o2L26j58l87M39m1j99L0j01K12l4J66m35K60j38R9
7423h6J63q4kK3j64j51J70K99M8m38J78L10J00n97L44l61N21j94o4M0M26l75Q5
7446A91p6j66K90k81J47K42m23O7o6R7n5J24K8j42J45K14k80J43l94K8L22l68
7468b13K63p3j8J53j61l0K63j51J00l21L85k48L01o22J65L61m05M33l59L4q0L97
7490A74k70K54K2k24L07l06J23m1n2j14l5K63J3J94k94q3R7J02j78J0j06L7J00
7513gP6j96J60N7l06K39J41p8k94O2J67P8M6l94K57Ok63K88o2K40k89L18l60q2
$$ plain form
7358 -421 -324 -198 75 -88 340 66 -104 198 192 -31 -2 -75 116 4 209 -178 -249 169 -235 -62 111 -280
7380 -280 -202 97 -136 54 -226 60 47 -132 -51 56 167 -267 -234 -115 187 -184 14 260 79 192 -124
7401 -124 -36 102 -191 0 229 -63 -125 201 43 -344 95 54 -145 -115 -216 -4 -38 128 -307 -47 -185 -86
7423 -86 77 -7 -9 14 -150 -301 -131 168 216 -222 -44 266 366 -231 113 -248 273 79 15 55 481 106 191
7446 191 115 -51 239 -42 105 347 -76 -9 -75 22 -33 91 119 -23 122 336 56 199 -195 -167 155 -213
7468 -213 50 -23 -41 112 -49 -79 184 33 133 -188 197 -51 250 -372 -207 154 -251 182 -177 -143 -223 174
7490 174 -96 158 180 -44 263 -43 80 39 -13 -127 -162 101 114 308 14 -69 28 130 -48 -38 -144 -107 -7
7513 -7 69 -127 33 90 -216 23 164 86 -208 -146 21 99 145 -249 8 14 -249 39 -23 217 -72 246 -114 -196
7537a96J19J63K7j57klJ30j63K56r5j99M6O7J00q3l09M20j9j04m1r6nK75K22k35
7562A18k06J68j01J45j5j45k6K78j08M7l83K26j41N7J09p6J41J45j14l36L27J2
7584A22l45r5M75j62r6J66j11J48j12j35O3P1L09k26mJ02j29j04K83q1o6l04J67
7607f4J66j89L27Q1q0k64K84l69M38r1o36K95K98l21K40P0k25J74k37J61m1l7
7629b0QN3p0l6J95m24K72L1o3J76l35L10Q5k46j6Q1J87j92k42K74J0k06Q7P4m7
7654e4J60J2n14K19L75k60L6n7J3L2n2K0P5M4q8J82J27k43o4J47K11l89Q3r0K96
7679B21l67J70k6J11k24J07K35k28Q2J47k60q6p8L61j26K03j30l79N79k59j5p4
7701c6o1K80J5k15R5j95J27P7j68N2j18L16k71K87M7j65n7m20N20j10N3k7PJ83
$$ plain form
7537 -196 -77 86 113 -44 -46 -49 81 -82 174 79 -120 -74 -7 93 10 -299 121 102 -2 -43 -139 -144 131 353 118
7562 118 -88 80 -21 124 109 -36 -62 216 108 155 -228 -2 -143 -86 23 -53 88 233 119 -217 110 122
7584 122 -223 -318 157 -5 -101 65 -46 102 -10 -145 -82 -11 298 72 68 170 41 -63 220 139 73 -231 -64
7607 -64 102 -87 240 321 241 -23 261 -108 330 239 -397 -102 196 -125 115 185 -40 134 -103 58 17 -20
7629 -20 -12 41 -29 -65 130 -294 -22 9 -54 122 -213 97 182 -64 -80 1 188 -4 -246 28 38 -168 -81 -7 -54
7654 -54 106 118 -396 -177 198 -62 -26 -83 -70 -38 -90 -70 5 49 -39 143 270 27 -37 110 321 -68 15 -75 221
7679 221 -146 24 -2 109 -115 -8 227 -1 81 228 -32 -118 -196 165 39 242 112 -267 312 53 38 -36
7701 -36 -97 183 198 -17 78 -117 10 87 -81 -29 -147 169 -102 185 232 67 10 -410 110 0 53 26 33 216
7725B16k14j65K4j2K57%L79p56J89j9M6P3J06n8J31k31P8J17m8j58K66l93K47
7748G5j97O4P7Ql08L00J88k39J00j55j78L27K54l15j53L17kj96J72k17L16k67
7770b9J09Q2j35j74K40p2j0j65l09M00J89l33K87j24Qk86M90k17j15O1j67M41
7792A71m59M62k80K1j90K08j22J05Q2N7j82J36l15L76n6j13j8L39j2k03O5l19
7814b47J67K14N60n61K5j65K83l41J09J70l35M63l44j2K64j29l68M59l7j33J15
7835A57j31J72J3j80J07N6j88k37O11k92j42J70j78k56M21J13j79O9l23L33K16
7856C32j91k69rJ69%Pk2k38J91J06l4J68R7l80L82l00o8l5J13J04j72K42l1l58
7880a96M7K61Q4l30Q6l1l1m8J54R1Pj15j80m3L15k35J05J63j95R9n0J74l19K14
$$ plain form
7725 216 2 -163 -139 -151 106 106 485 -271 -82 -101 -55 18 124 66 197 -34 44 161 113 -45 221 -172 75
7748 75 -122 -58 19 27 -281 19 207 -32 68 -87 -265 62 316 1 -152 165 163 -33 139 -78 238 -29
7770 -29 80 162 27 -147 93 21 11 -154 -463 -63 126 -207 80 -44 -36 -322 168 -49 -164 -103 -270 171
7792 171 -288 174 -106 -85 -275 -67 -189 -84 -2 55 -127 9 -306 70 14 -99 -117 222 210 7 72 -247
7814 -247 -80 134 694 133 158 -7 276 -65 44 214 -121 342 -2 -14 250 121 -247 212 175 42 157
7835 157 26 198 211 31 138 194 6 -231 380 88 -54 116 -62 -318 103 216 37 106 -217 116 332
7856 332 141 -128 -137 32 32 39 17 -221 -30 76 42 210 307 -73 309 9 -59 -94 19 123 -49 193 162 -196
7880 -196 -149 112 196 -134 -48 -79 -110 -158 -4 87 94 -21 -201 -244 71 -164 -59 104 -91 8 -42 132 -187 27
7904B7l3j06j15J68J80j49j31L33k35l16K36L34q6n3q4J09J20R5m55L30n30M00
7926C9J60k94k23K15J42j54L51l98J92k6M7k8j33k16L55l35K32R3N9P1L0k62J71
7949H8m3j8j1J1J97k79J88j82k3J33P7r0k68J78P3J57kk35k6K24j09J80o8j30
7973B2J40k43q5K01P2j11o7L9J28J36m23K57Q0j10n6J35j14k82L23j19K35j74
7995a6l26M13k83L62k09J62J58k24M2j35M4J6J65k02J6J90o6O8n0k13L4L08m07
8018a53L09p6J31j11Q7j25j80jK1L21j06m04M48n81L03J11j7%K47k42L3p1J25
8041F9q7j6mj22j11L27J13j63o4l9J19j23k07K02L31k25J0K71m16J05o6O3J9j49
8065a63Q0K41n61L04N8J11J02j86l4J09l88J61J74N6k79K16j36N2l5R0O6j19J07
$$ plain form
7904 27 -6 -112 -227 -59 121 -28 -159 174 -61 -377 -141 193 107 54 -30 79 199 294 -161 169 -361 39
7926 39 199 -95 -318 -103 39 -115 236 -162 30 4 51 23 -110 -326 29 -306 -74 19 78 149 179 -83 88
7949 88 45 27 16 27 224 -55 133 -49 -72 61 138 48 -220 -42 31 188 186 -49 -75 149 40 220 152 22
7973 22 162 -81 -166 35 107 -4 -71 -32 96 232 -191 66 146 36 -20 115 1 -281 42 -77 158 -16
7995 -16 -342 71 -212 150 -59 103 261 37 79 -56 -12 4 169 -33 -17 173 107 175 125 -88 -54 254 -153
8018 -153 156 80 211 100 187 62 -118 -119 -98 223 117 -287 161 -420 -117 -6 -23 -23 224 -18 15 -56 69
8041 69 -18 -34 -38 -160 -271 56 169 6 -58 -97 22 -101 -308 -106 225 0 10 281 -135 -30 -96 -33 -14 -163
8065 -163 -83 158 -403 -99 -41 70 172 -14 -48 61 -327 -166 8 64 -215 1 -135 -83 -118 -28 38 -81 26
8088B6M9k45O4L35j31k13J88k04R8K87m40M13k36r5K03R4j66K48k40j26R1M4K8
8111G2j70K25O5k52q3l6N32l44R6l42O0J4m5M51k75J90j22J15l67N90k21k9l07
8134a83M6K81l26K37o9R1k45K2J64R1k82o5M22j36M6l19J96L50l82k60N14j82
8156A1K92l11j76R4M3j7p4j04L18L2j6p4J49o7n9j20J35n8rm3J06m2k7J91l79
8181b05K34l33M83M0o5m9l09K17l48M19
$$ plain form
8088 26 75 -170 -106 229 98 -115 73 -131 -33 254 -186 227 -9 -104 99 193 27 275 35 -91 0 44 72
8111 72 -98 127 192 -60 -143 -179 353 9 105 -237 -177 -163 -208 243 -32 158 36 151 -216 374 153 124 -183
8134 -183 -137 144 -182 55 -14 77 -168 -146 18 109 -173 -238 184 48 94 -225 -29 321 -61 -321 193 11
8156 11 303 -8 -184 -90 -47 -64 -138 -242 76 108 92 18 167 100 41 -79 56 -2 -11 -54 52 10 -17 174 -205
8181 -205 29 -304 179 219 154 105 -204 13 -335 84
8191H4
$$ Imaginary data points
##PAGE= N=2
##DATA TABLE= (X++(I..I)), XYDATA
0@%%%%%%%qJ6j6J6k4L2l2M0n2O0p2Q8j04J20j41J65j92K22k54K88l25L70m18M72
31B51n33N97o67P45q31R26j030J142j264J400j550J716j902K106k336K596k888
48a522L224l613M068m611N274o105P177q622J0696j3942J9783l3583J25436J16022
62B19682j93566p3429N5053Q3401n6217o7515L1029J09285J6102q0710o3741M9975
74B9349P3587k958p9869m1123L3918M8575r518k4725K4404N4745q369p7255n0994
87c0233M0110N9390r216n2987K193O1573K1836o2874n4377L5636O7486j3448q0836
100a5747k7626O8656O5369k3601o1852l039M7002O142n8883m2262L4903O3453
112E2515O413m9015k5449L1285K9191k5218m4256K053L6330N763l2984j0315L9366
$$ plain form
0 0 0 0 0 0 0 0 0 -8 8 -8 8 -16 16 -16 24 -28 32 -40 48 -56 64 -77 88 -104 118 -136 152 -173 197 -221 251
31 251 -282 315 -352 393 -438 488 -542 600 -664 736 -814 902 -1000 1106 -1230 1366 -1522
48 -1522 1702 -1911 2157 -2454 2820 -3285 3892 -4730 5966 -7976 11807 -21776 103660 219682
62 219682 26116 -47313 7740 91141 34924 -32591 -1562 107723 123825 43115 -20626 29349
74 29349 102936 99978 20109 -21014 12904 61479 51961 27236 51640 106385 98016 20761 -30233
87 -30233 9877 69267 60051 7064 9257 70830 92666 29792 -24585 11051 78537 65089 -15747
100 -15747 -43373 25283 90652 67051 5199 2160 49162 55304 -3579 -45841 -10938 52515
112 52515 58928 9913 -15536 15749 44940 19722 -24534 -22481 13849 19612 -13372 -23687 15679
125A5679L4341k2391m5690r142K3760N474k5755j2271K8956L4758p334l9131j5680
138c4426K5154K1174k1806l7913Q55L7592J9839k0317j8432J8314K5075j4905
150B04m2769j5167K6606K5086p639j6529P903J9599k867k3677j1090J3062J1408
163a5870j0839j3974O068J9788Q274q809q007L004J520j1069j3533J966J8852
176b2629J3842n297j1858J332R205l119j5169o646J2163J1165n341o660Q187J4705
190f120n4j3204q659K032K393l651r52Q199J0884K648o081n270O78J851m035o678
206b6019J177Q961O744j300j390N883N461n641j3912m334Q076P167k105j494P708
221e018Q379l035j1221l043N670K209o008l729O824J0012L089k519r32J168j652
$$ plain form
125 15679 50020 27629 -18061 -27203 -3443 2031 -23724 -35995 -7039 27719 20385 -18746 -34426
138 -34426 -9272 11902 -9904 -47817 -46962 -9370 10469 -9848 -28280 -9966 15109 204
150 204 -42565 -57732 -31126 -6040 -13679 -30208 -22305 -2706 -5573 -29250 -40340 -27278 -15870
163 -15870 -26709 -40683 -34615 -14827 -6553 -15362 -23369 -20365 -18845 -29914 -43447 -41481 -22629
176 -22629 -8787 -14084 -25942 -24610 -15405 -18524 -33693 -40339 -28176 -17011 -22352 -29012 -20825 -6120
190 -6120 -6174 -19378 -28037 -26005 -23612 -27263 -28215 -20016 -9132 -6484 -12565 -17835 -17157 -15306 -19341 -26019
206 -26019 -24842 -15881 -9137 -10437 -11827 -5944 -483 -6124 -20036 -24370 -16294 -9127 -11232 -12726 -5018
221 -5018 3361 326 -10895 -13938 -8268 -6059 -12067 -15796 -8972 1040 4129 1610 678 1846 194
236A94p140n792K198Q438O811k18k453J930L516k471q105l532N438M407k662k572
252b013P281R350L41p933m125J661n71l919n28O735P086J215k525k015j76q31
268I033k819k414O86L839L212J232O51K421K597k186o424m063J392L076Q19J022
284A2074M482M835j103o587k779J326J70k865n38M295M527K57o11R94J359l239
300A6597n506k321J651K848J464K038K320Q97j715l619l395q30J155k05n79J429
316A2229M436K624k135l133o81K50m400m789Q25O576L532k371j580K275R65m974
332I649o684n94L836K041j985j404L281M664j112n925n150Q06K329k055m056Q57
348a502P585M349m981p775j25M536j911q254j618P638O089l502o161J797N510
$$ plain form
236 194 -6946 -12738 -10540 -2102 4709 4491 2038 3968 7484 5013 -3092 -6624 -1186 3221 559 -2013
252 -2013 5268 14618 14959 7026 2901 4562 3991 72 -456 6279 13365 14580 12055 10040 9864 9033
268 9033 6214 3800 4486 8325 11537 12769 13420 15841 18438 16252 9828 5765 7157 10233 11052 12074
284 12074 16556 21391 20288 13701 10922 12248 12418 9553 9015 13310 17837 18094 17483 18477 19836 16597
300 16597 11091 8770 10421 13269 14733 16771 19091 19988 18273 14654 11259 10429 11584 11379 10800 12229
316 12229 16665 19289 17154 14021 13340 13590 9190 4401 5226 11802 15334 12963 11383 13658 14623 9649
332 9649 2965 2371 6207 8248 6263 4859 8140 12804 11692 5767 617 1423 3752 1697 -2359 -1502
348 -1502 6083 10432 5451 -2324 -2449 2087 176 -8078 -9696 -2058 4031 529 -5632 -3835 1675
363A675j601r118m263L669N161q34l401Q74M820J817n614o263j084M419J148l833
379a2428j805M631O085j554p195k451M296J080n362m454N057P060L85n506j221
394a3382L586J444n234n286K305N627J900k843j264L747L612k372o293k177M026
409a2604K867k076k538L881O678O70o455l937L092L515k754m217K703P115K171
424a889l947k388K309K894k194m398l13L946L401j26j120J057L317K96l988l504
440f647J739L262J338k033O8M420K798k892m393Q31L002m40k810M84M101L164
456E992j496j836N99J124j747j876N0J766J787N65K63J15O12j83j627k057K15
473B266J405J290m77N47K188R59j841k637n1P28o22j411J400L036J070j894j486
$$ plain form
363 1675 74 -9044 -13307 -9638 -4477 -5311 -8712 -7838 -3018 -1201 -6815 -13078 -14162 -9743 -8595 -12428
379 -12428 -14233 -9602 -3517 -5071 -12266 -14717 -10421 -9341 -14703 -19157 -14100 -7040 -6655 -12161 -13382
394 -13382 -9796 -8352 -13586 -18872 -16567 -10940 -9040 -11883 -13147 -9400 -5788 -8160 -14453 -16630 -12604
409 -12604 -9737 -11813 -14351 -10470 -3792 -3122 -9577 -13514 -10422 -6907 -9661 -13878 -11175 -4060 -1889
424 -1889 -5836 -8224 -5915 -3021 -5215 -9613 -9926 -5980 -2579 -2705 -3825 -2768 549 845 -3143 -6647
440 -6647 -4908 -1646 -308 -2341 -2273 2147 4945 2053 -2340 -1509 1493 1053 -1757 -1273 2828 5992
456 5992 4496 2660 3259 4383 2636 760 810 2576 4363 4928 5191 5306 5918 5735 4108 2051 2266
473 2266 3671 4961 4484 5031 7219 8178 6337 3700 3649 4377 3755 2344 3744 6780 7850 5956 4470
490D470Q84L87k138k024L89K696Q75q20k7Q61O92j075k613j340O57J852L05j286
508B745N98K016O15k472k501K98K127o77k480L40L298J449j894j671P76J238k165
525A640k124j9K535J401q34j89j19J279p13k152j692M75J878P24q70m59J728J776
543D265j485k956o76K228N54k397l96K173K216q98j942M8R12m17j675o50J214
560A18J834L51r43NL85J67j230j579j06J713J361r02n81R65J794r40l093j212
578a893J494J719j174j512J434K603mk017j445O12O21r43j084OJ473J420J99j678
596a69n94R0L00r76j491J10K075J206j332q16Q55M83r83j884j96J070O03k54l45
615b248Q07J49j85q99r14r79N96O60K17o23K49J674l85j415j072K84P86q01o89
$$ plain form
490 4470 5354 5741 3603 1579 1968 4664 5539 4719 4692 5553 6245 5170 2557 1217 1874 3726 4031 2745
508 2745 3343 5359 5974 3502 1001 1299 3426 2749 269 609 3907 5356 3462 1791 2567 3805 1640
525 1640 -484 -503 2032 3433 2599 2410 2291 3570 2857 705 -987 -512 1366 2090 1220 761 2489 4265
543 4265 2780 -176 -852 1376 1930 -467 -863 1310 3526 2628 686 734 1646 1229 -446 -1096 118
560 118 1952 2303 1360 1365 1750 1917 687 -892 -998 715 2076 1174 593 1558 3352 2412 -681 -1893
578 -1893 -399 1320 146 -1366 68 2671 2667 650 -795 -183 438 -505 -1589 -1583 -110 1310 1509 -169
596 -169 -763 -673 -373 -1349 -2840 -2730 -655 551 -781 -1597 -742 -259 -1242 -3126 -3322 -2252 -1649 -1903 -2248
615 -2248 -1441 -1292 -1477 -2376 -3290 -4269 -3673 -3013 -2796 -3419 -3170 -1496 -1881 -3296 -4368 -4084 -3298 -4099 -4788
634d788O31J314R60r16j061J39J29p05l96M53k73Q46J061N69q44l16O8L28j572
653d373m37O78J710Q6n38O72Q79p19r58k95O37K79p41R92R01P72o08q1K37o69
673a576q0J50L73L59N80J184Q9p58j11L88j03p20k02J227J123J92m50K81J018
692B964m05p15o16M41L96J51K45O02O64K03k26o54q63L97J15L21J65l4J296Q38
712E285p53j123m16O18m45n91K9J455M27j08m41j06M7j045n22N40m28j53P31N75
732C576K13p71n97Q9p88n59n49J086N48l79J27N8r1n94j001k63n69M5Q97M41m65
753D54l55M13L92j051j374m09J013R5r55q6J199O87o24j508n36N79j66m40o94
772c366Q39J441R1l99j159k57J06P5n62j163J014J581N01j461N1N60N82j201j687
$$ plain form
634 -4788 -4157 -2843 -1883 -2799 -3860 -3721 -3592 -4297 -4693 -4240 -4513 -3667 -2606 -2037 -2881 -3197 -3129 -2801 -4373
653 -4373 -4810 -4132 -2422 -2336 -2874 -2202 -1323 -2042 -3000 -3295 -2658 -2379 -3120 -2128 -1227 -455 -1063 -1144 -907 -1576
673 -1576 -1656 -1506 -1133 -774 -194 990 1079 321 210 598 495 -225 -427 800 1923 2115 1665 1946 2964
692 2964 2559 1844 1228 1669 2065 2216 2461 3063 3727 3930 3704 3050 2187 2584 2699 3020 3185 3151 4447 5285
712 5285 4532 3409 2993 3611 3166 2575 2604 4059 4486 4378 3937 3831 3878 2833 2311 2851 2423 2270 3001 3576
732 3576 3789 3018 2421 2510 1722 1163 614 1700 2248 1869 1996 2054 1963 1369 368 105 -464 -419 478 919 454
753 454 99 512 904 -147 -1521 -1930 -917 -822 -1777 -1863 -664 23 -601 -2109 -2645 -2066 -2232 -2672 -3366
772 -3366 -2527 -1086 -995 -1394 -2553 -2810 -2704 -2629 -3191 -4354 -3340 -1759 -1258 -2719 -2668 -2108 -1526 -2727 -4414
791d414P93J491Q2l85R5J255M12j193j028j19M85K94L81q7O53P39N28q82j240
810b140L56J335l99j235K48J813J386r82j003L04R80n75j213r4J481O37M19m29
828H89J71N74j20q09q41j39J344M26j26q8M84J056o52j435p04J553O42p65j163
847B97J124K184l53j569q50R08N63j181j107P44J621L17j78p87k08P09q8j460
865F86o89J61J851J10j047m04J095J118j382k481J10J703N94j154m00J321J338
882B530j209j290o51M62M01n18j310O23J333J141r02j279R6N08n7j252j036J413
900i97J531m38r87k77J062L08j532j444N41J453L20n73o4O62O56o23j416n84M52
919a950R71j55l26L38J371M77j293j104J10Q38l3j274M61J362R34p32r19P32J75
$$ plain form
791 -4414 -3621 -2130 -2048 -2433 -2338 -1083 -671 -1864 -2892 -3011 -2526 -2232 -1851 -1938 -1285 -546 -18 -900 -2140
810 -2140 -1784 -449 -848 -2083 -1835 -22 1364 382 -621 -317 663 88 -1125 -1219 262 899 1318 889
828 889 1060 1634 1514 705 -136 -275 1069 1495 1369 1281 1765 2821 2169 734 30 1583 2225 1460 297
847 297 1421 3605 3252 1683 833 1741 2304 1123 16 760 2381 2698 2520 1733 1525 2234 2146 686
865 686 -3 158 2009 2119 1072 668 1763 2881 1499 -982 -872 831 1425 271 -129 1192 2530
882 2530 1321 31 -620 -158 243 -275 -1585 -962 371 1512 610 -669 -573 -65 -122 -1374 -2410 -997
900 -997 534 96 -891 -1168 -106 202 -1330 -2774 -2233 -780 -460 -1033 -1097 -435 221 -402 -1818 -2402 -1950
919 -1950 -979 -1134 -1460 -1122 249 726 -567 -1671 -1561 -723 -756 -2030 -1569 -207 727 -5 -924 -192 -17
938a7n21r23J08L29R06M73k90N43p4J79r14m44j41N86N11P3J21L87P94n29j102
959E5K5L99L4n36K37P94Q39l20l98l92K67q9j038k12O59Q21j2N96m20j9n15L0
981H05n84n84k61J002M36k78L39K08j04m47q96j71L36M6K15L45j46K57m33M54
1001E39p88o28k76L82P6M2j62P46M89m44p22k99m11mJ62k60K11P87L37o54o58
1022a535j02p0L58o24j78L67J194j13r43l18R50M38j079j091J29J666j6n29k52
1041a748N67O88k13r96r85R23P43K60q40L83R48P22q71j094k11J247j11j180K5
1060a743J675J347m25j320K25N34O30j720j02P67J357M21p62j71R76j80o54n93
1078B62j61Q90O62k2l25M49R83k75j433l88Q65P90k46j103P72J486L18j419p34
$$ plain form
938 -17 -538 -1461 -1353 -1024 -118 355 65 608 534 713 -201 -645 -786 -200 311 384 505 892 1686 1157 55
959 55 80 479 513 -23 214 1008 1847 1527 1129 737 1004 915 -123 -335 324 1145 1133 1729 1309 1290 775 805
981 805 221 -363 -624 378 814 536 875 1083 979 532 -364 -535 -199 -153 62 407 261 518 85 539
1001 539 -249 -877 -1153 -771 -695 -653 -815 -69 420 -24 -746 -1045 -1456 -1460 -1298 -1558 -1347 -560 -223 -877 -1535
1022 -1535 -1637 -1707 -1349 -1973 -2151 -1784 -590 -703 -1646 -1964 -1014 -576 -1655 -2746 -2617 -951 -967 -1496 -1748
1041 -1748 -1181 -493 -706 -1702 -2687 -1764 -1021 -761 -1601 -1218 -270 452 -419 -1513 -1724 -477 -588 -1768 -1743
1060 -1743 -68 1279 854 -466 -241 293 923 -797 -899 -132 1225 1646 884 713 1689 1509 855 262
1078 262 101 991 1653 1631 1306 1755 2738 2463 1030 642 1507 2297 2051 948 1720 3206 3524 2105 1371
1097A371R14K55l03j074M01J026Q65n03n71Q7L01jj082m39M47Q66J10o58m64Q88
1117B436P27j488j092L48J013k5r51l20Q87R32p15q66k62J08J47r35k1L18P33
1136I74M65o34q91k97M98k66j057k9N74P83j55p94K93L42k93j009p10L45Q31j46
1156a176l23K6M02j31j69o75k13J06L12l0j00J10L17K35Mr82l54M74r3k22K37
1177b245P56K03j34l22J93m01j48m28M99j00J33N74K87k51J30Q0j50o1n09J92
1197a702M45O86m68M09J84M17p43k04k06J10N29K14J20l0N00j95J90n54k45L69
1217a74J21J61j14M69N64j9m83j08K64l38k04j46O53M68J60k89J97J98j6r04J01
1238E61L17k56M58J53L5P0p7q5j32o17k67L21M44j56K36J47K73k43o73J53J08
$$ plain form
1097 1371 2285 2540 2237 1163 1564 2590 3455 2952 2381 2468 2769 2768 1686 1247 1694 2560 2670 2012 1548 2436
1117 2436 3163 1675 583 931 1944 1919 968 648 1535 2467 1752 886 624 732 879 -56 -77 241 974
1136 974 1439 805 -86 -383 115 -151 -1208 -1237 -663 120 -35 -829 -536 -194 -487 -1496 -2206 -1861 -1030 -1176
1156 -1176 -1499 -1473 -1071 -1202 -1371 -2046 -2259 -2153 -1841 -1871 -1971 -1861 -1544 -1309 -1305 -2287 -2641 -2167 -2260 -2482 -2245
1177 -2245 -1489 -1286 -1420 -1742 -1549 -1950 -2098 -2526 -2027 -2127 -1994 -1420 -1133 -1384 -1254 -1174 -1324 -1385 -1894 -1702
1197 -1702 -1257 -571 -1039 -630 -446 -29 -772 -976 -1182 -1072 -543 -329 -209 -239 261 66 256 -298 -543 -174
1217 -174 -53 108 -6 463 1027 1008 525 417 681 343 139 -7 646 1114 1274 985 1182 1380 1364 460 561
1238 561 878 622 1080 1233 1268 1338 1261 1176 1044 427 160 481 925 769 1005 1152 1425 1182 509 662 770
1259G70n86n81O34O78J45p5k51k19k91J3n41j31m6M49M31j43L5j71L32r2n44l89
1281e73JK37L45k17r3O28j63l43l13k00J3M4L09Kk23L81M36p2r16m10N56J54J40
1304b77o43K40O61K69n95l18Q2M96m15m13J92P06J38M50k71j32j75L44j55p34
1324e50K29M26O06n6j51Q7L10j60p71k15L95M77R3m03N49N66J12l65n50l2M29
1345A026j40m6l05O73M63k7o15k62M64j36n65k67K65J033M8j36p79P24K33m94
1365A157p70j72J191l67n20oN33M12l00q11l91L88L64k38j84nO67N9n73o36j70
1386c72O10j59q71O8N04Q12n37p06j10O47n59p73k60K09R28L24p64j20N14j94
1406h09l81o16m04O77O96n70n81M40Q71k48q40m30L88N96m85o95M12J190M1m04
$$ plain form
1259 770 184 -397 237 915 1060 985 734 515 224 237 -304 -435 -481 -32 399 256 291 120 452 360 -184 -573
1281 -573 -572 -335 10 -207 -300 328 165 -178 -491 -691 -678 -634 -325 -323 -546 -165 271 199 -717 -1127 -571 -417 -277
1304 -277 -920 -680 -19 250 -345 -663 -581 -85 -500 -913 -721 -15 123 573 302 170 -5 339 184 -550
1324 -550 -321 105 711 655 504 591 901 741 -30 -245 150 627 720 317 866 1432 1544 1179 629 597 1026
1345 1026 886 840 535 1208 1671 1644 1029 767 1231 1095 530 263 528 1561 1609 1473 694 1418 1651 1157
1365 1157 387 215 1406 1039 519 513 1046 1458 1158 347 -44 344 708 470 286 281 948 1007 434 -202 -372
1386 -372 238 79 -792 -724 -220 592 55 -651 -761 -114 -673 -1446 -1706 -1497 -569 -245 -1009 -1129 -615 -809
1406 -809 -1190 -1806 -2210 -1533 -837 -1407 -1988 -1548 -677 -925 -1765 -2195 -1807 -1211 -1696 -2391 -1979 -789 -748 -1152
1426a152p91N9M63m1r06J16O38O69j21n78r8O16L84o84q00N44Q91K10n71k17Q08
1447e61K48j95o65j10N13N64q1k73K61P41J50l36q99M37L14K70l29K3O22N80j25
1468A149l79n91L84L94n25l03K39R60L2k74K39j36M31n15n33R9N27p5N47k37m1
1489A392O24oo54k51JL74j28j38K26N88k3k23p00q0R6O1l22O5P6R69k77n41n6
1512A073K9l02r2p3l63L23O60k28l99j99J49M38j009k67K32M83k09k40L44Q3j65
1533B68l32k1m40Q8k23K48L9N7J91j59m63j89N56m56jk37J88L20j67L4j69o5J76
1556g57j00m29J30p8L36l6K09O1J53j33n27k74K08j66M08J56K36J37j61j09K14
1577e22l14n03L43Q2J97Q2N3M75k05J72j56m69j61N18J87k1k0N65Q8k20n01l23
$$ plain form
1426 -1152 -1943 -1884 -1421 -1462 -2368 -2252 -1614 -945 -1066 -1644 -1742 -1126 -742 -1426 -2226 -1682 -791 -581 -1152 -1369 -561
1447 -561 -313 -508 -1173 -1283 -770 -206 -287 -560 -299 442 592 256 -643 -206 108 378 49 72 694 1274 1149
1468 1149 770 179 563 957 432 129 368 1328 1360 1086 1325 1189 1620 1105 572 671 1198 1123 1670 1433 1392
1489 1392 2016 2010 1356 1105 1106 1480 1352 1214 1440 2028 2005 1782 1082 1002 1098 1159 837 902 978 1947 1670 1129 1073
1512 1073 1102 800 708 635 272 595 1255 1027 628 429 578 1016 7 -260 -28 455 246 6 350 433 268
1533 268 -64 -85 -525 -437 -660 -412 -373 -316 -125 -284 -747 -936 -380 -836 -837 -1074 -886 -566 -733 -699 -868 -933 -757
1556 -757 -857 -1286 -1156 -1234 -898 -934 -725 -664 -511 -644 -1171 -1445 -1237 -1403 -995 -839 -603 -466 -627 -736 -522
1577 -522 -836 -1339 -996 -914 -717 -635 -582 -107 -312 -140 -296 -765 -926 -408 -221 -242 -262 303 391 171 -330 -653
1599f53Q48j22j35k58M97M84p5j73o8K92o41K69l07K00N20K59k26k39K71L6j64
1620F15m10l28K88Q91o52N0P6N57J35o96l55J12J11K13k75n3N38L00n06m05J16
1641C22J93l42m08J22J77L54P1m11l7J84K60p82k34J10Q94k31k38m43N79M46m33
1662A53q48k27Q09l92j16k39L94N61q8o33j55J7N97r00q3k67J150L79n08o22J94
1683h24O69j82m83m40M69O35L3n18J09M77J12o55q07O71K44L22l50j01M58N37
1703C76m11o27rK92M99k55m12M09N69J46m16l22L55J50Oq36M51O28L31l40K4k17
1725C91K91j82m20J32K29N31J03l96L32J50O6k86l65k16L98K25l12J32L67K95
1745A465J49m89l71L51j08j67l5J79J25K49n01J8l2l96J92R4l35j8O17j48k77
$$ plain form
1599 -653 195 73 -62 -320 177 661 586 413 345 637 -4 265 -42 158 678 937 711 472 743 779 615
1620 615 205 -123 165 1056 404 454 530 1087 1222 526 171 283 394 607 332 279 817 1117 611 206 322
1641 322 515 173 -235 -113 64 418 489 78 41 225 485 -297 -531 -421 473 242 4 -439 140 586 153
1662 153 -695 -922 -113 -505 -621 -860 -466 95 7 -626 -781 -764 -167 -1067 -1150 -1417 -267 112 -396 -1018 -824
1683 -824 -155 -337 -820 -1260 -791 -156 -123 -641 -532 -55 57 -598 -1405 -734 -490 -168 -518 -619 -161 376
1703 376 -35 -662 -671 -379 120 -135 -547 -138 431 577 161 -161 194 344 350 -486 -35 593 924 584 608 391
1725 391 682 500 80 212 441 972 1075 679 1011 1161 1227 941 576 360 758 983 671 803 1170 1465
1745 1465 1614 1125 754 1105 997 830 795 974 1099 1348 847 865 833 437 629 723 388 370 987 839 562
1766E62k8k9o4j47k43j88L25J12j66K45k34j97J50r3l67n7j56K27K17o5m06M44
1788a58pm86J25n30N69l37j19K29J93M4j30j63k45j16P2j48j33K77J01L52k49
1809h59n81M03j04m4k18j30L17M09j80k47R1K41m3l48k80J59M73j26J24q3L58
1830f68N03l41l26q7O8J64k53j29L31O25J75m62o0j09L83J4m99J66Q66L45k62
1851D44n00J34K26L8n00K37O4K90J51k36n7N32P2j04k38k74N92j6j58k56M76P55
1873A672o16j76j50K08L96k15m96K22L93K95m22j31K88j2k84l00O4lN55n01j36
1894F51M8N29k0n92K4j87O55l6l64j67N02m8l17n79m9L34j43n5K70P7K94l82l95
1917E0J0k95M40l66m47L20N85Q8l71k12R1L7l84k22O3k9M90l05k19K16M7n0n4
$$ plain form
1766 562 534 505 441 294 51 -137 188 300 134 379 145 -52 98 5 -362 -419 -575 -348 -131 -196 -602 -158
1788 -158 -165 -651 -526 -1056 -487 -824 -943 -714 -521 -477 -607 -770 -1015 -1131 -1059 -1207 -1340 -1063 -962 -610 -859
1809 -859 -1440 -1037 -1141 -1185 -1403 -1533 -1216 -807 -987 -1234 -1143 -902 -945 -1293 -1573 -1414 -941 -1067 -943 -1026 -668
1830 -668 -165 -506 -832 -919 -851 -687 -940 -1069 -738 -113 62 -400 -460 -569 -186 -172 -671 -505 361 706 444
1851 444 -56 78 304 342 -158 79 143 433 584 348 291 823 895 791 553 279 871 855 697 441 917 1672
1873 1672 1056 880 730 938 1334 1119 623 845 1238 1533 1111 980 1268 1256 972 672 736 733 1288 787 651
1894 651 699 1228 1208 616 640 453 1108 1072 708 541 1043 995 678 99 50 384 241 186 456 533 827 445 50
1917 50 60 -235 205 -161 -608 -288 297 385 14 -198 -107 -70 -454 -676 -613 -642 -152 -457 -676 -460 -413 -463 -517
1940e17k83j19J80j8L15m42J03N93J39p23m1N4J40L62o50M69L29K9j45m08K25
1961d08J85m12j94RM06K00m3J80j76j80J00M6k60n7M24M80l03KO5k0K78k69l87
1984c34J04J39K19R1R2l0J62j30j13l33J70J85K34o2j10L63J62k84k70r2J16L79
2006F58l58k12r8Q92Om49lj47K05m22J00j55M56J19k18l69M57J82k68l35j60j37
2028b56M59L2l73R4M18q6n96K5m78N08J17k39Q8j40N50K62o76q4j83J88l11j42
2050h23K60K28J82k38l74n2M04J5m52k04K88L75K8m93r7P32j40o27r2K18N89m39
2072g12j33J03N47L2n5n16j81K30N44m01l28N83J75K11l31m70K32J73J95o08K31
2093d79M81J96j31N5j45L75k52M4p41N86P52m04j36R2K84%j07j13l05N08J78r9
$$ plain form
1940 -517 -800 -919 -739 -757 -442 -884 -781 -188 -49 -772 -813 -759 -619 -257 -907 -438 -109 -80 -225 -633 -408
1961 -408 -223 -635 -829 -820 -414 -214 -257 -77 -253 -433 -333 -287 -547 -604 -180 300 -3 -1 64 44 322 53 -334
1984 -334 -230 -91 128 219 311 281 443 313 200 -133 37 222 456 394 284 647 809 525 255 163 279 658
2006 658 300 88 -10 882 888 439 436 289 494 72 172 17 473 592 374 5 462 644 376 41 -119 -256
2028 -256 203 235 -138 -44 374 288 -308 -283 -761 -253 -136 -375 -287 -427 123 385 -291 -375 -558 -370 -681 -823
2050 -823 -563 -335 -153 -391 -765 -817 -413 -398 -850 -1054 -766 -391 -363 -856 -953 -221 -361 -988 -1080 -862 -273 -712
2072 -712 -845 -742 -195 -163 -218 -734 -915 -685 -141 -542 -870 -287 -112 99 -232 -702 -470 -297 -102 -710 -479
2093 -479 2 198 67 122 -23 352 100 144 -597 -11 741 337 201 293 577 577 470 357 52 560 738 639
2115F39PK98J72P2n17k2k36N26j50j64K20J23K79j19l98PJ90k32m59L79j57P17
2137A175R5o21p6O52k86j11n01L15J79N31o59n4J44K01l15j74j40N6L08l17K67
2158F69k16n3L20j50o38j4K05R0j75k04j43P75Q3o59j09J45r7k2n48J74L30M98
2180B61o35k43K98J3j09l45J99k60J06j9N0k77M95k8j67n77J91K29J92k70k21
2201a117L67J0k1j69m01K41L20k22J9j31N97N0j53j63k30N42l09oj96K99L24K39
2223a10m39j12l3K71q4j35M09P5J4j7k76N76k19j46k53N6M84k60J39r0J77M21
2245D48Q4j66j20j47J53P8k63O3J16K75J33l31L06Q4j07k90N1K34N9p2k09K21
2267F00K49k8l13k21J40J65r0L27l08J36J43n5r5n09L19n3J16O3mj40J07n3l93
$$ plain form
2115 639 646 944 1116 1188 671 649 413 939 789 625 845 968 1247 1128 730 737 927 695 236 615 458 1175
2137 1175 1270 649 573 1225 939 828 327 642 821 1352 693 639 783 984 669 495 355 411 719 402 669
2158 669 453 400 720 570 -68 -82 123 213 38 -166 -309 466 549 -110 -219 -74 -171 -193 -741 -567 -237 261
2180 261 -374 -617 -319 -306 -415 -760 -561 -821 -715 -734 -684 -961 -466 -494 -661 -1238 -1047 -818 -626 -896 -1117
2201 -1117 -750 -740 -761 -930 -1331 -1090 -770 -992 -973 -1104 -507 -457 -610 -773 -1003 -461 -770 -776 -972 -673 -349 -110
2223 -110 -549 -661 -694 -423 -507 -642 -233 -158 -144 -161 -437 139 -80 -226 -479 -423 61 -199 -60 -150 27 448
2245 448 532 366 246 99 252 330 67 130 246 521 654 323 629 713 606 316 367 601 660 588 379 600
2267 600 849 821 508 287 427 592 502 829 521 657 800 745 650 141 460 407 523 586 582 442 549 496 103
2290A03M28j90k21J2K33l30j8K27J7J72l63l11K15l9K94k08Q6n8M7k03j15nR9
2313a28k97L36l58J13R8K16k13Q8k49L35k91o2L2j36K66P2j70J43l86J22j56L47
2335b78k23j82N0J42r5M94k96R4O1J66l94o3L29p7k09K24O6O2j2M3J13k09L1K03
2359D0k28J29L65m1j24k60j57J55L06J83k19O0K7K34j26J32k15k78K15m0M3K9
2381B30J83J53j9n03L69K55j69k79l03J42L57J96nl46M46k64j72l32J03O11j43
2402E10J30j93j17K67k89n2Q9Q9P1n68J64K67Q8k90Q2m43K1K39l6l37k49M72r2
2425a77k8L1q8J67j10J01k58j89N6J06M23o72M4L02j93J39o22M62O6M2k19P8m5
2448e84K24n95k58M28L63l49k62L34Q7J15n0R0k67L02k41j48m6M1K67L15l94K41
$$ plain form
2290 103 531 341 120 132 365 35 17 244 261 433 70 -241 -26 -65 229 21 107 49 96 -107 -222 -227 -128
2313 -128 -425 -89 -447 -334 -236 -20 -233 -145 -394 -59 -350 -412 -380 -516 -250 -178 -348 -205 -591 -469 -625 -278
2335 -278 -501 -683 -633 -491 -586 -92 -388 -294 -233 -67 -461 -524 -195 -272 -481 -257 -191 -129 -141 -98 15 -194 -163 40
2359 40 -188 -59 306 265 141 -119 -276 -121 185 368 149 209 236 470 344 476 261 -17 198 158 201 230
2381 230 413 566 547 44 413 668 499 220 -83 59 416 612 607 261 707 443 271 -61 42 653 510
2402 510 640 447 330 597 308 256 345 434 505 -63 101 368 456 166 248 -195 -174 65 29 -308 -557 -85 -177
2425 -177 -205 -174 -262 -95 -205 -104 -362 -551 -495 -389 34 -638 -594 -292 -485 -346 -968 -506 -440 -398 -617 -539 -584
2448 -584 -360 -955 -1213 -785 -422 -771 -1033 -699 -612 -497 -547 -457 -724 -422 -663 -811 -857 -816 -549 -234 -628 -387
2470c87N6p3k0j67O1J18J55J9J50l3P9j38K36l93J20J33K0j39K77j30L38Lj79
2493A06k50N53J45l19k91L55K79J12j96k09N7J70r4Kj76rO09J54l05j54L44O4
2515I47m52l4K06L06O3k32j05l0K64j00l34jN06k78k73K87j5J58j94j15k15J8
2537C77M40m02o5M3O1K35k58o8j64K92j37j44Oj17K18K78k5m55l2J37J85m45j41
2560a81J38J3o7P7r7M92n22O8l55K7j78O97m77j68R1J59j5O1l02K1J51j09k33
2583g09J48J2J83l27J68j99K07k50q4q1o5L81q1J32k07K5L45k11J76o58L49J57
2605e89k16M25m90O06q4j64L0K48o7J20l71nK17L17n3j81p9J59O7j64P8J39L72
2628C15j42j43N2l45O55m07Q5P4j21L28m65M29k61m6N21m82j93J38J88J63k09
$$ plain form
2470 -387 -331 -404 -424 -591 -530 -412 -257 -238 -88 -121 -42 -180 56 -337 -217 -84 -64 -203 74 -56 282 285 106
2493 106 -144 409 554 235 -56 299 578 690 494 285 342 512 418 420 244 235 844 998 693 539 883 947
2515 947 495 461 667 973 1036 804 699 669 933 833 499 498 1004 726 453 740 725 883 689 574 359 377
2537 377 817 415 350 393 454 689 431 363 199 491 354 210 216 99 317 595 570 115 83 220 405 -40 -181
2560 -181 -43 -30 -97 -20 -117 375 -147 -79 -434 -407 -585 112 -365 -533 -442 -283 -298 -237 -539 -518 -367 -476 -709
2583 -709 -561 -549 -366 -693 -525 -724 -517 -767 -851 -932 -997 -616 -697 -565 -772 -747 -402 -613 -437 -1095 -746 -589
2605 -589 -805 -380 -870 -264 -348 -512 -482 -234 -301 -181 -552 -557 -340 -23 -76 -257 -336 -177 -110 -274 -196 -57 315
2628 315 173 30 82 -263 392 -15 70 144 23 351 -114 315 54 8 529 47 -146 -8 180 343 134
2649A34R5J53j33K53m26j1M90o7K76n27o8N22k73j39k78M78k21Q3j24j2P8L38
2671F21m04J0p8K20k08k33n0R5L00l73M25j73L3q8k05p1K55J32j19k83k10L59
2693d5J52Pk36k72J93K70l08j04Q8N0l8K35m39O0L29k16l38L84J10m3O4l19K34
2716a82l8O5k09l05L55J71P4k06J8K31L13l47k92n6J84J4J08l90K35L40K5j63
2738e5j1J07k5j9K10l11L85P0m27L47p0J36k38K53k83K49K52j67L6k48J8k5Jk6
2762A59O7J63J37k85L82j23R5k54R0n11O00J75l69N4J53p4L5m71K77J23L14m34
2784C03K01k9k07J22L05j80j70k30L39O7l90J09J3J27k55Q1K6j20K95l37L11l05
2806G6L50n62O2L05j57j0j68l07J07p8K2J67n9j28K50l3k42k80M58j32j14J3m7
$$ plain form
2649 134 229 382 249 502 76 65 555 488 764 237 169 691 418 279 1 479 258 341 217 205 283 621
2671 621 217 227 149 369 161 -72 -122 -27 273 -100 325 152 185 97 -108 -179 76 208 89 -194 -404 -45
2693 -45 107 114 -122 -394 -201 69 -239 -343 -255 -205 -243 -8 -447 -387 -58 -274 -612 -228 -118 -161 -97 -416 -182
2716 -182 -220 -155 -364 -669 -314 -143 -69 -275 -257 -26 287 -60 -352 -408 -224 -210 -102 -492 -257 83 108 -55
2738 -55 -66 41 16 -3 207 -104 281 351 -76 271 201 337 99 352 69 318 570 403 439 191 209 184 185 159
2762 159 226 389 526 241 623 500 595 341 431 -80 520 695 326 380 533 459 494 23 300 423 737 303
2784 303 504 475 268 390 695 515 345 115 454 521 131 240 253 380 125 206 232 112 407 70 381 76
2806 76 426 -136 -74 231 74 64 -104 -411 -304 -382 -360 -193 -252 -380 -130 -163 -405 -685 -227 -359 -473 -460 -507
2829e07R9K78j61k56L3J08j35r6j15R9L92l27Rl4J69J09k00r7O9J3k2J3QR2Q6
2854c73K71m84J35l9K5K86K11m60M5O0J81l27J53l41O92l40L4m2J20K16j09r2
2876a78pK29l31K71o6J9J42K81k47m5J60j00j06n2J49M81r7l89J30lp7N43m41
2899B66J94k12J88pj84Q5L10k47L57m45J90K44m46k3R3L27j28K27m36M5K93l4
2921F57k11p0J40J35l61L60j64j74L07j57L2l63K4L69k59j16K23J1k7n3k74J16
2943A45K63l68K54o26P56l61L4k16O0J98J8k43m91O26j04N6m57M65k84J10K30
2964F5m62M0J05j12k0J7k09M12L1k32j61N9O46o63K97l49J00M34l62p0L6j0L8
2987c70j42K33K75j61J55m70J98J5J33l3k10K34R2R0l49J38l26N05J18j54r8J43
$$ plain form
2829 -507 -408 -130 -291 -547 -514 -406 -541 -637 -752 -653 -261 -588 -579 -613 -444 -335 -535 -632 -563 -550 -572 -559 -551 -459 -373
2854 -373 -102 -586 -451 -490 -465 -179 32 -428 -383 -323 -142 -469 -316 -657 35 -305 -271 -313 -193 23 -86 -178
2876 -178 -185 44 -287 -16 -82 -63 79 360 113 68 228 128 22 -30 119 600 503 114 244 241 164 707 266
2899 266 460 248 436 429 245 330 640 393 750 305 495 739 293 270 363 690 562 789 353 398 691 657
2921 657 446 376 516 651 290 650 486 312 619 462 494 131 155 524 265 149 372 383 356 303 29 145
2943 145 408 40 294 -332 424 63 97 -119 -59 139 157 -86 -577 49 -55 1 -456 9 -275 -165 65
2964 65 -397 -357 -252 -364 -384 -367 -576 -164 -133 -365 -526 -467 179 -484 -187 -536 -436 -2 -364 -434 -398 -408 -370
2987 -370 -512 -279 -4 -165 -10 -480 -282 -267 -134 -167 -377 -143 -51 39 -310 -172 -498 7 125 -29 -127 16
3009A6Q3J17l52%J62J12k03l70K03K47K50l41M41Km0k23J41l20J14J21l6R7o7
3032A54K99j06r6L8j99L68k63j6J00J24K3m5l77K67p5L11k21p5k56P4K82M5j96
3055A60K08j31K39l68k55J26K92K86m93l29P32k68N6l21m09O71j54l67P3K51J7
3076A6N1m75K17l1M07k05m23K11k17P06m44k2k33K17K08l13k18K84P2j74K24k22
3098c64n3K96k48l07M42k86j45M2P4QL11J08j19j59K32K04j28j61J11P1O6k90
3120b95Jj75J54L73j58j45J64K38k57J56KJ29l9r0j18j92K21J08L5n7kJ09l6M23
3144E49m92k5K94j50M83l10K1J67j97m13L18k3K35k45K30o8J84l01K77l31l2O9
3166B40K61k2q7R7k54L24m9j10j86L57j67Rj8J17j90K4O2j02J60k44j82K72k32
$$ plain form
3009 16 99 216 -136 -136 26 138 -65 -435 -232 15 265 -76 365 367 327 104 245 -75 39 160 124 221 154
3032 154 453 347 251 289 90 458 195 179 279 403 426 381 4 271 196 507 286 211 -45 29 311 356 160
3055 160 368 237 476 108 -147 -21 271 557 64 -265 467 199 255 -66 -475 196 42 -325 -252 -1 16
3076 16 67 -408 -191 -222 185 -20 -443 -232 -449 257 -187 -209 -442 -225 -17 -330 -548 -264 -192 -366 -142 -364
3098 -364 -417 -121 -369 -676 -234 -520 -665 -623 -549 -541 -230 -122 -241 -400 -168 36 -92 -253 -142 -71 -5 -295
3120 -295 -294 -469 -315 58 -100 -245 -81 157 -100 56 58 187 148 58 -60 -252 -31 77 112 55 53 162 126 549
3144 549 57 32 326 176 659 349 370 537 340 -73 245 222 457 212 442 374 558 257 534 203 171 240
3166 240 501 479 392 489 235 559 510 400 214 571 404 413 395 512 322 346 408 306 466 222 40 312 80
3189H0L84j75q0J60M8l5k60j46j66L75K8k59LK89P7m42R8M9K33n35r2K4M15k59
3213a86N6k54k12M79J37l09k2J65k98L73j64l11M03L69m98j48J33j94J93M1j81
3234d28o4L46l68J12l1L50l60j03J81p4L40k94j02N33k62j14K58k81JK7L43k69
3256b59L36m47m1L67Q8k77M6k05L67j71J8L98k31n1RJ43p5J36l27K87k2j22L18
3279B85m29J21L7L83K6l84P2o2L28l6N1l35J63N6o4K83o39L17p9N1J75q4nk74
3303d3O19l04l3J28n9RR4R4k05M01m28k49L10j73M6J03j23m1r5L93k33j94K15
3326B32l38K38j76J76K30m97K95j39J51k79K8p6j26M34k40M7Q3r0l9k4l9o0J29
3349h0j82n1K42m00L28J03L6R0l14j76K71j79K28l08J0M36o88N69k99J35P3l58
$$ plain form
3189 80 464 289 209 369 417 382 122 -24 -190 185 213 -46 -43 246 323 -119 -21 28 261 -274 -366 -342 73 -186
3213 -186 -130 -384 -596 -117 20 -289 -311 -146 -444 -71 -235 -546 -143 226 -272 -420 -287 -481 -288 -247 -428
3234 -428 -492 -146 -514 -402 -433 -83 -443 -546 -365 -439 -99 -393 -495 38 -224 -338 -80 -361 -360 -333 10 -259
3256 -259 77 -370 -411 -44 44 -233 -187 -392 -25 -196 -178 220 -11 -62 -53 90 15 151 -176 111 89 -33 285
3279 285 -144 -23 14 397 423 39 111 49 377 341 392 57 220 276 212 495 -144 173 94 145 320 236 231 -43
3303 -43 576 272 239 367 308 317 411 505 300 701 273 24 334 161 207 310 187 146 51 444 211 17 232
3326 232 -106 132 -44 132 362 -135 160 21 172 -107 -79 -155 -281 153 -87 -40 43 -47 -86 -110 -149 -209 -80
3349 -80 -262 -313 -71 -471 -143 -40 -4 86 -228 -404 -133 -312 -84 -392 -382 54 -634 -65 -364 -229 -156 -514
3371e14L76n3K00j56k08K47pj6p2K17j57R4p1J08j17k1K34l84K69J33J84m35L08
3394A59l46J73J1M7J06j66o9L32k76L3J56q9l1J76l66N61k10J34k03o3J1P9K8
3417A87r7j9R5K12l63M9K79O5j99R3k64J02J44p6j45p6L56l03J8k22L00M18n02
3440E2J6j78L9K04J44j34l70l7O88p2r8l92O6k04J15N0q1k70M64l96Q8M7K41j90
3464b08j93KK61J38q5n6k56l2K76j77m3l4j23M70j20q9J21j8q2k28J38j19K15
3487b42O2l0k58j3K31K7qj2k71J5J63L04n02L62j15j04L46k44J42k10K50l05L59
3510e3l2j25R7j55O8L81n14L46nK0m20M03j18K19J49k94l59O62J59j55r0j49J67
3533B02J08pm35L4J16j32J79L6n3L37J00j54k05P0K79l24j9j9N76k34J25j84j64
$$ plain form
3371 -514 -138 -191 9 -147 -355 -108 -115 -131 -203 14 -143 -49 -120 -12 -129 -150 84 -300 -31 102 286 -149 159
3394 159 -187 -14 -3 44 150 -16 -85 247 -29 4 160 71 40 216 -150 411 201 335 132 69 80 159 187
3417 187 90 71 166 378 15 64 343 408 209 302 38 140 284 208 63 -13 343 40 58 -164 136 554 52
3440 52 68 -110 -71 133 277 143 -227 -264 424 352 254 -138 -72 -276 -161 -111 -192 -462 2 -394 -306 -259 -18 -208
3464 -208 -401 -399 -138 0 -85 -141 -397 -429 -153 -330 -373 -407 -530 -60 -180 -269 -148 -166 -248 -476 -338 -457 -242
3487 -242 -180 -210 -468 -481 -250 -223 -231 -243 -514 -499 -336 -32 -534 -172 -287 -391 -45 -289 -147 -357 -107 -412 -53
3510 -53 -85 -210 -113 -268 -200 181 -333 13 8 28 -392 11 -107 112 261 -33 -392 270 429 274 184 35 202
3533 202 310 303 -132 -98 18 -114 65 101 48 385 485 331 126 196 475 151 132 113 689 455 580 396 232
3556B32K72j66j10K07j20K46l61j10l8Q4K01k22P1J1M2p1j31k96M62O7j91K50
3578C29m48J94J89j94J7L1k2P4k32J40j40J27m0n5N5j24N7O1j07p2PJ19j7J17
3602F6j69j11j2k8Q8j37K69k11N7n5K9K85l94m2J51k11K21J62k50M9Q0k27m0J23
3626c07qJ19j67N4J47J66q0k80J78O0k59K93K79m63J08R2k44K19L9M7m62K55N40
3649C26l70k55J93Q2L20o00L93k62l8O3K16L66p5k49k26J62L02n11K39J27P6J68
3671D47m91L76k83K35m0O4j32Q6p4J09m8l28L61j50j70K29N1Rj01J84j63L5jN2
3695B57j12l2J18L0J96m54L00J4j7L1k15j2r6k13K93l20M20j08L31k43j21k23
3717a76K51m0k97L55j4k62K16j24P0J58l94M15n58K24M7Q1k52k19L74N0j7l42
$$ plain form
3556 232 504 338 228 435 315 561 200 90 52 136 337 115 186 197 239 168 37 -259 203 270 79 329
3578 329 -119 75 264 70 87 118 96 170 -62 78 -62 65 25 -30 25 -99 -42 19 -88 -160 -153 -34 -51 66
3602 66 -103 -214 -226 -254 -166 -303 -34 -245 -188 -243 -214 71 -323 -365 -214 -425 -204 -42 -292 -243 -163 -390 -430 -307
3626 -307 -315 -196 -363 -309 -162 4 -76 -356 -178 -118 -377 -84 195 -268 -160 -68 -312 -93 -54 -7 -469 -214 326
3649 326 -44 -299 -106 -24 296 -304 89 -173 -211 -148 68 434 359 110 -116 46 348 -163 76 203 279 447
3671 447 -44 332 49 284 244 308 176 262 188 297 249 -79 282 132 -38 191 242 251 150 334 171 206 205 257
3695 257 145 113 231 261 457 3 303 317 300 331 116 104 8 -205 88 -232 188 80 411 168 47 -176
3717 -176 75 35 -262 93 79 -183 33 -91 -21 137 -257 158 -400 -176 -129 -48 -300 -519 -145 -95 -112 -454
3739d54J34K71m20K23k36N55q3k65J51j49J88j22J43k21k33M43k90N2O4J07K72
3760A30l48K6j76M13Q0j01n6J4k07l4K06O7k66K0J97J0J95m05K94l76O0K66m7
3783c8k4p5P5P2q3K03p0Jj67J79n4k30M62j48M3O4r2K41P5j60J2j5j91K14K19
3808E13o5l51n0J7K36q8j7j97J52qK77j53k55J49J72k66Q6J16K15j44k48P8p1
3831I8K34m03L08J3j68o8M6M1k03J98k21K3J45j53K75q2j66j64M76l29J1J01l
3854Iq6J03k02j84J69j01K09j21L96k69M2k65J90n4j4o7K3j39M4K58J28l79j15
3877d25J81j97m0J33J4L3R5k53J14L05p1l13Q8j73N66k21m65L94J25j17r8O4j26
3900c87J77j22K49j32N9J39L30l24J41p5j9K9j44j52M66l93L84j94q7M45l48J26
$$ plain form
3739 -454 -320 -49 -469 -246 -482 73 -10 -275 -124 -273 -85 -207 -64 -285 -518 -75 -365 -313 -249 -142 130
3760 130 -218 -192 -368 45 125 24 -32 -18 -225 -259 -53 14 -252 -232 -35 -25 170 -235 59 -317 -257 9 -38
3783 -38 -62 -137 -62 10 -73 130 60 61 -106 73 19 -211 251 103 146 210 118 359 434 274 286 271 80 294 513
3808 513 448 97 47 64 300 212 195 -2 150 142 419 266 11 160 332 66 152 268 483 339 91 169 98
3831 98 332 -71 237 250 82 14 60 101 -102 96 -125 -102 43 -110 165 83 -83 -247 229 -100 -89 12 9
3854 9 -77 26 -176 -360 -191 -292 -83 -204 192 -77 -35 -300 -110 -164 -178 -245 -222 -361 -317 -59 69 -310 -425
3877 -425 -244 -441 -481 -348 -334 -301 -206 -459 -345 -40 -111 -424 -336 -509 57 -164 -629 -235 -110 -227 -325 -261 -387
3900 -387 -210 -332 -83 -215 -156 -17 313 -11 130 55 36 65 -79 -231 235 -158 226 32 -55 390 42 168
3922A68O1k78K05j4j77J53j05K33K10m27J29r7L0J99j28K00Q6k34J10p2j76K74
3944C50j10nr1k0o0J03J07k88L04K61k70K0r8N4j55Oj98J65j59L52k96J48K7k35
3968h8Q9r1O3M06m47L37l17J36k04l17K59J63Q2j1J51l86L27l20M60l76j4K45
3990A47m04J57k5j75N3Q4R8L0l13M78l4N6l54P6k50K66N7j21J42k16J15j70J39
4013a64l08K99K51l19K13j43m7j01K36J5r2J43k1N8j30j94K61j83J22m0K52p3
4035C5m40L91l08L14j39J51k56K88p4R6k96N27k04l2J27o23P02q3J86n83L0J36
4057e5L30j26k49M47k96J38K2KJ55j30l1k16N0K57J32n69J09k13N58j56o8N1J84
4080C26N3m16J18O8j17J58J01k60j25J53K85m42k0K68k85K97Ql14JL20J2k85p1
$$ plain form
3922 168 229 -49 156 142 -35 118 13 246 456 29 158 61 91 290 162 362 448 214 324 252 76 350
3944 350 240 235 144 124 64 167 274 -14 290 551 281 301 203 257 102 108 -90 75 -84 268 -28 120 147 -88
3968 -88 1 -90 -27 379 -68 269 -48 88 -116 -433 -174 -11 71 60 211 -175 152 -168 292 -84 -98 147
3990 147 -257 -100 -125 -300 -247 -163 -65 -35 -348 130 96 152 -202 -126 -376 -110 -53 -174 -32 -248 -133 -303 -164
4013 -164 -472 -173 78 -241 -28 -171 -218 -319 -83 -68 -160 -17 -38 20 -110 -304 -43 -226 -104 -144 108 35
4035 35 -405 -14 -322 -8 -147 4 -252 36 -38 58 -238 289 85 53 180 -443 259 176 362 -221 -191 -55
4057 -55 275 149 -100 347 51 189 211 213 368 238 207 -9 41 298 430 -139 -30 -243 315 159 91 142 326
4080 326 379 -37 81 149 32 190 291 31 -94 59 344 -98 -118 150 -135 162 170 -144 -143 177 189 -96 -167
4103a67M10k79j15K29p1k07jJ20K04o1l3K7o09L27R8k34R9K06N4m5J16l78J26
4126a84j2JJ77k48J5J01K01q4l31J97O5j48L61k87K62k4l78K45j95J95o6J08J41
4149A12j18j1m24N59k96k57M37r8O6j4j22P7K96o45M98k22L62l46L40m03K60k16
4171a65J27M84m96N4K02j36j63J09k05K13K6J10l85K58J62j49n4L0J74j23K25
4192B98k09K2J17o1J72k19J93j65N6o9m4J87L4P6j71k72Q0K33ok42n2O42o68R2
4216B4m2pP0j85J21J98J4m7j6J0j16r5K50J1o6j38N6j9k38J92j25L09j30k47R6
4241a20l5kj63M61m06M5j4J30L03j64L6j81m9j9K83l97N8K22j69K0k91J83M2J18
4265a09k31P2Q9q1J73l94K58J82j82o5J90Rj10L28m48J07J14k16J37j46K23j76
$$ plain form
4103 -167 243 -36 -151 78 7 -200 -201 -81 123 62 29 56 -553 -226 -128 -362 -263 -57 -3 -48 68 -310 -184
4126 -184 -196 -195 -18 -266 -251 -150 51 -33 -364 -167 -102 -250 111 -176 86 62 -316 -71 -266 -71 -137 -29 112
4149 112 -6 -17 -441 118 -178 -435 2 -96 -30 -44 -166 -89 207 -438 60 -162 200 -146 194 -209 51 -165
4171 -165 -38 446 -50 4 206 70 -93 16 -189 24 50 160 -225 33 195 46 -8 22 196 73 298
4192 298 89 111 228 167 339 120 313 148 204 135 91 278 312 388 217 -55 25 258 252 10 -42 600 -68 24
4216 24 -18 -25 45 -140 -19 179 193 146 130 140 24 -71 179 190 124 -14 42 23 -215 -23 -148 161 31 -216 -120
4241 -120 -155 -157 -320 141 -265 -220 -234 -104 199 35 71 -110 -159 -178 105 -292 -234 -12 -181 -161 -452 -269 -227 -109
4265 -109 -340 -268 -179 -260 -87 -481 -223 -41 -223 -288 -98 -89 -199 129 -319 -212 -98 -314 -177 -323 -100 -276
4287b76n5P1K49QL74j29r4n50K10j1L65k76J62m31Q03k04k66J21L93k85k06Q8
4309F1K54l47K61J8j64o2l0L12l59L18k9K7k53J23j76K99j13l8J98L5P6m37J34
4332A08J71J65q6j37k03j41J0L04n8P8n7j39J83m40M78j87P1j20L00k59k00J79
4354B0j65L27J88m75kN6K6Q1j80K33jN5k77L4o2P1N2k51O4J92O1j67q3N4m9K13
4380A5j51J61j71q3J6Q3p2o3O0k39M44O3j41k09K11ll36M46j0j83K31K5l51j18
4404c75L8K84k34J54p1J01Q4K1P6j02j15K34qp2J01k86M5o2K99m38M31j03p9%
4428g7K01Pr2P2m10L39Pk37J79J20m1K96l61l11L32P6K4K78j61j73K80j31l31
4451a14J24K73j40p7J4j83K24p6J06J30nk19k16K60j59M14l32O6p0j09L34r5j71
$$ plain form
4287 -276 -331 -260 -11 -3 371 242 148 -402 -192 -203 162 -114 48 -383 420 216 -50 71 464 179 -27 61
4309 61 315 -32 229 247 83 21 -9 303 -56 262 233 260 7 130 -46 253 140 102 300 335 411 -26 108
4332 108 279 444 358 221 18 -123 -113 191 133 211 154 15 198 -242 236 49 120 0 300 41 -159 20
4354 20 -145 182 370 -105 -107 -51 -25 56 -124 109 108 163 -114 -80 -142 -71 -19 -270 -206 -14 47 -120 -203 -149 -198 15
4380 15 -136 25 -146 -229 -213 -130 -202 -265 -205 -444 0 63 -78 -287 -76 -79 -415 31 21 -162 69 94 -257 -375
4404 -375 -337 -53 -287 -133 -204 -103 -19 2 78 -24 -139 95 87 15 116 -170 -125 -187 112 -326 105 2 -77 -77
4428 -77 124 131 39 111 -299 40 47 -190 -11 109 68 364 3 -308 24 100 124 402 241 68 348 217 -114
4451 -114 10 283 143 66 80 -103 121 45 151 281 276 57 -159 101 -58 356 24 90 20 -89 245 150 -21
4474b1M4J02O1m2r0p8J9J70n5l21M63p3k81M2j89J58R6k76L15j94J44j07PJk72
4499c77L67l5O2l49L71k52Q5J81j84j5j24K86l05J63J47L60k37k72k69L34k54
4520c17J94K24l71J19Q9j1j4l9J35j02r9P3r5K35l13K34J25j23J49k61L10m49
4542c07K49j31L18l72L05l0Rj43R5K0P2k47J73K00l78M19o9j65j28L14k77J36
4564F3j29M17k92J64j76J39k9J36k28J36m74N93l49L33p8k60K74j72K45l11M66
4585D68j70q5k79J%L61kk95l3J10k14M5M32l77L00m2j39j9o6J93p4k31P4J62r8
4610B2j22O0K29k91N9m6K80k2j73J91j02L8J84l14j4j21l9lL9L31j07j44p5J72
4634C2l55J70P6k0j02K17J27l50Q2K52l47J44j08L12l51K23jk1j98K68j42j70
$$ plain form
4474 -21 23 125 186 144 54 -24 -5 165 110 -211 252 179 -102 -60 -249 -91 5 -271 44 -150 -6 -113 -106 -105 -377
4499 -377 -10 -45 17 -332 39 -213 -128 53 -131 -146 -270 16 -289 -126 21 381 144 -128 -397 -63 -317
4520 -317 -123 101 -270 -151 -62 -73 -87 -126 9 -93 -192 -119 -214 21 -292 -58 67 -56 93 -168 142 -307
4542 -307 -58 -189 129 -243 62 32 41 -102 -7 13 85 -162 11 211 -167 252 183 18 -110 204 -73 63
4564 63 -66 351 59 223 47 186 157 293 65 201 -273 320 -29 304 226 -34 240 68 313 2 468
4585 468 298 213 -66 -65 -65 296 294 -1 -34 76 -138 -93 339 -38 262 220 81 62 -4 189 115 -116 -42 120 22
4610 22 -100 -40 189 -102 -43 -89 191 169 -4 187 85 123 307 -7 -21 -142 -181 -184 -145 186 79 -65 -140 32
4634 32 -323 -153 -77 -97 -199 18 145 -205 -123 129 -218 -74 -182 130 -221 2 1 -20 -218 50 -92 -262
4656b62J62l3l0J0K49l11oJ93J93m08Q3P7l80L38J19l19M04p0j81J12K56M7k02
4679D1L8J52n4m32K30k05J77J38k70J64j43M40m26K57j1J46k76J83O7j44L6k2
4701H6m2J49J68j55K4K2R4j19k74J18K96l18J45m08M59l80J91K34J42l39j24K08
4723A77J7jm87P76m99L95n72K5L18q3n8K4P3K64l57k3J61K30k81k05L00K18l36
4746G6j15L32k61r8J25j80k03J39M93j75j25j53k02J21M08j57k01J80J71l39j59
4767c23l1L32J25j21k88L82m14L67j90K34k01K20n15L17K4j59J67M8j42K19J43
4788A94j33j97R7J7j26j8N7O4Qk67M97k78j90J25J52p5J89J19l60K29j10qO1q7
4812d0R4%k66J88k0j61K74p6K79r3n05pJ41J63M17k91j41J67j11K18k45j52M14
$$ plain form
4656 -262 -100 -133 -163 -153 96 -215 -221 -28 165 -243 -160 -83 -463 -125 -6 -325 79 9 -172 -60 196 243 41
4679 41 79 231 177 -255 -25 -230 -53 85 -185 -21 -164 276 -150 107 96 242 -34 149 216 72 108 86
4701 86 44 193 361 206 230 252 346 227 -47 71 367 49 194 -214 245 -135 56 290 432 93 -31 177
4723 177 194 193 -294 482 -17 378 -194 -169 149 66 8 32 105 369 12 -11 150 380 99 -106 194 412 76
4746 76 -39 293 32 -66 59 -121 -324 -185 308 133 8 -145 -347 -226 182 25 -176 4 175 -164 -323
4767 -323 -354 -22 103 -18 -306 76 -338 29 -161 73 -128 92 -423 -106 -82 -241 -74 -26 -168 51 194
4788 194 61 -136 -39 -22 -148 -166 -109 -45 -37 -304 193 -85 -275 -150 2 -73 116 235 -125 104 -6 -14 47 -40
4812 -40 54 54 -212 -24 -44 -205 69 -7 272 179 -326 -333 -192 -29 388 97 -44 123 12 230 -15 -167 247
4835B47j25J23k69J74r3j81K06J61j08j66L18j43J29q1L7j1j17k54N25q9k64O1
4857H0k7R4j32n8R7J67j35K16l06j70J89J53J33k76j18j44M16j64M6p7l7J89k62
4880a26p7M6j69K49J28l95K11M1p8J54l17J96r8n8K74m72L64J13k02J13Q3l10
4902c30K58N9j90J08J18L0l4k00q2j61K84qL2J34j30J55R2k43%j0L3k42NK39K30
4927A47k95P6M%k73J35K20J61l6k43l4Kp8K86J19k31qJ18N6RL7j36j78l2K09k24
4953a89J89J2NN7pJ51j83L0M1k53L33p2j34M85j35k78K43m72L09J01k14J77k78
4976h2QJ03K20J65j05k36Q0J85k84J26j30m9r7J39q7L7J11K8j17J85J0j47J92
4999B55J8m79K84j88L30P1j53m16L63j2J10k84J3l44J61M35m75M68j62J04l57
$$ plain form
4835 247 122 245 -24 150 57 -124 82 243 135 -31 287 144 273 192 229 218 101 -153 372 283 19 80
4857 80 53 147 15 -43 54 221 86 302 -4 -174 15 168 301 25 -93 -237 179 15 61 -16 -53 136 -126
4880 -126 -203 -157 -326 -77 51 -344 -133 -92 -170 -16 -333 -137 -235 -293 -19 -491 -127 -14 -216 -103 -20 -330
4902 -330 -72 -13 -203 -95 23 53 19 -181 -263 -424 -140 -148 -116 18 -112 43 135 -108 -108 -118 -85 -327 -322 -83 147
4927 147 -148 -72 -68 -68 -341 -206 14 175 139 -104 -138 -136 -214 72 191 -40 -48 70 126 135 172 36 -142 -174 35 -189
4953 -189 0 12 17 74 67 218 35 65 106 -147 186 114 -20 465 330 52 295 -177 132 233 19 196 -82
4976 -82 -74 29 249 414 309 73 153 338 54 180 50 1 -96 43 -44 -7 104 132 15 200 210 63 255
4999 255 273 -206 78 -110 220 291 138 -278 85 73 183 -101 -88 -432 -271 164 -311 157 -5 99 -258
5020b58M21l0m5n73M43L4j74P0Q3k6j38M31j64l1j84J98J27l04O9k76J43K4J62
5043Bl92J26N61n58J06J88m15M52j22m1o9j46L10j54N3O6J36N6m67L16K2o9L21
5066B82l66qK04n11K29m0K73k14J89K01k45o0j4K2Q2j90J16k3J3j05LJ15L56k16
5090I3P4N57o10k66L92k45j23J8K59K3l51J05L93j62K95p9l92j1L43l0k4l54n5
5113a50Q19o11p9O1J44j35j17L06k24J5r4K04l47J25K00j29K15l68M66l04Kk35
5135b36L62j14NJ6k62L32l91N28k63R0l11K14k02L06r6J55K12m51j05J08J72j45
5157g6k73L11j41K37l38J50r8L14j01J06k55N3J17nk62J39n00N30K18j79L6o9
5179h6J66k29J26j6j64J22J85n1P5k40L14j45p1M3m29J04L33J61k74K16n8k7l0
$$ plain form
5020 -258 163 133 88 -485 -42 -8 -182 -112 -29 -55 -193 238 74 43 -141 57 184 -120 -51 -327 -184 -160 2
5043 2 -390 -264 297 -261 -155 33 -382 70 -52 -93 -162 -308 2 -152 -99 -33 103 159 -308 8 30 -39 282
5066 282 -84 -92 112 -399 -170 -210 63 -151 38 239 -6 -66 -80 -58 24 -166 -50 -73 -60 -165 -162 -47 309 93
5090 93 167 724 114 -152 240 -5 -128 -110 149 172 -179 -74 319 157 452 373 -19 -30 313 283 259 -95 -150
5113 -150 669 58 -21 40 184 49 -68 238 14 29 -65 139 -208 -83 117 -12 203 -165 301 -3 -1 -236
5135 -236 126 12 17 33 -229 103 -288 240 -23 67 -244 -30 -232 74 -22 133 345 -106 -211 -103 69 -76
5157 -76 -349 -38 -179 58 -280 -130 -228 86 -15 91 -164 -111 6 1 -261 -122 -622 -92 126 -53 -17 -86
5179 -86 80 -149 -23 -39 -203 -81 104 53 128 -112 202 57 -14 29 -400 -296 37 198 -76 140 82 55 25
5202B5n14K36qK53j58J55j40O2n4K85k2K20j53j33Q7j37K53m29J64L15l22m3J40
5225H2P8m3l2J96j52L3K04n90J81J37l18M49j35j1k73L71M4j93N6J6P3m2k68J60
5249B3m2k5k1mJ64j62L37n89M15Pn4k13J49K16j51l7o8P9j52Q1r6j03P2L12j9
5274A19j80M8q5J9Q9j42J35J1J11K6l29J32l49L44L63m26L7L1J67l3j04j20L82
5297B46l09j15J61K3k11K7m2J32R1k71N31m68l13L79L56l06J93j18L15k16k08
5318a23N0j36K57m5K44k77j14l28O14K16m12j29K24K3k56L92J44l41J31j62K01
5339A73j59R3j99M16l99J9L61j28j39N9J90m57J41Q4P6j18J99n32K54j26K60K08
5361B76j36j78J18l3J14M9m8l40K53k5o5K22j62R2q3J95k65l5j77k09N16j07p5
$$ plain form
5202 25 -489 -253 -261 -8 -166 -11 -151 -89 -143 142 120 340 187 54 141 4 257 -172 -8 307 -15 -58 82
5225 82 160 117 85 281 129 162 366 -224 -43 94 -224 225 90 79 -194 177 221 28 84 100 173 131 -137 23
5249 23 -19 -44 -65 -69 95 -67 270 -319 96 103 49 -164 -15 201 50 13 -55 24 -128 -47 -143 -246 -174 138 119
5274 119 -61 -13 -98 -79 10 -132 3 14 125 151 -178 -46 -395 -51 312 -114 -77 -46 121 88 -16 -136 246
5297 246 -63 -178 -17 6 -205 -178 -220 -88 3 -268 263 -205 -518 -139 217 -89 104 -14 301 85 -123
5318 -123 -73 -209 48 3 247 -30 -144 -472 142 358 -54 -183 41 64 -192 200 344 3 134 -28 173
5339 173 14 107 -92 324 -75 -56 305 177 38 97 287 -170 -29 55 131 13 212 -320 -66 -192 68 276
5361 276 140 -38 80 47 161 210 162 -178 75 50 -15 207 45 137 54 249 -16 -51 -228 -437 79 -28 -103
5384a03J22k58L03ok30K74j8J79j63j52R8n1K52k74j3P2l66J88J28k29K03J65
5406A21l02R6m2N3P9N3j46J7o2j32K35j04k06J93N1O7J19l27M60j91l44J05q4
5429b91M10j71Oj14K43j45N4M6J08k81j25n7L06p9J66j66r8L70j91j6n5M8L79
5452C47k95R2k81J81j46J69NK6r6Q6m6j03k59J41K22J45m86N0K15j58M72o1j39
5475H1J30J87l27r2K49k4l15K32L8j89n2K34J43l31O4J68k35L04j34J42n6J36
5497C53l52m1J87n8o5m3j14PL16o3j12qK37j1m0k58K3J09K24k27k54K57k15J25
5521b3j72m7K71j56MJ17p0K31m85L2K74p3L55m54K27o8Q7o9m4P5j34J53k72K90
5545D9o0j46j12N6K28k45J03J19K28m08K54R4l13O4k53K66K64j50L5j27K87k77
$$ plain form
5384 -103 19 -239 64 58 -172 102 84 263 100 -52 46 -5 247 -27 -40 32 -334 -146 -18 -247 -44 121
5406 121 -181 -85 -127 -74 5 58 -88 -71 -133 -265 -30 -134 -340 -147 -96 -29 90 -237 223 32 -312 -207 -291
5429 -291 119 -52 -46 -160 83 -62 -8 38 146 -135 -260 -317 -11 -90 76 -90 -188 182 -9 -25 -80 -32 347
5452 347 52 144 -137 44 -102 67 72 98 2 88 42 -61 -320 -179 43 188 -298 -248 -33 -191 281 220 81
5475 81 211 398 71 -21 228 204 -111 121 159 -30 -82 152 295 -36 28 196 -39 265 131 273 217 353
5497 353 1 -40 147 89 24 -19 -133 -126 190 127 15 7 244 233 193 -65 -42 67 291 64 -190 67 -148 -23
5521 -23 -195 -242 29 -127 -123 -6 -76 155 -330 -298 -24 -97 258 -196 31 -37 50 -19 -63 12 -122 31 -241 49
5545 49 -11 -157 -269 -213 15 -230 -127 -8 220 -188 66 160 -153 -89 -342 -76 188 38 73 -54 233 -44
5567d4r5O8j44J6K18o9LL12m20J05J14j27j8K55k51kk45K66K61j00l52K28K65
5590B44l85J43M0m9N6l01K78j01P7n0m3L31k70R2m42M52O1k88L04j09J12q6K56
5613C22m77J57k2J13O3k04L6J42J8r1o3J61Q7Lr6lp2K6L48n90J12J61j70L47l48
5638d0M69m96K49p6Q0k05k10n2L89j31r2J06j00K06j68J1kj43j34L36N0j05J03
5661D5O8l22L01k43K57L8j71j98O8j5J50k13jJ55m9J73P0j26n5k36N83m90K24
5684A3j98J93k1j21j93L27k7K22j19p8j77N1j05J1K09k49K19K8j19k7K36l9l29
5707b93M96m63j2K36o3N0k5J08m64K48J88j58k24J0L39L7K1k27j88P52k13j61
5729fj43K39J91k04j7J0O4l8M5K10n01L71k37k57J98P6L02j08p7k45K83Q6J19
$$ plain form
5567 -44 -139 -71 -215 -199 19 -50 -47 265 -155 -50 64 -63 -81 174 -77 -79 -324 -58 203 103 -249 -21 244
5590 244 -141 2 42 -7 49 -252 26 -75 2 -48 -91 240 -30 62 -380 72 133 -155 149 40 152 66 322
5613 322 -155 2 -20 93 156 -48 -12 130 148 57 -6 155 242 245 149 146 74 100 448 -142 -30 131 -39 308 -40
5638 -40 429 -67 182 106 186 -19 -229 -281 108 -23 -115 -9 -109 97 -71 -60 -62 -205 -339 -3 47 -58 45
5661 45 113 -209 92 -151 106 144 -27 -225 -157 -172 -22 -235 -236 -81 -130 43 113 -13 -68 -304 279 -211 13
5684 13 -185 8 -13 -134 -327 0 -27 195 76 -2 -179 -128 -233 -222 -13 -262 -43 -15 -134 -161 75 36 -293
5707 -293 203 -260 -272 -36 -99 -49 -74 34 -430 -182 6 -152 -376 -366 -27 10 31 -196 -384 368 155 -6
5729 -6 -149 90 281 77 60 70 134 96 141 351 -150 221 -16 -273 -75 1 303 195 118 -127 156 242 361
5752C61k84j4R9P4j37j48k18K73J54j40j46L59L3l07L17k79n3N6K50l03J13m7
5774A3l1o7J33j32K11r3l8J79k88O6r1K42j89O7J88l81K24l5k42Q0M10l55K25
5797I6j75k47J64J10P1k32L71k81k1n3K02K86m32M88o67K11J67k52L48j61j59
5818a66J30j77J24J83L4m8lJ16j20J05k62R5l8J56l75L57p6Q0l11M1N6j93K69
5841b3j2qR3J79k80J8l6J4J09o5J54o7o3L18k82K29l68J83k59L42j67k74M65l97
5865a97M40l39QJ26j7m9k4J80l4j46K10P0k49J05m09O7M06j56J20k84J79K05L5
5888B47l4m79j2K69J6o3K00p6Ol38L39j51K68l13L09k53J40l67N03l0j55j60L44
5911B10m89J16L61j43k07J69Q6k15JR1K28k54J81j24m4j34K73j13j2j24M55l87
$$ plain form
5752 361 77 63 162 236 99 -49 -267 6 160 20 -126 233 266 -41 276 -3 -56 0 250 -53 60 13
5774 13 -18 -85 48 -84 127 34 -4 175 -113 -47 -138 104 -85 -18 170 -211 13 -22 -264 -184 226 -129 96
5797 96 -79 -326 -162 -52 19 -213 158 -123 -144 -197 5 291 -141 347 -320 -109 58 -194 154 -7 -166
5818 -166 -36 -213 -89 94 128 80 77 193 73 178 -84 11 -27 129 -246 111 35 115 -196 -155 -99 -292 -23
5841 -23 -35 -43 50 229 -51 -33 -69 -55 54 -11 143 76 13 331 49 278 -90 93 -166 176 9 -265 200 -197
5865 -197 243 -96 -88 38 21 -28 -52 128 94 -52 158 228 -21 84 -325 -258 148 -8 112 -172 7 212 247
5888 247 213 -266 -278 -9 7 -56 144 68 74 -264 75 -76 192 -121 188 -65 75 -292 211 181 26 -134 210
5911 210 -279 -163 198 55 -152 17 103 -112 -111 -20 208 -46 135 11 -33 -167 106 -7 -19 -143 312 -75
$$ [...]
8191F7
##END NTUPLES=NMR FID
##END=
