##TITLE=1H_LR-713_CR7
 CDCl3, 32 sc, 
 9.7.2020
##JCAMPDX= 6.0         $$ Bruker NMR JCAMP-DX V2.0
##DATA TYPE= NMR FID
##DATA CLASS= NTUPLES
##ORIGIN= UXNMR, Bruker Analytische Messtechnik GmbH
##OWNER= root
$$ XWIN-NMR		Version 3.5
$$ Thu Jul  9 10:04:34 2020 Russian Standard Time (UT+4h)  she@DPX200
##.OBSERVE FREQUENCY= 200.1315
##.OBSERVE NUCLEUS= ^1H
##.DELAY= (6, 6)
##.ACQUISITION MODE= SIMULTANEOUS
##.ACQUISITION SCHEME= undefined
##.AVERAGES= 8
##.DIGITISER RES= 18
##SPECTROMETER/DATA SYSTEM= spect
##.PULSE SEQUENCE= zg30
##.SOLVENT NAME= CDCl3
##.SHIFT REFERENCE= (INTERNAL, CDCl3, 0, 15.7039)
##AUDIT TRAIL= $$ (NUMBER, WHEN, WHO, WHERE, WHAT)
$$ ##TITLE= Audit trail, XWIN-NMR		Version 3.5
$$ ##JCAMPDX= 5.01
$$ ##ORIGIN= Bruker BioSpin GmbH
$$ ##OWNER= she
$$ F:/spectra/data/she/nmr/H-F/1/audita.txt
$$ ##AUDIT TRAIL=  $$ (NUMBER, WHEN, WHO, WHERE, WHAT)
(   1,<2020-07-09 10:03:37.29 +0400>,<she>,<DPX200>,
      <created by zg, POWCHK disabled, PULCHK disabled
       configuration hash MD5:
       00 E9 B6 7A A2 85 ED C7 34 08 36 98 17 FE 4E 26
       data hash MD5: 16K
       1B E5 C3 39 FB 7B 2B E3 ED 0E 35 5D 3C 3F 73 21>)
$$ ##END=
$$ 
$$ hash MD5
$$ F5 BC 09 3B ED 21 62 B4 8C A9 2C FA 49 C4 65 17
##$RELAX= 
##$RELAX= 
##$RELAX= 
##$RELAX= 
##$RELAX= 
##$RELAX= 
$$ Bruker specific parameters
$$ --------------------------
##$DU= <F:/spectra>
##$EXPNO= 1
##$NAME= <H-F>
##$PROCNO= 1
##$TYPE= <nmr>
##$USER= <she>
##$AMP= (0..31)
100 100 100 100 100 100 100 100 100 100 100 100 100 100 100 100 100 100 
100 100 100 100 100 100 100 100 100 100 100 100 100 100 
##$AQSEQ= 0
##$AQ_mod= 1
##$AUNM= <au_zg>
##$AUTOPOS= <>
##$BF1= 200.13
##$BF2= 200.13
##$BF3= 200.13
##$BF4= 200.13
##$BF5= 200.13
##$BF6= 200.13
##$BF7= 200.13
##$BF8= 200.13
##$BYTORDA= 1
##$CFDGTYP= 0
##$CFRGTYP= 5
##$CHEMSTR= <none>
##$CNST= (0..31)
1 1 145 1 1 1 1 1 1 1 1 1 1 1 1 1 1 1 1 1 1 1 1 1 1 1 1 1 1 1 1 1 
##$CPDPRG= <>
##$CPDPRG1= <>
##$CPDPRG2= <>
##$CPDPRG3= <>
##$CPDPRG4= <mlev>
##$CPDPRG5= <mlev>
##$CPDPRG6= <mlev>
##$CPDPRG7= <mlev>
##$CPDPRG8= <mlev>
##$CPDPRGB= <>
##$CPDPRGT= <>
##$D= (0..31)
0 1.2 0 0 0 0 0 0 0 0.06 0 0.03 0 0 0 0 0.0002 0 0 0 0 0 0 0 0 0 0 0 0 
0 0 0 
##$DATE= 1594274616
##$DBL= (0..7)
120 120 120 120 120 120 120 120 
##$DBP= (0..7)
150 150 150 150 150 150 150 150 
##$DBP07= 0
##$DBPNAM0= <>
##$DBPNAM1= <>
##$DBPNAM2= <>
##$DBPNAM3= <>
##$DBPNAM4= <>
##$DBPNAM5= <>
##$DBPNAM6= <>
##$DBPNAM7= <>
##$DBPOAL= (0..7)
0.5 0.5 0.5 0.5 0.5 0.5 0.5 0.5 
##$DBPOFFS= (0..7)
0 0 0 0 0 0 0 0 
##$DE= 6
##$DECBNUC= <off>
##$DECIM= 24
##$DECNUC= <off>
##$DECSTAT= 4
##$DIGMOD= 1
##$DIGTYP= 9
##$DL= (0..7)
0 120 120 120 120 120 120 120 
##$DP= (0..7)
150 150 150 150 150 150 150 150 
##$DP07= 0
##$DPNAME0= <>
##$DPNAME1= <>
##$DPNAME2= <>
##$DPNAME3= <>
##$DPNAME4= <>
##$DPNAME5= <>
##$DPNAME6= <>
##$DPNAME7= <>
##$DPOAL= (0..7)
0.5 0.5 0.5 0.5 0.5 0.5 0.5 0.5 
##$DPOFFS= (0..7)
0 0 0 0 0 0 0 0 
##$DQDMODE= 0
##$DR= 18
##$DS= 0
##$DSLIST= <SSSSSSSSSSSSSSS>
$$ [...]
##$SUBNAM2= <"">
##$SUBNAM3= <"">
##$SUBNAM4= <"">
##$SUBNAM5= <"">
##$SUBNAM6= <"">
##$SUBNAM7= <"">
##$SUBNAM8= <"">
##$SUBNAM9= <"">
##$SW= 24.9337058887773
##$SWIBOX= (0..15)
0 0 2 0 0 0 0 0 0 0 0 0 0 0 0 0 
##$SW_h= 4990.01996007984
##$TD= 16384
##$TD0= 1
##$TE= 0
##$TE2= 300
##$TE3= 300
##$TEG= 300
##$TL= (0..7)
0 120 120 120 120 120 120 120 
##$TP= (0..7)
150 150 150 150 150 150 150 150 
##$TP07= 0
##$TPNAME0= <>
##$TPNAME1= <>
##$TPNAME2= <>
##$TPNAME3= <>
##$TPNAME4= <>
##$TPNAME5= <>
##$TPNAME6= <>
##$TPNAME7= <>
##$TPOAL= (0..7)
0.5 0.5 0.5 0.5 0.5 0.5 0.5 0.5 
##$TPOFFS= (0..7)
0 0 0 0 0 0 0 0 
##$TUNHIN= 0
##$TUNHOUT= 0
##$TUNXOUT= 0
##$USERA1= <user>
##$USERA2= <user>
##$USERA3= <user>
##$USERA4= <user>
##$USERA5= <user>
##$V9= 5
##$VALIST= <valist>
##$VCLIST= <CCCCCCCCCCCCCCC>
##$VD= 0
##$VDLIST= <DDDDDDDDDDDDDDD>
##$VPLIST= <PPPPPPPPPPPPPPP>
##$VTLIST= <TTTTTTTTTTTTTTT>
##$WBST= 1024
##$WBSW= 4
##$XGAIN= (0..3)
0 0 0 0 
##$XL= 0
##$YL= 0
##$YMAX_a= 230526
##$YMIN_a= -114227
##$ZGOPTNS= <>
##$ZL1= 120
##$ZL2= 120
##$ZL3= 120
##$ZL4= 120
##$ABSF1= 10
##$ABSF2= 0
##$ABSG= 5
##$ABSL= 3
##$ALPHA= 0
##$AQORDER= 0
##$ASSFAC= 0
##$ASSFACI= 0
##$ASSFACX= 0
##$ASSWID= 0
##$AUNMP= <proc_1d>
##$AZFE= 0.1
##$AZFW= 0.1
##$BCFW= 1
##$BC_mod= 2
##$BYTORDP= 1
##$COROFFS= 0
##$CY= 11.3945322036743
##$DATMOD= 1
##$DC= 2
##$DFILT= <>
##$DTYPP= 0
##$F1P= 16.9975609425685
##$F2P= -3.02152046262296
##$FCOR= 0.5
##$FTSIZE= 0
##$FT_mod= 4
##$GAMMA= 1
##$GB= 0.15
##$INTBC= 1
##$INTSCL= 1
##$ISEN= 128
##$LB= 0.24
##$LEV0= 0
##$LPBIN= 0
##$MAXI= 10000
##$MC2= 0
##$MEAN= 0
##$ME_mod= 0
##$MI= 1.114404
##$NCOEF= 0
##$NC_proc= 0
##$NLEV= 6
##$NOISF1= 3.799351
##$NOISF2= 2.8
##$NSP= 1
##$NTH_PI= 0
##$NZP= 0
##$OFFSET= 15.70392
##$PC= 1
##$PHC0= -9790.874
##$PHC1= 12.60085
##$PH_mod= 1
##$PKNL= yes
##$PPARMOD= 0
##$PSCAL= 0
##$PSIGN= 0
##$REVERSE= no
##$SF= 200.130013532006
##$SI= 16384
##$SIGF1= 3
##$SIGF2= 2
##$SINO= 400
##$SIOLD= 16384
##$SREGLST= <1H.CDCl3>
##$SSB= 0
##$STSI= 0
##$STSR= 0
##$SW_p= 3612.71676300578
##$SYMM= 0
##$S_DEV= 0
##$TDeff= 0
##$TDoff= 0
##$TI= <>
##$TILT= no
##$TM1= 0
##$TM2= 0
##$TOPLEV= 0
##$USERP1= <user>
##$USERP2= <user>
##$USERP3= <user>
##$USERP4= <user>
##$USERP5= <user>
##$WDW= 1
##$XDIM= 8192
##$YMAX_p= 0
##$YMIN_p= 0
$$ End of Bruker specific parameters
$$ ---------------------------------
##NTUPLES= NMR FID
##VAR_NAME=  TIME,          FID/REAL,        FID/IMAG
##SYMBOL=    X,             R,               I
##VAR_TYPE=  INDEPENDENT,   DEPENDENT,       DEPENDENT
##VAR_FORM=  AFFN,          ASDF,            ASDF
##VAR_DIM=   8192,          8192,            8192
##UNITS=     SECONDS,       ARBITRARY UNITS, ARBITRARY UNITS
##FACTOR=    0.0002004,     1,               1
##FIRST=     0,             0,               0
##LAST=      1.6414764,     0,               0
##MIN=       0,             -114227,         0
##MAX=       1.6414764,     230526,          0
$$ Real data points
##PAGE= N=1
##DATA TABLE= (X++(R..R)), XYDATA
0 0 0 0 0 0 0 0 0 0 -6 8 -8 8 -8 8 -16 16 -22 24 -32 34 -40 48 -56 64 -74 84 -98 109 -124 141 -160 178
32 178 -202 226 -252 279 -313 346 -384 426 -471 523 -578 641 -708 785 -875 972 -1083 1214
50 1214 -1367 1549 -1771 2048 -2404 2884 -3564 4621 -6483 10765 -44343 60913 151585 3352
64 3352 -89998 -26883 78426 23601 -99000 -114227 5539 74530 16476 -62656 -30526 53538
76 53538 64710 -11754 -53125 -12354 30330 -5377 -56615 -23455 71523 95904 18194 -47678
88 -47678 -5990 66159 45222 -42014 -52376 45211 114568 55269 -38989 -25832 65744 85878
100 85878 1223 -57184 -1502 79745 68458 -7 -5052 64853 97268 37659 -27818 -9414
112 -9414 53207 61217 13584 794 53273 92742 53462 -9232 -7069 46717 61316 12899 -18597
125 -18597 20814 76177 69239 18927 5387 44167 64926 26065 -18591 -3546 48319 63196
137 63196 27606 4971 31861 61099 38480 -9694 -15349 24034 44443 16760 -8314 15871
149 15871 56021 51540 8568 -10189 14102 33793 13767 -12807 -1146 33948 41633 13081
161 13081 -6223 7470 24192 11821 -11999 -10978 11455 21329 7043 -3721 8726 23908
173 23908 14534 -9290 -16767 24 12182 2608 -8490 1512 20257 16285 -8054 -20943 -9413
186 -9413 3175 -4094 -17051 -11054 7329 12144 -1004 -11555 -5233 2189 -5016 -18466 -18804 -6309
200 -6309 1141 -3411 -8309 -2660 3600 -3856 -19349 -23558 -13285 -5687 -10709 -15991 -8680 2594
214 2594 112 -13059 -17807 -9692 -5022 -13319 -22134 -16475 -4120 -1505 -9684 -13031 -7299 -5713 -14454
229 -14454 -24426 -21915 -11618 -7694 -12331 -13952 -7441 -2267 -7873 -17632 -19206 -12527 -10030 -15404 -19161
244 -19161 -12164 -3128 -3825 -13259 -16741 -12034 -10065 -16963 -23124 -18365 -7778 -5798 -11423 -13080 -8438
259 -8438 -7193 -14001 -19634 -17240 -11268 -9848 -12108 -11643 -6601 -4948 -9727 -15264 -15804 -12958 -13272 -15580
275 -15580 -14461 -8211 -3010 -4996 -10036 -10429 -7246 -8258 -14420 -16706 -10224 -3168 -3872 -8088 -6660
290 -6660 -1024 -1944 -10058 -14620 -9998 -4832 -6644 -9814 -5732 2267 4277 -3157 -7749 -4340 -358
305 -358 -3341 -8703 -6493 2931 7536 2702 -2411 541 5795 2906 -5164 -6440 2267 8152 4631
320 4631 -255 4256 12567 11347 1485 -2304 4670 11010 6661 1115 5709 15524 17610 8233 2128
335 2128 6904 13733 10282 2116 2680 13980 20724 14230 5188 8232 17939 17142 5600 950 10791
350 10791 21083 16771 6689 8713 20576 22902 9956 451 7649 18451 15549 5387 5381 17837
364 17837 24031 14640 3531 6654 16572 16233 5504 1024 10935 20893 16660 5299 4788 14402 17191
379 17191 6791 -2723 2987 14375 14059 3046 572 10909 17422 8361 -3694 -2151 9350 11263
393 11263 1412 -4228 4663 13741 8923 -4023 -5499 4635 9160 62 -9114 -3765 7684 7963
407 7963 -3570 -8541 191 7309 -78 -12093 -10288 2022 6510 -3169 -10163 -3254 5483 337
421 337 -12135 -13886 -3584 2455 -4790 -12284 -8115 2232 1979 -8088 -13131 -6647 149 -4310 -13501
436 -13501 -12946 -2195 3105 -4173 -11563 -7628 -4 -1729 -12302 -15046 -5724 1658 -3176 -11078 -8413
451 -8413 539 1471 -7956 -12787 -6313 977 -2130 -9947 -9348 -221 3397 -3365 -9650 -6647 329 -33
467 -33 -7316 -9281 -1800 3997 95 -6837 -6349 869 2360 -4289 -8176 -2952 3864 2240 -4586 -5310
483 -5310 1330 3921 -1006 -6313 -3565 2463 2490 -2916 -4920 481 5092 1867 -3797 -3736 1182 2750
499 2750 -1613 -4960 -1725 4082 2622 -2746 -3520 1450 3764 -189 -5273 -3071 2155 2292 -2695 -3872
515 -3872 779 3904 464 -4542 -3278 945 1409 -2637 -4642 -1178 2925 1387 -2830 -4307 -692
530 -692 937 -2279 -5722 -3501 1181 1737 -2382 -4498 -1493 1354 -1291 -5037 -4626 -439 1128 -2008
546 -2008 -4249 -1865 1354 18 -3805 -4453 -1548 -160 -2169 -3872 -2140 1083 1117 -1770 -2910 -1095
562 -1095 83 -674 -3310 -2756 328 1490 -590 -2284 -149 2572 1653 -1508 -2409 744 2288 637
578 637 -1122 646 3297 2810 185 -492 1688 3299 2614 672 1306 3536 4483 2982 973 1520 3646
595 3646 4347 2545 1697 3583 5996 5273 3019 2520 5240 5600 3552 1761 2622 5149 5309 4175 3595
612 3595 5343 6148 4789 3380 3154 4179 5127 4097 3558 3720 5128 5756 4776 3519 3633 4777 4371
629 4371 2943 2477 3742 4625 3773 2572 2839 3780 3803 2277 1216 1917 2710 2652 2136 1354 1619 2019 1619
648 1619 284 -74 330 1328 995 32 -76 455 562 -883 -2027 -2020 -413 -385 -1998 -2110 -938 -52 -1257
667 -1257 -2676 -3108 -1861 -1660 -3308 -3960 -3410 -1543 -1099 -2850 -3875 -3252 -1747 -2355 -4889 -4952 -3245
684 -3245 -1805 -2922 -4190 -3487 -1701 -1761 -3864 -5047 -3624 -2115 -2819 -4177 -4105 -1932 -1480 -2386 -3676
701 -3676 -3514 -1750 -1641 -2743 -4045 -2322 -631 -888 -2780 -3061 -900 29 -1358 -2890 -1644 56
717 56 365 -1463 -1995 -197 1316 287 -1339 -1472 680 901 -70 -795 452 2017 1841 155 -190 1147
735 1147 2021 1475 124 211 2340 3079 1371 -44 1211 2693 2420 549 145 1876 2529 1494 584
752 584 1197 2619 2607 1255 351 1137 1985 1469 1030 820 2004 2167 1171 340 608 1393 1048 34 -519
771 -519 833 1224 696 -147 -84 932 547 -945 -1225 -269 181 -590 -1029 -419 -136 -413 -1856 -1618 -1350
790 -1350 -1210 -1811 -1984 -1611 -1022 -1283 -1695 -1993 -1911 -1398 -2443 -3401 -2357 -2071 -1504 -2011 -2991 -2009 -1078 -1800
810 -1800 -3117 -3179 -2370 -1551 -2212 -3120 -2351 -847 -1599 -2572 -2724 -1880 -1274 -2166 -2792 -2206 -1004 -531 -1283
829 -1283 -1685 -715 -59 -918 -1948 -1873 -360 569 -941 -1162 -19 1443 512 -1056 -1081 327 1350 391
847 391 -376 500 2290 2075 937 315 1201 2142 1695 315 969 2656 3496 2332 1098 1989 3175 3047
865 3047 1843 1059 2402 4372 3386 1915 1901 3215 4351 3065 1222 2013 3814 3736 2242 2061 3573
882 3573 4264 3608 1771 1438 2966 3530 2212 1554 2514 3485 3623 2167 1580 2478 2753 2020 518 560 2186
901 2186 2421 1695 970 1688 2374 1437 -26 -425 745 1160 591 -583 39 1346 887 -96 -892 -392 94
920 94 -717 -1665 -1701 -672 -16 -485 -1588 -1514 -1099 -1419 -2381 -2578 -1609 -780 -1236 -2037 -2081 -1307 -1789 -2380 -2565
941 -2565 -2582 -1480 -1774 -2154 -2089 -1749 -1615 -1772 -2605 -2789 -2769 -2209 -2122 -2210 -1683 -1188 -1056 -1468 -1927 -1732 -1896
962 -1896 -2083 -2157 -1964 -1331 -890 -767 -1224 -1087 -990 -1015 -1421 -1239 -1175 -660 -22 246 -168 -280 -261 -288 -392 -314
984 -314 -263 152 649 840 323 656 1002 800 297 -14 510 622 797 1168 1090 1635 1566 779 840 920 1058 1339
1006 1339 957 904 1341 1520 1619 950 756 1124 1430 813 335 850 1432 1410 864 385 726 1137 733 269 63
1027 63 828 1145 659 305 363 614 821 -450 -1107 -142 288 57 -918 -674 328 807 -350 -1289 -947 -777
1047 -777 -863 -1684 -1969 -727 -351 -681 -1300 -1263 -1115 -1236 -2232 -2544 -1932 -1122 -1066 -1626 -1755 -1169 -620 -1617 -2394
1068 -2394 -2315 -1448 -1081 -2177 -1955 -1131 -652 -1202 -2369 -2190 -1439 -1122 -1616 -2030 -1028 42 -396 -1099 -1449
1087 -1449 -1165 -611 -1445 -1819 -754 98 819 389 -579 -114 148 139 -1150 -940 275 998 813 -3 865
1106 865 1831 1675 444 75 900 1535 1206 1205 879 2052 2095 1728 1254 1848 2176 2023 1322 1581 2050 2441
1126 2441 2161 1950 2115 2611 3049 1774 1881 2241 2900 2506 1741 1892 2616 2590 1914 1702 2441 2640 2058 1853
1146 1853 1904 2347 2124 1706 1133 1303 1975 1428 1035 936 1789 1780 1514 850 637 1296 1199 638 109 521 804
1167 804 616 8 -138 580 612 69 -547 -565 -478 -412 -1714 -987 -264 -260 -577 -1105 -1306 -1218 -1202 -1569 -2004 -1833
1189 -1833 -1342 -1587 -1911 -1778 -1793 -1394 -1767 -2411 -2208 -1677 -1970 -2076 -2249 -1666 -1700 -1912 -1989 -2042 -1892 -2026 -1731
1210 -1731 -1751 -1588 -1689 -1831 -2135 -2162 -1760 -1585 -1305 -1590 -1201 -1316 -1506 -1439 -1524 -901 -1188 -962 -1311 -949 -574
1231 -574 -736 -726 -681 -85 -370 -508 -464 -64 -154 -450 -410 331 890 157 -61 205 871 820 298 253 716 884
1253 884 931 813 916 1273 1837 1051 855 777 1372 1475 955 927 1443 2462 1588 762 751 1380 2103 929 840
1274 840 1460 1834 1522 793 966 1624 1757 1137 337 783 1648 1202 397 -202 1106 1379 781 -177 -80 750
1294 750 972 492 -352 85 1385 590 -773 -898 43 975 -338 -1009 -714 597 65 -824 -1401 -488 263
1313 263 -364 -1936 -1846 -410 235 -1153 -1558 -997 1 -399 -1848 -2406 -1024 152 -869 -2206 -1985 -54
1331 -54 209 -1061 -2238 -1377 -257 -495 -1740 -2144 -690 5 -513 -1997 -1466 143 89 -1327 -2040 -791
1349 -791 670 135 -1319 -1338 163 1142 -253 -1406 -543 1008 926 -559 -945 446 1080 1010 -579 -270
1367 -270 1483 1511 512 -629 724 2046 1928 -36 -275 1092 2319 970 144 535 2077 2026 888
1384 888 460 874 2432 2014 483 627 2186 2545 1764 343 1209 2128 2380 430 297 1668 2211 1639
1402 1639 -214 720 1456 1623 1253 666 770 1487 1544 441 162 782 1561 622 -927 -22 1201 871 2
1421 2 -884 -270 314 137 -1199 -1577 753 711 -184 -1554 -493 441 -725 -910 -1109 -774 -317 -1118 -1831
1440 -1831 -980 -719 -500 -1165 -1965 -1293 -1209 -1281 -1274 -1801 -1910 -1610 -1361 -2256 -2132 -595 -861 -2206 -1874 -1139
1460 -1139 -1090 -1424 -2140 -2666 -1848 -1600 -1265 -1045 -1097 -1123 -1173 -887 -1760 -661 -770 -1466 -883 -1374 -891 -736 -930
1481 -930 -1464 -379 -640 -999 -201 -634 -19 -121 106 -17 360 -293 -233 287 229 1253 434 647 -319 -282
1501 -282 1184 463 445 871 188 1351 844 863 1054 1247 1292 814 691 1264 1187 202 923 1685 1592 1694 1068
1522 1068 1685 2028 1655 1500 853 1201 1666 1532 225 315 1410 1620 996 935 892 1102 902 1160 845 1455
1542 1455 1309 688 438 1109 739 1495 721 -322 344 280 -140 12 461 387 623 161 -99 253 -261 -648
1562 -648 -154 -533 -125 -92 -1034 -893 -499 -737 -754 -1018 -1083 -779 -250 -1198 -814 -1278 -1140 -1092 -1262 -1133 -1326
1583 -1326 -1099 -823 -972 -1474 -652 -809 -769 -1510 -738 -800 -845 -1909 -694 -609 -482 -632 -929 -803 -1374 -1026
1603 -1026 -1342 -1290 -552 -266 -1057 -1071 -668 -24 -1029 -1251 -1312 230 -799 63 -751 -261 -208 13 -246 -783
1623 -783 423 92 407 -65 -47 936 292 306 -307 -226 1210 323 319 -64 1023 1248 303 566 398 2285
1643 2285 997 -124 376 913 1518 374 689 256 1317 1143 707 924 670 1270 821 352 1008 1708
1661 1708 1855 1099 265 928 1644 1209 326 722 1216 693 884 -624 135 1186 527 -143 -42 545 1180
1680 1180 567 -259 -724 492 943 243 -1012 -337 700 -57 -415 -794 285 1148 -293 -1098 -1406 753
1698 753 227 -1128 -1616 -1136 398 -25 -1806 -1499 -105 123 -995 -2260 -1210 -55 140 -1247 -2172
1715 -2172 -847 -145 -786 -1725 -1391 -109 47 -1154 -2122 -996 -197 -265 -1385 -1956 -242 161 -819 -1725
1733 -1725 -1382 -258 162 -939 -1526 -789 42 99 -940 -758 598 964 164 -1127 -426 554 198 -142
1751 -142 -730 639 946 673 -426 10 1211 1348 233 -362 527 1299 970 -285 231 1442 1913 1136
1769 1136 -2 436 1674 1484 497 410 1404 1800 1470 117 117 1594 1757 927 208 1176 1575 1595 612 282
1789 282 1140 1677 931 277 501 1149 1147 258 216 785 1380 580 62 103 808 712 263 -242 382 862 299 -716
1811 -716 -780 765 472 -225 -1025 -419 393 162 -703 -912 59 71 -628 -1239 -1029 257 -68 -934 -1455 -805
1831 -805 28 -808 -1591 -1825 -495 -475 -1338 -1636 -1119 -205 -763 -1533 -1628 -643 -212 -944 -1939 -1539 -536 -407
1851 -407 -1335 -1863 -1084 -223 -483 -1740 -1673 -594 -73 -1068 -1412 -1036 -509 -332 -1253 -1052 -137 -132 -286 -991
1871 -991 -881 145 494 -325 -1024 -314 432 94 -352 -394 294 1073 417 -542 214 901 700 291 -74 681
1891 681 1265 1554 56 106 940 1163 781 -74 706 1370 1725 841 460 1082 1616 1548 423 476 1624 1437
1911 1437 1262 380 967 1659 1385 1016 737 1075 1469 1017 166 686 855 1249 730 385 722 1130 1094 642
1931 642 127 638 733 727 205 145 696 921 220 6 178 677 -19 -133 -152 285 136 -260 -464 -198 57 57
1953 57 -514 -386 -56 -537 -236 -455 -802 -666 -761 -682 -625 -672 -837 -678 -738 -553 -901 -981 -941 -771 -797 -1054 -723
1976 -723 -762 -341 -942 -1100 -1061 -1003 -802 -941 -960 -936 -384 -497 -896 -925 -690 -602 -562 -831 -685 -536 -277 -469 -762
1999 -762 -594 -198 -47 -594 -684 7 291 -67 -353 -58 10 496 85 -317 190 586 256 156 415 721 865
2020 865 327 21 448 748 679 161 -27 566 1091 1042 628 493 979 1181 421 120 632 1025 1104 283 651
2041 651 763 1013 1075 529 660 732 1041 325 500 465 1052 764 55 356 775 1077 610 82 373 634 419
2062 419 79 174 -46 501 431 -235 248 289 538 -88 -349 -201 -38 -229 -412 -736 -156 -16 -283 -798 -417
2083 -417 -265 -361 -583 -854 -489 -238 -419 -969 -860 -376 -392 -731 -755 -722 -770 -807 -888 -972 -366 -680 -933 -1265 -715
2106 -715 -420 -899 -1190 -825 -505 -643 -857 -936 -576 -273 -707 -902 -905 -833 -244 -335 -752 -1042 113 -92 -455
2127 -455 -578 -245 36 -331 -752 -183 335 347 -217 -256 -8 596 345 -241 93 257 605 283 113 308 1567
2148 1567 1021 199 221 495 1044 934 235 48 911 1283 740 423 761 1256 916 340 790 925 1221 928
2168 928 513 454 1196 1188 96 559 1154 1274 861 654 565 1167 1122 667 241 640 1239 784 518 23 565
2189 565 843 376 -113 -17 712 992 108 -306 106 660 304 -492 -593 366 363 -203 -897 -390 263 65 -926
2210 -926 -491 -131 139 -447 -951 -967 -140 -155 -408 -1101 -846 -138 -389 -943 -1527 -566 -375 -1085 -1363 -895 -435
2231 -435 -263 -1157 -1637 -653 -421 -889 -1221 -1092 -340 -591 -898 -1446 -827 -353 -584 -1224 -1034 -458 -196 -671
2251 -671 -978 -790 -233 -173 -549 -937 -589 -218 -92 -908 -421 280 183 -288 -526 -157 301 311 -157 -154 158 386
2273 386 233 -60 105 618 994 117 -27 275 627 523 -74 281 668 1088 603 566 381 1044 1014 215 534
2294 534 678 1149 740 117 418 925 1007 688 47 909 836 780 389 629 949 1041 691 507 646 430 753
2315 753 364 346 393 722 803 348 -39 396 452 -209 108 180 364 76 6 214 189 -8 57 -141 -456 146 -134
2338 -134 -303 -257 -385 -294 68 -556 -554 -462 -482 -568 -578 -358 -613 -291 -660 -581 -681 -624 -808 -714 -731 -596 -593 -630 -697
2363 -697 -955 -676 -758 -754 -423 -223 -784 -785 -613 -538 -521 -540 -508 -561 -375 -444 -694 -193 -92 -290 -306 -504 -416 -202
2387 -202 -463 -454 -179 -157 207 32 -272 232 -19 105 -118 -182 278 471 258 239 82 582 361 466 279 599
2409 599 568 463 155 -41 645 581 327 2 350 798 770 567 740 729 735 560 506 787 779 1088 468 500 497 887
2433 887 714 607 410 659 1147 421 294 429 284 660 270 203 581 662 369 55 376 343 359 112 -18
2454 -18 37 500 2 -312 -26 35 -41 -159 -122 -438 -18 -198 -472 -295 122 -10 -606 -633 -551 -651 -523 -128
2476 -128 -391 -312 -343 -485 -745 -782 -384 -309 -682 -730 -325 -504 -685 -676 -863 -525 -470 -588 -784 -860 -427 -510 -860
2499 -860 -812 -516 -521 -689 -627 -815 -273 -405 -663 -615 -238 -5 -369 -262 -531 101 -63 -419 -537 90 -376 121
2521 121 -220 -91 242 85 80 158 -111 287 357 165 -94 517 857 243 81 105 504 735 308 346 109 574
2543 574 457 328 693 810 985 616 590 622 858 655 581 328 924 815 669 346 541 407 765 576 93
2564 93 718 1105 630 272 400 330 674 625 -78 396 597 611 494 -2 640 440 91 -90 -112 119 637 -164
2586 -164 -260 59 220 4 106 -346 -119 35 -199 -662 -176 -13 -360 -389 -507 -639 -170 -260 -388 -719 -337
2607 -337 -226 -622 -792 -1053 -484 -565 -606 -596 -576 -345 -629 -823 -1036 -664 -649 -824 -700 -995 -745 -461 -594 -610
2629 -610 -602 -407 -373 -774 -780 -454 -388 -484 -314 -516 -333 -339 -378 -301 -226 -516 -201 -200 -467 -332 -280 -29 -296 -356 -50
2654 -50 -320 -6 -77 216 46 -59 104 105 -28 354 184 299 400 105 282 306 405 329 465 200 481 466 152
2677 152 463 380 717 735 750 684 836 582 677 82 505 704 714 725 272 667 953 596 336 674 652 388 300
2700 300 314 310 653 399 414 377 395 585 366 349 150 481 -23 127 257 -93 243 -150 -290 -287 77 112 222
2723 222 -155 138 -49 155 -300 -502 -171 -254 -72 -501 -443 -278 -436 -466 -552 -365 -675 -86 -642 -645 -469 -196
2745 -196 -466 -493 -707 -369 -292 -614 -778 -836 -369 -753 -668 -760 -918 -438 -635 -814 -840 -328 -272 -408 -553 -329
2767 -329 -125 -252 -471 -188 -203 -49 -17 -439 -326 70 360 -111 -374 50 -98 -274 -187 -17 218 418 75
2788 75 -191 -54 97 470 204 19 417 479 318 82 181 342 432 324 442 621 549 750 519 352 289 925
2810 925 426 322 570 539 632 401 390 662 832 770 300 619 307 799 341 92 575 369 431 278 295 248
2832 248 426 376 -34 346 605 280 292 166 252 298 275 193 -110 49 302 -154 -297 -199 51 -53 -152 -38 -55
2855 -55 -30 -424 -376 -545 -380 -316 -416 -425 -453 -551 -453 -534 -383 -507 -305 -511 -460 -745 -574 -586 -555 -784 -469 -523 -382
2880 -382 -379 -829 -182 -223 -89 -587 -419 -795 -306 -602 -486 -283 -385 -588 -424 -428 -444 -265 -89 -534 -249 -189
2902 -189 -372 -298 -446 -198 -39 -56 17 -134 57 15 469 284 209 124 201 351 58 277 237 412 128 286 458
2925 458 314 139 414 532 281 431 335 499 880 637 511 427 591 291 643 409 807 549 635 640 488 252
2947 252 469 457 167 154 373 541 838 555 590 708 718 697 295 305 212 370 309 10 367 284 -118 -221 264
2970 264 264 417 -19 -198 -150 340 185 -87 -301 79 -44 75 155 128 -237 -89 -252 -494 -363 78 -333 -199
2992 -199 -299 -396 -588 -49 -307 -479 -424 -165 -302 -513 -521 -628 -440 -741 -575 -707 -490 -701 -492 -500 -451 -120
3014 -120 -358 -642 -593 -325 -235 -422 -568 -318 102 -371 -356 -561 -308 -256 -258 -386 -337 -187 -471 -119 -444 -253
3036 -253 31 -102 -488 -41 -45 204 -302 -370 100 346 249 56 -25 266 -155 369 214 128 529 151 46 591
3058 591 411 315 246 262 463 122 534 454 260 180 784 249 468 118 482 641 646 231 440 651 539 477 131
3081 131 695 789 795 413 413 441 440 386 -61 269 343 407 20 -46 -142 468 126 -288 15 -144 -26 478 -139 16
3105 16 -308 -110 -145 -159 -115 236 71 -104 -477 -91 67 -344 -186 49 -337 -119 -447 -579 -280 -270 -198 -450
3127 -450 -183 -360 -155 -394 -475 -178 -247 -602 -473 -266 -399 -72 -575 -544 -341 -372 -261 -348 -326 -276 -167 -239 -638
3150 -638 -400 -535 -217 -362 -303 -134 -165 -301 -476 -411 -199 -175 -372 -129 -213 -303 11 -112 -170 128 -125 -54 -149
3173 -149 -115 -37 -169 -93 258 296 388 335 -66 26 525 211 552 377 448 397 141 428 443 420 158 361 13 20
3197 20 539 282 196 450 680 497 486 482 355 212 415 163 425 141 520 317 299 531 233 378 417 213
3219 213 261 201 344 228 -80 490 135 147 414 -166 249 182 43 213 181 273 -44 -499 -71 -90 -243 9
3241 9 -247 -222 -235 -342 -276 -157 -106 -510 -318 -379 -430 -486 -331 -523 -415 -416 -467 -411 -472 -303 -393 -368 -492 -349 -11
3266 -11 -180 -639 -429 -380 -366 -306 -242 -471 -401 -437 -292 -494 -632 -271 -302 -213 -192 -151 -252 34 -338 -266 -161 -180
3290 -180 -202 4 -301 -122 -124 -359 -35 -2 -75 -102 116 173 94 93 -4 7 60 45 36 84 173 298 -204 0 228 384
3316 384 434 10 380 513 227 437 406 545 403 545 497 331 602 537 655 286 394 67 715 491 302
3337 302 508 436 350 449 219 444 577 469 314 156 337 462 118 -71 190 374 198 239 280 -21 241 -23
3359 -23 -59 -49 242 225 -82 241 -35 47 -13 -128 -114 -100 -38 -271 -397 -31 104 -193 -309 -148 -234 -190 -351 -492
3383 -492 -305 -355 -271 -577 -515 -443 -289 -246 -380 -339 -557 -260 -350 -429 -472 -288 -139 -471 -500 -172 -235 -446 -635 -454
3407 -454 -15 -187 -218 -280 -287 -437 -474 -175 -45 -161 -301 -356 -241 -515 64 -80 -103 -249 -17 316 66 -122
3429 -122 69 315 1 92 25 35 232 20 -213 27 270 213 419 353 273 382 295 53 554 342 446 264
3451 264 129 347 564 662 262 257 269 421 466 410 134 452 303 184 47 159 484 480 516 140 617 422 357
3474 357 -37 538 317 666 114 194 249 336 321 63 -34 287 252 -87 -26 33 122 306 -430 -302 -25 27 224
3497 224 -388 -176 -42 -68 -102 -398 -265 32 -20 -119 -143 -36 -14 -188 -330 -375 -183 -391 -506 -479 -279 -202 -307
3520 -307 -749 -531 -259 -230 -382 -490 -331 -163 -146 -383 -315 -410 -117 -312 -602 -287 -228 -198 -443 -326 38 48
3542 48 -156 -510 -178 0 334 -178 -135 -48 236 43 -229 -212 -81 104 170 -109 -114 251 -121 -120 -54 175 -59
3565 -59 390 296 -88 476 120 188 -79 86 351 82 269 611 267 393 137 348 -140 437 326 327 49 270
3587 270 268 361 442 230 292 470 259 65 156 242 511 502 330 459 443 152 130 221 204 301 348 95 278 187 189 461
3613 461 193 8 308 -6 21 47 281 276 -64 -257 -86 20 -90 227 -132 -169 -281 -16 -7 -346 -82 -30 -290
3636 -290 -65 -372 -61 -487 -370 -267 -358 -112 -120 -322 -823 -684 -265 -231 -631 -531 -463 -349 -387 -255 -336 -360 -64
3659 -64 -553 -331 -339 -373 -224 -274 -227 -217 -486 -113 -233 -9 -155 82 -237 -230 -134 -71 -50 -47 -37 -22 -256 -202 -106 -172
3685 -172 41 144 62 138 -61 70 -88 -189 -2 -122 347 -40 -8 -91 131 310 228 244 282 264 233 404 111
3708 111 311 414 329 166 -134 409 651 499 85 277 633 41 220 364 51 644 339 218 306 -27 546
3729 546 -141 409 373 307 298 255 43 402 258 109 103 202 128 236 -26 190 -224 237 264 20 -29 -47 -138 -380
3753 -380 -30 181 93 10 -214 -118 -275 129 -374 -75 -307 -188 -90 -138 -361 -476 -9 -142 -116 -183 -398 -451 38
3776 38 -339 -286 -98 -606 -234 -412 -324 -112 -189 -297 -212 -441 -201 62 -581 -185 -107 71 -360 -245 -3 -65
3798 -65 -346 -376 -129 -291 -125 -190 -296 -182 -331 -199 -359 -197 -163 2 16 -2 -277 218 184 -131 -169 99 77
3821 77 0 -93 -116 336 80 224 67 18 248 179 333 202 -105 67 322 193 262 27 370 246 350 215
3843 215 313 456 510 119 217 325 404 89 -7 340 523 304 29 140 265 512 83 79 408 575 374 13
3865 13 -202 526 325 241 210 53 457 106 136 90 313 318 -2 -98 -56 78 -161 -42 -188 12 -81 95 -24
3888 -24 -183 -144 8 74 -458 -4 -4 -141 -295 -436 -84 50 -362 -316 -135 -217 -248 -329 -226 -385 -312 -301 -226 -219 -318
3913 -318 123 -201 -333 -105 -273 10 -186 -271 -342 -129 -181 -296 -520 -86 -182 -309 96 1 -298 119 -471 -430
3935 -430 54 -158 -6 -92 -255 17 226 -128 44 276 -4 -148 -14 95 32 17 132 158 183 284 41 14
3957 14 -233 180 317 231 445 95 279 266 -99 82 331 317 249 81 77 348 261 366 425 446 275 178 206 273
3981 273 606 67 136 311 55 353 362 260 304 413 281 284 71 89 299 228 64 319 174 305 249 181 -241
4004 -241 278 -64 -178 -92 55 8 -38 53 55 -49 -17 -133 -147 -56 -106 67 14 -4 -1 -306 -290 -111 -180 -136 -105 -41
4030 -41 -274 -185 -491 -168 -240 -71 -296 -326 -193 -224 -516 -117 -189 -400 -300 -68 -345 -451 -41 -354 -105 -92
4052 -92 -26 130 -161 -104 -162 -166 -431 77 28 59 28 -272 62 -110 -92 86 -113 198 188 13 38 177 -120 151
4076 151 -218 -129 135 -139 150 -125 88 94 -108 -72 364 2 86 30 254 74 -239 -62 237 72 389 -62
4098 -62 392 319 305 154 122 170 618 432 104 112 138 165 245 294 292 225 228 7 -176 333 117 180 251 -53 182 216
4124 216 237 199 193 42 188 249 -37 54 -212 300 96 -55 99 221 136 -69 -40 -5 -4 -87 47 -285 -65 88
4148 88 -114 -120 -386 -327 -232 -141 -113 -427 -133 -534 -383 -430 -387 -84 -209 -263 -331 -89 -221 -198 -237 -244 -377 -287 109
4173 109 -205 -10 13 72 -180 -50 -289 -324 -312 -252 -285 -357 -149 -184 42 -72 81 -237 -163 -301 -157 -476 -74
4196 -74 -173 125 127 13 -30 -340 164 95 123 -61 33 79 140 39 -138 64 -39 394 141 248 388 119 176 157
4220 157 268 156 67 297 124 240 113 301 70 168 0 181 341 211 -12 424 265 227 114 3 227
4241 227 344 -220 232 393 -43 80 -63 139 -46 248 23 -53 -115 503 95 -34 135 206 -46 178 -119
4262 -119 -159 201 260 140 327 268 -317 -63 -447 90 5 -7 26 -252 -137 -51 -263 -57 -89 -394 -90 -323 -95
4285 -95 -179 -253 -394 -30 215 -144 -282 -226 -214 -236 -132 -485 -327 -140 -53 -354 -172 -373 -230 -110 202 -10
4307 -10 71 87 201 -125 -113 -313 -114 98 -371 -191 -107 -24 84 -138 -41 -120 -150 91 -408 79 -70 -19 -58 50
4331 50 -88 9 -54 37 238 276 -80 -6 230 -88 235 185 -30 303 -46 -116 428 175 216 39 320 130 389
4354 389 -200 8 315 179 515 243 23 287 99 -183 40 431 138 271 29 -45 483 82 169 67 186
4375 186 -12 52 348 -42 81 202 -19 -67 92 248 -28 276 33 -166 83 64 337 -147 -10 -70 -74 -30
4397 -30 -39 -263 170 -80 -135 -199 -255 -183 -66 -128 14 -270 -123 -52 -149 107 -316 76 -183 -281 -216 -139 -344 -209
4421 -209 124 -561 -73 -318 -154 -260 -212 -223 -339 -159 72 -108 72 -124 -285 -194 -210 -132 -273 -250 -242 -389 166
4444 166 -125 -268 33 -233 -54 103 35 -255 -150 120 -86 347 -162 -12 23 -152 25 116 144 22 200
4465 200 24 -41 -362 161 -98 -8 206 -61 140 -309 27 -85 348 175 212 201 164 366 195 67 66 274
4487 274 134 50 -69 110 115 292 286 44 148 138 -79 -37 71 118 86 211 9 121 -18 38 123 176 -11 176
4511 176 211 60 46 354 24 17 231 -25 2 -101 -264 -61 -79 43 72 37 112 125 204 142 -266 43 -99 -242
4535 -242 108 115 -396 14 -158 -198 -283 137 -329 -334 -27 -304 -226 -412 -338 -240 19 -80 -128 -232 188 -120 -104 -307
4559 -307 -41 -249 -161 -205 -322 -220 -187 78 -133 -303 36 -51 -81 -44 -344 24 -216 61 -377 -365 -115 -186 -17
4582 -17 -198 95 -277 262 -20 119 -98 -296 59 -56 -44 125 -131 -22 16 -73 -283 -115 -39 -1 -30 -79 253
4605 253 131 195 124 244 115 77 197 151 349 8 136 431 368 139 158 208 -12 271 -110 131 -10 98
4627 98 243 236 399 -22 188 111 479 -19 168 32 85 136 121 284 244 -66 -108 383 18 427 102 67 142 -187
4651 -187 75 162 -35 -128 -97 37 68 -139 -29 33 -39 -33 -224 102 18 -39 28 -299 59 -118 -176 -211 -179 -118 -116 163
4677 163 55 -344 -96 -480 139 -322 152 -102 -360 -89 -361 -130 -32 -34 -206 -243 -48 17 -135 57 -200 200
4699 200 -237 -78 -241 -298 -25 5 89 -150 -177 -46 -145 -14 -9 -225 52 43 56 -11 -173 207 -97 111 184 19
4723 19 143 53 -132 160 230 158 -28 -75 183 -284 204 9 153 325 21 280 -267 156 126 -2 156 144
4745 144 538 318 125 200 265 217 225 -10 -92 -23 -35 237 59 -93 452 415 -150 239 203 -47 -54 -25 -57 -54 246
4770 246 309 21 -72 -9 -60 132 19 3 129 1 -11 16 235 152 -73 -286 168 53 -40 -51 -234 -212 -165 -369
4794 -369 -216 69 -140 -45 -37 -117 -121 -136 -213 95 -306 -244 -188 -126 -197 -397 -255 -223 -249 -177 26 -271 -281 42 -33 180
4820 180 -60 148 31 -224 -464 -139 -290 -124 -114 -218 -207 -176 35 -25 -131 -383 18 -320 -334 -73 -155 -32
4842 -32 251 61 -35 -146 -302 11 -140 -17 245 38 -132 0 363 -55 253 197 95 -160 -149 -13 8 -51
4864 -51 -177 -46 174 47 369 124 -49 112 -159 60 158 328 98 -30 68 120 249 -174 278 99 7 26
4886 26 -81 15 -68 -124 29 176 -33 380 150 154 100 298 30 88 22 215 -194 95 -30 27 231 5 68 101
4910 101 289 -175 -240 -91 -19 91 56 23 -418 -28 -331 -236 -103 -67 -43 -224 -341 -62 -179 -311 -180 -88 -105
4933 -105 -422 -141 33 -113 -186 -276 -172 -133 76 -82 -123 -329 112 -204 -227 192 -29 -38 103 68 -370 -179 -213
4956 -213 66 416 -178 -35 18 78 43 -147 33 -89 -150 95 -204 120 -127 -1 79 270 67 -255 -88 -9
4978 -9 190 -82 -253 -67 211 -274 -270 -10 -86 135 178 84 -76 17 229 -1 287 320 306 -77 -23 341 17 340
5002 340 351 23 154 728 22 141 184 48 343 -19 116 -75 124 235 118 1 9 -180 462 -13 -110 297
5024 297 62 68 44 -128 -79 143 -204 -101 348 -132 -37 120 160 -83 2 165 10 272 -62 27 -232 -164 57
5047 57 166 -155 104 53 80 82 -335 -85 -84 -327 22 -456 -239 -106 -125 7 -85 -94 -139 -54 -97 -235 -320 -119 -35
5072 -35 -363 -170 -33 -67 10 -94 -192 -250 109 -147 -106 -132 -187 -124 -181 -174 -103 -17 -296 -17 68 -224 -20 -95 -85 30
5098 30 86 39 -18 -237 4 201 129 262 -59 207 -32 3 183 371 87 103 82 -16 -328 75 366 182 17
5121 17 82 20 137 35 81 -163 315 -54 162 145 351 424 72 98 -256 338 -155 -92 156 204 142 32 238
5144 238 -103 85 -14 -55 63 64 -10 -167 43 204 220 -63 -27 158 -18 -236 29 104 109 -14 -378 -13 176
5167 176 15 291 -184 -304 -84 344 -194 -158 97 214 -194 -170 -11 -23 261 -112 -103 -108 -55 -127 -60 -148 -146 21
5191 21 -3 95 59 -111 -180 -353 186 -57 -179 9 -94 -83 -194 29 -46 -1 -56 -90 -107 142 49 -196 -87 0
5215 0 -71 264 -154 23 -168 -200 -56 -322 245 -189 -84 -333 160 -60 -116 -79 -94 23 102 -30 194 -37 -157
5238 -157 304 67 191 -262 160 -184 -117 165 254 29 -11 158 -58 -232 43 105 -38 25 226 165 -98 173
5260 173 -154 -22 233 -125 106 148 85 91 -107 300 213 62 228 -163 57 221 -299 110 -190 178 72 -118
5282 -118 190 -239 -67 -60 -14 258 234 137 -34 -220 59 -96 -135 -183 15 89 222 42 8 19 -62 -168 53 -190
5306 -190 -16 140 11 -67 -286 -53 -173 343 -148 321 -3 -46 -225 -137 -228 -127 39 -203 -214 -228 -175 74
5328 74 189 221 -52 196 -122 -206 77 166 -70 -147 -136 132 -12 -115 45 -170 -3 -81 119 -2 198 -301
5350 -301 -111 -39 555 -36 -118 182 -212 -79 109 -23 326 -174 -130 -181 320 98 -218 158 -200 82 61 254
5372 254 252 144 149 73 31 107 272 236 164 -15 -197 161 -161 292 -37 210 236 218 320 -35 281 40 97 280
5396 280 168 -79 -80 109 46 -81 256 243 263 182 -66 150 92 187 334 97 -141 308 -65 -48 6 -248 2
5419 2 -52 147 208 31 -10 20 -31 -65 -137 -12 -246 -83 -150 -63 -123 -216 -204 -203 7 -281 -193 28 235 100 124 54
5445 54 -226 -153 63 -44 1 258 267 -156 -148 -12 -399 -108 129 58 -244 -189 -199 -318 -300 -25 -98 -30 163 -67
5469 -67 -68 -294 52 -7 -39 90 -153 -171 -102 145 -55 -101 310 31 -182 276 -231 31 126 72 -136 51 323
5492 323 132 108 70 200 88 197 -2 -242 286 8 18 53 75 213 245 223 158 -171 69 214 -120 -134 -91
5515 -91 164 227 -53 113 -56 241 21 -128 5 -65 -57 121 272 -45 260 -106 55 179 -80 -33 200 -119
5537 -119 -14 -112 244 236 -17 405 195 -52 -61 107 -88 -60 204 191 156 -275 -100 118 -225 345 -46 193 170
5560 170 -168 333 19 -244 -344 -135 -100 78 213 -261 -32 102 -97 -190 -76 145 -336 -143 -83 -134 0
5581 0 -94 -32 -47 -151 -175 -87 -222 -1 113 15 -243 -162 -168 104 -222 -299 103 -104 120 170 31 114 -330 -38 21
5606 21 -36 -150 -357 -25 -513 74 -29 174 145 209 -156 433 -109 -62 70 95 257 259 -471 280 28 230 -4
5629 -4 137 258 -220 301 34 -238 -323 -158 -116 119 20 -328 -620 -5 159 68 -167 102 639 -5 -81 -622
5651 -622 311 -30 -576 484 46 559 330 -431 617 -183 -72 -136 -110 -277 -233 -1124 391 439 251 524
5671 524 221 -564 -872 104 -464 714 310 -178 -294 -860 -277 201 -393 -400 479 -295 4 345 30 13 -97
5692 -97 293 -38 50 -205 121 -159 427 -143 -243 138 48 494 38 -314 163 -276 135 146 53 266 -268 -5
5714 -5 -261 -101 25 81 -34 91 118 119 0 -258 -138 137 -215 -300 101 185 159 142 -259 -177 -145 -51 138 16
5738 16 258 -66 137 -170 204 -16 34 -63 125 148 -69 -119 66 56 13 -190 12 12 138 -131 115 241 87
5761 87 1 243 13 -57 -142 -193 -287 -224 109 253 90 88 10 47 211 119 116 76 -51 86 148 227 293 275 24 257
5787 257 30 187 -111 -71 -114 -96 -12 45 25 271 331 147 -152 73 123 85 197 16 35 -190 -123 141 175 57
5811 57 74 -96 -53 -111 99 -239 116 309 -43 -68 -245 -99 -229 -101 -132 38 -203 -50 -14 -307 -156 -209 -143
5834 -143 47 56 -188 -106 -211 -91 -196 8 107 -131 -133 -268 330 -205 136 81 -29 130 -151 -300 -35 -127 45
5857 45 -332 200 -201 -326 -338 -45 -395 -176 -61 57 0 -223 -274 -38 202 -138 -186 -146 -26 2 -110 -131 -229
5880 -229 -45 -288 41 158 -108 -20 -284 179 70 140 -57 -18 95 263 -155 143 82 434 180 275 6 93
5902 93 -39 -19 97 172 -23 -180 153 -151 93 -267 254 235 -4 10 -1 100 61 -8 166 -75 168 -115 399
5925 399 -109 42 -82 19 -13 128 -142 -112 87 -169 95 -225 -19 -11 -313 7 64 275 70 -112 -159 18
5947 18 -181 -255 -104 115 -351 -121 -48 -218 80 -310 9 221 -413 -187 -6 151 -68 -129 -6 38 252 -122
5969 -122 171 -119 -13 127 -3 264 -12 -195 120 10 -90 -93 35 -242 -19 -199 -113 -103 -311 -187 -44
5990 -44 84 -173 163 198 16 60 -99 -109 54 -111 238 -41 -44 -110 -98 113 70 67 -34 83 -130 -146 80 170
6014 170 238 -185 -74 211 -54 -184 149 88 -283 24 200 101 -62 133 411 -168 8 126 191 -160 226
6035 226 116 98 262 100 -118 252 120 258 87 -269 -235 -572 177 -4 102 -26 63 -226 -156 -122 -283 -85
6057 -85 304 -155 -106 2 137 227 116 -62 75 -119 72 194 -260 -35 -99 174 29 210 -2 169 -198
6078 -198 80 86 -83 87 34 -130 -33 34 -12 -38 -229 110 148 58 -233 99 51 -61 127 -160 -79 -289 -135 -2
6102 -2 -326 43 158 17 -39 0 -318 -221 -5 -184 -239 -128 -95 88 51 136 159 63 -41 -107 42 -264 179 164
6126 164 22 268 93 94 58 175 -45 64 23 -40 339 -20 -52 -249 -87 -2 140 465 74 252 195 -1 51
6149 51 305 84 -127 120 40 141 149 -78 83 -79 55 44 -124 69 -179 -15 -23 62 51 -17 -35 -108 48 73
6173 73 -108 -1 50 249 -66 -36 -136 182 349 200 343 -108 -236 -127 299 71 -23 74 98 -135 -73 -117 -173
6196 -173 61 -15 71 61 -50 25 71 -188 -100 73 -60 -168 -92 54 -260 -105 -13 176 114 -236 213 33 -235
6219 -235 -212 232 -115 353 193 25 211 -163 -106 -205 -20 190 -183 -12 -18 -157 103 -147 -134 -182 -50 -108 -380
6242 -380 91 -291 -156 -52 117 -20 127 120 -176 86 1 118 38 115 8 47 135 -2 -192 237 53 197
6264 197 58 93 -7 -131 -58 69 -9 42 -177 79 22 -25 27 261 53 178 93 148 60 127 -165 87 -231 -70
6288 -70 136 218 85 406 23 309 329 -62 8 19 357 66 27 -327 177 -133 147 197 31 159 270 141
6310 141 -91 201 59 333 -360 49 -63 78 -71 501 84 32 374 -119 -194 244 286 144 130 70 -272 198
6332 198 -457 -18 -196 -87 -375 150 -81 0 -8 -206 -134 138 88 -235 -254 -8 -246 -27 -40 -29 -200 -227 322
6355 322 -28 132 -122 172 -16 -275 -189 10 -198 150 145 150 -81 -412 96 -27 260 278 69 -76 -149 -11
6377 -11 -168 -38 75 -3 143 24 158 100 -126 -381 -113 4 -59 -196 16 -47 -34 -41 -102 295 34 -11 133
6400 133 95 -76 -203 -377 135 43 76 -245 224 319 55 59 304 5 112 -109 -50 66 46 -115 221 157 10
6423 10 264 -9 -16 26 366 -255 -41 19 326 20 -285 7 99 236 -68 -180 27 -196 144 -48 -7 -122
6445 -122 -12 99 88 -114 123 265 -96 162 60 -180 -96 132 22 -9 -300 -21 -93 89 -117 122 4
6466 4 -77 68 306 -236 42 -179 -15 4 50 -280 -113 -34 -124 200 -332 -26 -27 55 -161 -239 112 -196 -4 -123
6490 -123 -204 53 -341 -241 -250 89 -56 124 187 136 -224 -89 -163 50 -29 43 -26 -202 -87 93 122 -154 -20
6513 -20 -112 50 70 101 -114 30 246 -51 -2 -55 86 -78 97 -259 180 16 20 63 -70 56 42 80 -51 98
6537 98 106 -4 343 -134 -64 -183 -131 256 181 -88 356 -72 -71 -122 -155 151 114 0 -64 70 10 321 168 -124
6561 -124 57 14 74 146 190 123 206 87 4 134 361 284 165 45 -84 56 -110 -127 -168 -121 42 -52 59 -33
6585 -33 -230 -244 -102 208 -48 155 -5 -11 -38 -19 117 37 135 -225 42 152 -183 -71 134 24 314 12 -78
6608 -78 101 263 126 92 -163 -61 66 -400 -298 -292 15 107 -134 -91 -245 622 -183 -8 146 -185 134 231
6630 231 -39 175 -193 56 -293 216 -2 167 -16 75 2 61 168 192 103 -77 225 -104 107 26 -282 69
6652 69 -228 -204 27 -116 259 -74 -75 -167 20 21 274 56 271 -23 211 75 225 -19 212 89 322 105
6674 105 -286 23 -7 -22 -398 -77 70 -160 194 8 28 60 -270 41 -132 17 20 248 16 227 3 73
6696 73 -63 -38 38 388 -213 -155 124 -74 -36 -10 64 42 -108 146 -8 76 -37 120 270 11 115 274 -134
6719 -134 -103 230 -183 -145 -304 48 -124 -176 -12 -24 76 -140 -72 83 29 118 205 86 -97 -147 -96 89 -15
6742 -15 -289 29 -98 -317 -107 -222 176 44 66 77 165 144 -89 156 -102 65 310 -97 190 416 4 -159
6764 -159 -182 -358 -22 24 304 -223 -80 20 -145 -174 79 23 -293 146 -30 -55 -317 81 -109 -35 82 -71
6786 -71 345 -267 -25 43 -270 -221 -117 -56 270 -258 242 97 288 -294 -236 25 12 406 154 -59 367 -151
6808 -151 -249 -57 -128 -52 -37 91 46 22 -89 -33 5 97 41 119 30 396 129 -175 -41 -42 109 270 168 -60 103
6833 103 86 -32 273 197 184 152 -28 0 100 -89 -72 -10 -62 99 1 -58 206 -186 50 -276 -607 -308 -291 102
6857 102 -185 201 -73 102 182 -1 -105 27 -69 -94 97 -188 -229 174 -266 -324 -12 -282 64 19 -210 -200
6879 -200 -52 -55 -124 -39 118 219 -166 -25 -71 -23 -29 -1 -121 5 128 -75 -180 -253 159 -154 242 -74 164
6902 164 82 90 183 -21 78 95 176 206 78 265 13 -200 153 7 54 -73 143 -42 -105 151 -174 -39 190
6925 190 144 89 171 -187 -94 -177 -239 -59 -12 -100 114 -67 -64 325 -57 -136 120 128 -122 472 -162 38 -26 -60 4
6950 4 -287 56 -177 50 -81 218 80 28 266 195 -245 -5 219 59 -222 -221 -245 309 101 112 112 96 -272 -154
6974 -154 38 -81 96 170 -53 -215 -130 69 -105 41 -105 25 -63 -132 259 -411 88 -119 63 -160 -219 37
6996 37 -80 169 -126 -99 -127 -202 -3 -46 -85 -374 -125 -127 -301 86 -232 65 132 8 58 162 190 -86 -175 -177 179
7021 179 -353 -353 -224 -120 224 321 273 134 -134 -148 -74 -85 31 -28 -74 -251 -205 -26 -147 -77 -69 185 132 107 -13
7046 -13 82 113 -14 -107 -137 106 -300 149 190 68 319 5 37 -132 160 12 -58 2 182 109 -6 8 -186 113
7070 113 133 93 -51 -22 202 228 427 -73 -28 105 -51 117 48 -89 39 -64 -137 2 -87 -124 128 261 -4
7093 -4 315 -161 139 -141 43 129 72 12 139 131 -40 127 -198 -24 11 -178 41 42 -11 169 16 128 -110 -155
7117 -155 -28 169 -98 225 14 150 -106 -153 127 65 -246 79 65 1 -139 -135 219 144 -98 22 93 4 -59
7140 -59 -152 -144 -23 -9 185 225 -202 35 -21 114 35 257 -54 -403 163 146 -4 -273 -220 -86 138 -188 -72
7163 -72 -19 138 -58 -226 -74 78 -131 -30 -17 -217 -121 186 -39 17 47 148 131 -60 -452 347 52 -289
7185 -289 121 65 -19 -60 -6 168 86 -242 103 150 7 -19 219 58 -3 16 23 -46 22 -3 -207 -86 225 77 113
7210 113 -114 131 -120 304 -325 -70 7 -140 -26 -263 -24 -263 39 -54 109 134 -138 9 -77 -40 -17 208
7232 208 71 -44 98 207 98 -261 -192 1 -129 -68 -345 89 -243 -17 -139 -378 -208 -63 239 -137 -328
7253 -328 260 135 -109 -233 -218 73 199 -141 -123 -376 -142 246 -227 126 -73 106 -259 42 358 113 -110
7274 -110 -181 -184 -140 -115 -88 -45 -210 52 44 174 -90 165 -114 280 21 -7 -127 -105 244 174 -202 14 -138 351
7298 351 -291 -15 149 -276 281 -255 117 276 43 124 -150 -320 226 -66 -22 85 131 -11 95 26 295
7319 295 55 158 197 -114 48 -63 111 166 58 141 -204 -196 -81 -129 39 -266 20 -2 171 111 7 179 -19
7342 -19 -120 67 10 -169 183 93 -190 -44 -111 -72 -84 -28 -1 76 -38 -69 44 235 -75 -100 152 -82 150 -79
7366 -79 -267 -62 0 -202 -112 456 45 -65 -137 135 -195 109 83 -124 60 27 26 58 -14 142 244 173 -211 -165
7390 -165 91 6 120 -269 72 -110 -159 -23 -18 -194 -157 150 -54 -171 -152 -121 291 92 150 34 -91 -65 -142
7413 -142 22 -204 -32 -51 -1 -14 84 -9 127 133 -67 -44 -154 -397 322 124 -236 113 -5 -123 296 -221 -69
7436 -69 174 -195 262 229 45 79 -62 -166 -118 43 314 -82 69 8 131 -103 9 -75 62 45 -327 78
7458 78 146 -2 86 -16 -15 -85 216 -219 -288 230 -109 -59 309 88 -254 100 -219 -187 11 -96 243 -16 238
7481 238 -60 -156 -266 30 56 -24 -31 -63 265 -66 -74 -195 76 -347 42 175 -33 201 -342 156 -106 -193 19
7504 19 -280 -15 -189 -37 -13 -35 92 191 3 -188 -204 81 43 -44 -164 473 70 -84 72 -214 -297 22 47
7527 47 94 249 -20 160 -55 61 79 69 -171 47 -191 -153 272 -32 -84 -25 81 -161 50 -80 -87 -47 53
7550 53 163 52 -54 -37 -304 11 -178 66 -98 148 216 400 37 -107 -14 -140 -162 -185 -54 31 476 131
7572 131 320 -6 -33 -72 -252 168 102 -114 -57 -9 -101 213 -175 -175 -26 223 179 95 110 -179 -85 -19 15 -49 105
7597 105 70 -28 221 -155 -341 -26 159 -278 43 186 274 -393 -18 64 39 -64 39 44 146 52 161 135 -114
7620 -114 -78 -87 -351 -182 118 -466 -88 -29 105 -102 -154 -98 70 148 -132 154 -201 114 24 81 -89 50 236
7643 236 -154 49 110 165 -47 -38 184 -138 -85 -322 -10 -88 70 238 -67 109 180 32 108 195 -1 181 -17
7666 -17 153 88 27 215 -77 341 7 -26 -1 -33 42 -82 232 -197 296 -6 111 24 -232 -64 148 122 -123
7689 -123 -8 48 32 -240 9 50 -23 -253 129 -222 164 -167 -173 22 111 69 -177 -226 10 -54 -51 158 66 245
7713 245 152 -205 -32 -345 -9 -45 -193 -3 28 -83 -19 65 -64 -97 105 445 -238 166 -49 84 168 22
7735 22 -165 -108 53 65 -14 -79 -295 -80 -63 43 -102 122 115 93 -76 -4 205 -63 -151 -104 -145 25 -6 120 -148
7760 -148 -20 316 62 28 -179 10 -395 -112 -280 -123 186 -232 54 -240 -93 -28 -16 -90 -67 -228 149 -64
7782 -64 216 -139 136 -193 48 -11 179 -60 124 48 -276 -428 -83 351 -4 -34 137 126 -91 14 11 -206
7804 -206 -4 -279 145 -234 -23 66 198 -7 -130 204 -323 -95 -21 -32 76 96 152 -71 -97 -299 165 221
7826 221 331 -50 -69 -36 -207 -195 -24 309 -21 -35 51 8 80 -175 -45 142 -132 275 -28 -34 13 -135 -41 -177
7850 -177 180 -52 -244 -192 -159 153 11 173 41 -83 -223 -18 14 -173 -194 48 -123 -96 -66 -183 -69 146
7872 146 47 -327 16 -210 -229 -150 -2 -168 89 0 -85 -129 -87 166 -295 -259 -160 110 -228 -89 -83 -125 14 -46
7896 -46 -117 -55 24 259 -124 259 -77 15 -19 101 234 -76 1 96 11 236 -154 137 168 -82 -61 67 -133 11
7920 11 150 1 148 196 -141 -369 -140 -196 -41 291 157 160 68 -34 -35 49 10 -249 -99 119 -191 14 -6 -19
7944 -19 15 223 28 -99 139 -8 -5 183 -247 55 -221 -11 -41 55 28 -21 -46 47 98 -7 3 237 16 16 -127
7969 -127 88 99 -189 -125 -187 -75 339 133 91 173 58 -178 93 228 1 184 137 99 174 125 -228 -385 -89
7992 -89 197 30 -71 -30 -190 -254 -51 -78 125 -128 49 -117 -35 -86 31 320 -31 101 12 28 -166 -63 92
8015 92 -23 -425 102 -147 -110 50 128 -307 -178 7 -106 -90 -149 151 -126 -21 11 -234 98 -18 -149 116
8037 116 112 215 149 -83 274 109 -148 109 -90 -181 -26 -160 -2 -28 -270 -85 102 103 -108 56 366 -104
8059 -104 84 57 29 -56 -70 -239 -34 7 179 -51 -314 -218 -268 24 22 222 100 -70 -194 -195 178 -70 -48 32
8083 32 166 -277 -111 -49 -196 65 13 131 126 -159 15 16 272 -76 -208 78 19 194 62 294 272 -87 135
8106 135 141 97 -192 158 146 173 -159 219 -161 -9 137 -62 -302 94 72 80 -183 238 119 -74 69 -88 -159
8129 -159 -339 -147 48 254 -65 25 -49 -160 -35 56 123 -5 -1 210 300 -63 35 2 -214 -71 244 20 231
8152 231 37 -2 90 210 -67 -14 -176 279 278 -164 18 -162 128 -182 -45 -138 133 357 -260 -196 2 -49 -194
8175 -194 -101 -125 -137 -38 5 36 8 156 327 293 -86 205 94 -339 20 164
8191A64
$$ Imaginary data points
##PAGE= N=2
##DATA TABLE= (X++(I..I)), XYDATA
0 0 0 0 0 0 0 0 0 -8 8 -8 8 -16 16 -21 24 -32 33 -41 49 -57 72 -81 96 -109 125 -144 161 -185 209 -237 265
31 265 -301 337 -374 421 -469 519 -575 640 -710 784 -870 964 -1067 1181 -1310 1458 -1623
48 -1623 1814 -2037 2302 -2618 3008 -3505 4154 -5048 6367 -8513 12602 -23244 110810 230526
62 230526 12173 -68296 9382 117231 46575 -58226 -39396 97566 141315 56846 -24594
73 -24594 21646 99157 88439 522 -27251 28581 75955 40728 1433 40177 115741 105969
85 105969 11917 -41283 16509 85093 55246 -23253 -13978 82250 122300 37560 -50894 -17843
97 -17843 75417 78573 -11133 -50243 23802 97990 66203 -11092 -10900 54934 69178 -1667 -54379
110 -54379 -14362 53746 51919 -1830 -13120 35081 57059 5486 -50314 -31268 28634 36928
122 36928 -13055 -34640 11456 55960 30752 -27004 -35180 6809 21706 -18999 -51248 -21547
134 -21547 30309 31958 -14044 -36146 -8027 14774 -13212 -53672 -44452 2667 18148 -13629
146 -13629 -35672 -9435 21544 3727 -41652 -51390 -18832 1996 -18757 -40859 -23376 8828
158 8828 5319 -29298 -45204 -25528 -7114 -20055 -39682 -31698 -6207 -483 -18682 -29558 -17932
171 -17932 -6031 -18782 -39307 -37928 -15716 -4356 -16101 -27113 -17384 -4151 -12849 -36449 -41821
184 -41821 -22342 -7526 -14788 -25474 -17543 -905 -1740 -19675 -28370 -19800 -10972 -17197 -27578 -22340
198 -22340 -7219 -1468 -9519 -16184 -12515 -8263 -16272 -27617 -24986 -10155 -2182 -7751 -13156 -6349
212 -6349 1103 -5120 -18279 -19785 -8966 -3731 -11041 -16926 -8421 2864 1727 -8949 -13081 -7620
226 -7620 -5083 -12763 -17937 -10560 1428 3703 -2944 -5377 -316 1788 -4943 -13042 -10823 -2130 992
241 992 -3972 -5764 791 7616 2931 -7107 -9256 -2565 857 -4582 -7286 350 9606 8804 902
256 902 -1471 2979 3852 -1890 -4976 416 7811 8056 4515 4421 7492 7116 1652 -2189 428 5052 6330
273 6330 4866 6804 12639 15030 10190 4255 4158 8171 7783 4277 4432 12071 17608 14684 8537 9095
289 9095 13409 11438 4073 2518 9911 16300 14304 10907 14070 19924 18099 9490 5638 10536 15001
304 15001 12451 8633 12175 20332 21483 13642 8058 10939 15482 12388 5851 7524 17099 21087 15274
319 15274 9378 13304 18664 14771 5431 3788 12186 17617 12849 7191 11280 18774 16432 5637 222
334 222 7284 13758 9713 2696 5008 15494 18133 8080 -739 2857 11920 9330 -1612 -3496 7689
349 7689 15423 7895 -2943 -670 9690 8517 -4954 -11423 -1374 9159 4659 -5739 -4693 6730
363 6730 8715 -3856 -13614 -7290 2924 1125 -9341 -10936 -219 6654 -1388 -13166 -11680 -1806
377 -1806 -478 -11229 -17554 -9161 1650 -1118 -12573 -13815 -3719 130 -10256 -20280 -14846 -2482
391 -2482 -1857 -12965 -16403 -6759 392 -7329 -19060 -17545 -5898 -2310 -12179 -18746 -10719 330
405 330 -2190 -14646 -17284 -7311 -1237 -9485 -18744 -13649 -661 1564 -9441 -15560 -7616 114 -6300
420 -6300 -16948 -14862 -2575 2082 -5911 -12831 -6699 2385 30 -10528 -13449 -4647 2004 -3277
434 -3277 -10853 -7332 3420 5842 -3254 -9423 -4297 3294 395 -8729 -8702 2253 8135 1092 -6363
449 -6363 -2684 5686 4635 -4950 -7240 795 7658 3099 -4561 -1798 6664 7868 -165 -5502 -792
464 -792 6420 4468 -1968 -2330 5321 9333 3404 -3631 -1255 5446 6043 -624 -3261 2977 8701 5056
480 5056 -1868 -1556 4895 6426 311 -3696 375 6229 4881 -947 -2006 3963 6712 2201 -3271
495 -3271 -1843 3410 4457 -666 -2844 1619 5887 3096 -2723 -2566 2739 4335 -509 -4416 -1278
510 -1278 4128 3162 -1816 -2194 2545 4294 -181 -4129 -1933 2415 2568 -1554 -2416 1164 4227 1760
526 1760 -2564 -3000 1133 2484 -508 -2635 -1 3902 3391 -1262 -2591 950 3539 558 -2538 -621
542 -621 3577 4328 989 -787 1891 4631 2337 -1080 -707 2720 4193 1960 356 2642 5383 4877
558 4877 1503 217 2648 4210 2636 1033 2098 5062 5547 2991 1464 3487 5713 4416 1334
573 1334 1798 4628 5705 3716 2017 3740 5759 4892 2055 1249 3766 5702 4145 2311 2591 4601
589 4601 5009 2741 1104 2203 4185 3984 2113 1304 3677 5170 3261 546 424 2915 2571 522
605 522 -932 714 3046 2874 207 36 1176 1132 140 -1816 -1202 206 690 -349 -1299 -1296 -173 151
623 151 -1560 -2899 -2235 -1081 -2079 -3327 -3665 -2067 -1216 -2239 -3323 -3348 -2291 -2577 -4288 -4857 -3631
640 -3631 -2663 -2932 -4021 -4619 -3977 -3588 -3843 -4551 -4396 -3817 -2893 -3392 -4520 -4576 -3673 -3571 -4857 -5716 -4389
659 -4389 -2888 -2991 -4026 -4422 -2968 -2332 -3349 -4921 -4561 -2985 -2427 -3419 -4190 -2876 -908 -912 -3027 -3709
677 -3709 -2459 -1236 -1793 -3281 -2500 -547 417 -918 -2390 -1285 681 400 -1616 -1762 -289 1091
693 1091 224 -749 -85 1350 2004 868 -524 109 1719 2019 563 60 1386 3393 2693 658 373
710 373 2800 3686 1466 387 1516 3864 3285 1264 1136 3048 4195 2249 561 1163 3106 3082 1788
727 1788 1044 2170 3452 2591 745 404 1929 2781 1826 663 1005 2680 2900 794 -256 889 2325
744 2325 1447 -899 -690 1179 1348 202 -711 -292 892 684 -1053 -1719 -506 114 -584 -1064 -1107 -466
762 -466 -56 -1469 -2041 -1524 -735 -1396 -1929 -1926 -1039 -619 -1424 -2424 -1885 -1218 -1743 -2757 -2751 -1511 -1133 -1790
782 -1790 -2237 -1547 -939 -1354 -2562 -1972 -1209 -822 -1524 -1705 -1275 -321 -867 -1304 -1564 -981 -462 -991 -1543 -883
802 -883 320 746 -248 -935 94 759 489 -1118 -320 1077 1314 744 60 964 2269 1397 491 727 1635
821 1635 1935 1405 787 1596 3142 2991 1811 1396 2417 2874 2423 1294 1706 3128 3727 2572 1978 2660
839 2660 3513 2839 1458 1485 2765 3521 2647 2006 2768 4306 3497 1317 1277 2589 3618 2512 1421 1867
857 1867 3069 3558 2040 729 1231 2435 2152 912 442 1965 2755 1839 176 140 1590 1254 187
874 187 -1083 221 1647 871 -735 -633 311 878 -640 -1944 -1419 -374 -421 -1677 -2181 -1171 148
891 148 -756 -2124 -2658 -1554 -1443 -2197 -3520 -2517 -1201 -1157 -2761 -2948 -2420 -1422 -2664 -3588 -3575 -2208
909 -2208 -1671 -2619 -3128 -2650 -1453 -2146 -3068 -3972 -2817 -2248 -2413 -2621 -2738 -1405 -1885 -2370 -3076 -2565 -2000
928 -2000 -1770 -2585 -2657 -1276 -788 -1450 -2034 -1736 -1568 -1183 -1930 -1695 -1233 -472 -937 -884 -618 -12 -112 -395
948 -395 -854 -822 15 -181 328 194 801 960 1176 472 66 445 710 515 1046 1016 1692 1690 1484 1103 995 1031
970 1031 848 1343 1425 2093 1997 1826 2178 1653 1303 1130 1296 1189 1108 1645 1808 2061 1507 1287 1614 1529 1369
991 1369 1095 837 1040 1260 964 942 924 938 697 642 109 61 591 783 123 -219 178 803 457 -432 -677 -184
1013 -184 161 -508 -687 -98 250 -170 -682 -1228 -912 -288 -1130 -1443 -1301 -625 -259 -827 -1386 -1285 -861 -803
1033 -803 -1989 -2143 -1268 -686 -827 -1464 -1233 -199 -602 -1558 -2330 -1664 -1278 -1516 -1878 -1233 -107 189 -452
1052 -452 -1386 -1284 -567 -954 -1162 -1203 -488 478 218 -225 -524 217 668 -352 -786 162 867 1039 117 102
1072 102 1000 1623 761 78 403 1210 1568 1200 951 1626 2012 1345 803 551 1457 1739 1535 1450 1679 2998
1092 2998 2538 1610 1292 1756 1913 2038 1177 1496 2742 3165 2441 1643 2187 2665 2063 1148 1040 1828 2508
1111 2508 1793 1551 1599 2372 2084 1345 790 1551 1623 1411 810 855 1368 1520 792 309 441 713 562 -271 -187
1132 -187 479 864 18 -520 -401 139 -147 -1054 -1021 -354 -177 -994 -1623 -1031 -793 -951 -1616 -1978 -1597 -1352
1152 -1352 -1592 -2150 -2132 -1471 -1462 -1704 -2499 -2585 -2091 -1848 -2578 -2833 -2127 -1647 -1951 -2702 -2463 -1831 -1798 -2474 -3086
1173 -3086 -2678 -2299 -2384 -2385 -2094 -1274 -1576 -1627 -2616 -2678 -1984 -2076 -2014 -1745 -1535 -1274 -1214 -1525 -1684 -995 -709 -1127
1195 -1127 -983 -959 -416 -445 -778 -532 31 -184 -411 -538 -207 68 291 240 567 619 681 -14 315 63 936
1216 936 916 1255 910 981 1087 1203 1241 1064 1269 1716 1470 1459 1334 1618 1533 1389 1498 1865 1650 1163 1704 1490
1238 1490 1848 1467 1653 1711 1886 1235 1169 1344 1975 1579 1118 1091 1421 1718 1332 806 1064 1465 1542 391 465
1259 465 613 1043 1154 712 528 1158 1370 285 -285 -496 631 479 -193 -679 112 260 -274 -645 -606 533
1279 533 427 -766 -1426 -877 -333 -303 -1194 -1077 -127 -22 -1176 -1698 -1334 -415 -324 -1150 -1822 -812 -76 -1067
1299 -1067 -1916 -1890 -395 -220 -1367 -1905 -1029 22 -253 -1993 -2156 -826 -14 -1077 -1886 -1519 305 433
1317 433 -619 -1605 -777 484 -128 -1462 -1069 359 1424 341 -962 -557 1195 815 -379 -1377 50
1334 50 1468 592 -442 -192 1474 2180 596 -661 303 1588 1397 279 -211 1399 2208 1233 152
1351 152 686 1914 1766 918 36 1330 2425 1981 520 304 1725 2340 1282 -165 649 2228 1958
1368 1958 508 311 965 2039 1117 8 -271 1143 1762 696 43 381 1574 1578 -664 -1089 523 1387
1386 1387 160 -711 -981 1244 1415 -193 -1181 -584 574 135 -1176 -1370 14 590 -563 -1686 -1093
1403 -1093 -226 124 -1200 -1851 -425 -121 -776 -1942 -1771 -653 -1098 -927 -1832 -1665 -1122 -1516 -1824 -2494
1421 -2494 -1584 -352 -891 -1794 -1671 -849 -237 -1682 -1866 -1788 -659 -1939 -2261 -1380 -1001 122 -2008 -2060
1439 -2060 -1721 -625 -777 -1102 -1155 -881 -938 -1203 -579 -891 -190 323 -252 -1331 22 35 -57 5 -149 671
1459 671 666 458 -739 -168 429 1725 725 639 833 1024 1300 185 1111 1318 1865 616 1430 938 1571
1478 1571 1836 1495 673 1264 1403 1240 773 1690 1654 1020 649 1018 1834 1983 1185 975 1730 1662 1194 1328
1498 1328 1063 345 1257 602 597 1899 1200 1032 1136 666 1379 1104 1082 691 1375 962 1342 663 1044 963 1559
1519 1559 1251 -108 -7 216 1027 749 -282 458 70 -276 -367 -523 -726 120 329 -775 71 239 -174
1538 -174 -1253 -1176 -595 192 -1173 -1393 -1306 -577 -1028 -1346 -1285 -621 -1464 -920 -1603 -1460 -984 -1031 -1582 -1927 -1085
1559 -1085 -812 -1003 -1766 -1426 -445 -806 -1720 -1153 -1041 -561 -801 -639 -694 -507 -36 -810 -1128 -974 -913 -224
1579 -224 -651 -865 -198 -282 61 -391 -594 150 109 -766 -689 -106 428 1165 -106 -158 700 -38 -19 719 684 700
1601 700 1328 495 422 1179 1817 295 276 1065 818 916 1071 1339 878 1779 818 651 703 1081 764 825 817 1042
1623 1042 1902 1674 606 1453 1815 1371 805 219 1331 868 282 413 948 1327 924 599 488 887 916
1642 916 641 180 569 1018 322 -62 -771 691 229 815 -491 -416 770 586 54 -811 242 429 -201
1661 -201 -949 -967 -626 -20 -77 -1488 -1429 -104 91 -1156 -1758 -969 173 -529 -888 -1365 -541 -110 -1567
1680 -1567 -2260 -1764 -173 -813 -1421 -2236 -882 -813 -548 -1125 -1376 -448 -141 -1302 -1550 -892 509 -116 -1200
1699 -1200 -1240 -1004 200 -668 -1294 -1606 -561 -203 -733 -1252 -727 563 675 -780 -1467 45 1126 224
1717 224 -1101 -322 789 698 -231 -940 474 1258 874 -755 -65 1166 1439 610 -53 144 1591 1184
1735 1184 -351 155 987 1916 932 194 671 1798 1746 739 82 475 1551 1284 265 368 1271 1920
1753 1920 659 42 388 1453 1235 300 165 568 1399 1023 149 194 1249 1263 589 -281 209 1205 823
1772 823 -208 -260 583 1235 171 -684 -264 654 456 -533 -1000 -41 502 -82 -827 -1054 84 214 -504
1791 -504 -1047 -403 -47 -257 -672 -1430 -353 -173 -728 -1615 -1447 -352 -267 -1094 -1536 -1209 -295 -890 -1962
1810 -1962 -1215 -216 -512 -1143 -1822 -1136 -251 -905 -1532 -1718 -638 -22 -1042 -1522 -1132 -309 -604 -1173 -1384
1829 -1384 -596 -277 -726 -1946 -993 -2 31 -503 -1557 -394 269 -95 -645 -729 222 1031 -415 -820 -293
1848 -293 815 600 -42 -307 200 1212 692 -274 -237 972 1230 438 -139 402 1486 1575 455 344 828
1867 828 1857 794 187 857 1398 1585 835 406 1020 1880 1576 437 577 1236 1763 1150 214 1055 1722
1886 1722 1349 650 549 1372 1958 1248 284 36 1024 1253 380 -12 498 1261 1074 330 41 688 877 362
1906 362 -180 -77 413 751 35 -401 193 490 -32 -618 -483 -162 242 -371 -863 -683 -262 -114 -845 -1139
1926 -1139 -576 -68 -647 -932 -1156 -526 -585 -922 -1004 -1009 -316 -523 -1002 -1274 -696 -860 -1215 -1081 -919 -850 -805 -830
1948 -830 -1051 -1059 -693 -950 -1083 -838 -827 -686 -985 -1120 -893 -1020 -966 -745 -736 -417 -282 -309 -381 -200 -267 -492 -540
1971 -540 -367 -95 -329 -450 87 335 174 -104 -166 44 382 53 -128 502 944 510 283 124 657 652 500
1992 500 129 153 438 975 615 535 668 1047 572 412 605 911 1046 960 417 674 798 1100 551 132 583
2013 583 1125 1174 622 599 1008 882 790 184 738 873 828 317 75 707 985 506 85 288 361 505 48 -523
2035 -523 2 556 840 -150 -422 199 223 56 -734 -116 95 87 -382 -880 -84 -29 -459 -863 -553 -454 -233 -625
2057 -625 -1200 -758 -248 -473 -1166 -791 -538 -396 -562 -993 -885 -473 -610 -1074 -1132 -851 -357 -862 -1241 -1283 -587
2078 -587 -581 -951 -927 -660 -20 -385 -943 -866 -458 -545 -672 -478 -510 -108 142 -592 -521 -338 -134 -296 -603 -351
2100 -351 215 -115 -43 -288 -83 602 348 -78 163 563 735 107 309 448 822 746 -60 357 988 982 744
2121 744 534 476 1287 555 494 255 617 915 751 576 805 1076 1375 570 452 794 1103 845 141 796 1036
2142 1036 1199 547 581 396 1080 1064 541 436 908 923 257 473 524 895 870 438 -480 155 593 601 -49 19
2164 19 295 927 212 52 -56 446 275 -686 -645 -73 318 -312 -1112 -402 -135 60 -823 -1035 -591 154 -471
2185 -471 -1044 -935 -663 -557 -552 -1158 -968 -190 -350 -980 -1022 -803 -233 -947 -1289 -1200 -549 -529 -1065 -1206 -849 -373
2207 -373 -726 -1300 -1056 -597 44 -420 -1403 -718 -212 -197 -1070 -1243 -611 161 -503 -963 -976 20 28 -457 -760
2228 -760 -538 307 146 -542 -537 12 426 -124 -436 -6 587 614 -293 -145 294 752 318 222 235 743 596 739
2250 739 195 463 1174 861 510 416 941 1285 623 485 270 1248 1132 657 451 905 1246 1088 260 709
2270 709 1309 1173 665 657 556 1218 1098 137 462 694 800 700 390 402 798 1167 460 4 287 515 685
2291 685 86 184 527 745 288 -64 -75 435 91 -139 -383 -273 106 -94 -390 -332 -56 176 -419 -833 -585
2312 -585 -314 -479 -273 -716 -253 -75 -414 -861 -692 -705 -398 -552 -924 -906 -416 -550 -917 -620 -516 -599 -708
2333 -708 -1038 -396 -598 -370 -793 -675 -378 -523 -406 -553 -633 -562 -177 -1009 -561 -361 -438 -100 -397 -690 -446
2354 -446 -572 -190 -195 -236 -127 -451 -304 -54 -309 38 -73 -85 230 158 198 306 453 224 292 78 418 275
2376 275 552 139 454 278 403 187 345 217 526 355 518 337 557 511 544 704 608 502 849 639 529
2397 529 622 815 1125 817 107 718 597 743 557 681 629 504 436 149 474 662 484 342 136 423 544
2418 544 353 165 268 315 289 180 -322 315 201 79 -309 -300 -17 132 -205 -534 -176 184 -82 -357 -549
2439 -549 -562 150 -325 -460 -379 -732 -452 -494 -725 -725 -412 -319 -957 -656 -247 -334 -657 -672 -967 -474 -469 -800 -858 -921
2463 -921 -344 -605 -760 -816 -396 -485 -453 -646 -338 -449 -322 -583 -460 -339 -278 -553 -529 -351 -383 -337 43 -376
2485 -376 -212 16 -106 1 -256 114 89 -66 -348 252 127 351 105 162 383 568 603 323 339 530 593 307
2507 307 327 612 739 453 341 598 695 469 591 373 622 666 634 307 585 1081 727 522 328 643 683 797
2529 797 399 564 1117 995 612 105 754 839 795 541 138 352 709 382 520 579 708 538 154 -308 22
2550 22 572 -74 41 -59 48 368 -124 -96 -93 58 191 -260 -104 -23 205 -288 -489 -361 -399 -368 -513 -706
2572 -706 -490 -196 -26 -951 -957 -533 -641 -576 -794 -681 -265 -274 -680 -782 -768 -546 -736 -833 -535 -701 -651 -899 -1055
2595 -1055 -509 -534 -641 -685 -719 -734 -600 -491 -485 -638 -547 -373 -474 -344 -290 -556 -453 -404 -457 -210 -112 28 -526
2618 -526 25 -239 251 -21 82 92 -138 54 89 57 687 474 116 468 350 410 300 402 385 294 355 714
2640 714 698 243 584 474 350 828 340 428 559 953 880 790 519 497 535 841 688 380 550 657 387 402
2662 402 593 360 424 842 217 185 656 366 488 521 413 307 33 252 199 336 297 252 -113 -116 260 -18 90
2685 90 -33 318 2 115 -156 -201 9 -126 -107 -204 -293 15 -183 -374 -301 -256 -355 -428 -648 -451 -567 -375 -559
2708 -559 -572 -384 -345 -603 -664 -628 -439 -849 -567 -745 -709 -318 -583 -462 -622 -765 -627 -328 -519 -664 -381 -299
2730 -299 -430 -515 -493 -192 -539 -868 -411 -576 -232 -230 -300 -187 -16 72 -148 -283 -185 96 -72 -264 -300 -334 6
2753 6 254 -21 81 31 338 9 -344 239 429 403 23 363 319 581 450 244 639 349 631 269 442 566
2775 566 498 675 317 430 560 606 413 408 368 656 637 310 520 617 582 554 314 337 470 624 446 124 355
2798 355 385 457 286 210 349 655 -13 137 254 307 221 -36 36 149 87 404 -86 -1 38 -255 91 -399 -580
2821 -580 381 -86 -144 -473 -176 -332 -356 -350 -483 -262 -440 -368 -259 -202 -798 -468 -470 -773 -866 -458 -476 -600 -402
2844 -402 -481 -348 -721 -745 -735 -325 -510 -892 -717 -655 -457 -627 -449 -544 -761 -378 -34 -924 -231 -342 -366 -466
2866 -466 -441 -51 -422 -101 -495 -430 64 -70 -364 -96 38 85 -82 -116 80 -7 323 -266 292 376 362 70
2888 70 168 420 304 445 226 58 348 481 485 633 429 656 354 568 592 610 883 880 423 684 547 586 517
2911 517 312 337 619 453 472 324 237 501 991 567 454 171 595 397 304 535 99 172 393 237 211 677
2933 677 98 179 164 350 299 156 15 121 473 -115 -168 70 -45 -209 -11 159 -147 -211 -210 17 -272 -153
2955 -153 -92 -134 -410 -218 -349 -82 -324 -476 -738 -571 -446 -573 -417 -152 -319 -666 -362 -729 -554 -209 -589
2976 -589 -297 -456 -382 -307 -434 -570 -556 -530 -117 -611 -647 -158 -381 -284 -498 -652 -446 -5 -468 -512 -284 -322 -23
2999 -23 -556 -474 45 152 -107 -284 -194 -146 -36 198 -94 16 -36 91 146 -149 166 186 346 49 170 503
3021 503 573 128 275 536 344 548 320 76 675 544 232 162 243 439 712 431 229 238 768 410 355 201
3043 201 614 467 672 513 310 689 314 920 360 66 323 317 304 58 339 554 331 -54 178 352 496
3064 496 234 192 62 415 132 -139 -202 56 2 159 -99 -449 72 52 -146 -336 -232 -7 -16 -354 -337 -215
3086 -215 69 -196 -534 -337 -229 -184 -294 -776 -343 -397 -366 -298 -391 -377 -499 -416 -545 -132 -360 -278 -366 -331 -520
3109 -520 91 -379 -596 -610 -311 -211 -791 -302 -159 27 -426 -468 -558 -274 -247 -169 -70 -500 -27 -167 -36 -174
3131 -174 71 -127 -201 -314 -110 -29 -70 -210 -675 1 -109 123 185 167 0 145 -73 110 367 162 161 274
3153 274 425 376 380 231 204 252 483 399 278 387 446 454 414 378 351 468 647 499 217 352 542 555 602 117 512
3178 512 405 143 235 434 670 681 241 513 420 205 407 183 1 183 136 388 103 120 96 36 150 29
3200 29 218 142 -184 100 -63 148 102 -176 -163 -229 -32 -1 -346 -399 -61 -491 -202 -392 -458 -549 -432 -358 -220
3223 -220 -648 -378 -561 -644 -171 -408 -395 -436 -250 -253 -351 -510 -464 -395 -259 -387 -366 -545 -312 49 -316 -199 -559
3246 -559 -318 -552 -323 -411 -173 -503 -319 -448 -338 -194 -182 -209 68 -118 -461 -72 -82 -172 -240 -84 -229 292
3268 292 -38 76 -111 38 174 124 142 -138 441 139 389 349 261 478 427 471 601 598 330 147 408 369 389
3291 389 530 264 141 373 633 353 390 519 664 325 55 317 347 239 634 354 287 318 690 146 232 204
3313 204 573 488 68 127 483 553 436 89 -210 464 360 233 199 342 159 51 -120 51 135 -19 -17 -149
3335 -149 -250 -83 -191 -291 77 -95 -306 -294 -628 -38 -149 -301 -414 -402 -257 -286 -322 -244 -664 -569 -409 -124
3357 -124 -383 -227 -290 -326 -725 -337 -352 -39 -304 -418 -404 -1 -457 -596 -655 -584 1 -390 -476 -573 -154 -236 -180
3380 -180 -381 -712 -323 -351 -469 -202 -285 155 -167 -384 -97 -118 141 183 -274 -25 11 -311 38 -184 -31 103
3402 103 64 65 -228 462 304 54 -130 235 433 494 306 80 462 401 581 126 369 344 463 545 364 473
3424 473 289 444 386 401 227 382 481 233 177 435 616 525 131 133 362 267 90 104 333 600 335 68 223
3447 223 136 -213 -10 159 160 378 418 -345 -4 133 105 27 -272 334 446 -10 -283 -277 148 -26 27 -230 -171
3470 -171 -75 17 -664 -387 -337 -131 -200 -86 -286 -72 -39 -165 -490 -520 -133 -115 -415 -809 -452 -342 -97 -588
3492 -588 -398 -89 -121 -473 -476 -471 19 -397 -367 -384 -304 -271 -303 -343 -471 -59 -285 -4 -446 -205 51 239 -341 104
3516 104 -27 126 -164 -189 -353 38 224 9 -269 -99 259 -376 3 -372 26 -69 25 194 140 493 318
3537 318 25 -76 424 38 295 134 132 469 395 281 -47 220 371 551 221 -84 382 790 405 80 387
3558 387 422 378 403 84 251 522 494 289 392 577 587 350 182 -179 216 357 249 101 290 55 178 106
3580 106 95 59 215 155 -27 -5 261 20 348 62 -292 132 20 141 -18 -101 -209 -375 -270 -187 -189 -137 -690
3603 -690 -431 -114 -343 -177 128 -192 144 -192 -273 -565 -306 -14 -310 -237 -288 -297 -305 -525 -339 -371 -90 -143 -215
3626 -215 -524 -291 -297 174 -187 -327 40 -309 -349 -461 -496 -87 -146 -369 -153 -276 234 -3 -92 -163 -163 8 -111
3649 -111 -316 -25 52 5 -405 195 -173 93 245 -38 179 73 345 414 86 -41 -116 54 263 446 257
3670 257 320 -43 232 482 224 213 233 557 634 355 401 595 225 213 403 196 221 370 278 540 222 454 -32
3693 -32 136 161 61 459 333 -84 56 -5 7 499 107 114 -105 3 145 308 16 71 -34 296 187 -402
3715 -402 -61 56 215 -161 118 -21 -277 188 53 -303 -337 -31 115 156 -168 -89 287 -364 -378 -129 -377
3736 -377 -257 -370 -230 -132 -83 -232 -237 -178 -284 -236 -209 -428 -374 -114 -427 -628 -687 75 -125 -288 -379 -129 -408
3759 -408 -94 -491 -204 -438 -256 -92 -565 -624 20 84 -30 -118 -243 84 -87 87 -285 -250 254 263 -318 -93
3781 -93 -199 285 170 3 -228 178 -134 -436 25 164 123 383 114 283 105 252 -2 319 73 419 385
3802 385 127 179 41 307 515 386 -16 214 468 271 132 245 232 72 426 372 151 552 433 163 -110
3823 -110 42 182 411 386 167 363 307 48 335 289 119 234 -161 -17 -81 198 256 -89 66 44 30 -451
3845 -451 -54 -15 -27 329 -94 -27 129 -8 52 54 83 -52 178 107 -498 -302 -77 132 -476 -17 -343 -218 -202
3868 -202 -320 -323 -49 -394 -92 -342 -159 -135 4 -356 -41 -133 -235 -374 -524 -128 -321 -19 -329 -303 -75 -91
3890 -91 -196 -313 8 -144 11 -141 79 204 -267 -270 24 -128 68 96 52 -85 -54 117 30 -191 151 148 -37
3913 -37 -234 40 -168 -188 30 16 77 13 242 -126 -75 -52 148 195 -7 157 257 490 197 100 175 70 160 24
3937 24 238 259 517 79 322 121 445 265 -228 286 101 172 423 -17 48 207 13 136 267 33 196
3958 196 150 265 127 139 -90 -179 113 32 232 256 84 47 30 -85 96 253 23 251 -183 -333 -144 -58 51
3981 51 -287 -98 275 39 -4 -123 -143 -25 -83 -336 -253 -315 29 -345 49 -162 -421 -302 -203 11 -327 -87
4003 -87 -388 -193 -248 -325 -401 -83 -427 -507 -135 -133 -332 -234 -305 -318 -314 -313 -172 17 119 -350 -222 -216 -434 -313 -153
4028 -153 108 -54 19 -374 -132 124 -7 263 -53 -116 -123 108 42 160 -21 63 60 -64 75 -29 252 248 222 273
4052 273 176 127 17 -11 236 356 258 300 -26 208 180 340 254 364 611 324 262 -219 184 470 97 364 96
4075 96 103 281 387 81 37 197 186 205 334 130 185 421 138 158 487 334 143 135 -132 105 118 -6 -17 404
4099 404 -125 60 130 13 476 -43 -48 71 -24 34 -137 91 -75 -242 85 -500 -378 -116 -258 -21 -142 -98
4121 -98 -103 47 -163 -89 -327 -105 -472 -36 -227 -102 -192 -191 -76 -396 -29 -248 30 -469 -302 -207 -36 -81 -175
4144 -175 -352 -162 -184 -120 -300 -246 -384 -323 -195 -337 3 33 -305 -311 111 -215 60 -204 -237 -2 41 44 103 140
4168 140 -16 51 24 -160 -86 36 -81 93 -14 306 261 3 -45 34 250 222 246 91 70 540 135 370 40
4191 40 179 111 82 -164 318 318 169 204 -165 107 181 325 254 44 15 358 129 168 -152 358 237 37 141
4214 141 190 258 -133 11 406 320 48 27 24 153 134 133 266 -122 149 354 156 26 -130 95 13 -240 60
4237 60 74 -81 -190 -175 -51 208 10 188 -150 -241 -105 -154 -268 -51 -336 -299 17 -280 86 -301 -113 -86
4259 -86 -230 -378 -151 -128 -315 -219 -62 -71 -42 -93 -413 -117 -232 29 -69 -280 -133 -81 -225 -274 -234 -164 -172 -177 -299
4284 -299 -10 -112 12 -121 -285 -39 76 55 31 -51 -348 83 59 95 -23 -64 -80 -230 -336 75 142 -36 8
4307 8 -20 305 233 -234 132 225 -17 390 -27 396 401 95 164 456 33 -99 441 289 -44 499 200 185 229
4330 229 313 62 86 143 48 372 276 251 336 506 199 243 326 290 17 -23 156 88 -10 -98 262 335 280 352 -42 162
4356 162 -182 -88 -279 -41 277 8 143 -3 -168 145 49 -122 -86 -6 -109 -238 -13 -229 -200 -211 -263 36
4378 36 -133 -66 -70 3 -74 -129 -133 -269 -241 -190 -535 -169 -78 -93 -82 -42 2 -367 -176 -169 -173 -227 -278 -392 -208 -95 -279
4405 -279 105 -215 -117 -219 -65 -417 -101 78 23 -327 -114 -470 -38 -42 44 30 -57 -290 184 145 -377 5 -329
4428 -329 -305 32 -108 -82 228 -129 58 -106 147 190 -21 195 79 130 59 139 111 352 26 130 272 164
4450 164 165 241 283 333 216 197 189 192 182 308 81 -61 154 365 336 122 -34 504 164 220 230 181 72 54 -36 208
4476 208 177 262 17 308 121 112 -223 -464 -53 -19 -18 -3 39 225 154 -198 111 -140 -209 -31 183 -67 14 -170
4500 -170 137 -110 55 -92 -194 -226 -113 -244 21 -248 -79 -133 -341 -135 -153 -92 -360 -96 0 4 -161 -247 -266
4523 -266 -54 -350 13 -35 24 -48 -225 -494 -94 -180 -228 -336 -307 90 196 -285 -413 -208 -98 -188 -519 -83
4545 -83 -175 -200 -338 -22 -1 244 -136 110 361 -56 234 71 215 -25 203 29 36 -164 -26 104 337 152
4567 152 -56 11 97 421 207 220 292 340 84 -60 -139 283 -8 102 74 252 -22 75 -42 413 223 410 195
4590 195 47 148 247 6 187 174 54 244 -55 42 -35 -45 80 49 131 91 142 210 31 -62 37 -36 158 263
4614 263 33 57 169 33 88 -24 99 136 204 -113 -28 174 30 142 -130 -222 -109 -276 -147 -153 -248 -260 -211 62
4638 62 -100 -102 -54 -108 36 -395 -134 -160 -42 -114 -12 -51 -435 32 -112 40 -161 -400 -294 -403 -153 -97 -167
4661 -167 -124 -84 -342 -76 -118 -91 -109 -243 -300 -33 -146 -216 -63 -19 87 -202 -51 188 64 -353 -55 68 131
4684 131 127 97 63 -60 179 319 152 -76 -62 374 326 222 97 153 295 324 137 27 80 90 258 113 -66
4707 -66 238 406 -425 100 154 131 300 391 273 370 186 308 80 -12 114 49 -9 535 381 239 115 315 381
4730 381 -6 130 113 -39 106 453 84 21 318 121 13 22 -45 249 401 19 -195 -21 73 21 -187 -26
4752 -26 94 58 297 17 107 -250 148 -128 32 -44 269 -249 -141 -114 66 -99 29 16 -284 -194 34 11 -54
4775 -54 -278 99 -420 -54 -137 -277 -314 -91 -182 -333 -196 81 -24 -143 229 -251 4 -296 -119 -63 26 56
4797 56 -65 95 -184 -54 -46 -98 -114 184 227 -36 -281 -161 271 320 72 106 108 4 -43 -8 -208 -177 76 34 316
4822 316 -178 248 310 117 68 73 95 396 -52 -201 -50 56 -107 290 309 355 275 306 95 -290 191 270 120
4845 120 29 323 -200 335 144 -2 275 166 232 -130 -122 101 102 55 292 -72 228 15 -99 155 -122 462
4867 462 138 213 37 228 227 262 194 -274 -172 -154 -48 -95 -118 -339 -25 314 167 -291 160 84 -44 -60 6 -268
4891 -268 -34 147 -333 -319 -298 -220 -190 -130 102 -35 -221 -34 -132 -350 -208 166 -162 -285 38 1 -278 -132
4913 -132 84 -142 96 -77 -506 9 -153 -421 -140 -247 95 -23 -287 -83 -14 81 -131 -112 42 40 187 -59
4935 -59 13 -178 74 -336 347 -264 -3 103 58 438 108 -145 -90 68 192 -77 41 -201 -6 86 -32 -105
4957 -105 355 87 321 -56 214 219 331 135 31 279 265 543 181 150 -33 -53 353 116 366 342 -19 172
4979 172 -129 134 300 384 298 62 59 372 -7 80 225 153 139 173 80 -23 138 -205 -93 -332 -224 -8 65
5002 65 1 -120 34 174 25 -138 49 -238 -218 133 -170 -223 -219 -45 -221 -19 -223 -297 59 -108 -346 -119
5024 -119 48 -181 -219 -135 71 -365 -361 48 221 -292 -170 -74 -180 -223 -406 -163 -171 -227 104 -178 5 -158 -192
5047 -192 158 12 -521 106 -71 -314 137 34 -247 -90 49 -36 -80 -121 -239 -293 -64 -169 1 -112 2
5068 2 -233 -54 66 -145 -297 34 462 -106 -344 -126 -5 30 29 -77 50 60 22 76 -105 397 151 180 270
5091 270 260 255 191 322 -160 -96 438 161 -80 234 -11 193 271 168 43 300 -141 -159 147 -205 -48 227
5113 227 -157 -127 148 6 -82 15 147 -54 -41 -79 228 170 66 104 -16 74 182 -24 -183 2 305 -217 -154
5136 -154 110 11 1 -1 -85 -193 136 -14 51 -160 -142 83 -23 307 -10 -308 -153 -317 -54 -20 25 -221 15
5159 15 -12 -78 -13 -101 56 -26 40 127 35 -7 -47 -125 -123 -203 -498 -288 -253 -179 259 -231 -319 -268 -52 -77 -243 186 -33
5186 -33 -3 33 -81 -21 97 -87 -273 220 -133 77 111 -39 -96 153 63 4 -105 -147 135 315 -86 -159 272
5209 272 -87 27 129 203 259 -209 372 219 209 -33 -101 112 -8 220 -1 262 52 150 -49 10 73 -140
5231 -140 -18 -225 -98 279 332 293 12 285 -5 -41 -139 -59 -73 171 278 3 -135 -167 122 -35 -80 197 126
5254 126 247 161 92 -231 -72 189 -319 -37 -4 -231 -28 -112 -402 61 22 262 193 -107 38 -240 -4 -46
5276 -46 89 44 -46 -236 -313 -96 107 31 -119 -229 186 -257 -198 112 -138 72 -157 -42 -120 -35 133 -21 -34
5299 -34 62 216 47 -183 -280 -18 45 142 -39 -255 109 -52 25 -37 64 -312 -5 -21 -187 -98 93 -198 -173
5322 -173 308 135 -22 -68 -156 -222 298 221 -247 135 120 -216 83 96 355 148 103 2 -33 66 394 70 164
5345 164 95 205 102 183 243 182 2 101 -184 52 163 124 0 -73 -60 325 101 14 -157 -94 385 96 58 -43
5369 -43 123 246 71 -30 243 -129 265 36 -274 123 11 -68 -56 -143 3 91 -279 170 -133 59 -157 -25
5391 -25 -60 142 97 -43 176 40 -172 70 58 183 -232 251 -137 -90 -145 -46 -55 -41 141 -336 62 -241 -120
5414 -120 27 73 -105 -101 -226 -183 -58 -224 -261 -185 -173 -365 -70 75 90 -135 -69 23 85 222 -124 108 -174 104
5438 104 -76 -3 -7 146 223 65 -94 -110 -200 126 -59 69 -57 61 -50 222 163 -74 90 -90 182 120 124
5461 124 47 -31 101 34 51 -245 44 -39 -292 -104 243 -139 219 467 24 -121 10 -277 65 -69 39 121
5483 121 125 108 210 140 109 -234 -267 44 -41 -7 286 208 -122 18 283 208 -23 -45 -219 263 180 112 384 38
5507 38 -47 -98 69 80 36 58 -13 -20 112 -237 149 78 51 74 115 161 13 -90 -140 -7 -90 64 -443 -283 43
5532 43 147 -6 -57 -106 -68 26 -38 3 -144 -136 105 -57 -7 -204 123 56 -300 -341 181 -15 -480 -220 68 167
5556 167 -48 149 -177 -167 -99 102 96 -22 226 -175 -165 -49 -75 74 14 -272 -181 -67 -162 62 246 -249 -23
5579 -23 -190 -3 -80 -78 95 239 86 80 58 -91 16 -148 33 439 -70 -163 5 -47 -85 358 149 68 128 -134
5603 -134 40 154 241 -172 -47 43 -94 230 30 242 -102 99 87 420 377 -192 -37 193 283 -53 286 228
5625 228 -77 181 40 -12 70 609 226 -167 -179 3 197 -36 85 3 468 7 -250 250 719 360 360 161
5647 161 207 -443 -222 144 -371 492 -415 304 -264 -589 -93 -97 872 -431 344 435 -325 523 344 -386 -433
5668 -433 -149 747 349 -299 505 110 -73 -215 409 -735 -802 406 -4 274 -61 -210 -70 543 558 -267
5688 -267 219 216 260 462 -395 -308 126 21 78 -117 560 181 -157 -359 -544 86 -142 -204 15 170 -28 175
5710 175 67 -123 -186 206 -10 -55 78 34 -54 67 89 -152 350 130 102 -115 73 259 155 116 74 -234 183
5733 183 50 -190 -203 -68 153 187 63 67 244 263 -145 167 320 65 191 91 542 131 152 204 -26 -170
5755 -170 174 58 -225 -75 79 -93 69 74 13 207 -36 9 358 -132 -261 -235 187 202 194 233 86 164 287
5778 287 -133 6 121 76 -93 -283 120 91 -188 87 -42 84 -181 -80 84 -342 -111 -408 -120 -55 -107
5799 -107 -96 -1 -32 -197 208 -81 93 -257 -205 -348 -158 -77 -177 203 -37 -7 74 162 -447 -66 -253 51 61
5822 61 9 -122 -111 -199 -238 -4 43 148 127 -102 -115 150 -59 -122 -203 78 -120 -191 -37 -18 225 -99 -159 94
5846 94 -47 -40 92 107 -12 111 102 196 38 119 -32 72 -134 323 126 271 284 -18 52 113 -28 292 280 32
5870 32 -129 31 -250 -178 -32 -19 218 -24 55 176 -38 126 -16 -187 -80 -87 2 128 121 29 -129 173 336
5893 336 -244 -233 -63 155 -318 -37 257 -93 132 116 283 -44 -229 -252 -86 307 -122 -192 -94 -88 -97 236 159
5916 159 -9 -96 217 -168 -222 312 323 -89 -158 150 138 -25 168 -38 -230 -251 -245 -164 88 309 72 -255 9
5939 9 -123 -11 58 -379 -201 81 -125 -271 -403 8 61 -98 129 -30 -97 -164 206 -45 -175 -266 -80 15 -454
5962 -454 -40 20 48 181 -193 32 -202 104 221 41 66 -130 -70 -10 167 -15 -212 -189 183 -38 55 153 145
5985 145 -154 315 140 120 -41 199 354 296 -129 -225 -363 115 54 93 17 157 120 -199 189 131 175 303 386
6008 386 -34 -245 96 -28 -146 -104 217 207 -113 -129 -14 72 -151 -43 -42 24 55 86 0 71 -24 150 -194 -28
6032 -28 -171 -299 -1 -38 -160 89 -31 -145 -1 351 -257 -20 -136 -203 14 -73 14 5 -74 -203 -67 48 -351
6055 -351 -324 -151 71 -49 190 10 63 -199 -9 -51 -371 -100 -343 -106 114 -63 -1 -306 -295 -242 40 -110
6077 -110 -115 -182 -272 -103 143 -40 -67 198 97 -174 11 3 195 -302 80 168 -34 -118 -153 -94 -24 -104 235 241 149
6102 149 -144 -115 -78 420 -21 11 -203 9 100 -150 -63 -92 117 77 240 -199 -69 -166 -14 87 -12 183 336
6125 336 86 59 30 43 7 -103 139 237 346 -154 178 176 56 272 -191 124 201 -81 86 78 16 69 -171 -2
6149 -2 271 160 71 427 164 11 107 -104 48 78 185 82 106 237 -107 -190 39 168 60 -124 -226 -278 200
6172 200 33 -54 57 71 -290 53 61 -354 -157 -220 -383 43 17 -26 -189 248 348 86 308 -49 -170 -483
6194 -483 -18 -31 -197 -274 -69 -77 126 -361 -196 282 -166 -166 -210 -188 -183 -155 -255 -265 43 59 257 8 -105 -98 11
6219 11 255 -253 44 -92 36 201 -125 -50 -227 -119 -3 -144 313 168 0 69 131 96 -90 61 -78 84
6241 84 -18 -52 389 -112 303 258 -142 270 75 45 234 66 -213 159 358 45 484 -75 154 65 275 79
6263 79 -135 188 -44 91 22 -84 -6 -108 -88 46 45 -31 251 106 -115 -111 31 -71 310 67 231 128 102
6286 102 -137 -66 13 -15 269 -59 37 -130 6 -13 105 351 -223 -244 -135 24 148 0 -286 -376 13 44 -315
6309 -315 -262 163 32 -230 -194 -124 -97 -80 72 54 96 296 -173 79 -197 -139 -184 149 -317 -303 214 -7 30 -102
6333 -102 -80 -57 -179 -115 -213 236 120 32 1 339 -138 62 -129 38 -104 173 170 -132 45 -21 145 -129 -10
6356 -10 144 -266 108 148 -225 -81 123 157 102 28 -33 157 -131 -19 128 122 -318 -62 -70 42 131 -161 -45 -60
6380 -60 59 282 215 150 -133 -179 15 68 203 -217 171 -8 -230 291 237 264 -33 235 10 219 -83 116
6402 116 7 -86 -114 80 19 -80 83 -329 383 72 136 118 49 119 -106 -135 -490 -175 -122 -30 -67 -213 149 103
6426 103 -194 65 -104 -46 -244 140 59 -292 -146 -70 -145 52 -83 -335 219 -119 121 -10 89 174 -13 106
6448 106 -11 -284 145 -62 -32 88 27 32 -124 -145 -348 -43 -106 -166 102 -35 120 -154 85 39 239 75 12
6471 12 1 144 -65 211 77 -30 -94 75 9 -329 -198 1 124 -185 48 224 141 -122 48 -47 65 19
6493 19 -29 -43 -322 -231 -54 -93 53 343 -98 -268 97 -6 215 -215 -216 218 -253 54 67 -44 62 46 67
6516 67 45 80 23 127 -67 -5 -164 316 12 56 194 224 97 36 -166 173 305 325 -90 279 59 279 36
6539 36 142 -166 -104 222 -380 -93 43 -74 217 -52 -158 432 42 -47 -161 -239 -86 -87 -165 -154 -331 -110 17
6562 17 273 -5 -208 -44 31 176 -181 120 -14 34 -175 -232 113 153 134 35 28 225 224 89 194 82 -4 -164
6586 -164 -137 -22 41 -27 114 -45 71 66 -201 -40 199 -251 60 82 308 -10 123 40 35 230 69 -313 -196
6609 -196 -12 192 -60 -32 -7 -34 -72 309 31 19 215 -152 144 -30 -166 180 -74 101 27 174 -114 7
6631 7 -30 210 79 3 -163 65 -51 -23 -129 319 85 181 80 -66 -33 -292 21 94 257 48 56 -21 16 82
6655 82 16 167 37 -21 169 301 34 261 52 62 374 -99 -21 146 69 -317 48 188 -61 -450 -60 266
6677 266 272 212 30 36 -40 -34 -211 -363 177 -41 -125 -285 21 -124 132 -43 13 135 301 85 349 132 -63
6700 -63 -144 -39 -118 100 85 119 81 -44 -187 -310 -213 -83 -58 -198 -128 -258 246 -181 -166 -27 -80 220 41 -192
6724 -192 375 388 -149 -342 -51 151 -32 -214 87 -21 -63 118 153 -99 14 -164 -158 163 8 210 396 225
6746 225 321 241 159 -119 95 96 109 2 45 16 11 -54 -54 59 237 79 64 4 -177 525 206 64 132 -146 120
6771 120 -273 123 -94 -13 177 88 14 267 -41 -33 332 -102 -159 49 -147 -99 85 175 -21 -387 -66 89 282
6794 282 -169 367 -12 222 -44 -141 -174 79 -11 70 121 -283 256 100 129 54 381 -183 53 -227 -59 -45 -272
6817 -272 -133 -494 51 67 76 -97 148 36 -98 -179 -130 -42 -174 181 -60 77 -88 -159 -213 -177 22 10 -142
6840 -142 -15 149 -66 65 -303 -311 116 -188 180 78 340 113 84 23 -81 -137 65 -316 37 139 82 -163
6862 -163 151 159 224 -130 -184 92 -191 12 -332 -85 -19 -23 -340 285 -130 16 45 78 -25 -149 131 -211 82
6885 82 67 7 -196 -48 157 -4 11 -78 200 -63 342 -175 4 -86 -93 163 -174 143 -99 82 -70 30 359
6908 359 34 15 -243 64 157 96 -160 106 169 239 56 -52 5 172 232 251 -54 -215 248 397 40 -78 80
6931 80 292 -95 67 -210 6 -65 -12 60 229 -93 -15 77 -26 -149 -219 -211 -101 -358 7 -67 3 77 -41 102
6955 102 -250 53 81 -231 131 72 59 -44 -43 82 -138 -277 163 -79 -101 108 -150 -86 -276 191 38 42 -95
6978 -95 -6 -205 195 -27 -5 170 -160 -31 39 167 74 -161 126 -404 80 -197 -40 18 -59 -123 -175 -17 104
7001 104 -65 -75 -116 -90 -120 -40 -80 -402 -83 -96 -135 167 102 -281 -14 -201 -100 -35 111 90 -150 -25 215 238
7025 238 198 -139 206 67 395 94 -293 107 180 319 368 122 -115 -141 -77 84 -58 -16 -171 -9 -105 173
7047 173 230 43 -111 39 -33 35 -31 148 -69 -76 80 -36 94 107 -120 -26 4 -190 198 -141 -118 -309 119
7070 119 -28 -120 155 -6 -114 183 202 212 -166 -78 -250 -64 110 -67 59 -382 -69 69 -280 253 -272
7091 -272 -310 -55 -63 -149 -29 90 12 78 -113 45 -357 -87 57 -131 48 -133 125 66 273 -101 271 14
7113 14 -234 -418 -285 -37 193 -148 -64 91 120 -241 -197 54 203 -247 -121 269 168 336 -68 62 -141
7134 -141 -75 10 -158 -91 -252 185 -8 -65 114 -207 225 163 72 -357 405 57 -101 153 11 -45 -125 335 252
7157 252 -62 -177 192 -123 20 157 -116 60 -76 327 67 -65 38 203 31 -77 148 -175 -293 88
7177 88 204 -217 100 -166 -4 136 0 -161 -56 100 46 215 143 216 -292 -298 -69 0 -133 -34 105 26 55
7200 55 47 105 -368 155 21 49 -78 65 -172 -56 -234 177 -95 -102 -138 -386 -235 -87 63 22 154 13 44
7223 44 -128 -95 -379 -344 -226 -151 42 3 -127 12 -102 97 -38 -226 -202 -282 14 75 92 -15 -59 -100 -30 219
7247 219 -26 -31 87 206 -54 138 204 299 143 -34 13 -59 -142 155 54 -45 96 197 -210 27 111 133 130 49
7271 49 -29 17 21 -81 24 133 95 355 -79 -125 -34 -114 -80 23 172 152 -72 88 103 -40 50 225 -82 -170 359
7296 359 160 49 -195 113 -81 65 -368 224 -109 149 3 -148 -31 119 47 122 66 167 -65 -73 144 -56
7318 -56 74 223 305 -429 274 13 -414 -267 -15 -426 -215 184 -168 -81 -186 11 134 -218 118 -23 136
7339 136 16 -1 -137 -2 -117 -80 229 -326 -435 -177 164 -99 -411 -284 -5 -68 98 -63 -231 90 157
7360 157 137 284 -115 -99 72 -52 -129 16 -199 86 201 -100 -37 -257 68 -6 406 102 121 -11 -138 -44
7382 -44 41 251 -172 -168 -35 369 -11 66 141 -74 -71 123 -193 78 -125 112 -18 -331 409 115 -141 -8 -34
7405 -34 -108 -82 11 -281 -71 104 124 -21 203 40 376 -257 -125 143 16 89 -156 -232 -55 97 0 243 -284
7428 -284 339 176 34 -84 -304 125 65 -98 -122 -295 193 29 39 5 -24 -81 -149 -68 -236 -196 101 35 -255
7451 -255 243 -79 7 -128 245 -73 48 171 161 -186 -22 296 6 -61 112 250 238 76 -48 -224 46
7472 46 -93 -190 -186 -63 118 -40 -193 -182 -1 -123 77 48 35 175 133 227 -20 87 47 88 288 137 -20 -25
7496 -25 21 361 -308 67 -197 42 22 163 132 31 -379 -286 -107 184 -197 222 275 -126 175 68 -33 -39 99
7519 99 46 127 -144 56 12 -69 61 -10 101 143 -56 99 -5 127 168 -47 272 -70 190 -6 -58 -86 -83 -91 -148
7544 -148 80 -455 -150 68 -200 187 -80 -43 22 72 24 -121 66 94 76 -152 -173 -133 175 90 2 -25 -16 -265
7568 -265 76 -6 -182 -100 88 7 61 144 164 274 179 9 87 120 -26 -165 61 -140 -27 -20 137 -68 83 -141
7592 -141 -13 340 -137 150 -89 -107 -80 60 77 -274 91 103 287 -130 -334 60 105 31 88 -445 -49 66
7614 66 96 236 -22 119 57 208 -206 31 34 -165 -35 -286 -174 -58 62 -48 102 157 -129 99 -129 235
7636 235 -22 34 241 -132 25 87 -1 16 290 -63 -133 -308 119 -16 -65 272 243 123 39 203 -14 222 -62
7659 -62 2 -57 127 -109 -66 -172 -80 -42 -77 143 70 208 211 -117 -315 -115 147 -216 101 -235 42 -358 -68
7682 -68 -112 -56 297 74 -124 -56 120 -105 -176 -219 -148 95 -235 -295 -379 -7 205 33 171 -400 -22 -9 87 -215
7706 -215 -30 -388 -113 160 -250 -68 74 -325 -276 167 -273 -67 85 140 -140 -100 -112 -135 -45 -15 179 -150
7728 -150 -11 -264 -116 103 -140 71 -445 -3 10 -206 -20 7 62 -112 12 -176 -262 250 69 -128 -71 5
7750 5 -173 299 162 -47 72 -90 -9 -2 135 44 -29 233 168 66 -256 -97 112 178 120 -35 -163 113 1
7773 1 76 201 144 -11 -41 -186 -197 306 -74 -190 -96 -69 -37 -56 -37 -82 -107 -82 295 3 -125 205 -163 -138 -127
7798 -127 6 -95 -272 3 135 -135 142 46 -259 59 -108 116 36 -139 -94 229 -241 94 24 -179 -38
7819 -38 155 150 107 364 52 -162 -203 -143 -323 249 163 -128 -95 101 -80 140 -49 221 209 305 129 288 37
7842 37 25 -271 -25 99 -172 -72 20 -54 -234 90 -37 183 -6 -24 -50 -105 -11 -170 -147 234 39 -168 -353
7865 -353 -187 38 -102 38 -18 -61 -47 5 16 119 -161 108 -62 -159 -110 -174 -27 -30 -236 -51 -88 -151 -39 -162
7889 -162 -153 405 109 183 71 89 153 -74 9 63 118 25 104 248 -105 51 173 8 115 -152 137 -112 -77 194
7913 194 230 233 -130 198 34 -153 -214 193 54 21 62 -122 -79 49 108 59 -327 -66 345 -19 -183 25 226
7936 226 272 222 48 20 39 -37 37 140 -86 56 57 -224 18 -44 90 14 -94 -87 136 -34 132 -111 -92 37
7960 37 -139 -39 101 131 145 -75 122 91 -160 388 -305 12 36 7 -275 95 -342 -52 43 -114 355 -107
7982 -107 -149 -96 29 -58 208 -80 120 -23 -117 -154 148 93 90 -60 59 -125 -66 -249 55 -401 41 -505 -89
8005 -89 2 166 139 -246 -61 -138 -304 -73 -34 110 -42 -143 -47 -67 46 -5 93 -142 -137 -4 -271 47 -93 134
8029 134 326 -191 -78 -120 98 -37 -185 -187 155 234 30 -224 -117 221 13 160 260 182 42 208 -204 178
8051 178 53 2 100 -16 30 -11 -25 -43 -101 -52 -31 29 -44 -110 -28 148 3 -239 142 -69 -165 8 63 -115 158
8076 158 21 -115 234 -139 -22 87 -283 107 -7 -66 14 -37 -4 121 237 -43 -37 102 54 -80 -75 -30 -12 -13
8100 -13 68 75 -10 -56 -25 2 -235 -31 -213 -21 43 7 77 -135 175 -193 213 -159 -89 -14 48 -252 174 218 17
8125 17 116 -448 -7 -205 109 -224 -10 14 -47 -158 109 45 -197 -151 48 27 121 -15 -190 82 -174 44 -139
8148 -139 -172 -473 -21 87 400 65 -135 -84 12 13 -448 142 278 178 27 -81 -247 158 -27 -11 -113 -42
8170 -42 104 -31 79 222 0 -60 21 9 -31 91 307 -191 -93 455 95 17 -82 174 104 60 -61
8191f1
##END NTUPLES=NMR FID
##END=
