##TITLE=1H_LR-713_CR5
 CDCl3, 8 sc, 
 8.7.2020
##JCAMPDX= 6.0         $$ Bruker NMR JCAMP-DX V2.0
##DATA TYPE= NMR FID
##DATA CLASS= NTUPLES
##ORIGIN= UXNMR, Bruker Analytische Messtechnik GmbH
##OWNER= root
$$ XWIN-NMR		Version 3.5
$$ Wed Jul  8 10:39:00 2020 Russian Standard Time (UT+4h)  she@DPX200
##.OBSERVE FREQUENCY= 200.1315
##.OBSERVE NUCLEUS= ^1H
##.DELAY= (6, 6)
##.ACQUISITION MODE= SIMULTANEOUS
##.ACQUISITION SCHEME= undefined
##.AVERAGES= 8
##.DIGITISER RES= 18
##SPECTROMETER/DATA SYSTEM= spect
##.PULSE SEQUENCE= zg30
##.SOLVENT NAME= CDCl3
##.SHIFT REFERENCE= (INTERNAL, CDCl3, 0, 15.7039)
##AUDIT TRAIL= $$ (NUMBER, WHEN, WHO, WHERE, WHAT)
$$ ##TITLE= Audit trail, XWIN-NMR		Version 3.5
$$ ##JCAMPDX= 5.01
$$ ##ORIGIN= Bruker BioSpin GmbH
$$ ##OWNER= she
$$ F:/spectra/data/she/nmr/H-F/1/audita.txt
$$ ##AUDIT TRAIL=  $$ (NUMBER, WHEN, WHO, WHERE, WHAT)
(   1,<2020-07-08 10:38:07.76 +0400>,<she>,<DPX200>,
      <created by zg, POWCHK disabled, PULCHK disabled
       configuration hash MD5:
       00 E9 B6 7A A2 85 ED C7 34 08 36 98 17 FE 4E 26
       data hash MD5: 16K
       86 41 49 A5 C1 9E 1A 9E F1 12 11 1E 47 1B 3F 68>)
$$ ##END=
$$ 
$$ hash MD5
$$ F3 28 7B 24 B1 B8 CE 7B EC 90 01 24 4E 73 B6 6B
##$RELAX= 
##$RELAX= 
##$RELAX= 
##$RELAX= 
##$RELAX= 
##$RELAX= 
$$ Bruker specific parameters
$$ --------------------------
##$DU= <F:/spectra>
##$EXPNO= 1
##$NAME= <H-F>
##$PROCNO= 1
##$TYPE= <nmr>
##$USER= <she>
##$AMP= (0..31)
100 100 100 100 100 100 100 100 100 100 100 100 100 100 100 100 100 100 
100 100 100 100 100 100 100 100 100 100 100 100 100 100 
##$AQSEQ= 0
##$AQ_mod= 1
##$AUNM= <au_zg>
##$AUTOPOS= <>
##$BF1= 200.13
##$BF2= 200.13
##$BF3= 200.13
##$BF4= 200.13
##$BF5= 200.13
##$BF6= 200.13
##$BF7= 200.13
##$BF8= 200.13
##$BYTORDA= 1
##$CFDGTYP= 0
##$CFRGTYP= 5
##$CHEMSTR= <none>
##$CNST= (0..31)
1 1 145 1 1 1 1 1 1 1 1 1 1 1 1 1 1 1 1 1 1 1 1 1 1 1 1 1 1 1 1 1 
##$CPDPRG= <>
##$CPDPRG1= <>
##$CPDPRG2= <>
##$CPDPRG3= <>
##$CPDPRG4= <mlev>
##$CPDPRG5= <mlev>
##$CPDPRG6= <mlev>
##$CPDPRG7= <mlev>
##$CPDPRG8= <mlev>
##$CPDPRGB= <>
##$CPDPRGT= <>
##$D= (0..31)
0 1.2 0 0 0 0 0 0 0 0.06 0 0.03 0 0 0 0 0.0002 0 0 0 0 0 0 0 0 0 0 0 0 
0 0 0 
##$DATE= 1594190287
##$DBL= (0..7)
120 120 120 120 120 120 120 120 
##$DBP= (0..7)
150 150 150 150 150 150 150 150 
##$DBP07= 0
##$DBPNAM0= <>
##$DBPNAM1= <>
##$DBPNAM2= <>
##$DBPNAM3= <>
##$DBPNAM4= <>
##$DBPNAM5= <>
##$DBPNAM6= <>
##$DBPNAM7= <>
##$DBPOAL= (0..7)
0.5 0.5 0.5 0.5 0.5 0.5 0.5 0.5 
##$DBPOFFS= (0..7)
0 0 0 0 0 0 0 0 
##$DE= 6
##$DECBNUC= <off>
##$DECIM= 24
##$DECNUC= <off>
##$DECSTAT= 4
##$DIGMOD= 1
##$DIGTYP= 9
##$DL= (0..7)
0 120 120 120 120 120 120 120 
##$DP= (0..7)
150 150 150 150 150 150 150 150 
##$DP07= 0
##$DPNAME0= <>
##$DPNAME1= <>
##$DPNAME2= <>
##$DPNAME3= <>
##$DPNAME4= <>
##$DPNAME5= <>
##$DPNAME6= <>
##$DPNAME7= <>
##$DPOAL= (0..7)
0.5 0.5 0.5 0.5 0.5 0.5 0.5 0.5 
##$DPOFFS= (0..7)
0 0 0 0 0 0 0 0 
##$DQDMODE= 0
##$DR= 18
##$DS= 0
##$DSLIST= <SSSSSSSSSSSSSSS>
$$ [...]
##$SUBNAM2= <"">
##$SUBNAM3= <"">
##$SUBNAM4= <"">
##$SUBNAM5= <"">
##$SUBNAM6= <"">
##$SUBNAM7= <"">
##$SUBNAM8= <"">
##$SUBNAM9= <"">
##$SW= 24.9337058887773
##$SWIBOX= (0..15)
0 0 2 0 0 0 0 0 0 0 0 0 0 0 0 0 
##$SW_h= 4990.01996007984
##$TD= 16384
##$TD0= 1
##$TE= 0
##$TE2= 300
##$TE3= 300
##$TEG= 300
##$TL= (0..7)
0 120 120 120 120 120 120 120 
##$TP= (0..7)
150 150 150 150 150 150 150 150 
##$TP07= 0
##$TPNAME0= <>
##$TPNAME1= <>
##$TPNAME2= <>
##$TPNAME3= <>
##$TPNAME4= <>
##$TPNAME5= <>
##$TPNAME6= <>
##$TPNAME7= <>
##$TPOAL= (0..7)
0.5 0.5 0.5 0.5 0.5 0.5 0.5 0.5 
##$TPOFFS= (0..7)
0 0 0 0 0 0 0 0 
##$TUNHIN= 0
##$TUNHOUT= 0
##$TUNXOUT= 0
##$USERA1= <user>
##$USERA2= <user>
##$USERA3= <user>
##$USERA4= <user>
##$USERA5= <user>
##$V9= 5
##$VALIST= <valist>
##$VCLIST= <CCCCCCCCCCCCCCC>
##$VD= 0
##$VDLIST= <DDDDDDDDDDDDDDD>
##$VPLIST= <PPPPPPPPPPPPPPP>
##$VTLIST= <TTTTTTTTTTTTTTT>
##$WBST= 1024
##$WBSW= 4
##$XGAIN= (0..3)
0 0 0 0 
##$XL= 0
##$YL= 0
##$YMAX_a= 168044
##$YMIN_a= -102113
##$ZGOPTNS= <>
##$ZL1= 120
##$ZL2= 120
##$ZL3= 120
##$ZL4= 120
##$ABSF1= 10
##$ABSF2= 0
##$ABSG= 5
##$ABSL= 3
##$ALPHA= 0
##$AQORDER= 0
##$ASSFAC= 0
##$ASSFACI= 0
##$ASSFACX= 0
##$ASSWID= 0
##$AUNMP= <proc_1d>
##$AZFE= 0.1
##$AZFW= 0.1
##$BCFW= 1
##$BC_mod= 2
##$BYTORDP= 1
##$COROFFS= 0
##$CY= 11.3945322036743
##$DATMOD= 1
##$DC= 2
##$DFILT= <>
##$DTYPP= 0
##$F1P= 16.9975609425685
##$F2P= -3.02152046262296
##$FCOR= 0.5
##$FTSIZE= 0
##$FT_mod= 4
##$GAMMA= 1
##$GB= 0.15
##$INTBC= 1
##$INTSCL= 1
##$ISEN= 128
##$LB= 0.24
##$LEV0= 0
##$LPBIN= 0
##$MAXI= 10000
##$MC2= 0
##$MEAN= 0
##$ME_mod= 0
##$MI= 1.114404
##$NCOEF= 0
##$NC_proc= 0
##$NLEV= 6
##$NOISF1= 3.799351
##$NOISF2= 2.8
##$NSP= 1
##$NTH_PI= 0
##$NZP= 0
##$OFFSET= 15.70392
##$PC= 1
##$PHC0= -9785.725
##$PHC1= 5.200859
##$PH_mod= 1
##$PKNL= yes
##$PPARMOD= 0
##$PSCAL= 0
##$PSIGN= 0
##$REVERSE= no
##$SF= 200.130013532006
##$SI= 16384
##$SIGF1= 3
##$SIGF2= 2
##$SINO= 400
##$SIOLD= 16384
##$SREGLST= <1H.CDCl3>
##$SSB= 0
##$STSI= 0
##$STSR= 0
##$SW_p= 3612.71676300578
##$SYMM= 0
##$S_DEV= 0
##$TDeff= 0
##$TDoff= 0
##$TI= <>
##$TILT= no
##$TM1= 0
##$TM2= 0
##$TOPLEV= 0
##$USERP1= <user>
##$USERP2= <user>
##$USERP3= <user>
##$USERP4= <user>
##$USERP5= <user>
##$WDW= 1
##$XDIM= 8192
##$YMAX_p= 0
##$YMIN_p= 0
$$ End of Bruker specific parameters
$$ ---------------------------------
##NTUPLES= NMR FID
##VAR_NAME=  TIME,          FID/REAL,        FID/IMAG
##SYMBOL=    X,             R,               I
##VAR_TYPE=  INDEPENDENT,   DEPENDENT,       DEPENDENT
##VAR_FORM=  AFFN,          ASDF,            ASDF
##VAR_DIM=   8192,          8192,            8192
##UNITS=     SECONDS,       ARBITRARY UNITS, ARBITRARY UNITS
##FACTOR=    0.0002004,     1,               1
##FIRST=     0,             0,               0
##LAST=      1.6414764,     0,               0
##MIN=       0,             -102113,         0
##MAX=       1.6414764,     168044,          0
$$ Real data points
##PAGE= N=1
##DATA TABLE= (X++(R..R)), XYDATA
$$ [...]
2086h55K72J236J9j237j200Q51J103k77j581J55J581Q60j237j122O31J509o43
$$ -855 -583 653 672 -565 -1765 -914 189 -88 -1669 -1514 67 927 -310 -1432 -801 708 65
2103F5j053m73J038O36k26r57J42Q68K40q41j096Q77J243m00o48j8M66L88m68
$$ 65 -988 -1461 -423 213 -13 -970 -828 40 280 -561 -1657 -780 463 63 -585 -603 -137 251 -217
2122b17p38M07O35k07n46J22J017j69o39q7K87O95p72o47J35J175L80j034j93
$$ -217 -955 -548 87 -120 -666 -544 473 304 -335 -422 -135 560 -212 -859 -724 451 831 -203 -396
2141c96P22J25k33j248o9J519L12r28m02O45J198o5j511l48Q29O41r59r31K93
$$ -396 326 451 218 -1030 -1099 420 732 -196 -598 47 1245 1180 -331 -679 150 791 -168 -1099 -806
2160h06J865O48j315j307R48J052k79j905O3J416Q97p19r88L70J198J77j048q64
$$ -806 1059 1707 392 -915 33 1085 806 -1099 -1036 380 1277 558 -430 -60 1138 1315 267 -597
2178e97P71N94m93p39J12J070P09q76o04kJ022J27j286l42Q97P08m59r83J45Q71
$$ -597 174 768 275 -464 -352 718 1427 551 -53 -55 967 1094 -192 -534 363 1071 612 -371 -226 645
2198F45R1r62k93Q52K02p56p9j24J000M75r74p14N17O42j80q35k55J026M65l68
$$ 645 736 -226 -519 333 535 -221 -300 -424 576 1051 77 -637 -120 522 342 -493 -748 278 743 375
2218C75j166M31P11K20j058m29O09Q73O8j022r3P10K71n07o01K27N51J38k42l45
$$ 375 -791 -360 351 571 -487 -916 -307 566 634 -388 -481 229 500 -7 -608 -381 170 308 66 -279
2238b79J45L44j51k99L00L2l21J1Q0M2R5r4N76j04k90l67l18P93J62L5p07L48
$$ -279 -134 210 59 -240 60 92 -229 -218 -138 -96 -1 -95 481 377 87 -280 -598 195 357 392 -315 33
2260C3M62k1o55j13L45R91k06j254k34P04R22n73n68j19O35O91q95j149P26J410
$$ 33 495 474 -181 -294 51 1042 836 -418 -652 52 974 401 -167 -286 349 1040 145 -1004 -278 1132
2280A132M5j366m80J110N97n96j063j64J770p8r65j079P63J447M9j279l98Q86
$$ 1132 1177 -189 -669 441 1038 442 -621 -785 985 907 -58 -1137 -374 1073 1122 -157 -555 331
2298C31R14j412n28J56J486J44j392p71O33J512j16j546O9J252M36j195j048Q24
$$ 331 1245 -167 -695 -539 947 1091 -301 -1072 -439 1073 957 -589 -520 732 1168 -27 -1075 -251
2316b51J387O0j778n09J415J088j039j492mJ943O20j615j635J212J764j38k033
$$ -251 1136 1196 -582 -1091 324 1412 373 -1119 -1123 820 1440 -175 -1810 -598 1166 1028 -1005
2333a005n75J592J222q07j985J84J888P72j458j590P65J834rj657j037J685J561
$$ -1005 -1580 12 1234 427 -1558 -1374 514 1286 -172 -1762 -997 837 828 -829 -1866 -181 1380
2350A380q18k001k98K328L65j283j349M83K117Jj866n20J035J259o65j656j88
$$ 1380 562 -1439 -1737 591 956 -327 -1676 -1193 924 925 -941 -1461 -426 833 168 -1488 -1676
2367a676J829Q97j037j399N39J765j73j663q28J337J331q93j010j32J725L61j403
$$ -1676 153 1050 13 -1386 -847 918 745 -918 -1746 -409 922 29 -981 -1113 612 973 -430
2384d30r92O16J307n1j132m83J467P48o06j382o1J260K98p07j030R20J144k47
$$ -430 -1422 -806 501 450 -682 -1165 302 1050 444 -938 -999 261 559 -148 -1178 -258 886 639
2402F39j524O1R25O10l04j586K57J135P65j050l95O87R32n65j132p16J009J066
$$ 639 -885 -824 101 711 407 -1179 -922 213 978 -72 -467 220 1152 587 -545 -1261 -252 814
2420H14o50r26J2J252O50r63r46N98N90K72q42o82N84J399j88j201k70Q25K77
$$ 814 164 -762 -750 502 1152 189 -757 -159 431 703 -139 -821 -237 1162 974 -227 -497 328 605
2439F05m68r21L79R99N9k99q26O7Q18J21q39L7P14J19j25q96L14M90q9n31J56
$$ 605 137 -784 -405 594 653 354 -472 -405 413 534 -305 -268 446 565 440 -456 -142 348 259 -272 -116
2460a16M8J0k3n35M92M14J56j05o02J42J13k98l29N37M01J4m16K0L55j48J40q15
$$ -116 -68 -58 -81 -616 -124 290 446 341 -261 -119 -6 -304 -633 -96 305 319 -97 -77 278 130 270 -545
2482e45J51M98J93p15l39L59Q43K70p51Pm05P78j68m14m16J265J58q08l26J64
$$ -545 -394 104 297 -418 -757 -398 445 715 -36 -29 -434 344 176 -238 -654 611 769 -39 -365 -201
2502b01K33K42l21p53P42N77k39o09J0N10K14l64n10M20L15P2m35J13K67N15m45
$$ -201 32 274 -47 -800 -58 519 280 -329 -319 191 405 41 -469 -49 266 338 -97 16 283 798 353
2523C53n83N6O26k30m77L79N92qj92j121K93Q95k91m67j50N99N19M3j011P0O67
$$ 353 -230 -174 452 222 -255 124 716 708 516 -605 -312 583 292 -175 -325 274 793 836 -175 -105 562
2544E62L85p97n68J67J334k79j131m6Q59P96m33j228p6P29R67j017j110K67J725
$$ 562 947 150 -418 -251 1083 804 -327 -373 486 1282 849 -379 -455 274 1241 224 -886 -619 1106
2563A106J66j124r57J081Q67j87j711K18J169P07p90j558N21J197L69r84r58P65
$$ 1106 1272 148 -809 272 1139 952 -759 -541 628 1335 545 -1013 -492 705 1074 90 -868 -103
2581a03J297n27j522L6J082P78j129r69O10Q61L77q98r31Q62P77m24j176K12R80
$$ -103 1194 667 -855 -819 263 1041 -88 -1057 -447 414 791 -107 -1038 -176 601 177 -999 -787 193
2600A93N34j022p01M32J498j61j414l21Q69P42l98j289M6J392M99j072j133P53
$$ 193 727 -295 -996 -564 934 773 -641 -962 -93 649 251 -1038 -992 400 899 -173 -1306 -553
2618e53J006J15j442o71J571Q29k38j572K21J006J63o81j050R56J135k56r40q36
$$ -553 453 568 -874 -1545 26 855 617 -955 -734 272 435 -246 -1296 -340 795 539 -401 -1237
2636a237J282J034j024p14n11J221M17p49q73N63J101K25j067n38L68J238j86
$$ -1237 45 1079 55 -659 -1170 51 468 -281 -1154 -591 510 735 -332 -870 -502 736 550
2653E50r64o8J103Q9m94r85K43O39O22o68o48L72Q27j30n90j70L42L77n65j94
$$ 550 -414 -482 621 710 216 -769 -526 113 735 67 -581 -209 618 488 -102 -272 70 447 -118 -312
2673c12q3Q70o6l75j89K16K10j0l93k42N51q3k3r7J92P4Q5l11l44J53L06L65p02
$$ -312 -395 475 409 34 -155 61 271 261 -132 -374 177 94 71 -26 166 240 325 14 -330 -177 129 494 -208
2696b08J53K41k4L48n13j83K86K39l39o59L00L69K23k16j14q7L61J25m28k85K38
$$ -208 -55 186 162 510 -3 -186 100 339 0 -659 -359 10 233 17 -97 -184 177 302 -126 -411 -173
2717a73O34k59l23k87Q58o6k12l84m26O67K12l08o27J15J196j09p61l98J94M65
$$ -173 461 202 -121 -408 450 384 172 -212 -638 29 241 -67 -694 -579 617 508 -253 -651 -457 8
2737HO51o62n79N84M91l52o37M6M97K33l59o89Q9J137qj008k42N33R41r14k10
$$ 8 659 -3 -582 2 493 141 -496 -450 47 280 -79 -768 -679 458 450 -558 -800 -267 674 -240 -450
2758d50j67L43O61m51l12K36N10o1n88O7M28J36l58k19k9K90P16k44n34J21J83
$$ -450 -617 -274 387 -64 -376 -140 370 309 -279 -212 216 352 -6 -225 -254 36 752 508 -26 95 278
2779B78Np09L10K65N76o28p5L51j7K54p59r8M22L86k7p72N26L33q2k09j75j37
$$ 278 283 -426 -116 149 725 97 22 373 356 610 -149 -247 175 561 534 -238 288 621 539 330 155 18
2801A8M58J07r73N7Q89L80n21n50J47P49J37r72n73N07M80K18q72j2N14M64l63
$$ 18 476 583 -390 -333 556 936 415 -135 12 761 898 -74 -647 -140 340 558 -314 -326 188 652 289
2822B89n03K67J10K57l78K5L86J89m14k16K80l7J1l51J27K72K36m52N2J6L58n1
$$ 289 -214 53 163 420 42 67 453 642 228 12 292 255 266 -85 42 314 550 98 150 166 524 473
2844D73o54k46N83K52k70n34J95Q92k16p48n37P63L45j19j051R4J370J97q34n74
$$ 473 -181 -427 156 408 138 -396 -201 691 475 -273 -810 -47 298 179 -872 -778 592 789 -45 -619
2864f19K71P87R1j258r9Q00O41k89j231M85Q91K58o95j167R05O13N4r62l14J101
$$ -619 -348 439 530 -728 -827 -27 614 325 -906 -421 470 728 33 -1134 -229 384 438 -524 -838 263
2884B63N71m40j550J32J452K30r66m76N64J439r59n91l88Q95L37o06q46M00J020
$$ 263 834 394 -1156 -1024 428 658 -308 -784 -220 1219 260 -331 -719 176 513 -93 -939 -539 481
2903D81j25q66k38Q78N56o57j075L47J104N08j080q80R12J399p89q13m85J181
$$ 481 356 -510 -748 130 686 29 -1046 -699 405 913 -167 -1047 -135 1264 475 -338 -823 358
2921C58N30q20j071N64J188J35j018j064R77J265m91q79n73R91J015j028q84M91
$$ 358 888 68 -1003 -439 749 884 -134 -1198 -221 1044 553 -326 -899 92 1107 79 -805 -314
2939c14J099P3j108o72P69J187j37j279k50Q76O33r78j182N87J646m2j129p87
$$ -314 785 858 -250 -922 -153 1034 897 -382 -632 244 877 -101 -1283 -696 950 908 -221 -1008
2957a008J153P34n92j155m1J403N64j232p57M40J053j40r04l35Q48N93o03j081
$$ -1008 145 879 287 -868 -909 494 1058 -174 -931 -491 562 422 -482 -817 31 624 21 -1060
2975a060L21J034J42p12k57N46L48n18m95K80M20L36p00l12M88M61m08m63l18
$$ -1060 -739 295 437 -275 -532 14 362 -156 -651 -371 49 385 -315 -627 -139 322 -86 -549 -867
2994h67O58M50j90n67J85M17J59m95m70M41M21k93n86K75M50K89k96l73NO65m3
$$ -867 -209 241 51 -516 -331 86 245 -250 -720 -279 142 -151 -737 -462 -12 277 -19 -392 -387 278 235
3015B35m80k87K27L15o7k37j54N67j38k56k30L99M79m68k72L07K08M02n19m43
$$ 235 -245 -532 -305 10 -57 -294 -448 119 -19 -275 -505 -106 373 -95 -367 -60 148 550 31 -412
3035d12L89M05n71j82M48K39O4k60l34M34M00m73q56K83R45J67p37kJ21N33Q4
$$ -412 -23 382 -189 -371 77 316 380 120 -214 220 620 147 -709 -426 519 686 -51 -53 68 601 685
3056F85n60m24K98N52k32r25L86P17L10j067l09O18P05j52p13l06O23N35n31n20
$$ 685 125 -299 -1 551 319 -606 -220 497 807 -260 -569 49 754 602 -111 -417 206 741 210 -310
3076c10L80N13j05n29k32J86P41K5q76ML73N55n99l60J80O01K4n39m65P48L83
$$ -310 70 583 478 -51 -283 -97 644 669 -207 -203 170 725 126 -234 -54 547 571 32 -433 315 698
3097F98l92o29J37N71L89j053N7L11L37n7n71k98N20M40m44o75K47O70L10n05
$$ 698 306 -323 -186 385 774 -279 -222 89 426 369 -202 -500 20 460 16 -659 -412 258 568 63
3117F3q14N06N83K42j196Q4P06M87l58j302L49J005K22q53k32K94O06K22q41j61
$$ 63 -751 -245 338 580 -616 -532 174 661 303 -999 -650 355 577 -276 -508 -214 392 614 -227 -388
3137c88L33L90k89p69J64O23L55m46l09O2M20lm91K15J26L41k9p53K6P38j22k44
$$ -388 -55 335 46 -723 -559 64 419 -27 -336 -274 146 143 -348 -133 -7 334 305 -448 -422 316 194 -50
3159e0jj38L69L00l09m19K86K59r1k79J3r9L42N9l33OK29J2N0m19j2M53j18k36
$$ -50 -51 -189 180 480 171 -248 38 297 206 -73 -60 -159 183 242 -91 -85 144 156 206 -213 -225 228 110 -126
3183a26J58O5L15n49P2K87l14L60j07m3k8J1j79J4L90m22M19J54o83K83M2K65
$$ -126 32 97 412 -137 -65 222 -92 268 161 118 90 101 -78 -64 326 -96 323 477 -206 77 119 384
3205C84j61J54k59p4J93l48j69J56J21J87L2m39J42L8O0j48k35L34M03j49o96
$$ 384 223 377 118 44 237 -111 -280 -124 -3 184 216 -223 -81 -43 17 -131 -366 -32 371 222 -474
3226d74J68Q8O99m56p7k18J81M06r8o18K24J49J54k60k97M21J22N6m88j16M42
$$ -474 -306 -218 481 25 -52 -270 -89 317 219 -399 -175 -26 128 -132 -429 -8 114 170 -318 -434 8
3247HN85r89j00J19M89L35q51l02M33L52k2n01l7M38L23k04p80M50O0J88j34o36
$$ 8 593 -396 -496 -377 112 447 -404 -706 -273 79 57 -444 -481 -43 280 76 -704 -254 -194 -6 -140 -776
3269g76N65J24Q5q07M51M23M44m49k72j0J73J74o10j02L69N04k71k78L6L41Q4
$$ -776 -211 -87 -2 -809 -358 65 509 60 -212 -222 -49 125 -485 -587 -218 286 15 -263 -227 114 198
3290A98l42m06M91L1pl60K42L57rJ04o46j15P92j77m42j31L72M70J31p52k13O45
$$ 198 -144 -550 -59 -28 -35 -395 -153 204 195 299 -347 -462 330 153 -289 -420 -48 422 553 -199 -412 233
3312B33J04l01l19M86J94L4k79m48K82N05k51O7m13p7N92o67J92L74j79J58n17
$$ 233 337 36 -283 203 397 431 152 -296 -14 491 240 307 -106 -183 409 -258 -66 308 129 287 -230
3333b30lL42lj22L0J47L09k65k03N0M12j35l23j98J4M23j01l79L45O0J85j87m80
$$ -230 -233 109 106 -16 14 161 470 205 2 52 464 329 6 -192 -178 245 144 -235 110 170 355 168 -312
3356c12K38K91R9n46l87O04M84l86n67J95P01M3r14l94P15N08N8p85p0P53M97
$$ -312 -74 217 316 -230 -617 -13 471 85 -482 -287 414 457 -457 -851 -136 372 430 -355 -425 328 825
3377H25o04r08J20N70M34o87m77P67M22Q8j058j02P15N86m68p66K15P70L3q13
$$ 825 221 -687 -567 3 437 -250 -727 40 462 550 -508 -610 105 691 223 -543 -328 442 475 -338
3397c38j30L30Q74m63n41l85R11L89j071j33M99P29m79n67l68O94O63n91p73K64
$$ -338 -468 -138 736 273 -268 -653 258 647 -424 -557 -58 671 192 -375 -743 -49 614 23 -750 -486
3417d86R27K85p68p90O24P17l67o74k35J002O96j113m56K25J190J93q78q48M87
$$ -486 441 726 -42 -832 -208 509 142 -532 -767 235 931 -182 -638 -413 777 970 92 -756 -269
3436b69J253l17j050j17R16M05p14r08P09N60M29j051o25N99J258o75p78k8Q12
$$ -269 984 667 -383 -500 416 821 107 -801 -92 468 897 -154 -779 -180 1078 403 -375 -403 409
3455D09N31n20j025j10J052L81q85k88M38P53l85q30NO25N61r63j77p8J150R4
$$ 409 940 420 -605 -715 337 718 -167 -455 -17 736 351 -479 -474 151 712 -251 -428 -506 644 738
3475G38r09j50K26M49k3r54j22J049M62r62n51L84P84N5q54k27N55P99o65o50
$$ 738 -171 -321 -95 354 331 -623 -745 304 766 -196 -747 -363 421 476 -378 -605 -50 749 84 -566
3495e66N3Q27J11q12j49L14O84k87o48j38O09O43n52p32K92P92j7n16n45N75M92
$$ -566 -513 314 425 -387 -536 -222 462 175 -473 -611 -2 641 89 -643 -351 441 424 -92 -637 -62 430
3516D30k99m62m8K66N41m03p00J31L95O25p08k29L93N97n29l51j66N67J96m12
$$ 430 131 -331 -379 -113 428 25 -675 -544 -149 476 -232 -461 -68 529 0 -351 -517 50 246 -166
3536a66m78M19j0L92k58m87K35M12j55l5l29K64M15l32j70K09J55J06k89k8K17
$$ -166 -644 -225 -235 157 -101 -588 -353 59 -96 -131 -460 -196 219 -113 -283 -74 81 187 -102 -130 87
3557H7m2k3l41J57N73m07r9k43N35j16m7k08Q1J60J6j93p0L05J36l32J31n21N65
$$ 87 45 22 -319 -162 411 4 -95 -338 197 81 34 -174 -93 67 83 -110 -180 125 261 -71 60 -461 104
3580A04O9k84LK51L2j77J44j20M8M4k57J88J00j2o5k55K93J78l67k25L07k3K72
$$ 104 173 -111 -108 143 175 -2 142 22 70 114 -143 45 145 133 68 -187 106 284 -83 -308 -1 -24 248
3603B48k78R6k28J63K34k48j48j0K38K53m97R1ON50m71P0o05N32J20j14k91P9
$$ 248 -30 66 -162 1 235 -13 -161 -171 67 320 -177 -86 -80 470 -1 69 -536 -4 116 2 -289 -210
3625b10K05Q4m17K47k13N32l17J22m49N00L8k39k04j82P27O6n90J26J54l3P2j91
$$ -210 -5 79 -338 -91 -304 228 -89 33 -416 84 122 -117 -321 -503 224 290 -300 -174 -20 -53 19 -172
3647a72J56N8K0J20j23J65k48K37m77J61j48L11oj82l6j29M22k79pP7J89Q1Q4
$$ -172 -16 42 62 182 59 224 -24 213 -264 -103 -251 60 54 -128 -164 -293 129 -150 -157 -80 109 190 274
3670B74k19j76p6K20%jnK01n8k2r7j23K43j18n7Q0N2j62K98J03l07j28NK68J38
$$ 274 55 -121 -197 23 23 22 17 218 160 138 41 -82 161 43 -14 66 118 -44 254 357 50 -78 -73 195 333
3695C33n28L53pj29j44j01N53k40oo1J82Q5l34P6P2j62L01N8l30J08p7L09l04
$$ 333 -195 158 151 22 -122 -223 330 90 84 23 205 290 -44 32 104 -58 243 301 -29 79 2 311 7
3718Gj52L69R4J38n82J20L79j98p8l47M68j64K84l41l87L84L89m9l89l28O60N5
$$ 7 -145 224 318 456 -126 -6 373 175 97 -250 218 54 338 -3 -390 -6 383 334 -55 -383 277 332
3740C32Jm19j37M55Q3k09l17J78L47O8m55k90N06M28j64p00j28N33M06m86n16
$$ 332 333 -86 -223 232 315 106 -211 -33 314 382 -73 -363 143 571 407 -293 -421 112 518 32 -484
3761d84J48M00K8k95k50M72M97j44p63J59J79J07J90q08J64N76K04p12p3L43J93
$$ -484 -336 64 92 -203 -453 19 516 372 -391 -232 -53 54 244 -564 -400 176 380 -332 -405 -62 131
3782A31K44o36k91O99J44m16k67K51J55N7l84j41L71L76k95n44O2N66j01j42p1
$$ 131 375 -261 -552 147 291 -125 -392 -141 14 71 -313 -454 -83 293 -2 -546 -484 82 -19 -161 -232
3803b32q4O43l24m46P4K94K18n1q27M99P92k01m79m43O76N48n44k63n23L58J012
$$ -232 -316 327 3 -443 -369 -75 143 92 -735 -236 556 355 -124 -567 109 657 113 -150 -673 -315 697
3824F97p78j76L18J90K4k19m19O05L11k98l44k75O21Q2j65m86m3O48l2n03j68
$$ 697 -81 -257 61 251 275 56 -363 242 553 255 -89 -364 257 339 174 -312 -355 293 261 -242 -410
3845d10L29M93n20p2k56P45Q3n22L3K43R4j73k26j12L03K72j88l24n23P89j73
$$ -410 -81 412 -108 -180 -436 309 392 -130 -97 146 240 67 -159 -271 32 304 116 -208 -731 58 -115
3866a15K23m17M84o1P4m12j2N18j04m49q8M31K60m02n6J14Q8K12n93K24j05N06
$$ -115 108 -309 175 114 188 -224 -236 282 178 -271 -359 72 332 -70 -126 -12 76 288 -305 -81 -186 320
3888C20j59k55j84L13J37m8l12j51M78Kl24L4K20Q9k96k2k3M23l16k3m40K01L81
$$ 320 161 -94 -278 35 172 124 -188 -339 139 141 -183 -149 71 160 -136 -158 -181 242 -74 -97 -537 -336 45
3911D5J8m48K93k4J85l95N1J61J81o5k75j38N07J09n40K48n4R4K34j70l63L42
$$ 45 63 -385 -92 -116 69 -326 -275 -114 67 2 -273 -411 96 205 -335 -87 -141 -47 187 17 -346 -4
3933dK48m7n35N10k23L54m33M7k9L05k3j89l22J79M72l0m17MM46j36l1m60L73
$$ -4 244 197 -338 172 -51 303 -130 -83 -112 193 170 -19 -341 -162 310 280 -137 -133 313 177 146 -314 59
3956E9J09J51j18o13N85K61k81l33J56M48l3j10q63J59N81N1n43K93p1L49n6k36
$$ 59 168 319 201 -412 173 434 153 -180 -24 424 391 281 -582 -423 158 209 -334 -41 -112 237 181 -55
3978e5J2J44K20k39k89O7N08j38k58J28J20j16j78J01J46K8rl5k98L33L79l91
$$ -55 -43 101 321 82 -207 -140 368 230 -28 100 220 104 -74 27 173 201 192 157 -141 192 571 180
4000A80p39K71R4J52p7k3M8M30J86q25l3N53k51r1M3j77L09N12m79j13m6L34k77
$$ 180 -559 -288 -194 -42 -119 -142 -94 336 522 -303 -336 217 -34 -125 -82 -259 50 562 83 -30 -76 258 -19
4023a9l37n5M41J0L6o19O12j57M46l57l62K8J90L60k13j83J43J62j39l14K20R6
$$ -19 -356 -411 30 40 76 -543 69 -88 358 1 -361 -333 -143 217 4 -179 -36 126 -13 -327 -107 -11
4045a1L75n05j52K8J23L43l5j18J51j56j84J10j70J87p3l77M92k02Lj86J69K97
$$ -11 364 -141 -293 -265 -142 201 166 48 199 43 -141 -31 -201 -14 -87 -464 28 -174 -171 -357 -188 109
4067A09j31j37K11P7R7j82l90O42l62K71l72J2K19P9N3j73o3P7J62L5k64M8j71
$$ 109 -22 -159 52 129 226 44 -346 296 -66 205 -167 -155 64 143 196 23 -40 37 199 234 -30 18 -153
4090a53K12k0j15M0J72j7j01O3l6o3K16j80N85o75J15Q1j39J29r3p8jl0J28j16
$$ -153 59 39 -76 -36 136 119 18 81 45 -18 198 18 603 -72 43 124 -15 114 21 -57 -58 -88 40 -76
4114g6R2K15P8K23p38J52L58Q0k71j54j30K47M0J52o02J52J56J7k97N42n32M72
$$ -76 16 231 309 532 -206 -54 304 384 113 -41 -171 76 116 268 -334 -182 -26 -9 -306 236 -296 176
4136A76K55m73k37J13M40k08k18o5Q4l03N13J91n95O86o88q3Q51q00m0K65N36
$$ 176 431 -42 -279 -166 274 66 -152 -217 -133 -436 77 268 -327 359 -329 -412 439 -361 -401 -136 400
4157D00k24P3n53M01k73J8n00J97O94r31L34N13l4j83l0J31J71l45K08M6j22j30
$$ 400 176 249 -304 97 -176 -158 -658 -461 233 -698 -364 149 115 -68 -98 33 204 -141 67 113 -9 -139
4179a39r4M2K86p0p5k08P5L33j41j40J43J90l72M97n05K83p8j34j40L69m43K0
$$ -139 -233 -191 95 25 -50 -258 -183 150 9 -131 12 202 -170 327 -178 105 27 -107 -247 122 -321 -301
4201c01J87m6K94l4k9L9J27l06p0j1M62l66O4j35P9j93M40m48J07L67O1k43j30
$$ -301 -114 -160 134 100 71 110 237 -69 -139 -150 312 -54 10 -125 -46 -239 201 -247 -140 227 288 45 -85
4224h5J20o2l0K28j14j29mL81k32k89L76P3l38O2j4J85O6J09m77j05N15m4j79
$$ -85 35 -27 -57 171 57 -72 -76 305 73 -216 160 233 -105 -43 -57 128 194 303 -174 -279 236 192 13
4247A3k05j17N91L15q01j42K31K5J83l69K11K33j78J82m53L18l6J91k36k12L65
$$ 13 -192 -309 282 597 -204 -346 -115 -90 93 -276 -65 168 -10 172 -281 37 1 192 -44 -256 109
4268A09J49j49j95j54M31j73o0j06K8Q6k6j15m2L07K16j0l30j54M14J16l62k6
$$ 109 258 109 -86 -240 191 18 -42 -148 -120 -34 -60 -175 -217 90 306 296 -34 -188 226 342 -20 -46
4290d6J02J78l15j11m9J08L95l74j82l7N60l74n8n7R4K91k77Q8k06M04j31p8k55
$$ -46 56 234 -81 -192 -241 -133 262 -112 -294 -331 229 -145 -203 -260 -166 125 -152 -64 -270 134 3 -75 -330
4313c30M47j00R1j86M2k06L95r0L8J0L9j55K0j12M26n1K99o48j50K40K56P4p01
$$ -330 117 17 108 -78 -36 -242 153 63 101 111 150 -5 15 -97 329 278 577 -71 -221 19 275 349 -352
4336c52K74p8N76k59l25m4m4J80j21N1L26M8K8l41m4L05r6l03j21O72np6k95k42
$$ -352 -78 -156 420 161 -164 -208 -252 -72 -193 -142 184 232 260 -81 -125 180 84 -219 -340 332 327 251 -44 -286
4360b86M59j02L67p74O28j21M8j83m5M3R4l74P1K57k05K65o2o9r4jp1rj65K70
$$ -286 173 71 438 -336 292 171 219 36 -9 34 128 -246 -175 82 -123 142 80 11 -83 -84 -155 -164 -329 -59
4384e9P5k6Mj83j86K86q4l7l8J93o9j15K59P0j3Qj23J54m02K59Qn5J33j30K55
$$ -59 16 -10 -6 -189 -375 -89 -173 -210 -248 -55 -124 -239 20 90 77 85 -38 116 -286 -27 -19 -74 59 -71 184
4409A84j00o1j35k87L65J5K30p2j68P0K23l01r9J92o5J37l58J49P6j50J73k07
$$ 184 84 23 -112 -399 -34 -19 211 139 -29 41 264 -37 -136 56 -9 128 -230 -81 -5 -155 18 -189
4431a89j85L57J85j11J34n66L78r9K43j84l36M82q1J67j44k47L08N0j14k64J38
$$ -189 -374 -17 168 57 191 -375 3 -96 147 -37 -373 109 28 195 51 -196 112 162 48 -216 -78
4452g8K71R0l67k56L36J78o9j64m2J59K7j87J32o2J33n1j13N8j91J53nJ7l09L28
$$ -78 193 283 -84 -340 -4 174 105 -59 -101 58 85 -102 30 -32 101 50 -63 -5 -196 -43 -48 -31 -340 -12
4476a2k1J12K31k53P0o3r0k26L83j36P5r4j6J02k8n6l4O3j00L01l73J18K16j81
$$ -12 -33 79 310 57 127 64 -26 -252 131 -5 70 -24 -40 62 34 -22 -56 7 -93 208 -165 -47 169 -12
4500a2j12L76l31JJ42j24j89K83rjq9K81m02K29j95J89k28J52J0PJ49l31J75n0
$$ -12 -124 252 -79 -78 64 -60 -249 34 25 24 -65 216 -186 43 -152 37 -191 -39 -29 -22 127 -204 -29 -79
4524g9K37j09k22L17r4k10R1p7J38K37r2j56M0Nj6K57m93j29M64K74o26p0N18
$$ -79 158 49 -173 144 50 -160 -69 -146 -8 229 137 -19 21 26 10 267 -226 -355 109 383 -243 -313 205
4547B05l15L49n46N0K52J47l05q5K69J42n7l37m9K00N90l80l08L04J04j99k88
$$ 205 -110 239 -307 -257 -5 142 -163 -248 21 163 106 -231 -280 -80 510 130 -178 126 230 31 -257
4568b57L1J64K1N5l21K80K32l04P3k76R9J41K20j88K46k26J0K07l10j05J86L23
$$ -257 -226 -62 -41 14 -307 -27 205 -99 -26 -302 -203 -62 158 -30 216 -10 0 207 -103 -208 -22 301
4590C01j37k38j26nO06j92p80M48L03K19k05k55J60k41J30k8n34Q41l97M92l01
$$ 301 164 -74 -200 -205 401 209 -571 -123 180 399 194 -61 99 -142 -12 -40 -574 267 -130 362 61
4611F1j96K23j90N2M7K17j25J8j15K0J24J7k05J9m1L84l02j93K62k19L71J15m82
$$ 61 -135 88 -102 -50 -3 214 89 107 -8 12 136 153 -52 -33 -74 310 8 -185 77 -142 229 344 -138
4634a38N7J5L42j70j79k0L91l64MN0K81Q1q55L25J88J42j72N7j93M08J6k86r5
$$ -138 -81 -66 276 106 -73 -93 298 -66 -62 -12 269 350 -505 -180 8 150 -22 35 -158 250 266 -20 -115
4657a15Q1j10J02p0K4J17J02l63lL3L4K44p3l69O0L85j74l83P36l53J15J23l61
$$ -115 -34 -144 -42 -112 -88 29 131 -232 -235 -202 -168 76 3 -366 -306 79 -95 -478 258 -95 20 143 -218
4680b18M4K61M32q27R5j4K77J31j98j13J42j78L20j94j48K35m9m19L62L14k36
$$ -218 -174 87 519 -308 -213 -227 50 181 -17 -130 12 -166 154 -40 -188 47 -2 -421 -59 255 19
4701A9lq5k1K46l39K82k17J21O1m1J19l7L9P0m00N6K30M0J74m22j46M18l44j57
$$ 19 16 -69 -90 156 -183 99 -118 3 64 23 142 105 144 214 -186 -130 100 140 314 -108 -254 164 -180 -337
4725c37J88K99j52J3j67J72Q6J77k94j63J43L33q4l90J08m6N57p44J68J36K11
$$ -337 -149 150 -2 11 -156 16 102 279 -15 -178 -35 298 214 -176 -68 -114 443 -301 -133 3 214
4746B14j51q0J4J00K5j11M0j68J88k32J61j41K86j36O9j97k16L92J19k27k84J34
$$ 214 63 -17 -3 97 122 11 51 -117 71 -161 0 -141 145 9 78 -119 -335 57 176 -51 -335 -201
4768b01J72m0J65j81K3N44p30R2M0m8mN9K49k37j73K96K75o52N58k13m26J40L41
$$ -201 -29 -69 96 -85 -62 482 -248 -156 -116 -164 -168 -109 140 -97 -270 26 301 -351 207 -6 -432 -292 49
4791D9j90k45M67j97K60J47m86o9K94j58K22k36J96k9K06l68K86p1J41l64nN9
$$ 49 -141 -386 81 -116 144 291 -195 -264 30 -128 94 -142 54 25 231 -137 149 78 219 -145 -150 -91
4813i1R9J0k30J31j77L82m9k26J31k4j81K66j91N8K9n0l3N8J03j25M23k14j23
$$ -91 8 18 -212 -81 -258 124 75 -151 -20 -44 -225 41 -150 -92 -63 -113 -146 -88 15 -110 313 99 -24
4836b4K43l28L32j04l7J22l2j40j24K77o6k22J13l2k29R6P4J18J46k88R5k3j21
$$ -24 219 -109 223 119 82 204 172 32 -92 185 119 -103 10 -22 -251 -155 -81 37 183 -105 -10 -33 -154
4859a54P37k59l14j45N51j9l18l67M09k1K09j88m57L02L69j74m25K06J62j28j35
$$ -154 583 324 10 -135 416 397 79 -288 121 100 309 121 -336 -34 335 161 -264 -58 104 -24 -159
4880a59L72k41J15l8J93n13J92L87p8j29l54L35K28j33j58k27K90q2r1J0K7N06
$$ -159 213 -28 87 49 242 -271 -79 308 230 101 -253 82 310 177 19 -208 82 0 -91 -81 -54 452
4902D52o33N3K5L0K70j70O5k1n9J35j85m11N59K52j80j56m79K38N92l54r6O9L97
$$ 452 -181 -128 -103 -73 197 27 92 71 12 147 -38 -449 110 362 182 26 -453 -215 377 23 -73 -4 393
4925C93r3p3m12N1K46J8k98j51M17J36j0o75N35R4l6m50J65K44j14L6j56k66O84
$$ 393 300 227 -185 -134 112 130 -168 -319 98 234 224 -451 84 178 142 -308 -143 101 -13 23 -133 -399 285
4948B85k74j5k8P2J89k43r1o9M01k24O4k54J50j50J58J23j71M0J4j71L5K96k07
$$ 285 11 -4 -32 40 229 -14 -105 -174 227 3 67 -187 -37 -187 -29 94 -77 -37 -23 -194 -159 137 -70
4971g0K58k52K11r7nl20J18O13l80K00n88K32K26q5o2j85N34l62j11L20j18k35
$$ -70 188 -64 147 50 45 -275 -157 456 76 276 -312 -80 146 61 -1 -186 348 -14 -125 195 77 -158
4993a58O19k21j92m21K97O6Q3q9J25k7J19l61k24L18J53k43J59J0K9J36k35P3
$$ -158 461 240 48 -373 -76 -10 73 -16 109 82 201 -160 -384 -66 87 -156 3 13 42 178 -57 16
5015A6r6NL10n33L89PJ08k66J37M4O4j23R8J21j05l1k62o4K1L45l31k07R6K59
$$ 16 -80 -75 235 -298 91 98 206 -60 77 121 185 62 160 281 176 145 -117 -181 -160 185 -146 -353 -257 2
5039Bp2J89j56j05K5L21l21J1L90J89l27k12l30N14j31Q7r9J58k20L66m01k97
$$ 2 -70 119 -37 -142 -117 204 -117 -106 284 473 146 -66 -396 118 -13 74 -25 133 -87 279 -122 -419
5061d19N09R9j96l71K01Q5K9O6l88K9O02J28p32J86L28j20n7k1m0lJ04L1k78M16
$$ -419 90 189 -7 -378 -177 -92 -63 3 -385 -356 246 374 -358 -172 156 36 -21 -42 -82 -85 19 50 -228 188
5085A88Ll02l6oL04M9m32j84L82K8J01l22J14j45M91m39k41K87L38J71k53k17
$$ 188 191 -111 -147 -153 151 200 -232 -416 -34 -6 95 -227 -113 -258 233 -206 -447 -160 178 349 96 -121
5107a21l6L30r5l3j44L2K14j89K17k86J81j18jm2L49m4j97j06l5K21j32K82k14
$$ -121 -157 173 78 45 -99 -67 147 -42 175 -111 70 -48 -49 -91 258 214 17 -89 -124 97 -35 247 33
5130C3L03l45J19lj21P8k28K23j47L61j50k0l60K55Pj20J61k24L22j34M8k76M70
$$ 33 336 -9 110 107 -14 64 -164 59 -88 273 123 103 -257 -2 5 -115 46 -178 144 10 58 -218 252
5153B52l45Q1k17P4J82k9J55k41K07P1n5j65Rj89L36M8k59k79J69L92j85j18O2
$$ 252 -93 -12 -229 -155 27 -2 153 -88 119 190 135 -30 -21 -210 126 174 -85 -364 -195 197 12 -106 -44
5176d4J22j78L04k35k17M61j41k06K4M6l07J46J88k9L6L95n95N94k79l8L49n74
$$ -44 78 -100 204 -31 -248 213 72 -134 -110 -64 -371 -225 -37 -66 -30 365 -230 364 85 47 396 -178
5198a78J59L6M9j36m08K09K35J37m0R1r6J74k37j44J54J81k1o02K7M42qjk72K38
$$ -178 -19 17 66 -70 -478 -269 -34 103 63 154 58 232 -5 -149 5 186 165 -437 -410 32 24 23 -249 -11
5222a1L8L32l95K01j53K06k89J12r1J6J05R7k96K9J54k6K96n96K68K6J85j56p8
$$ -11 27 359 -36 165 12 218 -71 41 -50 -34 71 168 -128 -99 55 29 325 -271 -3 23 208 52 -26
5245b6p8M12n09K53k68N4K69j72J3j91L84N8l08O2M4K61j41j87J3K91l69Q6j04
$$ -26 -104 308 -201 52 -216 -162 107 -65 -52 -243 141 199 -109 -47 -3 258 117 -70 -57 234 -135 -49 -153
5268a53K82r4m45L63l5l1K98m81L44J24l85M16l36k48N34k98M26l99k02J67K92
$$ -153 129 35 -410 -47 -82 -113 185 -296 48 172 -213 203 -133 -381 153 -145 281 -118 -320 -153 139
5289A39j43j68J21K73l7o2j73L71l16r3M3K8K61k54L23k71L8N4k12k54P5K60K0
$$ 139 -4 -172 -51 222 185 123 -50 321 5 -88 -45 -17 244 -10 313 42 80 134 -78 -332 -257 3 23
5312B3K99n07mJ89K07l48k74K57q2j88L28j6j8J48J95n48L31j23K8J40N1k28J19
$$ 23 322 -185 -189 0 207 -141 -415 -158 -240 -428 -100 -116 -134 14 209 -339 -8 -131 -103 37 88 -140 -21
5335b1K89l91R3O0k42pJ88K78L7o25K97o8J75J08j76o7R5J94l30M8N4J09l4j71
$$ -21 268 -123 -30 30 -212 -219 -31 247 284 -341 -44 -112 63 171 -5 -72 23 217 -113 -65 -11 98 64 -107
5359a07k1J71l66K88N8k07J03J11M1n7J2qJ04k10q8R2K29k35L83l32L89j99j94
$$ -107 -128 43 -323 -35 23 -184 -81 30 71 14 26 18 122 -88 -176 -84 145 -90 293 -39 350 151 -43
5382d3k71M91q9m0m39L72Pq6k31K45J13N8k97K87j11k4K38j79j5n1L86l62J3j21
$$ -43 -314 177 88 48 -391 -19 -12 -98 -329 -84 29 87 -210 77 -34 -58 180 1 -14 -65 321 -41 -28 -149
5406a49J43O6O9J55k36K17n40J03L15l26K47k68J07J33K48k22J2k63K79J4Jj36
$$ -149 -6 60 129 284 48 265 -275 -172 143 -183 64 -204 -97 36 284 62 74 -189 90 104 105 -31
5428c1R2J76j96j83J11J36j46j14P9P4r0k2J72k76J22R9J03L9j28j14K14l62J02
$$ -31 61 237 41 -142 -31 105 -41 -155 -76 -2 -92 -114 58 -218 -96 3 106 145 17 -97 117 -245 -143
5451a43j31L38QP5k4r8j07K68k44j39L33j30Q7k38OK78P6K2j21J73l97J80q0j66
$$ -143 -274 64 72 147 123 25 -82 186 -58 -197 136 6 93 -145 -139 139 215 237 116 289 -108 72 -8 -174
5475a74M2J78l53P5K51j12L62m00k20L51R9j27k50J67j03L15k11K85j79P6k52
$$ -174 -132 46 -307 -232 19 -93 269 -131 -351 0 99 -28 -278 -111 -214 101 -110 175 -4 72 -180
5496a80R4o6L14l07K02L26k66%k59qJ12L26k10l76J89j2lJ49R7j33p6j34J56m6
$$ -180 -86 -152 162 -145 57 383 117 117 -142 -150 -38 288 78 -298 -109 -121 -124 25 122 -11 -87 -221 -65 -111
5520a11K97k80J64lk37K41j23j6R9l7J74j98n6J45J57j70P9Knj24n1P3k03L00
$$ -111 186 -94 70 67 -170 71 -52 -68 31 -6 168 -30 -86 59 216 46 125 127 122 -2 -53 20 -183 117
5544A17k11K15j55K94l59K23Nl74K21k9K53K80n69J75J12k15rJ99j5l25o0Q4K24
$$ 117 -94 121 -34 260 -99 124 129 -245 -24 -53 200 480 -89 86 198 -17 -26 173 158 -167 -227 -143 81
5567H1j88K64j64l57K91j20J29L24j49k47k30L27K31l60M38k96j83L34P8k78J64
$$ 81 -107 157 -7 -364 -73 -193 -64 260 111 -136 -366 -39 192 -168 270 -26 -209 125 203 -75 89
5588H9j26k8j84J09m4l2K20k24K37Q1l89K93P7K49l51l78J50K44K67k51k69oj12
$$ 89 -37 -65 -249 -140 -184 -216 4 -220 17 98 -291 2 79 328 -23 -401 -251 -7 260 9 -260 -266 -378
5611c78K72r3M0J7k95M77pJ85j37q2o0k47J73M97m42K61k9n0J08j72k56L31k08
$$ -378 -106 -199 -159 -142 -437 40 33 218 81 -1 -61 -308 -135 362 -80 181 152 102 210 38 -218 113 -95
5634i5M57j76k66L37m2l23O7Q0p6j2j36M82k74k8jj8R6k00K36j55j52K41k4j56
$$ -95 362 186 -80 257 215 -108 -41 39 -37 -49 -185 297 23 -5 -6 -24 72 -128 108 -47 -199 42 18 -138
5658a38L10k64J41j1J69m84nL07R8Q1m09k8O1J10jl00J32J62N9JM7L9j08J41j63
$$ -138 172 -92 49 38 207 -277 -282 25 123 204 -205 -233 -172 -62 -63 -363 -231 -69 -10 -9 38 77 -31 110 -53
5683e3J23p2j4j27j75K35L8M24m03p0K2p1J21J04K1j00j45J60p4J6l5J4J13K68
$$ -53 70 -2 -16 -143 -318 -83 -45 379 -24 -94 -72 -143 -22 82 103 3 -142 18 -56 -40 -75 -61 52 320
5707C20r8j38j54Q4J18m59M62l15K52j76k28N77k47k22L17l12L90k38j60K10k00
$$ 320 222 84 -70 14 132 -327 135 -180 72 -104 -332 245 -2 -224 93 -219 171 -67 -227 -17 -217
5728b17J87k1j00nk08K57j75L04q7O2no6j62P28k70m26R9P6J07o1j5j0J02O9K24
$$ -217 -30 -51 -151 -156 -364 -107 -282 22 -65 -3 -8 -74 -236 492 222 -204 -105 -29 78 17 2 -8 94 163 387
5753C87l74j60J10K40k81N0j10k44N83l16O0km7lJ30k66N98p5l30l0O3N3J49k16
$$ 387 13 -147 -37 203 -78 -28 -138 -382 201 -115 -55 -57 -104 -107 23 -243 355 280 -50 -80 -17 36 185 -31
5777c1p2p6N7Q7p3nJ05J31M5j23r0j34K89Q6l18J50k16J85j67M2K0J42k16M39
$$ -31 -103 -179 -122 -35 -108 -113 -8 123 168 45 -45 -179 110 196 -122 28 -188 -3 -170 -128 -108 34 -182 257
5801B57l17L3r2J79R9j60J17L96n10j70M39l49j05J34J16n8N1OJ47k07K87j99
$$ 257 -60 -27 -119 60 159 -1 116 512 2 -168 271 -78 -183 -49 67 9 60 66 213 6 293 94
5823I4j45K4R8K1N7k08j2J7l04L32J29J92j79l98J89J04O6R9n27p7J61q3M43k8
$$ 94 -51 -27 71 92 149 -59 -71 -54 -358 -26 103 295 116 -282 -93 11 77 176 -351 -428 -267 -350 93 65
5847F5J62l34j61L55m92K94k8R1J20o2k56K33M4OK73k13q8M2j11J92j01j24K82
$$ 65 227 -107 -268 87 -405 -111 -139 -48 72 10 -246 -13 31 37 310 97 9 51 -60 132 31 -93 189
5870A89l21L87n16P8K22m2j45K18o6p6mJ65l1k05P5J70l00lN01p02P01j77J8m37
$$ 189 -132 255 -261 -183 39 -3 -148 70 4 -72 -76 89 58 -147 -72 98 -202 -205 296 -406 295 118 136 -301
5894c01R8L75J6l75J41j5J2l4R2q1R4p4M34l67LJ45l94K61k46j15L29K17l82J80
$$ -301 -203 172 188 -187 -46 -61 -49 -83 9 -72 22 -52 382 15 18 163 -231 30 -216 -331 -2 215 -167 13
5918A3J75J63j05m15j36J02J61j20K63Rl8j89J69j76Q2L58m35K3J34L23l27K16
$$ 13 188 351 246 -169 -305 -203 -42 -162 101 110 72 -117 52 -124 -42 316 -119 -96 38 361 34 250
5940B50j26K18l93K46k97k0K62n8O4j74K82l82J32J59j79p7n3J83q3j48K44J05
$$ 250 124 342 -51 195 -102 -122 140 82 146 -28 254 -128 4 163 -16 -93 -146 37 -46 -194 50 155
5962A55k49j30K73k9J54j26l6n2l0j57J96p8j17O56l97L3K03J6l34J78k83L36
$$ 155 -94 -224 49 20 174 48 12 -40 -70 -227 -31 -109 -226 430 33 66 269 285 -49 129 -154 182
5984A82L7j64m96L88J64j24N54l22k28n9l15K17J60l3J21j34J18N5J93l17K78
$$ 182 219 55 -441 -53 111 -13 541 219 -9 -68 -383 -166 -6 -39 82 -52 66 121 314 -3 275
6005B75m18j20K59J7j55J33r4J26J88l86k9L10m04L62k42J34L8J06l71J88M75
$$ 275 -143 -263 -4 13 -142 -9 -103 23 211 -175 -204 106 -298 64 -178 -44 -6 100 -271 -83 392
6026C92k07j50n5k26M32k16j55L13l17N0LM10k31j03k8j1m6Q4J47l27L23M9k51
$$ 392 185 35 -20 -246 186 -30 -185 128 -189 -139 -136 274 43 -60 -88 -99 -145 -61 86 -241 82 131 -120
6049a20L17j71p7LJ99j80K44m74k9L75j07q4K47k53K83m8p9J63k81k68N52l02
$$ -120 197 26 -51 -48 151 -29 215 -259 -288 87 -20 -104 143 -110 173 125 46 209 -72 -340 212 -90
6071i0J29o6%J93l37L01qk02L3N0o0J24l3q3n9L2J32j81q1J09L66k55M7j72jQ5
$$ -90 39 -27 -27 166 -171 130 122 -80 -47 3 -57 67 34 -49 -108 -76 56 -125 -206 -97 269 14 61 -111 -112 -27
6097b7k4K0J77j31J85Nk69K45j10r4J9O1m14N29k51Mk60L79J4J75Pm69M4L26k56
$$ -27 -51 -31 146 15 200 205 -64 181 71 -23 -4 57 -357 172 -79 -75 -335 44 58 233 240 -229 -185 141 -115
6122a15j33oM47k82J36Q2k45J86m16K93J57P7l39K55o2Q0j79K52m62J39L12rk23
$$ -115 -248 -254 193 -89 47 129 -116 70 -346 -53 104 181 -158 97 35 115 -64 188 -274 -135 177 168 -55
6145e5J35j09Q5O4j78l00L61J46k05K35j69J93l27K00n9j27n9K64M5l56J78K8
$$ -55 80 -29 56 120 -58 -358 3 149 -56 179 10 203 -124 76 17 -110 -169 95 140 -216 -38 -10
6167a0jq0N10j96j19k08n5L08k5j68L15j46m09K06mj3M1KK5q0J58n6j07J1L23
$$ -10 -11 -91 419 223 104 -104 -159 149 124 -44 271 125 -284 -78 -82 -95 -54 -52 -27 -107 51 -5 -112 -101 222
6192B22r1J2J56m24L31n22K95l0k9j47J51n0L12j61K81k20J7O5k31j28J08J26
$$ 222 131 143 299 -125 206 -316 -21 -51 -80 -227 -76 -126 186 25 306 86 103 168 -63 -191 -83 43
6214D3l47M43j93J20k9p8P7J67l31l1J9K07j31l64K04P60m99K2J77k45J57k35
$$ 43 -304 139 -54 66 37 -41 36 203 -128 -159 -140 67 -64 -428 -224 536 37 59 236 -9 148 -87
6236h7L50k34K48l33L09m25O1n8L29l4J64k43j51N34n63J13j93N60k80J99l89
$$ -87 263 29 277 -56 253 -172 -111 -169 160 126 290 47 -104 430 -133 -20 -213 347 67 266 -123
6257a23J12k45K74p7j1j16K60r9K64j13j90J4j13K34J20q6k10J04j99N56m91K42
$$ -123 -11 -256 18 -59 -70 -186 74 -25 239 126 -64 -50 -163 71 191 105 -105 -1 -200 356 -135 107
6279A07j2j89N0K33l61j17K73N3j23%J14J40m2J7k42J25O2J01rn3j91K83j63L13
$$ 107 95 -94 -44 189 -172 -289 -16 37 -86 -86 28 168 126 143 -99 26 88 189 180 127 -64 219 56 369
6303C69k95O4k44r1K48j70j34J65N91q24O6o0J82K85m74J58J37k9R7p1n9j02K18
$$ 369 74 138 -106 -197 51 -119 -253 -88 503 -321 -255 -315 -133 152 -322 -164 -27 -56 41 -30 -89 -191 27
6326B7j0j5j2K4k12N66l01l57J28J68k4pl3j31K57o6j6K14l21J68j2k50M3K1L45
$$ 27 17 2 -10 14 -198 368 67 -290 -162 6 -18 -25 -58 -189 68 2 -14 200 -121 47 35 -215 -172 -151 194
6351A94j09l90L57l3R3j44l4k37K47m7j49J28Rk94Q5O8K37k7J65j12K3j4j56K16
$$ 194 85 -305 52 19 112 -32 -66 -303 -56 -103 -252 -124 -115 -409 -324 -256 -19 -46 119 7 30 16 -140 76
6375G6N7k54j29L41m7j19k15K80j9M2R8j50l3j40R9M49k42l54M78k27Kk6R3k5
$$ 76 133 -121 -250 91 44 -75 -290 -10 -29 13 111 -39 -72 -212 -113 336 94 -260 218 -9 -7 -33 60 35
6399C5Q5k67m6K76p0k20K42k75Q0L59k33L1K31M9k68J48l38P4N5K21k78Q4j14
$$ 35 120 -147 -193 83 13 -207 35 -240 -160 199 -34 -3 228 277 9 157 -181 -107 -52 169 -109 -25 -139
6422a39R8l43J94K64l33j50M58J1k8J73j04j19J87k20J58r2k15K57J71M9m91O0
$$ -139 -41 -384 -190 74 -259 -409 49 60 32 205 101 -18 169 -51 107 15 -200 57 228 277 -214 -154
6444a54k08O4L71P6j42L99l49j09R2J36k27K07o6j30oJ76l20M69m04J7J05L81
$$ -154 -362 -298 73 149 7 406 57 -52 40 176 -51 156 90 -40 -46 130 -190 279 -125 -108 -3 378
6466C78m81K7p1L1K53j88K54N1l05l83K88J21k9J36J79j96K21n2o3k31j87L16
$$ 378 -103 -76 -147 -116 137 -51 203 254 -51 -434 -146 -25 -54 82 261 65 286 234 171 -60 -247 69
6488F9k51K74n1o5J03j74K25j37j70J66L03k46l62M54n5rq1j85K92k27Q0m3j42
$$ 69 -182 92 41 -24 79 -95 130 -7 -177 -11 292 46 -316 138 83 74 -7 -192 100 -127 -47 -90 -232
6511b32q4PK97k8k15J21K13K07m41j09Q8L28j72L95m89J63J69l02j24K12j07L1
$$ -232 -316 -309 -12 -40 -255 -134 79 286 -155 -264 -176 152 -20 375 -114 49 218 -84 -208 4 -103 -72
6533g2J51k79qM20j94n1Jo5p6J93j38J33J05q3j85J99l14K84J44k3q6K92j81k
$$ -72 79 -200 -208 212 18 -33 -32 -97 -173 20 -118 15 120 37 -148 51 -263 21 165 142 56 348 167 165
6557A65j06r8J93q5n8j76M57k55j1o0m0J1j46K00J49k26J31K59J07n61K40J7j44
$$ 165 59 -39 154 69 11 -165 292 37 26 -34 -74 -63 -209 -9 140 -86 45 304 411 -150 90 107 -37
6580c7n3J26o0j56n3J12L91j72L37m04L3j81R0j05J21l03M83l98K81j63J30k78
$$ -37 -90 36 -24 -180 -233 -121 270 98 435 31 64 -117 -27 -132 -11 -314 169 -229 52 -111 19 -259
6602b59L30J06k91J05J9K23l89Q9m9J29K00l59K38J90n27K43k12N36j69j9O8m07
$$ -259 71 177 -114 -9 10 233 -156 -67 -116 13 213 -146 92 282 -245 -2 -214 322 153 134 202 -205
6624b05L32j7k23J53J79j38k61K88j38J87l85M6M11m24J60L80r4k12L2M0J17l97
$$ -205 127 110 -113 40 219 81 -180 108 -30 157 -228 -182 229 -195 -35 345 251 39 71 111 228 -169
6646a69ML51j81J05K4k92M28l00O7J9k54J56k78N21o2l63K73M0k78K87j43J86
$$ -169 -165 186 5 110 134 -158 270 -30 37 56 -198 -42 -320 201 139 -224 49 89 -189 98 -45 141
6668A41r1Kj47p9L6M33k79R8l31K65J17k39j9K5J7m5N4k59P2J77J31K37KJ61m71
$$ 141 50 52 -95 -174 -138 295 16 114 -217 48 165 -74 -93 -68 -51 -96 -42 -301 -229 -52 79 316 318 479 8
6693HR0j8j81J76o8K13l43j28j2M95p3k86j03M03N5k48j72J61Q7O0j44j21l5J31
$$ 8 98 80 -101 75 7 220 -123 -251 -263 232 159 -127 -230 173 228 -20 -192 -31 56 116 -28 -149 -184 -53
6717e3Oj14j50L41k47J56p7L9K36j14o4j8p5J74j29J16J38k83J06j45N0Q8k16
$$ -53 -47 -161 -311 30 -217 -61 -138 -99 137 23 -41 -59 -134 40 -89 27 165 -118 -12 -157 -107 -19 -235
6740b35J77k03K21J05k87K27K3k72K65j17J38j41R7r4J06j49K1K32J16k39L78
$$ -235 -58 -261 -40 65 -222 5 28 -244 21 -96 42 -99 -2 -96 10 -139 -118 114 230 -9 369
6761C69k33P4j31j27K12N9l17N9K4J77n07L60j16M6K89L07m10p1K34n88K54J64
$$ 369 136 210 79 -48 164 223 -94 -35 -11 166 -341 19 -97 -51 238 545 135 64 298 -290 -36 128
6783A28l68M18l34J98J72l30j30L06R2j21L7j30l34K21K65j57J96k17J13O4r0
$$ 128 -240 178 -156 42 214 -116 -246 60 152 31 68 -62 -396 -175 90 -67 129 -88 25 89 -1
6804aP5k50N60m7l13M4k97P2l1K05lQ2l70L41j49L8Q5K36q0k78K24j84k47J80
$$ -1 74 -176 384 337 24 68 -229 -157 -188 17 14 96 -274 67 -82 -44 41 277 197 -81 143 -41 -288 -108
6828a08J40j3J85m18J63K18L3l8k50J0N7O3O7l43K58k08L79j22k17Q3N4k01L76
$$ -108 32 19 204 -214 -51 167 200 162 -88 -78 -21 42 109 -234 24 -184 195 73 -144 -61 -7 -208 168
6851A68j97J0K42Kl82L4N01k03m53O6J94J9l8k87qN58o6m26J91o8J08J09j82q2
$$ 168 -29 -19 223 225 -157 -123 378 175 -278 -212 -18 1 -37 -324 -332 226 160 -266 -75 -143 -35 74 -108 -190
6875a90M98m49J30k99N50k26M6j1k06O0M78l41k27K76k19J52j35K76k86J92J32
$$ -190 308 -141 -11 -310 240 14 60 49 -157 -97 381 40 -187 89 -130 22 -113 163 -123 69 201
6896B01k76jJ88K03n63O6K49k53K66j39Mk84M78j55Lp2J70k36PL70k43J10k64
$$ 201 -75 -76 112 315 -248 -182 67 -186 80 -59 -55 -339 139 -16 -13 -85 85 -151 -144 226 -17 93 -171
6919a71j37J23N5K10j85N8m7K31q2l78L42j03J7k3J00p1j39L66j85j20K84l26
$$ -171 -308 -185 -130 80 -105 -47 -94 137 55 -323 19 -84 -67 -90 10 -61 -200 166 -19 -139 145 -181
6941a81J31m7O7rK29q5Mk65K41l7K43j78k55K42k08j3L11o8k0OK60l47j64K47
$$ -181 -50 -97 -30 -39 190 105 109 -156 85 48 291 113 -142 100 -108 -121 190 122 102 108 368 21 -143 104
6965A04l84L48m04N49L6m95M5K07J94r4j03j61K15Q0n6J9p6P2k35K06Lq6o8R4
$$ 104 -280 68 -336 213 249 -246 -201 6 200 106 3 -158 57 137 81 100 24 96 -139 67 70 -16 -84 10
6989A0j17J04Qo4K11k08k16N95j56k22J04O8k7q4Q0q9J86k20J81k83M01m02L28
$$ 10 -107 -3 5 -59 152 -56 -272 323 167 -55 49 117 90 6 86 -3 183 -37 144 -139 262 -140 188
7012A88m12K91q2m4J65o5K3r0k44k0L34k59J72J40k5l53R7J39M6r0K13ok82K85
$$ 188 -224 67 -15 -59 106 41 64 -26 -270 -290 44 -215 -43 97 72 -281 -184 -45 1 -89 124 118 -164 121
7036A21j49J57j52q9R4j45K86j47j50J76o1J64k79K45j33j28J09J0R3r3J99p1
$$ 121 -28 129 -23 -112 -18 -163 123 -24 -174 2 -59 105 -174 71 -62 -190 -81 -71 22 -71 128 57
7058E7j47j45L09J28j18l96O07m78L12k87K42k1P3l24j75R8K87L6J14k79PM2J27
$$ 57 -90 -235 74 202 84 -312 295 -183 129 -158 84 63 136 -188 -363 -265 22 58 172 -107 -100 -58 69
7081F9o9j91K01j35L56l15k9P6k09J23p2K88J4J06j57j92O4L5n1L7Q9k7j5k41
$$ 69 0 -191 10 -125 231 -84 -113 -37 -246 -123 -195 93 107 213 56 -136 -72 -37 -88 -51 38 11 -4 -245
7105b45L50l47M35j4k71j93J80j56M70j03J0j48K02k75J12J5jJ58m1p8j29K23
$$ -245 105 -242 193 179 -92 -285 -105 -261 209 106 116 -32 170 -105 7 22 21 179 138 60 -69 154
7127A54n97M02j45J63M2k8l86J77K11nJ24j21p9M0Q4Q0j70M6k68M26l88P4R4N0
$$ 154 -443 -41 -186 -23 19 -9 -395 -218 -7 -12 112 -9 -88 -48 36 116 -54 -8 -276 150 -238 -164 -70 -20
7151b0L49P5k67k75K09j41J29k16p6jP4K3J52qJ70l26j18J76j67L30k8q7J04n5
$$ -20 329 404 137 -138 71 -70 59 -157 -233 -234 -160 -137 15 7 177 -149 -267 -91 -258 72 44 -43 61 6
7175Fr0K05j95J45k07J94Pl52L15l6J04j26M01l76r4J48l30M06j45J16K27j45
$$ 6 -84 121 -74 71 -136 58 65 -287 28 -8 96 -30 371 -5 -99 49 -281 125 -20 96 323 178
7197A78j95q4J90k88K16p9j96L4J85r4N8KJ37j9K25m04L97k99j63M28r0k84K93
$$ 178 -17 -101 89 -199 17 -62 -258 -224 -39 -133 -75 -73 64 45 270 -134 263 -36 -199 229 139 -145 148
7220A48J79k03l2Q1l09J20L0m4R7j20J70l81L16J92l98o1L02l09K49k15J7M9J30
$$ 148 327 124 92 173 -136 -16 14 -30 67 -53 117 -264 52 244 -154 -215 87 -222 27 -188 -171 -122 8
7243HQ9j35q2O3M00o59J42J25j3j52L00j34J99k98j06K42j91n1l6K68j32K13k90
$$ 8 97 -38 -120 -57 343 -316 -174 -49 -62 -214 86 -48 151 -147 -253 -11 -202 -253 -289 -21 -153 60 -230
7266b30K42J7q3J19k69M62j40j41Kj12n4J17k59J89R1j20J71k2Q8k11QJ49m43
$$ -230 12 29 -54 65 -204 258 118 -23 -21 -133 -187 -70 -329 -140 -49 -169 2 -20 68 -143 -135 14 -429
7289d29L99m2N9l82M85k64L3q1M08o7K00j88L2j6p6Q8k8j07J30j71K2k9L5J56
$$ -429 -30 -72 -13 -395 90 -174 -141 -222 186 119 319 131 163 147 71 159 131 24 154 -17 5 -24 11 167
7313A67j19J42l89K49K43j54k0j80L0Q1Q2j02%j85n1Q5m7q4K82o9L5m5J11k9k91
$$ 167 48 190 -199 50 293 139 119 -61 -31 50 132 30 30 -155 -206 -121 -168 -252 30 -39 -4 -49 62 33 -258
7338b58J29K73n3k18L7J36Jk06l6L14J38l89J06N5O6j55N5l68J87L0L24l22J57
$$ -258 -129 144 91 -127 -90 46 47 -159 -195 119 257 -132 -26 29 95 -60 -5 -373 -186 -156 168 -154 3
7361Cj47k02K37J8N6N8k77J09L6j56L92j65R5q2O8k3K2j49K45k17K62j8l62J79
$$ 3 -144 -346 -109 -91 -35 23 -254 -145 -109 -265 127 -38 57 -25 43 20 42 -107 138 -79 183 165 -197 -18
7385a8J97k5j67l23L19J76k18K2o4M00k41O9q0j69K30m6M1j52l8K8L96j50l98
$$ -18 179 154 -13 -336 -17 159 -59 -37 -101 299 58 127 47 -122 108 62 103 -49 -87 -59 337 187 -211
7408b11R8L03mm07L88j93J63n2L5M8k13K00Rm4J4k58L78k23J7l9J13j87j52K30
$$ -211 -113 190 186 -221 167 -26 137 85 120 168 -45 155 164 120 134 -124 254 31 48 9 122 -65 -217 13
7432A3j71J68K4J34l31J85j59K33m05M10k32M3J12P0R1o7j03J16k41K87l8k26
$$ 13 -158 10 34 168 -163 22 -137 96 -309 101 -131 -88 24 94 185 118 15 131 -110 177 139 -87
7454h7j1nL11k06Q9JM6j10j86J58k66L71j94K67j96M9m8k13M16k98L70l21M9M96
$$ -87 -98 -103 208 2 91 92 138 28 -158 0 -266 105 -89 178 -18 31 -17 -230 186 -112 258 -63 -14 482
7478D82n40K24j58k41L19j91P6k55M29L6o7j76L95n91M7Q4K8J54J49m5k77R5j0
$$ 482 -58 166 8 -233 86 -105 -29 -284 145 181 114 -62 333 -258 -211 -127 -99 55 204 159 -118 -23 -33
7501c3J62l31J28J18j3j3P8j7p9J68j41j35J28Q7j25j12J73p0MK80n87N36l07
$$ -33 129 -202 -74 44 31 18 96 79 0 168 27 -108 20 107 -18 -130 43 -27 -23 257 -330 206 -101
7524a01K58j16n4J84j76p7K18l63N88m05K1J50O8j32m8r9R7j07J71J44l45K69
$$ -101 157 41 -13 171 -5 -82 136 -227 361 -44 -23 127 195 63 15 -84 13 -94 77 221 -124 145
7546A45j97P2Oj33RJ39K08m26O8j84L9J51Q2NL2j6j19K23j03m8j83L11m09J79
$$ 145 -52 20 26 -107 -98 41 249 -177 -109 -293 -254 -103 -21 -16 16 0 -119 104 1 -47 -230 81 -328 -149
7570a49L81k03k00j0J2j2J64J57j18n0k49L39p2k24J91O9R7j18l3j83K80j54L38
$$ -149 232 29 -171 -181 -169 -181 -17 140 22 -28 -277 62 -10 -234 -43 26 123 5 -28 -211 69 -85 253
7593B53l24j51K01K34m14M04k71j15m9N1K60n4j52Q1kj00L47l17LJ09N6L5l27
$$ 253 -71 -222 -21 213 -201 203 -68 -183 -232 -181 79 25 -127 -46 -48 -148 199 -118 -115 -6 50 85 -242
7616b42M26j91k84L81r9k32L18n47L39rJ78j09J17j67l47M64Q7L4P5k54j38J92
$$ -242 184 -7 -291 90 -9 -241 77 -470 -131 -140 38 -71 46 -121 -468 -4 83 117 192 -62 -200 -8
7638hr6j3j66K16J44k8r3K48j98l1J90o1l2M0k18J38K52n43K45M64o09J55J95
$$ -8 -104 -117 -283 -67 77 49 -44 204 6 -25 165 104 72 112 -106 32 284 -259 -14 450 -159 -4 191
7661A91k62J2J85l54L95k12k95L6K3L56J08Q6l38j77K34R6k10R0q4QK90m05J75
$$ 191 -71 -59 126 -228 167 -45 -340 -304 -281 75 183 269 -69 -246 -12 84 -126 -36 -120 -112 178 -227 -52
7684e2rJ47L19n63J90j86K47J29j35n8j86RJ03j35J62J14j75N8K9P3L4r6j85Q5
$$ -52 -61 86 405 -158 32 -154 93 222 87 29 -157 -148 -45 -180 -18 96 -79 -21 8 81 115 19 -166 -81
7708h1J46P4n20J88J89K06J97k72p7p0Q9m2k73L16o1K43j87m5q5K50k81p8R0K05
$$ -81 65 139 -381 -193 -4 202 399 127 50 -20 69 27 -246 70 9 252 65 20 -65 185 -96 -174 -84 121
7732A21k17J2J3k28J30p7K25k64J58j03K40r1J16O0l77N01l44m4K16k33L00j17
$$ 121 -96 -84 -71 -299 -169 -246 -21 -285 -127 -230 10 -81 35 95 -282 219 -125 -169 47 -186 114 -3
7754cn6j84J74j51N36q6m26L36%J26l01L46l2j65K17o7k59r7j78k23R14o20K93
$$ -3 -59 -243 -69 -220 316 230 -196 140 140 266 -35 311 279 114 331 264 5 -92 -270 -493 421 -199 94
7777I4L7k62J9L3J96n9k51J78J35l02k78M02K46K0k21n1J40j96K48o9%N3j0K32
$$ 94 131 -131 -112 -79 117 58 -193 -15 120 -182 -460 -58 188 208 -13 -64 76 -120 128 59 59 112 102 334
7801C34l68K67l0l40J67l58M21k83j64M73J08k54K49l24J99J37j07j23L2k26P9
$$ 334 -34 233 203 -137 30 -328 93 -190 -354 119 227 -27 222 -102 97 234 127 4 36 -190 -111
7822a11K34M8k22o8L22k32J09q3j51k8KL86o3k55r5J86J47q6L6Kr2l37N26k52
$$ -111 123 171 -51 -119 203 -29 80 -3 -154 -182 -180 206 143 -112 -207 -21 126 40 76 78 -14 -351 175 -77
7846g7J67q9k48K21K7k54K09L03k15K20k87k82L5L76l04K53no8o2M6L21k82J36
$$ -77 90 1 -247 -26 1 -253 -44 259 44 264 -23 -305 -270 106 -198 55 50 -18 -80 -34 287 5 141
7869A41J5mqj79j1j41L6J65k5j95M33l50J06j48K22rk59J06N5K28k44J80m11K88
$$ 141 156 152 144 -35 -46 -187 -151 14 -11 -206 227 -123 -17 -165 57 48 -211 -105 -50 178 -66 114 -297 -9
7893iL53j14m73L33L63k59l40P7p6L48j08J28o8p6q4n0L48j3k27jJ82o7o5m9k17
$$ -9 344 230 -243 90 453 194 -146 -69 -145 203 95 223 155 79 -5 -55 293 280 53 52 234 167 102 53 -164
7918a64J99k02L33j79J35k37K7Q6N9J47l00J00J10n3j86J37l5m4k0K20j44j56
$$ -164 35 -167 166 -13 122 -115 -88 -2 57 204 -96 4 114 61 -125 12 -23 -67 -87 133 -11 -167
7940a67m5J71Rk47M50k31Qj88Q0j46j06M90k38L71Po15K01Q1K1p2N0J03Jj5p7
$$ -167 -212 -41 -32 -279 171 -60 -52 -240 -160 -306 -412 78 -160 211 218 -397 -196 -115 -94 -166 -116 -13 -12 -27 -104
7965a04M5M9j33K07O5k55R6K04J6m24R5J54j84L43Lr7l00J7K11k94M33k29j23
$$ -104 -59 -10 -143 64 129 -126 -30 174 190 -234 -139 15 -169 174 177 80 -220 -203 8 -286 147 -82 -205
7988b05K32JK3k77M69k13o9n8K03M5r4q6j3J05M4j37R1j09p1J06K0J49r0kj60
$$ -205 27 28 51 -226 243 30 -39 -97 106 151 57 -29 -42 63 107 -30 61 -48 -119 -13 7 156 66 64 -96
8013i6K01l86L89k12P6l02L67K42m13P2J39kK1k20N7J86Q9Om9n9K12l54R6M7J55
$$ -96 105 -281 108 -104 -28 -330 37 279 -134 -62 77 75 96 -124 -67 119 208 214 165 106 318 -36 60 107 262
8038B62q9j21K25j69k80K51K43m20J19N1j63J11n9Q5R3l62L52pJ92m51R6m5K86
$$ 262 173 52 277 108 -172 79 322 -98 21 72 -91 20 -39 46 139 -223 129 122 314 -137 -41 -86 200
8061B00Ol10K61j94J97j86K78k36J01l33L0L80k67J96q0m2j21j77L44J50K5j41
$$ 200 206 -104 157 -37 160 -26 252 16 117 -216 -186 194 -73 123 43 1 -120 -297 47 197 222 81
8083H1q9k11k00J96M60k71o2K70l81L53j49j13L0lQ4o5J38k56L30k09J35n7L0
$$ 81 -8 -219 -419 -223 237 -34 -96 174 -207 146 -3 -116 -86 -89 -5 -70 68 -188 142 -67 68 11 41
8106D1q1M0Pn0l4K4j95K67K14l68L24m46L65j19J83M1k54L15l28L25l18J55Ro0
$$ 41 -40 0 7 -43 -77 -53 -248 19 233 -135 189 -257 108 -11 172 213 -41 274 -54 271 -47 108 117 57
8130E7Jj56j12M35j12k22lk9K07j69j1P1J76k58K23J02j38k01m6j46K72j34q9
$$ 57 58 -98 -210 225 113 -109 -112 -141 66 -103 -114 -43 133 -125 98 200 62 -139 -185 -331 -59 -193 -282
8153b82N3L43j29O2j52R8P5k54J55L13m40J94l2k93M7k0J89j40K23j51K8m4K84
$$ -282 -229 114 -15 47 -105 -7 68 -186 -31 282 -158 36 4 -289 -242 -262 -73 -213 10 -141 -113 -157 127
8176A27j28k4%J1K15l61J11K35l17J57q9P7L7j39m1
$$ 127 -1 -25 -25 -14 201 -160 -49 186 -131 26 -63 14 51 -88 -129
8191a29
$$ Imaginary data points
##PAGE= N=2
##DATA TABLE= (X++(I..I)), XYDATA
0@%%%%%%%qJ6j6J6j6K4l2L4m2M9n7P2q8J04j20J36j54J79k09K36k65L03l44L86
$$ 0 0 0 0 0 0 0 0 -8 8 -8 8 -8 16 -16 18 -24 25 -32 40 -48 56 -64 72 -82 97 -112 124 -141 162 -182 204
31B04m34M89n47O10o81P59q42R33j036J148j271J407j558J726j914K126k365K639
$$ 204 -230 259 -288 322 -359 400 -442 491 -545 603 -668 739 -819 907 -1007 1119 -1246 1393
49A393k956L333l782M327n010N890p080Q787j1460J6273k7630J02126Q3833j91998
$$ 1393 -1563 1770 -2012 2315 -2695 3195 -3885 4902 -6558 9715 -17915 84211 168044 -23954
63b3954o0405R1541R1628q7515j05480M0314J41698J9259j17626p7528Q5574J08252
$$ -23954 -84359 7182 98810 11295 -94185 -53871 87827 107086 -10540 -88068 -2494 105758
75A05758k8078j23865l0451R1907O2288o8448p5105N2506J16073R03j15564o5477
$$ 105758 77680 -46185 -76636 15271 77559 9111 -65994 -13488 102585 103488 -12076 -77553
87g7553O9158P7297l6138q1733J4073R2722K5115q4249o6024M8076Q0604j4872
$$ -77553 -8395 68902 32764 -48969 -34896 57826 82941 -1308 -67332 -19256 61348 46476
99D6476q3511j9445P3848N1170m4235o0263K5037P1273K564p9553n0085M6804
$$ 46476 -37035 -56480 17368 68538 24303 -35960 -10923 60350 62914 -16639 -66724 -19920
111a9920O8128j0314o2819o460O5312L1089o2185o9127K6090P8445Q353o8173
$$ -19920 48208 37894 -24925 -31385 33927 65016 2831 -66296 -40206 38239 46592 -21581
123b1581k9621O0095N5673l4048o6235M666O1464J3847o0467m2573M0130O4162
$$ -21581 -51202 8893 64566 30518 -35717 -31051 30413 44260 -16207 -58780 -18650 45512
135D5512k646n6158j9655M1660K7643l8733m9250J6007N7192J0165m6110k1806
$$ 45512 42866 -13292 -32947 8713 36356 -2377 -51627 -35620 21572 31737 -14373 -36179
147c6179M2208M2515k1792m9751k552L7464N500l9126j7831L9154L9025j9108
$$ -36179 6029 48544 26752 -22999 -25551 11913 17413 -21713 -39544 -390 38635 19527
159A9527m4662j072L6340R708l3192j9144K8016K9481j7990l6292N894M1491J6073
$$ 19527 -25135 -26207 10133 19841 -13351 -32495 -4479 25002 7012 -29280 -23386 18105 34178
172C4178l3043k9193J6873L1304o306l3666l821L6994K0210l3086m0437J1024
$$ 34178 1135 -28058 -11185 20119 13813 -19853 -23674 13320 33530 444 -39993 -28969
184b8969M2243P005l4641j4346L3034K7114k2665l6876P724L9249R248l4123k3459
$$ -28969 13274 20279 -14362 -28708 4326 31440 8775 -28101 -20377 18872 28120 -6003 -29462
197b9462J9636K9116p296k8205j218K8842J2744k7201k8650R483L0669M558k3735
$$ -29462 -9826 19290 11994 -16211 -17429 11413 24157 -3044 -31694 -22211 8458 13016 -10719
210a0719r277K3280J8638j8656k8261P292L2750P066k7854j8455J8678K3127j1731
$$ -10719 -19996 3284 21922 3266 -24995 -17703 15047 22113 -5741 -24196 -5518 17609 5878
223E878k6750K598K9290P257l0024k3968J7557L0590p29k6123o025K4405J5586
$$ 5878 -20872 -18274 11016 18273 -11751 -35719 -18162 12428 11699 -14424 -20449 3956 19542
236A9542k0009k6112Q524L1218O870k8368k1214J7067K6764n487k7880l572K6992
$$ 19542 -467 -26579 -18055 13163 20033 -8335 -29549 -12482 14282 8795 -19085 -22657 4335
249D335J2635k4490k5557J2359L0278K403k5138r707J9859J6625j2648j9218N556
$$ 4335 16970 -7520 -33077 -20718 9560 11963 -13175 -22882 -3023 13602 954 -18264 -12708
262a2708K2097L370j9948j3146J1344J5072n047j4787L56J5214L880j5209j0559
$$ -12708 9389 12759 -7189 -20335 -8991 6081 1034 -13753 -13397 1817 5697 -9512 -20071
275b0071J1666J5760l423j4410J096J5127L291j5673q948J4100J5408q898j8734
$$ -20071 -8405 7355 3932 -10478 -9382 5745 9036 -6637 -15585 -1485 13923 5025 -13709
288a3709J787J9091M516j8217j0196J5117J5566j0324k1735J000K2368J0899j4875
$$ -13709 -11922 7169 11685 -6532 -16728 -1611 13955 3631 -18104 -17104 5264 16163 1288
301A288j3603J0807J8535m139k1956n452K0269J5715j4257k1450M048K2144L973
$$ 1288 -12315 -1508 17027 12888 -9068 -14520 5749 21464 7207 -14243 -10195 11949 15922
314A5922k1100j1032J7960J8345j2167k4286K597K6428R364k0113j4366J4933
$$ 15922 -5178 -16210 1750 20095 7928 -16358 -13761 12667 22031 1918 -12448 2485
326B485J9391r334k4904o20K5953J2227j9534k1413J0238K4214j332k6679q757
$$ 2485 21876 12542 -12362 -12982 12971 25198 5664 -15749 -5511 18703 17371 -9308 -18065
339a8065K4006J9743j7150k8480N130L3521J0743k8137k1414J9645K9320r795
$$ -18065 5941 25684 8534 -19946 -14816 18705 29448 1311 -20103 -458 28862 19067
351A9067l5768m728L4683K1013k6345l3263J1381L6505L478l4770j8713K7173
$$ 19067 -16701 -21429 13254 34267 7922 -25341 -13960 22545 26023 -8747 -27460 -287
363b87L0568j4326l6868j766L6898J9732k7446l1834J3663L5910J794l5987j7187
$$ -287 30281 15955 -20913 -22679 14219 33951 6505 -25329 -11666 24244 26038 -9949 -27136
376b7136K9354K9456j6997l7169P60L5740J3108k9822k5385J8558L2732m340l3101
$$ -27136 2218 31674 14677 -22492 -21732 14008 27116 -2706 -28091 -9533 23199 18859 -14242
389a4242p679L0289K0289k0848k8873P304L0563N274k8060j6692K0798K5657j0482
$$ -14242 -21921 8368 28657 7809 -21064 -13760 16803 22077 -5983 -22675 -1877 23780 13298
402A3298k9794k458K8558J3657k4193k4144J3383L0256m06k7780r559K5923K0496
$$ 13298 -16496 -18954 9604 23261 -932 -25076 -11693 18563 18157 -9623 -19182 6741 27237
415B7237j7282k8855M300K8776O930k5310j7408J7480K4720o043k6706m838K3849
$$ 27237 9955 -18900 -14600 14176 21106 -4204 -21612 -4132 20588 14545 -12161 -16999 6850
428F850J4889j8293k3668O472K6547O271k0731j3537J6256K0084q923k4455j872
$$ 6850 21739 3446 -20222 -13750 12797 19068 -1663 -15200 1056 21140 12217 -12238 -14110
441a4110K2681J1510j6558j8395P875J9155q06j8149n601J5524J1052j1014j4514
$$ -14110 8571 20081 3523 -14872 -6997 12158 11352 -6797 -12398 3126 14178 3164 -11350
454a1350M184J6637M366j2675q321P695R019o352j1639K305J3922M747j1795r360
$$ -11350 -7166 9471 13837 1162 -7159 536 9555 3203 -8436 -6131 7791 12538 743 -8617
468h617O392J0356m123j3015m04J3344M718j1289q756J0344J4062l226j5413l845
$$ -8617 -2225 8131 4008 -9007 -9411 3933 8651 -2638 -11394 -1050 13012 9786 -5627 -9472
482i472J1328N662j0110j0516Q307J5295J67j4620q001R816R494p591j3518J230
$$ -9472 1856 7518 -2592 -13108 -4801 10494 10661 -3959 -11960 -2144 7350 -241 -13759 -12529
496a2529J4952N393j0820r188Q756J4290k821j6135n382J1456P464r250j1152
$$ -12529 2423 7816 -3004 -12192 -3436 10854 8033 -8102 -13484 -2028 5436 -3814 -14966
509a4966O750J5777P01j4155p084R974Q939p640j2294K147J3268L826j1304p259
$$ -14966 -8216 7561 8262 -5893 -12977 -3003 5936 -1704 -13998 -11851 1417 5243 -6061 -13320
523a3320R279J2157l879j4081k145J2060P228r704j1077N435J3531n53j5574p123
$$ -13320 -4041 8116 4237 -9844 -11989 71 7299 -2405 -13482 -8047 5484 4931 -10643 -17766
537a7766J3434J3048n927j4130J453J5240M721j4374j1641P681J4904j570j4850
$$ -17766 -4332 8716 2789 -11341 -9888 5352 10073 -4301 -15942 -8261 6643 5073 -9777
550i777l830J4286J2527p610j4881k6J2471M318j2754j1350Q172J5831J547j3237
$$ -9777 -13607 679 13206 5596 -9285 -9311 3160 7478 -5276 -16626 -8454 7377 8924 -4313
564d313n399J1679J0699p779j4976n29J3210N540r655p961P692J2420q58j2743
$$ -4313 -9712 1967 12666 4887 -10089 -10618 2592 8132 -1523 -9484 -1792 10628 9770 -2973
578b973n460P027P201m538q899J375J0597M782o558o707L401P184j222q545l859
$$ -2973 -8433 -1406 5795 1257 -7642 -6267 4330 9112 2554 -4153 -752 6432 5210 -3335 -7194
593g194O938O684l013o427J811P171J487p661m898L305N816j366n718l77O047
$$ -7194 -256 6428 3415 -3012 -1201 5970 7457 -204 -5102 -1797 4019 2653 -3065 -3442 2605
608B605K981l771m898J021N374J402m259l549L505M929n47n756k565L435L435
$$ 2605 5586 1815 -3083 -2062 3312 4714 455 -3094 411 5340 4793 -963 -3528 -93 3342
623C342l345m850R83O777L695l303m174J053L056j633m952k889L195N295J609
$$ 3342 -3 -4853 -3870 2907 6602 3299 -875 178 3234 1601 -3351 -6240 -3045 2250 3859
638C859k948j225L495K920j925o099l057K358L128j231l275J021O216M008k641
$$ 3859 911 -314 3181 6101 4176 -1923 -4980 -2622 506 -725 -4000 -2979 3237 7245 4604
653D604n326o66K889L67m012k454K789M931J826l545k360J667L131j057m973k300
$$ 4604 -722 -1388 1501 1868 -2144 -4598 -1809 3122 4948 1403 -957 710 3841 2784 -2189 -4489
669d489L563M193l63l247L26M112J381m058m575R45L619Q25j838l58K883K571
$$ -4489 -926 3267 2904 -343 -17 4095 5476 1418 -3157 -2212 1407 2232 394 36 2919 5490
685E490j078l445j579J450R20j329j433Q22K796J585p41j374P73P07j359k474
$$ 5490 4412 967 -612 838 1758 429 -1004 -182 2614 4199 3458 2084 2857 3564 2205 -269
701b69J2K320J276q06k0O47R60j770k473m5J873R13j296J45J452J704q48j601
$$ -269 -257 2063 3339 2533 2513 3160 4120 2350 -123 -168 1705 2618 1322 1467 2919 4623 3775 2174
719B174j453L4o0m91o91M76K937J886j87j986j148M0k26j632j713N45K222J209
$$ 2174 721 755 695 204 -487 -11 2926 4812 4625 2639 1491 1531 1305 -327 -2040 -1495 727 1936
737A936j85k74N87M09Qj504k068j252Q09J943L70j357K4K332J263k542l613O8
$$ 1936 1751 1477 2064 2473 2481 977 -1091 -2343 -1534 409 779 -578 -554 1778 3041 499 -3114 -3046
755c046L133J425k265k444J412L797Q6l420l120J865L455q95m299j049M734M417
$$ -3046 87 1512 -753 -3197 -1785 2012 2098 -1322 -4442 -2577 878 -17 -4316 -5365 -631 3786
771C786j760n201j587L990J860l918m477J956O672J277m969l244L913M899j578
$$ 3786 2026 -3175 -4762 -772 1088 -2830 -7307 -5351 1321 2598 -2371 -5615 -1702 3197 1619
786A619o218j916L889L642k471m037J400N413J874m583m226J320N300lm479j770
$$ 1619 -4599 -6515 -2626 1016 -1455 -5492 -4092 1321 3195 -1388 -5614 -4294 1006 1003 -3476 -5246
802e246M587L814l121m779O01M955R31m190l397K936M856o18m128r6L693K131
$$ -5246 -659 3155 34 -4745 -4144 811 1742 -2448 -5845 -2909 1947 1329 -2799 -2895 798 2929
818B929l935m791J307M751K275l441k379L321M261j682n900j421N130L338m099
$$ 2929 -1006 -5797 -4490 261 2536 -905 -3284 37 4298 2616 -3284 -4705 425 3763 -336
833c36n529J607O412K185m723l976M107M962j814p235j593N929N049k244n822
$$ -336 -5865 -4258 2154 4339 -384 -4360 -253 4709 2895 -4340 -5933 -4 5045 2801 -3021
848c021k5N608K448n072n472J757P190J407o068m293M097P035j166p402k696N595
$$ -3021 -3046 2562 5010 -62 -5534 -3777 3413 4820 -1248 -5541 -1444 5591 4425 -2977 -5673 -78
864g8M396l615n475J026P097L553n212o061J178N664N97n483l627L949O238r11
$$ -78 4318 703 -4772 -3746 3351 6904 1692 -4369 -3191 2473 3070 -2413 -6040 -2091 4147 3236
880C236n921k225N667M181l947o340N97O201K151m574l775L623N434p95o379k528
$$ 3236 -2685 -4910 757 4938 991 -5349 -4752 1449 3600 -974 -4749 -1126 4308 3513 -2866 -5394
896e394M568L834k446n212J021N659K372m818m863K615N202n75n855j907O001
$$ -5394 -826 3008 562 -4650 -3629 2030 4402 -416 -5279 -2664 2538 1963 -3892 -5799 202
911B02N273l211o054M26O597J579o379m855L890P217j901o856j615O734M949m286
$$ 202 5475 2264 -3790 -3364 3233 4812 -1567 -6422 -2532 4685 2784 -4072 -5687 1047 5996 1710
927A710p079Q26P285K696o225m874M427P625n04q632l766O826O561l398q247L30
$$ 1710 -5369 -4543 2742 5438 -787 -5661 -1234 6391 5887 -2745 -6511 315 6876 3478 -4769 -4439
943d439Q920L227p417o633L678Q657j71q572l303O801P106l003p392J85P468L000
$$ -4439 4481 7708 291 -6342 -2664 5993 5822 -2750 -6053 748 7854 4851 -2541 -2356 5112 8112
959H112o982o683K868P698L53n507k984M961N695l807o971k51O725K598m983m601
$$ 8112 1130 -5553 -2685 5013 5366 -141 -3125 1836 7531 3724 -3247 -3498 3227 5825 842 -3759
975c759L845N532n21n540q82N087K510m407m962K020N321om583j529L756L289
$$ -3759 86 5618 5097 -443 -1325 3762 6272 1865 -3097 -1077 4244 4238 -345 -1874 1882 5171
991E171l033m473P54N258J538n081l503L189M894j182n393l59N655K222m115n104
$$ 5171 2138 -2335 -1581 3677 5215 134 -3369 -180 4714 3532 -1861 -2220 3435 5657 1542 -3562
1007c562K083N610m48n686k399M408L760k394m902J072N089J800l815m092K116
$$ -3562 -1479 4131 3683 -2003 -4402 6 3766 1372 -3530 -2458 2631 4431 616 -3476 -1360
1022a360M237o88m554j101M177L195k623m007O97L860j21m187j799L598K434k366
$$ -1360 2877 2189 -2365 -3466 711 3906 1283 -2724 -2027 1833 1712 -2475 -4274 -676 1758 -608
1038f08l346J495M350Q60m178j486K902K715k763m147J768M803N00m680l188L949
$$ -608 -3954 -2459 1891 2751 -1427 -2913 -11 2704 -59 -4206 -2438 2365 2865 -1815 -5003 -1054
1054a054M136j711n178m15N417K352n088m674K781O865N31o554k331N692N218
$$ -1054 3082 1371 -3807 -4222 1195 3547 -1541 -6215 -3434 3431 3962 -2592 -4923 769 5987
1069E987l459p286J67O517K817o440n643M238P158N16o761k753N315M749l702
$$ 5987 2528 -4758 -4591 1926 4743 -1697 -7340 -3102 4056 4572 -2189 -4942 373 5122 1420
1084A420o968P7P547L248n026m653L185O295k22o358l338M990M345l850o131J186
$$ 1420 -5548 -5471 2076 5324 298 -4355 -1170 5125 4903 -1455 -4793 197 4542 692 -5439 -4253
1100d253O220K389m958l808L829M813j750n526q80N474L478m141m833J800N512
$$ -4253 1967 4356 -602 -4410 -581 4232 2482 -3044 -3924 1550 5028 887 -3946 -2146 3366
1115C366l8m696k961M396M513k901n580o01N559K392m647m243K822N865K47n828
$$ 3366 3328 -1368 -4329 67 4580 1679 -3901 -4502 1057 3449 -1198 -5441 -2619 3246 3493 -2335
1131b335j956N057M524l125o253n42M999K539l651m316K638N660J72n628l194
$$ -2335 -4291 766 5290 2165 -4088 -4630 369 2908 -743 -5059 -2421 3239 3411 -2217 -5411
1146e411K891M352j396m135j298M682L652k511m212M57M605J267l969l654J393
$$ -5411 -2520 1832 436 -3699 -4997 -315 3337 826 -3386 -2929 1676 2943 -1026 -4680 -3287
1161c287M260K70l071j218K128L003j419l764j818K611K678l63k139j72K832J675
$$ -3287 973 1243 -1828 -3046 -918 2085 666 -3098 -4916 -2305 373 10 -2129 -2301 531 2206
1177B206j908k552K39K868R28k373k395R53K604J67k041r82J715J498r96k322
$$ 2206 298 -2254 -2015 853 1781 -592 -2987 -2034 570 737 -1304 -2286 -571 927 -69 -2391
1193b391o45L189K152j075k143N2J971N00k684j383K403L093l45l075r61K308
$$ -2391 -3036 153 2305 1230 -913 -861 1110 1610 -1074 -2457 -54 3039 2694 -381 -1342 966
1209I66J346k163k689R12L464J34l192j833L782L619p31l774n39K861J440l144
$$ 966 2312 149 -2540 -1628 1836 1970 -1222 -3055 727 4346 3615 -159 -698 2163 3603 459
1225D59l981K117N198J292m654l064K505M102j190n047j249N023L597l293m968
$$ 459 -3522 -1405 3793 5085 431 -2633 -128 3974 2784 -2263 -3512 1511 5108 1815 -3153
1240c153J412N866K265m802m081K171M391r71m773j102M836M260k986n684n85
$$ -3153 -1741 4125 6390 1588 -2493 -322 4069 3098 -1675 -2777 2059 6319 3333 -2351 -2936
1255b936M286J999m004k994K774M789K40n057j624L721L802k243m712J2L687J009
$$ -2936 1350 3349 -655 -3649 -875 3914 4154 -903 -2527 1194 4996 2753 -1959 -1947 1740 2749
1271B749l307k152K916M053j260m035j860K642J805k449j769K039L308O8l433
$$ 2749 -558 -2710 206 4259 2999 -1036 -2896 -254 1551 -898 -2667 -628 2680 2748 -685
1286f85j404K633K098j760k706N66L110N19l414j726K682K740j588l976l95K867
$$ -685 -2089 544 2642 882 -1824 -1258 1852 2371 -1043 -2769 -87 2653 1065 -2911 -3306 -439
1302d39J787k418j483K401L283J30l928j468K314J834j575k497K79L457J228k779
$$ -439 1348 -1070 -2553 -152 3131 3261 -667 -2135 179 2013 438 -2059 -1780 1677 2905 126
1318A26j971J222K444q31k675j173K233J642j012r53J051K246k35k176j250J183
$$ 126 -1845 -623 1821 990 -1685 -2858 -625 1017 5 -948 103 2349 2114 -62 -1312 -129
1334a29Q29n71m38J012J448n51j849n89Q12N51j629n20J248J818l11j561l23K652
$$ -129 700 129 -309 703 2151 1600 -249 -838 -26 525 -1104 -1624 -376 1442 1131 -430 -753 1899
1352A899J256k356k810R04K366o4k155o40L065K838k461l692o96K721J525k925
$$ 1899 3155 799 -2011 -1107 1259 1195 -960 -1600 1465 4303 1842 -1850 -2546 175 1700 -1225
1368a225j872K231L690m36l300j247K778K566j550l362p81L415J905l040j855
$$ -1225 -3097 -866 2824 2388 -912 -2159 619 3185 1635 -1727 -2508 907 2812 -228 -2083
1383b083J674K823q80l344j987K361K166m15k338M75L119K85k604j885J450K243
$$ -2083 -409 2414 1534 -1810 -3797 -1436 730 315 -2023 -1548 1571 1856 -748 -2633 -1183 1060
1399A060n82k382P5K399R65j868j734J103J931p00k513j074J956J450j022j260
$$ 1060 478 -1904 -1829 570 1535 -333 -2067 -964 967 267 -2246 -3320 -1364 86 -936 -2196
1415b196P79K079O27k629j382J561K275o38k436k9J814R15j317k542P83K313L77
$$ -2196 -1417 662 1289 -1340 -2722 -1161 1114 476 -1960 -1989 -175 740 -577 -3119 -2336 -23 354
1432C54k142j400J797J918m64j639j75J290J094p51j591L14J197J041o24r00j64
$$ 354 -1788 -3188 -1391 527 63 -1576 -1751 -461 633 -118 -1709 -1395 -198 843 219 -681 -845
1449h45M76P65j454m72k52P75P28r5p10l93J361J028k98j184l15M50J321n86j173
$$ -845 -369 396 -1058 -1530 -1782 -1007 -279 -374 -1084 -1477 -116 912 614 -570 -885 -435 886 300 -873
1468h73K53J687J111j865j727L62J619Q66j936j625J714K111k68k236j99J956
$$ -873 -620 1067 2178 313 -1414 -1052 567 1433 -503 -2128 -414 1697 1429 -807 -1006 950
1484I50K332j595k884k03K721J009k184j567J494L062q15l131j032J828K172j593
$$ 950 3282 1687 -1197 -1400 1321 2330 146 -1421 73 3135 2320 -811 -1843 -15 2157 564
1500E64l030R88L039R55k498j318K389K554j538l390m39K818J692k819j902J804
$$ 564 -2466 -1478 1561 2516 18 -1300 1089 3643 2105 -1285 -1724 1094 2786 -33 -1935 -131
1516a31L404o84l799j378K788K958k220l794O37M298J575m047k472K428L874p36
$$ -131 3273 2589 -1210 -2588 200 3158 938 -2856 -2219 2079 3654 -393 -2865 -437 3437 2701
1532B701m852j423M602L366k592m324J95M627R93m659l407L082M950k63m763j470
$$ 2701 -2151 -3574 1028 4394 1802 -2522 -2327 2300 3293 -1366 -4773 -1691 3259 2996 -1767 -3237
1548c237M043L639k770n031M22M720J699m062l165L296M520o97m909j677L269
$$ -3237 806 4445 1675 -3356 -2934 1786 3485 -577 -3742 -446 4074 3377 -1532 -3209 60
1563F0K483k812l671J499M450J542l654j765K098K811j544l501p38L141J865j789
$$ 60 2543 -269 -3940 -2441 2009 3551 -103 -1868 230 3041 1497 -2004 -2742 399 2264 475
1579D75j971J703K968o08l165j851K297J395j242k163R04L344M79k596j277J933
$$ 475 -1496 207 3175 2567 -598 -2449 -152 1243 1 -2162 -1258 2086 2565 -31 -1308 625
1595F25J854j018k932O3L076J205k206j821J469K413j146k650q92K127J978j343
$$ 625 2479 1461 -1471 -1408 1668 2873 667 -1154 315 2728 1582 -1068 -1960 167 2145 802
1611H02j975Q91K147M73k609j064J428J799l82j796J2J738O81j253j453M92J102
$$ 802 -1173 -282 1865 2338 -271 -1335 93 1892 1510 -286 -274 1464 2145 892 -561 -69 1033
1628A033q51j736N00J839L91o27l90J97N52q10j192O23J408m8r48n62J900R55
$$ 1033 182 -1554 -1054 785 1176 549 159 356 908 98 -1094 -471 937 889 -59 -621 1279 2234
1646B234j099j743m16J974k73k383j140K253K695p12k748l33K383J082k515k219
$$ 2234 1135 -608 -1024 950 677 -1706 -2846 -593 2102 1390 -1358 -1691 692 1774 -741 -2960
1662b960J504L232k5l301j261K847K176j379l219j07K937J129l066k137K091L229
$$ -2960 -1456 1776 1751 -1550 -2811 36 2212 833 -2386 -2493 444 1573 -1493 -3630 -1539 1690
1678A690Q8l830j181K658K532j942k708R38L415K38l429j842K367K619q18l264
$$ 1690 1778 -2052 -3233 -575 1957 15 -2693 -1755 1660 1898 -1531 -3373 -1006 1613 795 -2469
1694b469j77L077R18k674j874J693K999l66l324q51K209K772j499k961P59L547
$$ -2469 -2646 431 1349 -1325 -3199 -1506 1493 1127 -2197 -3048 -839 1933 434 -2527 -1768 1779
1710A779L03l220k435K385L307j211l337k22L200J966k708l078J615L652p0l707
$$ 1779 2082 -1138 -3573 -1188 2119 908 -2429 -2651 549 2515 -193 -3271 -1656 1996 1926 -1781
1726a781j262K730K934j490k924j9L663J031l217k342J314L234o5l326j055K898
$$ -1781 -3043 -313 2621 1131 -1793 -1812 1851 2882 -335 -2677 -1363 1871 1806 -1520 -2575 323
1742C23K226j912k251K64K720O81k487j809J926K070l22k388K02J942O86j619
$$ 323 2549 637 -1614 -1350 1370 2051 -436 -2245 -319 1751 1429 -959 -757 1185 1871 252
1758B52j416O39J400k95j540m1J436R39j384j195J169J405p60j503j35J934N96
$$ 252 -1164 -525 875 580 -960 -1001 435 1374 -10 -1205 -36 1369 609 -894 -1029 905 1501
1775A501j388j792J699J592m96k253n85K265R81j556k209J425K417l83k424o40
$$ 1501 113 -1679 20 1612 1116 -1137 -1722 543 1524 -32 -2241 -816 1601 1218 -1206 -1846
1791a846J704J745j298k105J48L014N48k073j354J421J794p65k617j66J799J255
$$ -1846 -142 1603 305 -1800 -1652 1362 1910 -163 -1517 -96 1698 933 -1684 -1850 -51 1204
1807A204j613j773J306K652l67k644j009K544J296j348k255P26K973M80k893j371
$$ 1204 -409 -2182 -876 1776 1409 -1235 -2244 300 1596 248 -2007 -1281 1692 2172 -721 -2092
1823b092K279J978j589k657K91L151J386k849k136J659L150j081l301j005L275
$$ -2092 187 2165 576 -2081 -1790 1361 2747 -102 -2238 -579 2571 1490 -1811 -2816 459
1838D59K717k363k840R33L810N82l818k431K808K710q74l851j46M033K191k783
$$ 459 3176 813 -2027 -1094 2716 3298 -520 -2951 -143 2567 1693 -2158 -2304 1729 3920 1137
1854A137l744J402L870K44l631j871L059K949j206l563j59L716J732l029l267
$$ 1137 -2607 -1205 2665 2909 -722 -2593 466 3415 2209 -1354 -1513 2203 3935 906 -2361
1869b361P94L616O27l325j324L184K143j975l223L58L072J050k463j946J851K852
$$ -2361 -1567 2049 2676 -649 -1973 1211 3354 1379 -1844 -1486 1586 2636 173 -1773 78 2930
1885B930q75l119k16K897J050k433k377J196K827l55j853j108K445J778j668k802
$$ 2930 2055 -1064 -1280 1617 2667 234 -2143 -947 1880 1525 -328 -1436 1009 2787 1119 -1683
1901a683L45K877N69k133j696J768K186q87k646o7K066J434j804k344P92K516
$$ -1683 -1338 1539 2108 -25 -1721 47 2233 1346 -1300 -1367 699 2133 329 -2015 -1223 1293
1917A293J66k184r49J779J390p33k482K33K069R29j506j352Q88J519l72j812n5
$$ 1293 1459 -725 -1674 105 1495 762 -1720 -1487 582 1511 5 -1347 -459 1060 688 -1124 -1179
1934a179J356O22j275r16Q96R91j21j587M78Q67L88j331o64J158J016n94j284
$$ -1179 177 799 -476 -1392 -496 495 374 -1213 -735 132 520 -811 -1475 -317 699 105 -1179
1951a179K74J233M0j085j140J392J324n70j884R6J921P35j362j563R89J849O7
$$ -1179 -905 328 368 -717 -1857 -465 859 289 -1595 -1499 422 1157 -205 -1768 -779 1070 1137
1968A137k797l81K024K201j477k656N23K396P92k359j568J305K435q00k362l12
$$ 1137 -1660 -2041 -17 2184 707 -1949 -1426 970 1762 -597 -2165 -860 1575 775 -1587 -1899
1984a899K597J819k270k136N40K225M81k670j193K540J867r56k319j64K697R69
$$ -1899 698 2517 247 -1889 -1349 876 1357 -1313 -2506 34 1901 945 -1374 -1538 1159 2128
2000B128k444j932J676K193n50k896j1K789J370j902k559J016K615N28k711j876
$$ 2128 -316 -2248 -572 1621 1071 -1825 -1836 953 2323 421 -2138 -1122 1493 2021 -690 -2566
2016b566K611K371j159k965J41K567J141k773k265J723K951K0l014j007K478K267
$$ -2566 45 2416 1257 -1708 -1567 1000 2141 -632 -2897 -1174 1777 1797 -1217 -2224 254 2521
2032B521j653l634L17L242J420k683k222K027K905n00l582q58K620J846r51l032
$$ 2521 868 -2766 -2449 793 2213 -470 -2692 -665 2240 1740 -1842 -2700 -80 1766 815 -2217
2048b217O15K701J196k848j997J539K361o33k827m24K522K214j525k071K32J898
$$ -2217 -1602 1099 2295 -553 -2550 -1011 1350 717 -2110 -2534 -12 2202 677 -1394 -1162 736
2064G36K08k184j402J867J906l53k085K26J605R55j963r70R33R57m03j461JJ578
$$ 736 944 -1240 -2642 -775 1131 778 -1307 -1081 524 1479 -484 -1454 -521 436 33 -1428 -1427 151
2082A51J061q24j106L67J049r0j933j46J151J294q24j106L75J255M34j458n08
$$ 151 1212 388 -718 -351 698 608 -1325 -1471 -320 974 150 -956 -581 674 1108 -350 -858
2099h58O82J476q54j311j47J276J141r12j157L00R20J95j280l37J071O87J93j215
$$ -858 -176 1300 446 -865 -1012 264 1405 493 -664 -364 556 751 -529 -866 205 892 1085 -130
2117a30n2J002j65p64k31O00P50k71n24j4L56L5l26m19L81M49l30q62J004J054
$$ -130 -182 820 655 -109 -340 260 1010 739 215 201 557 592 266 -153 228 677 347 -515 489 1543
2137A543n62m93m04J21K27l86p32M16J545l9r61o65P44J005n83j436q8J235P66
$$ 1543 981 488 84 205 432 46 -686 -270 1275 1236 275 -390 354 1359 776 -660 -748 487 1253
2156A253j023j112R59J341K88j653r75R89J119p69j300KJ313J144j012q56l7J216
$$ 1253 230 -882 77 1418 1706 53 -922 67 1186 417 -883 -881 432 1576 564 -292 -329 887
2174H87o1j557l85P88J354q21q89L89J095K38j351n92N75P97j09j164m2Q53N25
$$ 887 826 -731 -1116 -328 1026 205 -684 -295 800 1038 -313 -905 -330 467 358 -806 -848 5 530
2193E30j54r42J92P62k50q37k38J037N82n66o44n2R68K14j099p26J139N11k79
$$ 530 376 -566 -374 388 138 -699 -937 100 682 116 -528 -580 388 602 -497 -1223 -84 427 148
2212A48q37K95P45K96p84q94N56P82Q0j159m2Q08P45m71o60K95K24K75o97l99
$$ 148 -689 -394 351 647 -137 -1031 -475 307 387 -772 -814 -6 739 268 -392 -97 127 402 -295 -694
2232f94L11Q57o8m19k16K89J29p9l98M0N1K32j90N09l65J83L6j60M11k46p07N0
$$ -694 -383 474 406 -13 -229 60 189 110 -288 -248 -197 35 -155 354 -11 172 208 48 459 213 -494 -444
2254d44O90M81n73q57O80O72j63m19o51K30J185n28r96o8J181O73n48j242N13
$$ -444 246 727 154 -703 -23 649 486 67 -584 -354 831 303 -693 -761 420 1093 545 -697 -184
2273a84R18J54j377l55M95J526l93j538j33R08R80p78j132M45R78J44j363o27
$$ -184 734 888 -489 -844 -349 1177 784 -754 -887 21 1001 223 -909 -464 514 658 -705 -1332
2291a332J229J342n04j591j38J227O19j184r42M42J596k25j380m23J043Q23n34
$$ -1332 -103 1239 735 -856 -994 233 852 -332 -1274 -832 764 539 -841 -1264 -221 602 68
2308F8j272R7J597o6j246p72J054J239K86j873o79J613N09q01j087L28J516K44
$$ 68 -1204 -1107 490 424 -822 -1594 -540 699 985 -888 -1567 46 555 -246 -1333 -1005 511 755
2326G55j822q00J447J401k83k143j22J945P55j367j808Q41K358J53k697m54J241
$$ 755 -1067 -1867 -420 981 698 -1445 -1567 378 1133 -234 -2042 -1201 1157 1310 -1387 -1841 -600
2343f00J856l23k074l89K287Q28j599j671K87K021N15j664j209J303J841k72k098
$$ -600 1256 933 -1141 -1530 757 1585 -14 -1685 -1398 623 1138 -526 -1735 -432 1409 1137 -961
2360i61m67J616J227j056j425K22J582O47j660p78O03J412l79j694k13J325J201
$$ -961 -1428 188 1415 359 -1066 -844 738 1385 -275 -1053 -450 962 583 -1111 -1324 1 1202
2377A202o96j264M33J652J42j484j139R02J351l21j171l6R34J101j371j018L01
$$ 1202 506 -758 -325 1327 1469 -15 -1154 -252 1099 778 -393 -429 505 1606 235 -783 -482
2394d82J462J2j022r12J021J088k48j392j08J470M18r54j364P44J321p0r63n79
$$ -482 980 992 -30 -942 79 1167 919 -473 -581 889 1307 353 -1011 -267 1054 984 21 -558
2412e58P38P44p75j041n47J909P16p12j123K43J506k88q98r38Q07J000j32j334
$$ -558 180 924 149 -892 -1439 470 1186 474 -649 -406 1100 812 -86 -1024 -217 783 651 -683
2430f83j51J087O63k56j058l19J002M44j006m34N76Q54k75o01n08N66L16Jp77
$$ -683 -834 253 916 660 -398 -717 285 729 -277 -711 -135 719 444 -157 -665 -99 217 218 -559
2449e59L27N14M52p87k61K06L75k3m05l18K09M72j80n86M77L77L51n10l41N3Q4
$$ -559 -232 282 734 -53 -314 -108 267 244 -161 -479 -270 202 22 -564 -87 290 641 131 -210 -157 -73
2470g3k42j59M85N25J67r13j69M04N13r36j97K48L60o6P9l37M75L79J30r42P4
$$ -73 -315 -474 11 536 703 -210 -379 25 538 -398 -595 -347 13 -53 26 -311 164 543 673 -269 -195
2491a95M7O87k91l98N7O81R4n43q07N05L42N5k13m14P89K18k90o77K54M50K3j60
$$ -195 -148 539 248 -150 -93 588 682 139 -668 -163 179 234 21 -393 396 614 324 -353 -99 351 374 214
2513B14l98M14N52k68k96l60N64J76m10m46Q0O17j64k99j36M07L95n91n88N38
$$ 214 -184 230 782 514 218 -142 422 598 188 -258 -178 439 275 -24 -160 247 642 51 -537 1
2533AO88j80n14k99M84P13n19j020N7R48j51n97n28O23J152o4j361l01J072Q03
$$ 1 689 509 -5 -304 180 893 374 -646 -589 359 208 -389 -917 -294 858 794 -567 -868 204 1007
2553A007q67j233M36J177Lq59o07Q97Q54l51j073l93J076O96r58q92L09Q77O20
$$ 1007 140 -1093 -657 520 523 -336 -943 -46 808 457 -616 -1009 67 763 -195 -1087 -778 99 719
2572G19q46j115M89J446%j466n29J026J146r83j068K80J069K80p71j161Q99J121
$$ 719 -127 -1242 -753 693 693 -773 -1302 -276 870 -113 -1181 -901 168 448 -323 -1484 -585 536
2590E36J65j224j96L48P74n84r42L60J192K17r25j051J195O60l21j191M8J194
$$ 536 701 -523 -719 -371 403 -181 -1123 -763 429 646 -279 -1330 -135 525 204 -987 -939 255
2608B55O59r87r63L99J240K00j425m37P11J235k80j479R5J257N97o95j127J38
$$ 255 914 -73 -1036 -637 603 803 -622 -1059 -348 887 607 -872 -777 480 1077 382 -745 -607
2626f07J318J30r74r62J105J176k50j652j89J025P22o04j209K06J368J85j026
$$ -607 711 841 -133 -1095 10 1186 936 -716 -905 120 842 238 -971 -765 603 788 -238
2643b38m85N70J328o7j716k07R28R81n54j022j42R62O44j379m21J95J471m06m75
$$ -238 -723 -153 1175 1108 -608 -815 113 1094 540 -482 -624 338 982 -397 -818 -623 848 442 -33
2662c3l68Q96k2l0p00k98O24N56m59n43J31R28k03k24o50N05L22n91j49k61O64
$$ -33 -401 495 473 443 -257 -555 69 625 166 -377 -246 682 479 255 -395 110 432 -159 -308 -569 95
2683I5Q2j2n51M07J84L74p71P0K10L5j16m8k87N47R6l93l19k06P25M2l12K14l1
$$ 95 177 165 -386 21 205 579 -192 -122 88 123 7 -41 -328 219 315 -78 -397 -603 122 164 -148 66 35
2706C5l9K71k38l54M37K63l46k94j83M62J83J47n88j19Q02J7k22p69k34J168J82
$$ 35 -4 267 29 -325 112 375 29 -265 -448 14 197 344 -244 -363 439 456 234 -535 -769 399 581
2727E81n56o37M40K98K24o73j24N29P76k53q73n51J005N37r00n40L68N82K23k85
$$ 581 25 -612 -172 126 350 -323 -447 82 858 605 -268 -819 186 723 -177 -717 -349 233 456 171
2747A71p73N21R46m28n56k48N01R21q01p74L63O03M23m51p33K74P58p4j085k10
$$ 171 -602 -81 865 437 -119 -367 134 1055 254 -520 -157 446 869 418 -315 -41 717 643 -442 -652
2767f52P10N32k74l89L7N75J12l91m70L58N17l57m37k11P98J2j71m84L30L31J37
$$ -652 58 590 316 -73 -36 539 651 260 -210 148 665 308 -129 -340 458 470 299 -185 145 476 613
2788F13p42j03P86J7n05m84O23M41J34q23n16O22N92m50m44R2P56N8l27r07M96
$$ 613 -129 -232 554 571 66 -418 205 646 780 -43 -559 63 655 205 -239 -147 609 667 340 -567 -71
2809g1K08J51p11l70Q36Q1j08l09k5Q28j5o18k94J10O79m32k37J41L83P1m16m49
$$ -71 137 288 -423 -793 43 124 16 -293 -318 510 495 -123 -417 -307 372 -60 -297 -156 227 298 -118 -567
2831e67J32M43l51l35M62K95R9j83m95M10J94o40Nk0N41M13n40m43M86N83l03
$$ -567 -435 8 -343 -678 -216 79 178 -5 -500 -90 104 -536 -531 -551 -10 403 -137 -580 -94 489 186
2852A86q17k54R35J22j85q97N06J031K12r54q79N65O54J24j226J42J468L43j007
$$ 186 -631 -885 50 172 -13 -910 -404 627 839 -115 -994 -429 225 349 -877 -735 733 1076 69
2871F9o71K08J069j34j125m26P98R70k19j217PP27O74p11q07K20J237l5j150j46
$$ 69 -602 -394 675 541 -584 -1010 -212 758 539 -678 -671 56 730 19 -788 -568 669 634 -516 -662
2891f62R49M29k51r05l22J004M78n75j296J189O07Lj228n82J425N73p25j428R16
$$ -662 287 716 465 -440 -762 242 720 145 -1151 38 645 648 -580 -1162 263 836 111 -1317 -401
2910d01J089J74j295l85O16J133l50j228o19J633Q06j151j075O52J267j45j410
$$ -401 688 862 -433 -818 -202 931 581 -647 -1266 367 1173 22 -1053 -401 866 721 -689
2927f89l60P38J333o05j304P1J344O92j035j588P79J174R6j126n34J035Q32k40
$$ -689 -1049 -311 1022 417 -887 -816 528 1220 185 -1403 -624 550 646 -480 -1014 21 853 613
2945F13j231P2R85K37j141o14P20J270j50j079o73R65O30m87j148L98R21L98r84
$$ 613 -618 -546 439 676 -465 -1079 -359 911 761 -318 -991 -26 604 117 -1031 -633 288 686 -298
2964b98l61N72Q19m09p41p7M80N44p36n67K76Q70O0n77l77K70O84m43o54J65N97
$$ -298 -659 -87 732 323 -418 -495 -15 529 -207 -774 -498 372 432 -145 -522 -252 432 -11 -665 -500 97
2985I7L13m57n82M49N80l12l60n47J044L03l98p67L71P69J3n99j21o2Q97m41m61
$$ 97 410 -47 -629 -180 400 88 -272 -819 225 528 130 -637 -266 503 516 -83 -204 -266 631 190 -271
3006b71j05M71M67n93l28M31K21n20M4j50M97J78P9o01j3K66M21o75q7K86N22
$$ -271 -376 95 562 -31 -359 72 293 -227 -183 -333 164 342 421 -180 -193 73 494 -181 -268 18 540
3027E40k73r4L48R8L6n57k2K9N31m06l16l9O49J7n57j60M10M23o00o55M40O84
$$ 540 267 173 521 619 655 98 76 105 636 230 -86 -125 524 541 -16 -176 234 657 57 -598 -158 526
3049E26j24n32j1M44K91n9q60Q9M01Q70q09q96O19L54K54m50o74O66M35j00q61
$$ 526 402 -130 -141 303 594 535 -325 -236 165 1035 226 -670 -51 303 557 107 -567 99 534 434 -427
3070d27n1Q04M45n61n88Q7M90M32j021r8L46Q15n93l71n7M33L82p07l00M61N10
$$ -427 -478 326 771 210 -378 -291 199 631 -390 -488 -142 673 80 -291 -348 85 467 -240 -540 -79 431
3091D31q0o73j07N60L18m13q20L21P07L16p30m80M37N62k02o03k20P09M40l73
$$ 431 351 -322 -429 131 449 36 -784 -463 244 560 -170 -650 -213 349 147 -456 -676 33 473 100
3111A00n63K34M85K6o54L0K87P20o54n12L1N89L57k86r69K84R30r4n95j64P55
$$ 100 -463 -229 256 282 -372 -342 -55 665 11 -501 -470 119 476 190 -779 -495 435 341 -254 -418 337
3132C37J40q6q86L6M86K21k31o48L15N79K26o16k89L76L97p6n69l3M56M03m11
$$ 337 477 391 -495 -459 27 248 17 -631 -316 263 489 -127 -416 -40 357 281 -288 -321 135 538 127
3153A27n10R2K81L64k69l59K15L00k13j74k4K14K49k54j33K58l88K10m6J45o2
$$ 127 -383 -291 -10 354 85 -274 -59 241 28 -146 -170 44 293 39 -94 164 -224 -14 -60 85 23
3174B3K09J9k69J04n2K75m39J39j64L19L3j83j66J07j73K90k57P7j48M94k59K03
$$ 23 232 251 -18 86 34 309 -130 9 -155 164 197 14 -152 -45 -218 72 -185 -108 -256 238 -21 182
3196A82o94M39K77k82k48L23l6m0j24J89j88K35l31K8L39m40O71n04O5J23p6O20
$$ 182 -512 -73 204 -78 -326 -3 -39 -79 -203 -14 -202 33 -298 -270 69 -371 300 -204 -139 -16 -92 528
3218E28l00m46k13O20j9j8n56P4J93K78J00n10j26M63K38o14j76L33J06M26q17
$$ 528 228 -218 -431 189 170 152 -404 -330 -137 141 241 -269 -395 68 306 -308 -484 -151 -45 381 -436
3239d36P0M01K40j39o72L13K73L46n31l17K54M14J66o90J0J53L81R7n71mM43M14
$$ -436 -366 35 275 136 -536 -223 50 396 -135 -452 -198 216 382 -308 -298 -145 236 333 -238 -242 201 615
3261F15m41m84K26M62K39p37J84J31n8J57m27j27N45J25k60j97K77J13J1n46j54
$$ 615 174 -310 -84 378 617 -120 64 195 137 294 -133 -260 285 410 150 -47 230 343 354 -192 -346
3282c46O28M09n26k58K0M71J71m01n38J42O95j67q37M01O45L56p37l80J11M35
$$ -346 282 691 165 -93 -73 398 569 168 -370 -228 467 300 -537 -136 509 865 128 -252 -141 294
3302B94Jl66m8L56J36j45m35J29M50k10Q5o10M13N33K9o52j23K42L17m76M7n40
$$ 294 295 -71 -119 237 373 228 -207 -78 372 162 247 -363 50 583 612 -40 -163 79 396 -80 -33 -573
3324e73Q33K05m37jJ49K48m31l5QJ18k04Q4k95N13M2N4k08k19O5M63q23L24L01
$$ -573 260 465 28 27 176 424 -7 -42 -34 84 -120 -36 -331 182 224 278 70 -149 -84 379 -444 -120 181
3347A81r4o3l65L12K94k9n05k20J30R11o68k37J11L67K94q0j047N09O40j34o68
$$ 181 87 24 -341 -29 265 236 -269 -489 -359 552 -116 -353 -242 125 419 339 -708 -199 441 307 -361
3368c61j56L01O85or12K4N42K78k17q90J66Q29J8m92m52P26O60l50p16k28P97
$$ -361 -517 -216 469 463 -449 -425 117 395 178 -712 -546 283 301 -191 -643 83 743 393 -323 -551 246
3389B46j07k56o04N38P40j99m28l44O73M70o17p43L66K99O08r37j15Q1J306q44
$$ 246 139 -117 -721 -183 557 358 -70 -414 259 729 112 -631 -265 34 642 -295 -410 -329 977 133
3409A33l78l45P85J37l10l89M4Q63qp89l15O60N03k72r70M06M20P49j046m70N02
$$ 133 -245 -590 195 332 22 -367 -323 540 532 -257 -572 88 591 319 -651 -245 175 924 -122 -592 -90
3430i0O39K96j370j67P45Q78l70j259M8J069L78q10q09N95Q41L67j422k97P91
$$ -90 549 845 -525 -692 53 931 561 -698 -650 419 797 -13 -822 -227 614 981 -441 -738 53
3449E3N68k82r36J84O02O31q29p18L80J173j97j050m28Q12O52j89j372m7J395
$$ 53 621 339 -597 -413 189 820 -9 -727 -347 826 629 -421 -849 -37 615 426 -946 -993 402
3468D02o8m36o52N37Q41k49q29Q2K75O74o16p25K42P41K48n94m61M03O91l68q77
$$ 402 334 -102 -754 -217 624 375 -454 -372 -97 577 -39 -764 -522 219 467 -127 -588 -185 506 138 -739
3489g39j37R45M50n02p67Q9J025J24o79l09L45O36n10q82N86N09K87q43k12M68
$$ -739 -876 69 519 17 -750 -661 364 488 -191 -500 -155 481 -29 -911 -325 184 471 -372 -584 -116
3509a16O43k12p77j55K69J122n79o46r7O08M16p96k64M95M63P2q70k13P12M98
$$ -116 527 315 -462 -617 -348 774 195 -451 -548 60 476 -320 -584 -89 374 446 -424 -637 75 573
3529E73l53m57l3N57p8o5k64ML20n2j58j61K98L76n82m18O42j88J22Q5m50O00
$$ 573 220 -237 -270 287 209 144 -120 -116 204 152 -6 -167 131 507 -75 -493 149 -39 83 168 -282 318
3551C18j15k90jj26N22m07K08l52J72K21L09n30O7p2RK25m28K47K64j81j50J60
$$ 318 203 -87 -88 -214 308 -99 109 -243 -71 150 459 -71 -4 -76 -67 158 -270 -23 241 60 -90 70
3573G0q3K00l64K67k07N30k63k40P8J66J50k36k58P7L24m51J29k45K06L63oj28
$$ 70 -13 187 -177 90 -117 413 150 -90 -12 154 304 68 -190 -113 211 -240 -111 -356 -150 213 207 79
3595G9j73r8N6M2k0r1N28k44k6j75J72Q6Q6l08j68J33M39m91J76q6J55j18n5j69
$$ 79 -94 -192 -136 -94 -114 -205 323 79 53 -122 50 136 222 -86 -254 -121 318 -173 3 -83 72 -46 -101 -270
3619b70J83O9j52J34N5RK41l42r8L38l06M9j06LM59lp0K12n25L78k12l9k23K86
$$ -270 -87 -18 -170 -36 19 28 269 -73 -171 167 -139 -90 -196 -193 266 263 193 405 -120 258 46 7 -216 70
3643G0N7j13j18J41p6K78j30l1J08k03P3k46J90j52Q9J30K15j78j67J07J20k05
$$ 70 127 14 -104 37 -39 239 109 78 186 -17 56 -190 0 -152 -63 67 282 104 -63 44 164 -41
3665d1J01K16Rj90O7j78RJ47K80m43n4m9J45L5j37K50k76K65m61K32j70N74k26
$$ -41 60 276 285 95 162 -16 -7 140 420 -23 -77 -126 19 54 -83 167 -109 156 -305 -73 -243 331 105
3688A05j40R8QK07K36l72m8k09K19R9j49k9Q7L6k69%j84L39K4l8O9J55j47k1k83
$$ 105 -35 63 71 278 514 142 94 -115 104 203 54 25 112 148 -121 -121 -305 34 58 20 89 244 97 76 -207
3713b07K31L18l16j53l31K75M97O2o93L3M90p2l09J7L37J44l6l00j98K00Q4J73
$$ -207 24 342 26 -127 -458 -183 314 376 -317 -284 206 134 -175 -158 179 323 287 -13 -211 -11 73 246
3735B46l64k02N31J30m42l47K89J62L70m48l08k8R45k97n09n6K45L80n3n12j14
$$ 246 -118 -320 211 341 -101 -448 -159 3 373 -75 -383 -411 534 237 -272 -328 -83 297 244 -268 -382
3756c82L42M85q93j14N90Jn8m37k28R25j07k75k46M8P30j52m39K3J62K19j1l76
$$ -382 -40 445 -448 -562 28 29 -29 -466 -694 231 124 -151 -397 -349 381 229 -210 -187 -25 194 183 -193
3778a93k09J90M29k3o34K29M85Q7o93pM28K02p4o84J87N62J97l52o69N95K61l2
$$ -193 -402 -212 217 194 -440 -211 274 361 -332 -339 89 291 217 -467 -280 282 479 127 -542 53 314 282
3800B82n31k60O97O4j74p56L02K74M56m85j75M61M31m9r40mM80L21j57o89L20
$$ 282 -249 -509 188 252 78 -678 -376 -102 354 -131 -306 155 586 537 -403 -407 73 394 237 -452 -132
3821a32K95K11l10k26j59M84J04n73j34K76O86l12m38J66K60j35N8p36L54M70
$$ -132 163 374 64 -162 -321 163 267 -306 -440 -164 522 210 -228 -62 198 63 121 -615 -261 209
3841B09J19m03k65N19K8j97l57J78N23j54m45j17K57L72o5l03L8J19M38m40l34
$$ 209 328 -75 -340 179 207 10 -347 -169 354 200 -245 -362 -105 267 202 -101 -63 56 494 54 -280
3862b80J72J67j14r5R9j98P9J07m27K65N71l56k74J79k59M70m62J20K76J92j08
$$ -280 -108 59 -55 -150 -51 -249 -170 -63 -490 -225 346 -10 -284 -105 -364 106 -356 -236 40 232 124
3883A24m64J20J68M52j93m02M4q5O32m44j52K22o9J24l1k08K22k40q8K29M27m14
$$ 124 -340 -220 -52 400 207 -195 -151 -236 396 -48 -200 22 -47 77 46 -162 60 -180 -268 -39 388 -26
3905b6M19k18p8m7J84M9n19o7N15P7l04L86m11K83P3j58l26L71o9j16j95K4N25
$$ -26 393 175 97 50 234 283 -236 -303 212 289 -15 371 -40 243 316 158 -168 203 134 18 -177 -153 372
3928C72q4m67K9K49M23l01l69o9M66j8k60k64L58M68k57j89j42K56K14q1o25L00
$$ 372 288 -179 -150 99 522 221 -148 -217 249 231 -29 -293 65 533 276 87 -55 201 415 334 -291 9
3950IN27M9n24q9k00L86j41j51j18J88L49Qn91K82L67L5n48J20j08N81k51l78
$$ 9 536 585 61 -28 -228 158 17 -134 -252 -64 285 293 -298 -16 351 386 -162 -42 -150 431 180 -198
3972a98K06J47L09o59k88J83N84k61J39k85M4L89k48k04j43K71K92o05K25L1J72
$$ -198 8 155 464 -195 -483 -300 284 23 162 -123 -79 310 62 -142 -285 -14 278 -327 -102 -71 101
3993A01o7n75M43j14M60l40j48K14K76q0q5m32J42O46l83l26K03L25r4j21m86
$$ 101 34 -541 -98 -212 248 -92 -240 -26 250 170 85 -347 -205 441 58 -268 -65 260 166 45 -441
4014d41M55N1L57k60k13m9J4L40n39p3M63j42J24l72J01K12j39J93m41M54k05
$$ -441 14 65 422 162 -51 -100 -86 254 -285 -358 105 -37 87 -285 -184 28 -111 82 -359 95 -110
4035a10J35K65o11K73L14j81l53J56K3n0pK6K88M1k58J3j21J28j82Q8J43k9j24
$$ -110 25 290 -321 -48 266 85 -268 -112 -89 -139 -146 -120 168 209 -49 -36 -157 -29 -211 -123 20 -9 -133
4058a33K56l04M31j56L4n9l83L88q3L7O2k58K12j15j49L93j83q4l51L71j54M23
$$ -133 123 -181 250 94 128 69 -314 74 -9 28 90 -168 44 -71 -220 173 -10 -94 -445 -74 -228 195
4080A95j18l6l25K83M18o56P19o46J37Q5K6n8p2r6K11J87n75N29j11l56N1K37
$$ 195 77 41 -284 -1 417 -239 480 -166 -29 56 82 24 -48 -144 67 254 -321 208 97 -259 -208 29
4102B9l6l67K60K0L51k00k90J83K56j05k39j69K13K16k08J31k52L79j72m5l12
$$ 29 -7 -374 -114 -94 257 57 -233 -50 206 101 -138 -307 -94 122 -86 45 -207 172 0 -45 -357
4123c57J80J36N1Q9k11M08m58M39j26l52j40M24q0k8l67q1N03o5k75L27K90L53
$$ -357 -177 -41 10 99 -112 296 -162 277 151 -201 -341 83 3 -25 -392 -473 30 -35 -310 17 307 660
4145F60j131O08kJ85n9l3q57j39J75J53o1n49J290j078J053l83O74r7L05j297
$$ 660 -471 137 135 320 261 228 -629 -768 -593 -440 -501 -1050 240 -838 215 -168 506 409 714 -583
4165e83R25R6P7l53j36m6K81r6j06l7P5l11K44j46R4J78j00K1q9l5J13O6m00K92
$$ -583 342 438 515 162 26 -20 261 165 59 22 97 -214 30 -116 -22 156 56 77 -12 -47 66 132 -268 24
4189B4K53k19Q3j35j75J99Q0m30L63J55j04j21J60J02J60k59j65N9m07K70J48
$$ 24 277 58 141 6 -169 30 110 -320 43 198 94 -27 133 235 395 136 -29 30 -377 -107 41
4210D1K49m19J31M2LJ4J14l38P7L89k31j17k08J15J62m3L13k31m6j00J50l31K01
$$ 41 290 -129 2 44 47 61 175 -163 -86 303 72 -45 -253 -138 24 -19 294 63 17 -83 67 -264 -63
4233f3R4mJ95n09r5O10q3L9k23J15L1J97M1o32L08k5K36l64RL63M1n4j58m0J15
$$ -63 31 27 222 -287 -382 228 145 184 -39 76 107 304 345 -287 21 -4 232 -132 -123 240 281 227 69 29 144
4258A44q0jk46J70J33K48m94j94N74k67P3j56j6K21k4j86k32O3L90J08n07J20
$$ 144 64 63 -183 -13 120 368 -126 -320 254 -13 60 -96 -112 109 85 -101 -333 -270 120 228 -279 -159
4280a59J69p6k2k13K23J16J32m27j08K52J31k03L72j14R3j74K20m65K21J63j2
$$ -159 10 -66 -88 -301 -78 38 170 -257 -365 -113 18 -185 187 73 166 -8 212 -253 -32 131 119
4301A19k96k00K02M29n4k57J6J88K13n14J62j69M22j91Q6j98J10K3J03m48J05
$$ 119 -177 -377 -175 254 200 -57 -41 147 360 -154 8 -161 261 70 156 -42 68 91 194 -254 -149
4322a49M80o2k30l65K29Q9J90m49J50J24j11M13m73n5N88j29j43r6P5K50j41k07
$$ -149 331 269 39 -326 -97 -8 182 -267 -117 7 -104 309 -164 -219 369 240 97 1 76 326 185 -22
4344b2j8L8j24J38j93M6K57J6k70Q7j6J29l64O66n49K58j16o3l53M82L7k1j55
$$ -22 -40 -2 -126 12 -181 -135 122 138 -132 -45 -61 68 -296 370 -179 79 -37 -100 -453 29 66 45 -110
4367a10J06l13M32o6J64l89N27n30P4n7L1K43j82l8k10L29m0k97L09p0pK61O4
$$ -110 -4 -317 115 49 213 -176 351 -179 -105 -162 -131 112 -70 -108 -318 11 -29 -326 -17 -87 -94 167 231
4390B31j89M6J74k97N8o0L9r0J24o2O0l5j05Q4m9J06o9J12m5k44L36r2r2Nq2j01
$$ 231 42 88 262 -35 23 -37 2 -88 36 -26 34 -1 -106 -22 -71 35 -34 78 33 -211 125 33 -59 -54 -136 -237
4416b37J56K81k26L2j76k97O72r8m4l79K44R0J10j61j44K01j79L19J1j22Q1q0
$$ -237 -81 200 -26 6 -170 -467 205 107 63 -316 -72 18 128 -33 -177 24 -155 164 175 53 134 54
4438E4K38l44k71R9K16J5j14J61j94R2J22k5j68L07k16J78O6l60L05l87K12k4
$$ 54 292 -52 -323 -224 -8 7 -107 54 -140 -48 74 49 -119 188 -28 150 216 -144 161 -226 -14 -38
4460c8J18Q6k79m4k24O11J14o93M43l4Oo0j5j47R1J35J72p16L65j42M0N07j88
$$ -38 80 166 -113 -157 -381 230 344 -349 94 60 66 6 -9 -156 -65 70 242 -474 -109 -251 -211 296 108
4483A08l0q0J26k33j96J24J38J06N9m8k9j49l4L50l09k6J44j20J03P7o4o2p0K12
$$ 108 78 -2 124 -109 -305 -181 -43 63 122 74 45 -104 -138 212 -97 -123 21 -99 4 81 17 -45 -115 97
4507I7k04M02m40K39k32l1N36p82K64M7l3M31l74k22M17O4k88M2J34J63m01K22
$$ 97 -107 295 -145 94 -138 -169 367 -415 -151 -104 -137 294 -80 -302 115 179 -109 -67 67 230 -171 51
4529E1m8K12k03N28n44l6l8K6K78k50j9J5K76l11l2L6k14N14j50j27O8K17N9j70
$$ 51 3 215 12 540 -4 -40 -78 -52 226 -24 -43 -28 248 -63 -95 -59 -273 241 91 -36 32 249 308 138
4553A38m32J52Q7L42l35j83J06J67m8M7k07k6L33k17j55J85J76p4p7j20J32j0
$$ 138 -294 -142 -55 287 -48 -231 -125 42 -6 41 -166 -192 141 -76 -231 -46 130 56 -21 -141 -9 -19
4575a9R3j38qJ58p6K04j90j39L35m2l25J32M9K04k82k41J98L11q2q0k95K52J49
$$ -19 74 -64 -72 86 10 214 24 -115 220 178 -147 -15 34 238 -44 -285 -87 224 142 62 -233 19 168
4598A68k23k78J77K94J6P0l69l0L47J62p53K07K92J40k24K70n03K86O9k0k17j81
$$ 168 -55 -333 -156 138 154 224 -145 -175 172 334 -419 -212 80 220 -4 266 -237 49 118 98 -119 -300
4620c00M10k57k73L39P1p8J71k34J45Q0J17o4k33r9K79j03j27l00K92L3K49k47
$$ -300 110 -147 -420 -81 -10 -88 83 -151 -6 74 191 127 -106 -205 74 -29 -156 -456 -164 -131 118 -129
4642a29k22K30J8J08j49k54N55m00N17k32n6P0o3ok67N07l10J44o36L57K75k9
$$ -129 -351 -121 -103 5 -144 -398 157 -243 274 42 -14 56 -7 -13 -280 227 -83 61 -575 -218 57 28
4664B8k70L24j30q8j84K51k29K83O1j65r4L28j72j10K03N8j8q5k46K20o1Q8L00
$$ 28 -242 82 -48 -136 -320 -69 -298 -15 46 -119 -213 115 -57 -167 36 94 76 -9 -255 -35 -96 -8 292
4687B92m75QK81J7l38K44n6j17J84PJM2K80m65k08L04K29j47J8L00m06K14p9j65
$$ 292 -183 -175 106 123 -215 29 -27 -144 40 47 48 90 370 -95 -303 1 230 83 101 401 -5 209 130 -35
4711c5K07Kk27N1k24K94J31j28j8J11R4k45r2L50k38n9o0n5K32J03k43M6n4p0
$$ -35 172 174 -53 -2 -226 68 199 71 53 164 258 13 -79 271 33 -26 -86 -141 91 194 -49 -3 -57 -127
4735a27M84m12n6j4P0K80k11R0j20n2n8K20j23K6P4Q9n51M18Q6j65R1k03J11J97
$$ -127 357 -55 -111 -125 -55 225 14 104 -16 -68 -126 94 -29 -3 71 160 -391 27 113 -52 39 -164 -53 144
4759A44l20j9K2K84l6r2Q1l23J05M31j39q8J04J51k21j95O2o9K72k76J32M3L5
$$ 144 -176 -195 -173 111 75 -17 64 -259 -154 277 138 50 154 305 84 -111 -49 -118 154 -122 10 53 88
4782H8O6q9K8J09k73K25n37M16k01lJ37j19N5K46j40j17o2L96Q4m27K67o7j85
$$ 88 154 65 93 202 -71 154 -383 33 -168 -171 -34 -153 -98 148 8 -109 -171 225 309 -118 149 82 -103
4805a03L2j58J87O3j01K63p6m1J7J2j9J39l38J76l1N3Q1P8m65K86j89K87j53J52
$$ -103 -71 -229 -42 21 -80 183 107 66 83 95 76 215 -123 53 22 75 156 234 -231 55 -134 153 0 152
4829A52k27K0L10j47j19j94M56n40N04j13j77K20p2m3RN2L70p12K86OJ94k10K20
$$ 152 -75 -55 255 108 -11 -205 251 -289 215 102 -75 145 73 30 39 91 461 -251 35 41 235 25 245
4852B45l04R3J93J89m43j68O38m80r8j06j30N18O4l37j99N96l1Rr2J47k86jL5
$$ 245 -59 34 227 416 -27 -195 443 -37 -135 -241 -371 147 211 -126 -325 271 240 249 157 304 18 17 52
4875E2m02K56N53n42J33rk18L13k72j40K83R8j64j50j57N44k28j00Q1J07r5K13
$$ 52 -350 -94 459 -83 50 41 -177 136 -136 -276 7 105 -59 -209 -366 178 -50 -150 -69 38 -57 156
4897A56k40L9jL70j78l76K37O9p0o6l74M37J24q0j14P1k44K69R1l57j07M50J84
$$ 156 -84 -45 -46 324 146 -230 7 76 6 -60 -434 3 127 47 -67 4 -240 29 120 -237 -344 106 290
4920B90j89m98J28L38L5j16k51L08N0O5n53Q1N75j55k37k04Q2M71o7n93J46L76
$$ 290 101 -397 -269 69 104 -12 -263 45 95 160 -393 -312 263 108 -129 -333 -251 220 153 -440 -294 82
4942H2k22O9j72JM49K6j80l38LM86p9k74J25N5J70j69o7j20L29j43J29m45L88
$$ 82 -140 -71 -243 -242 207 233 53 -285 -282 204 125 -149 -24 31 201 32 -35 -155 174 31 160 -285 103
4965A03p1R6Mm2Ol57J29n9M31m16K62m41J36M12j46j96J12M85k99P1l64o1J69
$$ 103 32 128 132 90 96 -261 -132 -191 240 -176 86 -355 -219 193 47 -149 -37 448 149 220 -144 -205 -36
4988c6N6J00l98N23K8m04m3K25J55k48O0j83K29N0k49P4P7m0KJ34j52k1J30J19
$$ -36 20 120 -278 245 273 -131 -174 51 206 -42 18 -165 64 114 -135 -61 16 -24 -22 112 -40 -61 69 188
5012A88l4o4Q9k43J98k69M25j0l26R1l07M29k17p8j67N7M30k36j23K63k58M06
$$ 188 154 90 179 -64 134 -135 290 280 -46 45 -262 167 -50 -128 -295 -238 192 -44 -167 96 -162 244
5034B44j70m24N01k13K18k84K00j22J47J72m62J80q3K49k82L75m44K40J22j51
$$ 244 74 -350 151 -62 156 -128 72 -50 97 269 -193 -13 -96 153 -129 246 -198 42 164 13
5054A3K05n10K05K13k62l84L82L68P6n93K35J7Q7O1k15J74J84k41k93M56k68J78
$$ 13 218 -292 -87 126 -136 -520 -138 230 306 -287 -52 -35 52 113 -102 72 256 15 -278 178 -90 88
5076H8j13K87j20l77K99Mj13J97J35j27j87j98L50j17j58L08j4J55l59k86K96
$$ 88 -25 262 142 -235 64 68 -45 152 287 160 -27 -225 125 8 -150 158 144 299 -60 -346 -50
5097e0L6K82M7m17K50k24K49J74l70O5J79l01Q2k2J30R1l24n1L13N7j30j89K01
$$ -50 -14 268 315 -102 148 -76 173 347 -23 42 221 -80 2 -20 110 201 -123 -174 139 196 66 -123 78
5120G8l45K68J28l17r0L39k3k66M86M0m32j6K97r7l9M0P2k3N2K53m04m7k38L01
$$ 78 -267 1 129 -188 -278 61 38 -228 258 298 -134 -150 147 50 11 51 123 100 152 405 1 -46 -284 17
5144A7K69m91J29J05j03K00k57K54k05K06k64O3J18n6J28Lk03Q4O4k70k64O51
$$ 17 286 -205 -76 29 -74 126 -131 123 -82 124 -140 -77 41 -15 113 116 -87 -3 61 -209 -473 178
5166A78j10k47Mn0L34j4r2j85P8K51j57k09M86l44K65j73K74m00J66k66K23J14
$$ 178 68 -179 -175 -225 109 95 3 -182 -104 147 -10 -219 267 -77 188 15 289 -111 55 -211 12 126
5188A26k34K74p8l45K2N62k26J93p11M67l28M92l59p0K76K08m91j8J93K06L40
$$ 126 -108 166 88 -257 -235 327 101 294 -417 50 -278 214 -145 -215 61 269 -222 -240 -47 159 499
5209D99n37M9J37K94j98n73M67N6J2K02n14L53N5j80m29KK01K95P0l76K4K99n7
$$ 499 -38 11 148 442 244 -329 138 194 206 408 -106 247 302 122 -307 -305 -104 191 261 -115 -91 208 151
5232A51m19J54J3K66M45o16J25J25j0J25k58j4K58l64K82n07N5K78j9q5j7Q0J77
$$ 151 -268 -114 -101 165 610 -6 119 244 234 359 101 87 345 -19 263 -244 -189 89 70 -15 -32 48 225
5255B25l62OK85n5J30n64J92J61L1K80l67l05L69K56j58r5l5L55q5l50J40k4K02
$$ 225 -137 -131 154 99 229 -335 -143 18 49 329 -38 -343 26 282 124 29 -6 349 264 -86 54 30 232
5278B32o1l15K41k86K21O1k68J76J80j18k63J61kM4R8m11K21J17J70n01L10M2
$$ 232 171 -144 97 -189 32 93 -175 1 181 63 -200 -39 -41 3 101 -310 -89 28 198 -303 7 49
5300D9l8k7l03K95J76M2j44j35K10j93q1J56Kk9L87l97J37N1j98j18K30j62R0
$$ 49 11 -16 -319 -24 152 194 50 -85 125 -68 -149 7 9 -20 367 -30 107 158 -40 -158 72 -90 0
$$ [...]
8190En8
8191e3
##END NTUPLES=NMR FID
##END=
