##TITLE=1H_LR-713_CR4
 CDCl3, 8 sc, 
 8.7.2020
##JCAMPDX= 6.0         $$ Bruker NMR JCAMP-DX V2.0
##DATA TYPE= NMR FID
##DATA CLASS= NTUPLES
##ORIGIN= UXNMR, Bruker Analytische Messtechnik GmbH
##OWNER= root
$$ XWIN-NMR		Version 3.5
$$ Wed Jul  8 10:25:16 2020 Russian Standard Time (UT+4h)  she@DPX200
##.OBSERVE FREQUENCY= 200.1315
##.OBSERVE NUCLEUS= ^1H
##.DELAY= (6, 6)
##.ACQUISITION MODE= SIMULTANEOUS
##.ACQUISITION SCHEME= undefined
##.AVERAGES= 8
##.DIGITISER RES= 18
##SPECTROMETER/DATA SYSTEM= spect
##.PULSE SEQUENCE= zg30
##.SOLVENT NAME= CDCl3
##.SHIFT REFERENCE= (INTERNAL, CDCl3, 0, 15.7039)
##AUDIT TRAIL= $$ (NUMBER, WHEN, WHO, WHERE, WHAT)
$$ ##TITLE= Audit trail, XWIN-NMR		Version 3.5
$$ ##JCAMPDX= 5.01
$$ ##ORIGIN= Bruker BioSpin GmbH
$$ ##OWNER= she
$$ F:/spectra/data/she/nmr/H-F/1/audita.txt
$$ ##AUDIT TRAIL=  $$ (NUMBER, WHEN, WHO, WHERE, WHAT)
(   1,<2020-07-08 10:24:21.18 +0400>,<she>,<DPX200>,
      <created by zg, POWCHK disabled, PULCHK disabled
       configuration hash MD5:
       00 E9 B6 7A A2 85 ED C7 34 08 36 98 17 FE 4E 26
       data hash MD5: 16K
       FD 8B 92 52 0D 60 55 77 09 EE 84 11 0B 4E 6B BE>)
$$ ##END=
$$ 
$$ hash MD5
$$ C6 33 13 CB 99 42 6C 71 96 2A 69 41 4E 68 3D 90
##$RELAX= 
##$RELAX= 
##$RELAX= 
##$RELAX= 
##$RELAX= 
##$RELAX= 
$$ Bruker specific parameters
$$ --------------------------
##$DU= <F:/spectra>
##$EXPNO= 1
##$NAME= <H-F>
##$PROCNO= 1
##$TYPE= <nmr>
##$USER= <she>
##$AMP= (0..31)
100 100 100 100 100 100 100 100 100 100 100 100 100 100 100 100 100 100 
100 100 100 100 100 100 100 100 100 100 100 100 100 100 
##$AQSEQ= 0
##$AQ_mod= 1
##$AUNM= <au_zg>
##$AUTOPOS= <>
##$BF1= 200.13
##$BF2= 200.13
##$BF3= 200.13
##$BF4= 200.13
##$BF5= 200.13
##$BF6= 200.13
##$BF7= 200.13
##$BF8= 200.13
##$BYTORDA= 1
##$CFDGTYP= 0
##$CFRGTYP= 5
##$CHEMSTR= <none>
##$CNST= (0..31)
1 1 145 1 1 1 1 1 1 1 1 1 1 1 1 1 1 1 1 1 1 1 1 1 1 1 1 1 1 1 1 1 
##$CPDPRG= <>
##$CPDPRG1= <>
##$CPDPRG2= <>
##$CPDPRG3= <>
##$CPDPRG4= <mlev>
##$CPDPRG5= <mlev>
##$CPDPRG6= <mlev>
##$CPDPRG7= <mlev>
##$CPDPRG8= <mlev>
##$CPDPRGB= <>
##$CPDPRGT= <>
##$D= (0..31)
0 1.2 0 0 0 0 0 0 0 0.06 0 0.03 0 0 0 0 0.0002 0 0 0 0 0 0 0 0 0 0 0 0 
0 0 0 
##$DATE= 1594189460
##$DBL= (0..7)
120 120 120 120 120 120 120 120 
##$DBP= (0..7)
150 150 150 150 150 150 150 150 
##$DBP07= 0
##$DBPNAM0= <>
##$DBPNAM1= <>
##$DBPNAM2= <>
##$DBPNAM3= <>
##$DBPNAM4= <>
##$DBPNAM5= <>
##$DBPNAM6= <>
##$DBPNAM7= <>
##$DBPOAL= (0..7)
0.5 0.5 0.5 0.5 0.5 0.5 0.5 0.5 
##$DBPOFFS= (0..7)
0 0 0 0 0 0 0 0 
##$DE= 6
##$DECBNUC= <off>
##$DECIM= 24
##$DECNUC= <off>
##$DECSTAT= 4
##$DIGMOD= 1
##$DIGTYP= 9
##$DL= (0..7)
0 120 120 120 120 120 120 120 
##$DP= (0..7)
150 150 150 150 150 150 150 150 
##$DP07= 0
##$DPNAME0= <>
##$DPNAME1= <>
##$DPNAME2= <>
##$DPNAME3= <>
##$DPNAME4= <>
##$DPNAME5= <>
##$DPNAME6= <>
##$DPNAME7= <>
##$DPOAL= (0..7)
0.5 0.5 0.5 0.5 0.5 0.5 0.5 0.5 
##$DPOFFS= (0..7)
0 0 0 0 0 0 0 0 
##$DQDMODE= 0
##$DR= 18
##$DS= 0
##$DSLIST= <SSSSSSSSSSSSSSS>
$$ [...]
##$SUBNAM2= <"">
##$SUBNAM3= <"">
##$SUBNAM4= <"">
##$SUBNAM5= <"">
##$SUBNAM6= <"">
##$SUBNAM7= <"">
##$SUBNAM8= <"">
##$SUBNAM9= <"">
##$SW= 24.9337058887773
##$SWIBOX= (0..15)
0 0 2 0 0 0 0 0 0 0 0 0 0 0 0 0 
##$SW_h= 4990.01996007984
##$TD= 16384
##$TD0= 1
##$TE= 0
##$TE2= 300
##$TE3= 300
##$TEG= 300
##$TL= (0..7)
0 120 120 120 120 120 120 120 
##$TP= (0..7)
150 150 150 150 150 150 150 150 
##$TP07= 0
##$TPNAME0= <>
##$TPNAME1= <>
##$TPNAME2= <>
##$TPNAME3= <>
##$TPNAME4= <>
##$TPNAME5= <>
##$TPNAME6= <>
##$TPNAME7= <>
##$TPOAL= (0..7)
0.5 0.5 0.5 0.5 0.5 0.5 0.5 0.5 
##$TPOFFS= (0..7)
0 0 0 0 0 0 0 0 
##$TUNHIN= 0
##$TUNHOUT= 0
##$TUNXOUT= 0
##$USERA1= <user>
##$USERA2= <user>
##$USERA3= <user>
##$USERA4= <user>
##$USERA5= <user>
##$V9= 5
##$VALIST= <valist>
##$VCLIST= <CCCCCCCCCCCCCCC>
##$VD= 0
##$VDLIST= <DDDDDDDDDDDDDDD>
##$VPLIST= <PPPPPPPPPPPPPPP>
##$VTLIST= <TTTTTTTTTTTTTTT>
##$WBST= 1024
##$WBSW= 4
##$XGAIN= (0..3)
0 0 0 0 
##$XL= 0
##$YL= 0
##$YMAX_a= 258856
##$YMIN_a= -162331
##$ZGOPTNS= <>
##$ZL1= 120
##$ZL2= 120
##$ZL3= 120
##$ZL4= 120
##$ABSF1= 10
##$ABSF2= 0
##$ABSG= 5
##$ABSL= 3
##$ALPHA= 0
##$AQORDER= 0
##$ASSFAC= 0
##$ASSFACI= 0
##$ASSFACX= 0
##$ASSWID= 0
##$AUNMP= <proc_1d>
##$AZFE= 0.1
##$AZFW= 0.1
##$BCFW= 1
##$BC_mod= 2
##$BYTORDP= 1
##$COROFFS= 0
##$CY= 11.3945322036743
##$DATMOD= 1
##$DC= 2
##$DFILT= <>
##$DTYPP= 0
##$F1P= 16.9975609425685
##$F2P= -3.02152046262296
##$FCOR= 0.5
##$FTSIZE= 0
##$FT_mod= 4
##$GAMMA= 1
##$GB= 0.15
##$INTBC= 1
##$INTSCL= 1
##$ISEN= 128
##$LB= 0.24
##$LEV0= 0
##$LPBIN= 0
##$MAXI= 10000
##$MC2= 0
##$MEAN= 0
##$ME_mod= 0
##$MI= 1.114404
##$NCOEF= 0
##$NC_proc= 0
##$NLEV= 6
##$NOISF1= 3.799351
##$NOISF2= 2.8
##$NSP= 1
##$NTH_PI= 0
##$NZP= 0
##$OFFSET= 15.70392
##$PC= 1
##$PHC0= -9788.047
##$PHC1= 8.60086
##$PH_mod= 1
##$PKNL= yes
##$PPARMOD= 0
##$PSCAL= 0
##$PSIGN= 0
##$REVERSE= no
##$SF= 200.130013532006
##$SI= 16384
##$SIGF1= 3
##$SIGF2= 2
##$SINO= 400
##$SIOLD= 16384
##$SREGLST= <1H.CDCl3>
##$SSB= 0
##$STSI= 0
##$STSR= 0
##$SW_p= 3612.71676300578
##$SYMM= 0
##$S_DEV= 0
##$TDeff= 0
##$TDoff= 0
##$TI= <>
##$TILT= no
##$TM1= 0
##$TM2= 0
##$TOPLEV= 0
##$USERP1= <user>
##$USERP2= <user>
##$USERP3= <user>
##$USERP4= <user>
##$USERP5= <user>
##$WDW= 1
##$XDIM= 8192
##$YMAX_p= 0
##$YMIN_p= 0
$$ End of Bruker specific parameters
$$ ---------------------------------
##NTUPLES= NMR FID
##VAR_NAME=  TIME,          FID/REAL,        FID/IMAG
##SYMBOL=    X,             R,               I
##VAR_TYPE=  INDEPENDENT,   DEPENDENT,       DEPENDENT
##VAR_FORM=  AFFN,          ASDF,            ASDF
##VAR_DIM=   8192,          8192,            8192
##UNITS=     SECONDS,       ARBITRARY UNITS, ARBITRARY UNITS
##FACTOR=    0.0002004,     1,               1
##FIRST=     0,             0,               0
##LAST=      1.6414764,     0,               0
##MIN=       0,             -162331,         0
##MAX=       1.6414764,     258856,          0
$$ Real data points
##PAGE= N=1
##DATA TABLE= (X++(R..R)), XYDATA
$$ [...]
$$ plain form
2615 -156 -2216 -2902 -1717 56 -89 -1133 -1082 -613 -937 -1916 -1990 -1449 -1280 -1532 -769 1596 2245 -210 -1880
2634 -1880 -1341 406 240 -2227 -3152 -88 3253 2128 -1418 -1468 1404 3166 560 -4241 -3325 1393
2650 1393 3824 736 -2053 378 5081 5018 -465 -3902 -849 3888 3547 -935 -2375 1950 6064 4295
2666 4295 -757 -2333 1820 4582 2343 -1848 -1229 3245 6198 3681 53 450 3560 3948 1161 -1452
2682 -1452 232 3834 5068 2950 1013 1516 3245 3665 1057 -437 453 2477 3985 3005 1852 2243
2698 2243 3834 4338 2117 113 -363 1827 3631 2853 1075 1422 3580 4392 2770 -436 -613 1447
2714 1447 3397 2150 137 963 3839 5114 2402 -108 -131 2114 2856 332 -633 508 3929 4595
2730 4595 1687 -253 136 2329 1672 -611 -1577 254 3047 3242 1454 215 1053 2397 1967 -582
$$ packed form
2615a56k060o86J185J773j45j044N1M69l24r79p4N41J69k52P63K365O49k455j670
2634a880N39J747j66k467r25L064L341j125l546n0K872J762k606m801R16M718
2650A393K431l088k789K431M703o3n483l437L053M737l41m482j440M325M114j769
2666D295n052j576M153K762k239m191O19M474K953k517l628L97L110L88k787k613
2682a452J684L602J234k118j937N03J729M20k608j494Q90K024J508r80j153L91
2698B243J591N04k221k004m76K190J804p78j778L47K158Q12j622l206j77K060
2714A447J950j247k013Q26K876J275k712k510k3K245P42k524r65J141L421O66
2730D595k908j940L89K193o57k283r66J831K793J95j788j239Q38J344m30k549
$$ plain form
2746 -582 -1768 -713 1589 2208 757 -181 822 1988 2125 -234 -2535 -1429 970 2186 661 -812
2762 -812 203 2551 2891 63 -2653 -1615 1336 1555 -407 -2210 266 2986 3014 -373 -2891 -1209
2778 -1209 1283 941 -2177 -2912 -166 3154 2541 -918 -2526 45 2323 778 -3002 -3177 142 2655
2794 2655 1503 -1837 -1899 464 1815 -478 -3575 -3251 46 1867 -124 -1915 -1306 1239 1807 -996
2810 -996 -3504 -2795 -278 1158 -820 -2614 -1186 972 1524 -1128 -3528 -3010 -780 78 -1985 -2987
2826 -2987 -1440 877 1634 -1150 -3326 -2872 -960 -744 -2731 -3655 -1686 215 883 -1213 -2769 -2346
2842 -2346 -1138 -1397 -3553 -4016 -2826 -923 -357 -1069 -1814 -1750 -1060 -935 -2542 -3606 -3322 -2171 -689
2859 -689 -763 -2043 -2181 -1411 -185 -1924 -4608 -4723 -2624 -463 -827 -3157 -2849 -17 1320 -981 -5072
$$ packed form
2746e82j186J055K302O19j451r38J003J166J37k359k301J106K399J216j525j473
2762h12J015K348L40k828k716J038K951K19j962j803K476K720K8l387k518J682
2778a209K492l42l118p35K746L320o13l459j608K571K278j545l780j75L319K513
2794B655j152l340o2K363J351k293l097L24L297J821j991j791O09K545N68k803
2810i96k508P09K517J436j978j794J428K158N52k652k400N18K230Q58k063j002
2826b987J547K317P57k784k176M54J912K16j987r24J969J901O68k096j556M23
2842b346J208k59k156m63J190J903N66p12p45O4O90J25j607j064K84J151J482
2859f89p4j280j38P70J226j739k684j15K099K161l64k330L08K832J337k301m091
$$ plain form
2876 -5072 -4654 -1236 687 -1926 -4895 -2828 1737 2474 -1965 -5536 -3617 961 472 -3503 -5801 -1038
2892 -1038 3567 2140 -3057 -4170 -361 2309 -562 -5019 -4405 1088 3712 715 -3170 -1714 2131
2907 2131 2091 -2211 -4920 -2261 2004 1865 -1010 -1771 1054 3348 1758 -1862 -2516 -48 928 -50 -532
2924 -532 962 2712 2233 922 270 99 -11 -633 -257 844 1814 1075 851 2295 3441 2144 -874
2941 -874 -1423 1175 2308 660 -888 1103 4476 5046 1059 -1699 320 3568 2385 -1174 -1896 2414
2957 2414 5933 3572 -810 -813 3696 5079 1049 -3206 -1287 3726 5065 1473 -1238 1570 5408 3966
2973 3966 -1143 -2864 438 4155 3063 -498 -318 2829 4824 2398 -1005 -829 1665 2813 1165
2988 1165 -349 827 3022 3750 1955 606 405 799 1157 523 23 212 1109 2502 2821 1363 219
$$ packed form
2876e072M18L418J923k613k969K067M565P37m439l571J919M578m89l975k298M763
2892a038M605j427n197j113L809K670k871m457O14N493K624k997l885J456L845
2907B131m0m302k709K659M265j39k875p61K825K294j590l620o54K468R76r78m82
2924e32J494J750m79j311o52j71j10o22L76J101R70p39k24J444J146j297l018
2941h74n49K598J133j648j548J991L373N70l987k758K019L248j183l559p22M310
2957B414L519k361m382lM509J383m030m255J919N013J339l592k711K808L838j442
2973C966n109j721L302L717j092l561J80L147J995k426l403J76K494J148j648
2988A165j514J176K195P28j795j349k01L94L58o34n00J89Q97J393L19j458j144
$$ plain form
3005 219 -26 1423 1883 61 -1110 622 3071 3527 1185 -828 355 2977 2144 -871 -2399 212
3021 212 3811 2720 -210 -1263 1870 4247 1707 -2056 -2004 1808 3441 1073 -1321 35 3490 3780
3037 3780 429 -2098 -654 1796 1431 -920 -1313 1134 3120 2055 71 -375 550 993 -252 -805
3053 -805 -106 645 1420 994 1273 1401 156 -791 -129 244 -228 -1260 -678 1693 2420 628 -1532 -515
3071 -515 1670 1923 -1750 -3426 -1030 2489 2029 -1749 -2990 845 3950 863 -4399 -4230 628 2590
3087 2590 -358 -4126 -2106 2668 3498 -1650 -5334 -2353 1975 1280 -3339 -4811 -378 3619 1250
3102 1250 -3362 -3993 -62 1770 -1394 -5479 -3754 370 1602 -1541 -3811 -1842 601 -137 -3766
3117 -3766 -4436 -2359 -258 -874 -2418 -2014 -624 -675 -1725 -3133 -2757 -1928 -2604 -2914 -1680 -569 -1008
$$ packed form
3005B19k45J449M60j822j171J732K449M56k342k013J183K622q33l015j528K611
3021B12L599j091k930j053L133K377k540l763N2L812J633k368k394J356L455K90
3037C780l351k527J444K450l65k351l93K447J986j065j984m46R25M43j245n53
3053h05O99P51P75m26K79J28j245r47O62L73m72j032N82K371P27j792k160J017
3071e15K185K53l673j676K396L519m60l778j241L835L105l087n262J69M858J962
3087B590k948l768K020M774Q30n148l684K981M328o95m619j472M433L997k369
3102A250m612o31L931J832l164m085J725M124J232l143k270J969K443p38l629
3117c766o70K077K101o16j544M04J390n1j050j408L76Q29o76l10J234J111m39
$$ plain form
3134 -1008 -1898 -1648 -291 -1139 -2948 -4126 -2495 173 -718 -2817 -2712 209 1248 -1300 -4523 -3665
3150 -3665 -139 338 -2691 -4407 -1584 1797 1119 -2388 -4580 -1671 746 -703 -4211 -3933 401 2705
3166 2705 470 -2891 -2501 473 1473 -1759 -4211 -2614 1133 1816 -814 -2320 -272 1911 1194 -1858
3182 -1858 -3020 -1187 1106 789 -857 -1346 149 1791 1321 -499 -1662 -827 616 743 -307 -702
3198 -702 264 1951 2039 454 -1239 -942 812 1312 156 -728 89 2204 2889 720 -1073 -499 1489
3215 1489 1786 -662 -1645 309 2714 2962 372 -673 652 2681 1601 -989 -1350 547 3233 2082
3231 2082 306 62 1618 2440 1209 -829 -901 834 1849 1200 304 579 1948 2489 1264 -127 -53
3248 -53 799 1261 992 517 672 1605 2370 2153 865 -53 692 1136 1529 327 -460 817 2609 3325 1237
$$ packed form
3134a008q90K50J357q48j809j178J631K668q91k099J05K921J039k548l223Q58
3150c665L526M77l029j716K823L381o78l507k192K909K417j449l508K78M334K304
3166B705k235l361L90K974J000l232k452J597L747O83k630j506K048K183p17l052
3182a858j162J833K293l17j646m89J495J642m70j820j163Q35J443J27j050l95
3198g02R66J687Q8j585j693K97J754N00j156q84Q17K115O85k169j793N74J988
3215A489K97k448r83J954K405K48k590j045J325K029j080k590l61J897K686j151
3231B082j776k44J556Q22j231k038p2J735J015o49q96K75J369N41j225j391P4
3248e3Q52M62k69m75J55R33P65k17j288r18P45M44L93j202p87J277J792P16k088
$$ plain form
3267 1237 -536 449 1967 1981 -616 -1307 750 3615 3075 370 -357 1530 2926 1643 -1336 -1285 1810
3284 1810 3461 2270 -481 -132 2559 3808 1078 -1370 -730 2188 3104 786 -769 664 3222 3353
3300 3353 213 -1089 57 2291 2178 -21 -658 1329 3105 2574 878 -525 927 1857 1485 15
3316 15 -686 823 2844 2560 814 82 928 1433 1315 -278 -1238 559 2002 2025 712 -177 620 1561
3334 1561 1157 -844 -1155 -314 1436 1307 -262 -266 752 1762 950 -854 -1342 -817 615 -28 -484 -407
3352 -407 453 1556 436 -1161 -1446 -1124 -568 -531 -1008 -1087 -584 577 638 -642 -1765 -1915 -850 -405 -1636
3371 -1636 -2576 -1716 274 837 -915 -2563 -1899 -24 -251 -2213 -3980 -2092 929 712 -2079 -3525
3387 -3525 -1474 1336 -14 -3664 -4499 -1218 1461 -242 -3510 -3298 -155 1172 -1319 -4952 -3973 208
$$ packed form
3267A237j773R85J518J4k597o91K057K865n40k705p27J887J396j283k979N1L095
3284A810J651j191k751L49K691J249k730k448O40K918R16k318j555J433K558J31
3300C353l140j302J146K234j13k199o37J987J776n31j696j403J452R30l72j470
3316A5p01J509K021k84j746p32Q46N05j18j593r60J797J443K3j313q89P97R41
3334A561m04k001l11Q41J750j29j569mJ018J010q12j804m88N25J432o43m56P7
3352d07Q60J103j120j597k85L22N56L7m77p9N03J161O1j280j123j50J065M45j231
3371a636r40Q60J990N63j752j648O64J875k27j962j767J888L021k17k791j446
3387c525K051K810j350l650q35L281K679j703l268K12L143J327k491l633R79M181
$$ plain form
3403 208 866 -2282 -4199 -1739 1651 1117 -2812 -4627 -1627 739 -1008 -3367 -3470 -217 1597 -433
3419 -433 -2909 -2333 -360 214 -1978 -3236 -1646 52 140 -1503 -1754 -158 60 -1221 -2157 -1487 -623
3436 -623 -887 -1302 -823 587 401 -1293 -1829 -774 -121 -1051 -2885 -1668 1090 1457 -655 -2395 -654
3453 -654 1912 699 -2417 -3415 211 2204 526 -2413 -1872 2003 3127 -947 -3502 -1856 1756 2311
3469 2311 -1505 -3510 -155 3754 2092 -2000 -3063 648 2581 461 -2912 -2124 1661 3325 511
3484 511 -2255 -724 2175 1943 -1071 -2998 -327 2202 1668 -882 -1265 844 1757 817 -1490 -1137 346
3501 346 654 358 -216 274 854 772 395 -138 490 -232 -374 -21 1063 968 157 199 1654 1690 346 -994
3521 -994 -428 1602 1806 -200 -1057 796 2867 2223 -355 -1418 968 2704 1087 -1603 -1188 2424
$$ packed form
3403B08O58l148j917K460L390n34l929j815L000K366j747k359j03L253J814k030
3419d33k476N76J973N74k192j258J590J698Q8j643k51J596K18j281r36O70Q64
3436f23k64m15M79J410j86j694n36J055O53r30j834J217K758L67k112j740J741
3453f54K566j213l116r98L626J993j678k939N41L875J124m074k555J646L612N55
3469B311l816k005L355L909j662m092j063L711J933k120l373P88L785J664k814
3484E11k766J531K899k32l014j927K671K529n34k550l83K109R13r40k307L53J483
3501C46L08k96n74M90N80q2l77n33O28p22j42L53J084r5q11M2J455L6j344j340
3521i94N66K030K04k006q57J853K071o44k578j063K386J736j617k690M15L612
$$ plain form
3537 2424 3568 905 -1023 -249 2249 2766 -599 -1882 750 3009 2661 213 -580 1447 2894 1721
3553 1721 -669 -955 1649 2667 1454 533 1133 2464 2804 1372 370 623 1254 1326 866 806 1338 1670
3571 1670 1729 1943 1404 752 382 755 1497 1844 858 310 1608 2786 1854 -2 -364 1688 2369 1076
3589 1076 -983 -299 2382 3168 1079 -1152 24 2556 2688 -595 -2175 283 3841 2667 -590 -1730
3605 -1730 1250 3119 1026 -2005 -2005 1397 2808 650 -2104 -431 2191 2540 -581 -2431 -828 1424
3621 1424 1027 -1175 -1621 283 1904 1111 -1496 -1827 -77 569 -382 -1386 -1007 529 825 -405 -1022
3638 -1022 -707 -69 -652 -1320 -1529 -597 -773 -622 -428 169 294 -780 -1596 -467 -471 -1003 -2202 -1204 148
3657 148 425 -1171 -1873 -1089 368 54 -2278 -3013 -1023 1038 241 -2237 -2396 -22 1509 -551 -3413
$$ packed form
3537B424J144k663j928P74K498N17l365j283K632K259l48k448p93K027J447j173
3553A721k390k86K604J018j213r21O00J331L40j432j002K53O31P2m60o0N32L32
3571A670N9K14n39o52l70L73P42L47r86n48J298J178r32j856l62K052O81j293
3589A076k059O84K681P86k089k231J176K532J32l283j580K458L558j174l257j140
3605a730K980J869k093l031%L402J411k158k754J673K622L49l121j850J603K252
3621A424l97k202m46J904J621p93k607l31J750O46r51j004L79J536K96j230o17
3638a022L15O38n83o68k09R32j76J51J94N97J25j074q16J129mn32j199R98J352
3657A48K77j596p02P84J457l14k332p35J990K061p97k478j59K374J531k060k862
$$ plain form
3674 -3413 -2520 69 1117 -922 -2734 -1495 1401 1193 -1724 -3013 -1346 672 429 -2381 -3149 -593
3690 -593 1388 570 -1984 -2538 -541 1306 -487 -2691 -2038 -114 1333 195 -2011 -1433 465 778
3706 778 -1105 -2531 -1874 263 795 -341 -1299 -525 529 188 -1088 -1844 -1198 77 -204 -515 -828 -336
3724 -336 149 377 -538 -1012 -913 -771 -212 -620 -735 -624 -33 197 175 -909 -1389 -935 -393 -52 -821 -787 -69
3745 -69 931 631 -442 -1371 -780 40 -74 -1148 -1434 -87 960 517 -713 -1178 -113 579 -51 -1984
3763 -1984 -1729 -18 1378 238 -1033 -1025 343 1191 -109 -1875 -1518 727 922 -194 -1163 -489 1150
3780 1150 1544 -258 -2087 -854 1154 1412 -242 -1439 38 2104 1477 -450 -1301 -186 1635 935
3796 935 -886 -1073 553 2451 1495 -265 -381 1001 1385 400 -443 -347 1034 1988 1328 120 73 1225
$$ packed form
3674c413Q93K589J048k039j812J239K896k08k917j289J667K018k43k810p68K556
3690e93J981q18k554n54J997J847j793k204O53J924J447j138k206N78J898L13
3706G78j883j426O57K137N32j136r58P74J054l41j276p56O46J275k81l11l13M92
3724c36M85K28r15m74R9J42N59m08j15J11N91K30k2j084m80M54N42L41p69L4P18
3745f9J000l00j073r29N91Q20j14j074k86J347J047m43j230m65J065O92o30j933
3763a984K55J711J396j140j271QJ368Q48j300j766L57K245J95j116r69O74J639
3780A150L94j802j829J233K008K58j654j197J477K066o27j927q51J115J821p00
3796I35j821j87J626J898r56j760j16J382L84r85q43R6J381R54o60j208m7J152
$$ plain form
3814 1225 1729 902 -33 277 853 1831 1078 679 555 1132 1666 898 456 293 935 1814 1719 777 643 1200
3834 1200 1816 1677 855 161 460 1892 1672 453 458 1244 2464 1918 107 -406 819 1976 1506 12
3852 12 -274 1607 2470 1616 30 413 1661 2172 925 -319 -163 1619 2121 813 -230 302 1358
3869 1358 1581 659 -644 -264 1115 1507 689 -113 291 1324 1602 301 -443 244 385 414 382 -257 -102
3888 -102 1078 997 473 -723 -674 216 1086 58 -662 -998 484 1382 320 -850 -837 692 1189 -383
3906 -383 -1653 -912 1053 1420 -439 -1633 -632 911 668 -1346 -2288 -714 1514 605 -1253 -1581 38
3923 38 1455 420 -2318 -2029 -174 804 -133 -1873 -669 858 1184 -818 -1481 -839 332 -201 -1301
3940 -1301 -1262 -401 533 173 -605 -659 -83 -235 -1067 -1183 -697 -508 -543 -295 40 418 -469 -1321 -741 275
$$ packed form
3814A225N04q27r35L10N76R78p53l99j24N77N34p68m42j63O42Q79r5r42j34N57
3834A200O16j39q22o94K99J432k20j219NP86J220n46j811n13J225J157m70j494
3852A2k86J881Q63q54j586L83J248N11j247j244J56J782N02j308j043N32J056
3869A358K23r22j303L80J379L92q18q02M04J033K78j301p44O87J41K9l2o39J55
3888a02J180q1n24j196M9Q90Q70j028p20l36J482Q98j062j170J3J529M97j572
3906c83j270P41J965L67j859j194J001J543k43k014r42J574K228r09j858l28J619
3923C8J417j035k738K89J855R78r37j740J204J527L26k002o63O42J171n33j100
3940a301L9Q61R34l60p78n4N76j52q32j16M86J89l5K48L35L78q87q52N80J016
$$ plain form
3960 275 -420 -1289 -1301 263 1220 -133 -1344 -1374 412 505 -1124 -2569 -1329 1128 987 -1166 -2140 -6
3978 -6 1433 343 -2121 -2917 -386 1229 -259 -2246 -1915 842 1888 -356 -3050 -1752 832 966
3994 966 -1371 -2782 -752 1359 1004 -1424 -2498 -676 853 -261 -2409 -2162 191 1056 -285 -1653
4010 -1653 -1207 -380 -52 -1423 -2096 -1187 -170 413 -506 -873 -288 -84 -576 -895 -1113 -1244 -937 -606 -337
4029 -337 -141 -478 -602 -565 -85 -457 -1305 -984 -466 595 331 -1091 -995 364 792 -436 -1937 -1337 343
4048 343 619 -503 -1531 -545 1593 830 -758 -1920 -417 1355 490 -1120 -1080 773 1529 686 -703
4065 -703 -1016 642 970 67 -870 -511 1075 1797 580 -92 186 926 421 -252 -80 12 1259 1252 831 295
4085 295 505 781 1314 913 -142 -54 545 1487 1668 371 49 982 1997 1145 -24 -357 550 1990 1209
$$ packed form
3960B75o95q69j2J564R57j353j211l0J786R3j629j445J240K457j41k153r74K134
3978fJ439j090k464p96K531J615j488j987L31K757J046k244k694J298K584J34
3994I66k337j411K030K111l55k428j074J822J529j114k148K47K353Q65j341j368
4010a653M46Q27L28j371o73R09J017N83r19l67N85K04m92l19k18j31L07L31K69
4029c37J96l37j24L7M80l72q48L21N18J061k64j422R6J359M28j228j501O00J680
4048C43K76j122j028R86K138p63j588j162J503J772q65j610M0J853P56q43j389
4065g03l13J658L28r03r37L59J586P22j217o72K78P40n05o73J72R2J247pm21n36
4085B95K10K76N33m01j055Q8N99R42J81j297l22R33J015q52j169l33R07J440p81
$$ plain form
4104 1209 -350 26 1599 1999 1000 -1132 -162 1648 2110 463 -626 447 2130 1980 302 -724
4120 -724 668 1581 1587 -301 -563 808 2281 1665 -161 28 1048 1449 325 -384 188 856 1232 837
4138 837 18 798 1356 1052 399 66 200 171 439 366 554 600 147 358 725 571 110 -453 327 1020 923
4159 923 -329 -420 444 1216 508 -865 -861 639 1406 140 -1270 -444 1382 1783 -99 -1298 -361 934
4177 934 1059 -1017 -1398 58 1839 1233 -1077 -1274 631 1416 469 -1552 -1157 818 1410 420 -1168
4194 -1168 -313 745 1004 -236 -1498 -561 873 922 -541 -943 22 1164 645 -432 -831 -214 449 144
4212 144 -471 -547 42 527 567 -316 -737 -424 161 243 -418 -557 -213 236 150 -153 -597 -455 -160 229 -384
4233 -384 -1060 -496 256 563 -275 -956 -575 -14 357 -698 -1138 -633 -131 562 -641 -971 -627 107 -135
$$ packed form
4104A209j559L76J573M00r99k132R70J810M62j647j089J073J683j50j678j026
4120g24J392R13Oj888k62J371J473o16j826J89J020M01j124p09N72O68L76l95
4138H37q19P80N58l04o53l33J34k9K68p3J88M6m53K11L67j54m61n63P80O93r7
4159I23j252r1Q64P72p08j373MJ500P67j266j410Q26J826M01j882j199R37J295
4177I34J25k076l81J456J781o06k310j97J905P85r47k021L95J975N92r90j588
4194a168Q55J058K59j240j262R37J434M9j463m02R65J142n19j077l99O17O63l05
4212A44o15p6N89M85M0q83m21L13N85Q2o61j39L44M49q6l03m44J42K95L89o13
4233c84o76N64P52L07q38o81L81N61L71j055m40N05N02O93j203l30L44P34k42
$$ plain form
4252 -135 -1010 -1229 -824 205 -300 -543 -1328 -618 -34 231 -524 -1202 -887 -314 -310 -612 -1293 -723 100 400
4272 400 -777 -1711 -983 -112 -150 -983 -1356 -1113 204 396 -1139 -1919 -792 53 81 -1505 -2186 -836 367
4291 367 39 -1340 -1830 -378 215 -339 -1573 -1691 -209 842 -63 -1650 -992 290 526 -553 -1905
4308 -1905 -1216 335 628 -674 -1204 -734 473 229 -608 -1338 -565 224 432 -186 -620 -163 408 420 75
4327 75 -799 -690 16 156 -240 -287 -326 72 704 -77 -179 -230 143 712 319 -317 -69 460 1122 584 -309
4348 -309 -180 460 982 531 -370 -268 742 995 351 -95 1 990 1105 47 -610 -12 644 1179 410 -216
4368 -216 353 1378 1408 216 -301 241 1300 669 -189 -85 485 1195 928 304 -6 160 668 802 192
4387 192 -266 97 1124 1103 139 -175 297 717 1094 -2 -365 34 1100 1243 269 -184 85 1523 1042
$$ packed form
4252a35q75k19M05J029n05k43p85P10N84K65p55o78L15N73Ml02o81N70Q23L00
4272D00j177r34P28Q71l8q33l73K43J317J92j535p80J127Q45K8j586o81J350J203
4291C67l28j379m90J452N93n54j234j18J482J051r05j587O58J282K36j079j352
4308a905O89J551K93j302n30M70J207k44q37p30P73P89K08o18m34M57N71J2l45
4327G5q74J09P06J40l96m7l9L98O32p81j02n1L73N69l93o36K48N29O62n38q93
4348c09J29O40N22m51r01J02J010K53o44m46R6R89J15j058o57N98O56N35p69o26
4368b16N69J025L0j192n17N42J059o31q58J04N70P10k67o24l10J66N08J34o10
4387A92m58L63J027k1r64l14M72M20L77j096l63L99J066J43r74m53K69J438m81
$$ plain form
4406 1042 -202 -1160 289 1386 963 -93 -630 505 1745 1047 -598 -1010 370 1057 360 -751 -92
4423 -92 1261 1487 203 -653 -49 909 980 -250 -796 126 1311 1118 47 -238 479 1074 183 -559 -162
4442 -162 596 922 446 129 837 915 682 150 -120 292 168 264 546 1326 792 56 234 370 633 -162 -320
4463 -320 -92 686 1008 128 -495 359 1057 1091 -702 -1002 19 1461 563 -613 -307 907 1526 294
4481 294 -1108 -1092 696 1243 269 -1191 -330 1435 1279 -558 -968 -32 1126 866 -1168 -1273 57 1248
4499 1248 371 -724 -908 248 919 29 -877 -1050 227 899 -29 -965 -721 176 422 -206 -1337 -812
4517 -812 -48 55 -442 -657 -466 -36 87 -287 -899 -808 -339 -327 -344 -661 -714 -319 -375 -290 -806 -1018 -411 -206
4539 -206 -672 -1137 -1116 -388 -90 -571 -885 -1035 -598 -311 -475 -1009 -1147 -400 98 -418 -968 -1326 -766 -226
$$ packed form
4406A042j244r58J449J097m23j056n37J135J240o98j645m12J380O87o97j111O59
4423i2J353K26j284q56O04R58P1j230n46R22J185j93j071k85P17N95q91p42L97
4442a62P58L26m76l17P08P8k33n32k70M12j24R6K82P80n34p36J78J36K63p95j58
4463c20K28P78L22q80o23Q54O98L4j793l00J021J442q98j176L06J214O19j232
4481B94j402J6J788N47r74j460Q61J765j56j837m10R36J158k60k034j05J330J191
4499A248q77j095j84J156O71q90r06j73J277O72r28r36K44Q97K46o28j131N25
4517h12P64J03m97k15J91M30J23l74o12R1M69J2j7l17n3L95n6Q5n16k12O07K05
4539b06m66m65K1P28K98m81l14j50M37K87j64n34j38P47M98n16n50l58N60N40
$$ plain form
4559 -226 -691 -1471 -1168 -518 134 -219 -1233 -922 -377 -134 -307 -931 -1472 -491 571 -317 -881 -1060 -150
4578 -150 345 -358 -1355 -1050 -22 474 -334 -1321 -867 548 717 -361 -1675 -1030 345 546 -442 -1441
4596 -1441 -448 686 625 -830 -1096 95 855 347 -918 -1091 403 1136 391 -803 -580 452 450 -34
4614 -34 -679 -529 340 465 153 -512 -62 263 738 -34 -264 -327 125 428 279 -128 210 -86 200 565 34
4635 34 -458 -232 -35 709 84 -661 -94 809 1227 -9 -528 -139 471 604 -690 -683 235 893 942 -241
4655 -241 -455 214 1165 424 -758 -872 481 1041 -7 -293 -28 1093 823 -50 -594 -26 841 496 60
4674 60 -303 437 781 485 -164 -598 252 780 297 238 122 392 435 329 281 48 -353 165 454 545 170 -68
4696 -68 500 895 715 26 -412 506 1060 392 -362 -294 736 1533 683 -846 -623 744 1442 137 -1091
$$ packed form
4559b26m65p80L03O50O52l53j014L11N45K43j73o24n41R81J062q88n64j79R10
4578a50M95p03r97L05J028M96q08r87M54J415J69j078j314O45J375K01r88r99
4596a441R93J134o1j455k66J191P60n08j265j73J494P33p45j194K23J032km84
4614c4o45J50Q69J25l12o65M50L25M75p72k30o3M52L03j49m07L38k96K86L65n31
4635C4m92K26J97P44o25p45N67R03M18j236n19L89O10J33j294PR18O58M9j183
4655b41k14O69R51p41j182j14J353N60j048k86K65J121k70q73n44N68Q67l45m36
4674F0l63P40L44k96o49m34Q50N28m83n9j16K70M3j06m8k33m01N18K89R1l75k38
4696f8N68L95j80o89m38R18N54o68p54O8J030P97q50j529K23J367O98j305j228
$$ plain form
4715 -1091 -193 1408 1340 204 -701 131 1750 1113 -603 -477 739 1332 868 -596 -292 1318 1436 320
4733 320 -772 -229 1051 1087 -186 -274 732 1073 862 -204 -272 542 666 343 -75 142 808 420 226
4752 226 60 678 266 -267 -89 129 648 217 -277 352 834 761 -245 -679 304 956 284 -998 -1018 539
4772 539 951 132 -832 -438 813 918 -946 -1540 -43 1274 728 -767 -1008 324 1068 -75 -1421
4789 -1421 -1244 336 629 -402 -1549 -485 679 474 -758 -1322 -690 482 83 -997 -1210 -250 444
4806 444 -330 -966 -770 -696 -71 -202 -667 -717 -218 -110 -60 -467 -784 -754 -333 -435 -576 -688 -420 -220 -94
4827 -94 -362 -349 -780 -270 -65 -732 -897 -665 44 525 -210 -725 -327 432 -94 -871 -1251 -371 174 107 -649
4848 -649 -831 199 204 112 -629 -600 83 184 -517 -661 -222 119 509 111 -211 -163 -21 -241 -273 -396 -332 -189
$$ packed form
4715a091Q98J601o8j136r05Q32J619o37j716J26J216N93m64j464L04J610J18j116
4733C20j092N43J280L6j273q8J006L41k11j066o8Q14J24l23m18K17O66l88j94
4752B26j66O18m12n33J78K18N19m31m94O29M82p3j006m34R83O52o72j282k0J557
4772E39M12q19r64L94J251J05j864n94J497J317n46j495k41J332P44j143j346
4789a421J77J580K93j031j147J064J164k05j232n64O32J172l99j080k13R60O94
4806D44p74o36J96P4O25j31m65n0M99J08N0m07l17L0M21j02j41j12K68K00J26
4827i4k68J3m31N10K05o67j65K32P09M81p35n15L98P59n26p77l80Q80N45o7p56
4848f49j82J030Nr2p41K9O83J01p01j44M39L41L90l98l22M8J42k20l2j23O4J43
$$ plain form
4870 -189 -12 -151 503 -98 -272 271 213 -386 -352 -557 196 451 208 -531 -475 595 368 -279 -935 -71 1114
4891 1114 611 -407 -1084 241 1168 482 -954 -1109 140 849 285 -923 -584 852 1161 -49 -1128
4908 -1128 -586 940 941 -251 -1101 26 1102 600 -745 -789 379 761 -70 -833 -455 648 775 -239
4926 -239 -113 185 187 126 -406 -110 54 -65 -82 -103 220 555 -187 -278 257 331 -9 -383 -129 291 867 266
4948 266 -497 73 1006 696 -806 -289 267 1174 132 -513 -487 875 1156 167 -1111 -2 1155 775
4966 775 -383 -717 609 1448 877 -669 -573 691 1085 26 -641 -280 970 1024 106 -477 29 1057
4984 1057 854 -253 54 461 678 609 155 359 613 964 593 86 430 584 170 381 613 441 502 49
5004 49 385 765 634 -330 -192 566 1217 368 -437 -255 1248 1191 171 -933 311 1384 669 -728 -536
$$ packed form
4870a89J77j39O54o01j74N43n8n99L4k05P53K55k43p39N6J070k27o47o56Q64J185
4891A114n03j018o77J325R27o86j436j55J249P09n64j208L39J436L09j210j079
4908a128N42J526Jj192q50J127J076n02j345m4J168L82q31p63L78J103J27j014
4926b39J26K98Ko1n32K96J64j19j7k1L23L35p42r1N35P4l40l74K54M20N76o01
4948B66p63N70R33l10j502N17N56R07j042o45K6J362K81r89j278J109J157l80
4966G75j158l34J326Q39n71j546R6J264L94j059o67L61J250N4r18n83N06J028
4984A057k03j107L07M07K17o9m54K04K54L51l71n07L44J54m14K11K32j72O1m53
5004D9L36L80j31r64J38P58O51q49q05J82J503n7j020j104J244J073p15j397J92
$$ plain form
5023 -536 438 1558 453 -835 -431 1195 1173 -305 -1133 -708 1366 993 -376 -717 124 1260 382 -661
5041 -661 -957 284 844 -21 -634 -184 655 636 -131 -683 -138 513 -26 -680 -548 244 498 -287 -281 389 514
5062 514 -94 -761 -496 59 371 -500 -329 355 255 -197 -1347 -524 158 265 -581 -1149 -247 804 -35
5081 -35 -884 -1036 71 642 -376 -1283 -670 609 799 -283 -1428 -209 840 615 -984 -1361 141
5098 141 956 230 -1098 -399 393 768 -377 -981 -992 192 623 -427 -879 -27 916 250 -223 -789 -162
5117 -162 76 28 -515 -413 208 304 -111 3 33 -29 148 3 -345 104 -84 -86 140 285 -225 -346 -245 281
5139 281 171 -405 -663 40 521 80 -399 -454 -61 582 -213 -886 -940 96 536 16 -692 -695 50 258 -430
5160 -430 -803 -182 273 347 -249 -308 96 277 -125 -697 -639 -3 33 -169 -350 -303 -323 -92 132 -98 -19 -567
$$ packed form
5023e36R74J120j105j288M04J626k2j478q28M25K074l73j369l41Q41J136q78j043
5041f61k96J241N60q65o13M50Q39j9p67n52N45O51n39o54J32P92K54p85OO70J25
5062E14o08o67K65N55L12q71J71O84j00m52j150Q23O82J07q46n68R02J051q39
5081c5q49j52J107N71j018r07O13J279J90j082j145J219J049k25j599l77J502
5098A41Q15p26j328O99P92L75j145o04j1J184M31j050m52Q52R43o66m73n66O27
5117a62K38m8n43J02O21R6m15J14L0o2J77j45l48M49j88kK26J45n10j21J01N26
5139B81j10n76k58P03M81m41m79n5L93O43p95o73n4J036M40n20p08lP45K08o88
5160d30l73O21M55P4n96n9M04J81m02n72N8O36L6k02j81M7k0K31K24k30P9n48
$$ plain form
5182 -567 38 66 215 -291 -340 -386 207 52 -99 -707 19 331 -27 -783 -852 252 704 273 -598 -474 498
5203 498 511 -373 -963 -211 689 451 -843 -780 152 889 537 -823 -948 187 950 -291 -716 -722 588 1033
5223 1033 44 -441 -649 740 598 -571 -469 291 953 350 -7 17 409 267 67 -275 -136 361 803
5242 803 144 66 412 400 310 240 526 380 25 67 203 696 659 61 -10 374 616 283 -288 128 619 1067
5264 1067 135 -88 126 1046 913 -313 -372 181 981 704 -386 16 633 940 318 -364 -79 489 1047
5283 1047 -112 -582 -5 1155 559 -437 -529 75 851 390 -374 -93 609 372 49 -189 -6 381 267
5302 267 222 -81 86 290 216 124 107 -58 -18 -10 199 -6 88 -105 1 406 95 -201 -199 -358 367 -197 -613
5325 -613 -285 299 718 -290 -655 -142 617 511 -581 -795 -168 760 370 -563 -796 136 579 36 -820
$$ packed form
5182e67O05K8J49n06m9m6N93j55j51o08P26L12l58p56o9J104M52m31q71J24R72
5203D98J3q84n90P52R00k38j294O3R32P37l52j360j25J135P63j241m25oJ310M45
5223A033r89m85k08J389j42j169J02P60O62o03l57K4L92j42k00l42J39M97M42
5242H03o59p8L46j2r0p0K86j46l55M2J36M93l7n98p1L84K42l33n71M16M91M48
5264A067r32k23K14R20j33j226n9N53Q00k77j090M02O17L07o22o82K85N68N58
5283A047j159m70N77J160n96r96r2O04P76m61p64K81P02k37l23k38J83L87j14
5302B67m5l03J67K04p4r2j7j65M0QK09k05R4j93J06M05l11k96Kj59P25n64m16
5325f13L28N84M19j008l65N13P59j06j092k14O27R28l90r33k33R32M43n43q56
$$ plain form
5344 -820 -570 778 498 -339 -561 -319 502 469 -354 -632 8 327 -104 -573 -499 194 132 -86 -466 -286 276
5365 276 -47 78 -210 -189 -91 -170 -217 540 677 -384 -189 75 791 -104 -294 -416 -128 490 65 -637 -395
5386 -395 626 409 -150 -859 170 703 173 -708 -652 166 1299 -4 -720 -775 542 780 120 -763 -406
5405 -406 442 826 -475 -1006 -349 482 446 -781 -798 -131 682 -103 -632 -716 195 598 -50 -623 -485 351
5425 351 323 -225 -354 -26 248 -125 -458 -588 -39 -334 86 -647 -248 -200 -323 -214 -277 -35 -446 -135 -363
5446 -363 -92 -233 -161 -439 -121 253 249 -278 -161 181 195 -274 -954 -588 138 -136 -91 -561 -373 253 449 -900
5468 -900 -892 -139 318 86 -320 -209 -38 708 259 -545 -353 51 178 28 -395 45 82 67 -112 -132 -94 -189
5490 -189 671 17 -261 395 526 540 150 127 -52 77 344 199 -183 27 96 680 114 -76 -110 329 579
$$ packed form
5344h20K50J348k80q37k22K42Q21l3q23k78O40L19m31m69P4O93o2k18l80J80N62
5365B76l23J25k88K1R8p9m7P57J37j061J95K64P16q95j90j22K88O18m25p02K42
5386c95J021k17n59p09J029N33n30q81N6Q18J133j303p16n5J317K38o60q83L57
5405d06Q48L84j301n31O57Q31l6j227j7O67Q13p85n29q4R11M03o48n73J38Q36
5425C51k8n48j29L28K74l73l33j30N49k95M20p33L99M8j23J09o3K42m11L11k28
5446c63K71j41P2k78L18L74mn27J17L42J4m69o80L66P26k74M5m70J88O26J96j349
5468i00QP53M57k32m06J11J71P46m49q04J92M04J27j50m23M40L7j5j79k0L8r5
5490a89Q60o54k78O56J31J4l90k3j79J29K67j45l82K10O9N84n66j90l4M39K50
$$ plain form
5511 579 123 105 -217 280 537 186 -200 -168 653 740 -171 -360 -217 739 666 -54 -169 317 686 485 -208
5532 -208 -240 173 631 405 -96 -146 398 680 375 166 -448 294 231 81 -123 -160 277 415 176 -170 245
5553 245 418 -40 -2 -324 -2 224 -91 65 305 180 -179 148 -282 25 -264 -181 -218 313 169 -337 -212
5574 -212 329 296 -13 -60 -88 315 358 58 -455 -214 333 227 -123 -313 -21 304 505 -133 -680 301 370 124
5596 124 -198 -330 257 556 423 -596 18 351 434 187 -550 -301 389 470 -32 -453 -615 390 640 -173
5616 -173 -214 -134 305 331 -173 -628 11 601 238 68 -88 257 370 54 -90 -415 180 179 334 -135 -214 541
5638 541 355 14 -288 -21 -76 180 140 72 88 238 280 23 163 220 8 147 407 -203 -128 -269 277 91
5660 91 -113 -250 -198 -410 152 -299 -292 -247 -168 326 79 -135 -324 -83 115 -483 -677 -257 108 579 -98 -354
$$ packed form
5511E79m56j8l22M97K57l51l86L2Q21Q7r11j89J43R56p3p20j15M86L69k01o93
5532b08l2M13M58k26n01n0N44K82l05k09o14P42o3j50k04l7M37J38k39l46M15
5553B45J73m58L8l22L22K26l15J56K40j25l59L27m30L07k89Q3l7N31j44n06J25
5574b12N41l3l09m7k8M03M3l00n13K41N47j06l50j90K92L25K01o38n47R81O9k46
5596A24l22j32N87K99j33j019O14L33Q3k47p37K49O90Q1n02m21j62J005K50q13
5616a73m1Q0M39K6n04m55O39N90l63j70j56L45J13l16j44l25N95jJ55m69p9P55
5638E41j86l41l02K67n5K56m0o8J6J50M2k57J40N7k12J39K60o10P5j41N46j86
5660I1k04j37N2k12N62m51PM5P9M94k47k14j89K41J98n98j94M20L65M71o77k56
$$ plain form
5682 -354 -155 475 201 -350 -552 51 18 87 -451 -679 63 488 -165 -118 -587 -128 -117 -316 -746 -517 203
5703 203 146 -334 -162 -259 -210 239 -368 -369 -136 112 -162 -287 -574 -337 -189 -54 -299 -759 -575 -224 57 48
5725 48 -437 -101 49 -72 -486 -677 -516 -76 68 104 -327 -301 -250 -175 -386 -453 -130 -34 55 -129 -102 -19 96
5748 96 16 -37 -403 110 87 49 -316 -310 -131 458 309 -133 -140 -135 284 203 -117 -170 66 432 225 24 8 -434 91
5773 91 166 172 -426 -6 200 244 120 119 -110 111 496 196 -306 -19 101 399 194 -149 1 478 447 -99 -248
5796 -248 -176 144 356 -40 -294 255 515 115 -329 -19 -102 279 468 -57 -424 296 -48 98 -159 -5 7
5817 7 428 69 -173 -66 216 701 250 -339 -90 160 388 7 -15 214 290 203 138 -128 96 287 -98 -323
5839 -323 51 152 253 284 71 -506 116 -362 157 -273 -317 92 276 422 34 -244 -117 150 375 -283 -369
$$ packed form
5682c54J99O30k74n51k02O03l3O9n38k28P42M25o53M7m69M59J1j99m30K29P20
5703B03n7m80J72r7M9M49o07jK33K48k74j25k87K37J48J35k45m60J84L51K81r
5725D8m85L36J50j21m14j91J61M40J44L6m31K6N1P5k11o7L23R6Q9j84K7Q3J15
5748I6q0n3l66N13k3l8l65OJ79N89j49m42pNM19q1l20n3K36L66k07k01j6m42N25
5773I1P5On98M20K06M4j24jk29K21L85l00n02K87J20K98k05l43J50M77l1n46j49
5796b48P2L20K12l96k54N49K60m00m44L10q3L81J89n25l67P20l44J46k57J54J2
5817GM21l59k42J07K82M85m51n89K49K50K28l81k2K29P6q7o5k66K24J91l85k25
5839c23L74J01J01L1k13n77O22m78N19m30m4M09J84J46l88k78J27K67K25o58q6
$$ plain form
5860 -369 116 368 53 49 91 170 193 317 -98 -183 74 59 193 -170 -198 -88 154 -2 54 110 -168 196 151 289
5884 289 -28 62 220 379 514 -52 -155 230 407 153 141 -324 241 447 392 -184 -354 386 346 456 -229
5905 -229 -242 339 430 -84 -863 -236 369 441 -358 -408 -1 386 414 -316 -644 -126 814 -24 -596 -341 300 526
5927 526 -175 -384 -292 331 368 -622 -425 -196 238 394 -634 -622 -133 491 225 -147 79 -24 308 -191 -446
5948 -446 -79 186 169 -403 -360 -206 334 -74 -88 20 20 102 -497 -236 -107 42 -61 -162 -81 402 -110 -517
5970 -517 -612 213 193 -136 -430 -99 368 308 -467 -840 -241 104 -20 -478 -255 90 394 321 -708 -299 36
5991 36 397 -267 -787 -227 368 204 -394 -611 -330 302 283 -760 -632 218 385 -112 -736 17 280 283 -179
6012 -179 -330 -186 313 89 13 -74 -129 350 18 16 161 206 153 -217 -24 -38 -163 199 24 306 -38 -154 -166
$$ packed form
5860c69M85K52l15mM2P9K3J24m15q5K57j5J34l63k8J10K42j56N6N6k78L64m5J38
5884B89l17R0J58J59J35n66j03L85J77k54j2m65N65K06n5n76j70P40m0J10o85
5905b29j3N81R1n14p79O27O05P2p99n0M07L87K8p30l28N18R40q38n72K55O41K26
5927E26p01k09R2O23L7r90J97K29M34J56j028J2M89O24k66l72K26j03L32m99k55
5948d46L67K65j7n72M3J54N40m08j4J08%Q2n99K61J29J49j03j01Q1M83n12m07
5970e17r5Q25k0l29k94L31M67o0p75l73N99L45j24m58K23L45L04p3j029M09L35
5991C6L61o64n20N60N95j64n98k17K81O32j9j043J28Q50J67m97o24P53K63Lm62
6012a79j51J44M99k24p6q7n5M79l32kJ45M5n3l70J93j4j25L62j75K82l44j16j2
$$ plain form
6035 -166 61 53 83 -97 -246 237 447 68 -293 -152 439 459 -275 -370 -200 502 115 -282 -361 300 547 175
6057 175 -218 -236 263 393 84 -280 -113 39 456 -216 -202 16 4 85 14 -136 197 -48 -216 -125 -267 18
6079 18 150 23 -52 -135 -250 361 317 269 47 -214 52 -116 -39 216 -172 216 36 104 -117 -152 284 294 10
6102 10 -121 -21 103 146 135 -401 -338 -7 325 -61 -258 -226 384 433 -17 -160 61 263 154 -99 -446 -47
6124 -47 528 396 -137 -69 144 438 35 -221 -149 243 247 131 40 54 381 198 -11 -252 54 42 346 7 -163
6147 -163 141 26 382 36 -95 -35 34 -11 129 126 -56 -40 271 393 18 -52 148 36 227 -67 -242 -103
6169 -103 71 178 296 28 -65 76 106 -177 63 130 33 -64 -59 -166 247 40 -126 30 126 49 167 70 149 -155
6193 -155 81 -89 78 -16 -49 -125 91 218 -688 253 -152 108 -113 -127 -165 -71 298 -26 -341 -232 179 5
$$ packed form
6035a66K27qL0j80j49M83K10l79l61J41N91K0p34r5J70P02l87l97p9O61K47l72
6057A75l93j8M99J30l09l64J67J52M17o72J4K18j2Q1p1j50L33k45j68R1j42K85
6079A8J32j27p5q3j15O11m4m8k22k61K66j68P7K55l88L88j80O8k21l5M36J0k84
6102A0j31J00J24M3j1n36O3L31L32l86j97L2O10M9m50j43K21K02j09k53l47L99
6124d7N75j32n33O8K13K94m03k56P2L92Mj16r1J4L27j83k09k41L06j2L04l39j70
6147a63L04j15L56l46j31O0O9m5J40lj82J6L11J22l75p0K00j12J91k94j75J39
6169a03J74J07J18k68r3J41L0k83K40O7r7r7Nj07M13k07j66J56R6p7J18r7P9l04
6193a55K36j70J67r4l3p6K16J27r06R41m05K60k21j4l8R4L69l24l15J09M11j74
$$ plain form
6215 5 66 -512 -45 243 70 -331 -529 32 217 -22 -183 -285 -39 155 197 -124 -259 69 262 -80 -329
6236 -329 -160 360 117 110 -279 -113 -3 82 -97 -226 -65 527 80 -253 -233 468 98 -336 -399 -326 209 -232
6258 -232 -125 -60 -79 309 -89 -269 -73 -2 -215 -112 -92 139 152 40 163 -101 202 7 -523 -372 412 578
6280 578 272 -273 -32 315 359 -253 -376 425 -108 344 -166 -510 -84 121 44 -152 -121 314 368 -124 -168 -112
6302 -112 299 176 237 -221 -300 492 159 -168 -105 38 -7 101 -565 -267 -233 394 -75 -264 -71 -255 231 147
6324 147 -331 101 107 118 443 -209 199 -257 -100 66 -264 83 16 290 -80 -25 -427 -90 52 284 -330 -482
6346 -482 152 86 62 -395 63 94 149 161 -28 -58 -276 117 -20 -102 -297 -181 18 -134 -19 335 64 73 25
6369 25 -197 -274 312 -99 -78 -221 -95 132 143 22 66 431 93 41 348 -109 -160 -51 4 162 -117 120 65
$$ packed form
6215EO1n78M67K88j73m01j98N61J85k39j61j02K46J94M2l21j35L28J93l42k49
6236c29J69N20k43pl89J66J10Q5j79j29J61N92m47l33K0P01l70m34o3P3N35m41
6258b32J07O5j9L88l98j80J96P1k13J03K0K31J3j12J23k64L03j95n30J51P84J66
6280E78l06n45K41L47M4o12j23Q01n33M52n10l44M26K05p7j96L1M35N4m92m4N6
6302a12M11j23O1m58p9P92l33l27O3J43m5J08o66K98L4O27m69j89J93j84M86q4
6324A47m78M32OJ1L25o52M08m56J57J66l30L47o7K74l70N5m02L37J42K32o14j52
6346d82O34o6k4m57M58L1N5J2j89l0k18L93j37q2j95J16J99j52J15L54k71Rm8
6369B5k22p7N86m11K1j43J26K27J1j21M4L65l38n2L07m57n1J09N5J58k79K37n5
$$ plain form
6392 65 210 13 -63 -254 253 306 244 88 -79 -131 89 -6 96 156 190 25 141 -86 -16 394 221 148 -279
6415 -279 -180 83 273 -101 -161 -111 160 364 -153 -62 -88 702 100 56 -539 -51 116 269 392 118 319 275
6437 275 285 55 254 -135 408 294 51 105 -31 14 94 -100 78 -350 93 -160 -59 97 -94 -267 13
6458 13 -88 -244 -115 202 161 -9 -117 242 298 10 -40 39 -344 272 183 92 -123 -142 -14 -76 -167 -186 -130 -114
6482 -114 -272 137 181 31 186 -87 94 -121 -204 203 -259 47 -216 -44 65 81 -58 -367 -232 89 -53
6503 -53 16 -189 -117 38 -23 89 -529 145 -64 136 4 -374 -259 79 108 -274 -367 158 61 285 -155 1
6525 1 296 413 -165 18 -32 179 215 -50 -218 41 -12 336 8 -226 -168 166 -17 -57 -185 -70 85 -108
6547 -108 -69 -172 4 -137 -479 -222 9 78 29 -182 178 99 -55 75 -235 143 364 -327 -267 123 210 91
$$ packed form
6392F5J45j97p6j91N07N3o2j56j67n2K20r5J02O0L4j65J16k27P0M10j73p3m27
6415b79R9K63J90l74o0N0K71K04n17R1k6P90o02m4n95M88J67J53J23k74K01m4
6437B75J0k30J99l89N43j14k43N4j36M5Q0j94J78m28M43k53J01J56j91j73K80
6458A3j01j56J29L17m1j70j08L59N6k88n0P9l83O16q9r1k15j9J28o2r1j9N6J6
6482a14j58M09M4j50J55k73J81k15q3M07m62L06k63J72J09J6j39l09J35L21j42
6503e3O9k05P2J55o1J12o18O74k09K00j32l78J15L38K9l82r3N25r7K24m40J56
6525AK95J17n78J83n0K11L6k65j68K59n3L48l28k34N8L34j83m0j28J15J55j93
6547a08L9j03J76j41l42K57K31O9m9k11L60p9j54J30l10L78K21o91O0L90Q7j19
$$ plain form
6569 91 -298 -117 -74 -57 -107 -58 244 250 68 -158 -39 -10 140 139 -229 -194 -104 7 -153 -142 -42 170 199 -104 -304
6594 -304 263 67 50 -221 168 16 -165 283 29 -176 92 28 -61 -58 -40 106 -292 62 -258 -37 -8 -265
6616 -265 67 -108 -121 -80 66 -191 170 -88 -247 -94 68 -14 -268 -87 -90 167 128 -149 -183 297 -272 -281 -56
6639 -56 285 144 72 -292 -179 245 119 -182 -311 -74 297 126 -195 -277 154 91 256 107 -283 -151 349
6660 349 123 9 -181 313 665 48 -128 58 169 -216 65 -178 -34 287 -2 -191 -41 209 321 -136
6680 -136 68 232 182 41 -84 350 262 184 -87 -187 16 448 118 -475 106 283 305 -30 -388 -123 454
6701 454 -57 -20 -470 353 181 -129 -115 -75 200 257 -324 -350 38 196 99 -14 -274 72 270 -6 -163 10
6723 10 271 208 -306 -350 -70 144 154 121 -96 5 173 -87 16 -89 29 -48 -58 -51 129 -215 -18 -32 184
$$ packed form
6569I1l89J81M3J7n0M9L02Oj82k26J19K9J50jl68L5R0J11j60J1J00K12K9l03k00
6594c04N67j96j7k71L89j52j81M48k54k05K68o4q9LJ8J46l98L54l20K21K9k57
6616b65L32j75j3M1J46k57L61k58j59J53J62q2k54J81lK57l9k77l4M80n69rK25
6639e6L41j41p2l64J13M24j26l01j29K37L71j71l21q2M31o3J65j49l90J32N00
6660C49k26j14j90M94L52o17j76J86J11l85K81k43J44L21k89j89J50K50J12m57
6680a36K04J64n0j41j25M34q8p8k71j00K03M32l30n93N81J77K2l35l58K65N77
6701D54n11L7m50Q23j72l10J4M0K75N7n81k6L88J58r7j13k60L46J98k76j57J73
6723A0K61o3n14m4K80K14J0l3k17J01J68k60J03j05J18p7j0PJ80l44J97j4K16
$$ plain form
6746 184 200 46 63 -91 -173 184 -173 -90 167 209 -4 -275 -47 -75 240 -455 13 -192 133 181 -157 150
6768 150 -90 339 376 -18 -391 42 63 83 -161 110 119 215 -357 -284 -70 90 294 -193 -109 -46 187 -11 -151
6791 -151 -127 247 116 126 -257 128 21 65 -104 169 -113 22 4 30 73 35 -75 190 361 102 -44 -2 -186
6814 -186 200 147 -168 -20 415 161 92 -204 28 352 154 -276 -271 -105 322 292 21 64 105 -3 328 -318
6836 -318 -78 61 -152 145 157 -160 54 -54 -74 -524 -120 309 -136 -175 -290 174 106 -93 -334 180 80
6857 80 141 -360 -169 200 18 -77 19 -141 -331 -246 153 -38 -3 140 205 -94 -180 -254 173 -122 -141 137 -103
6880 -103 -82 -230 127 56 273 -239 -312 -303 280 -71 -166 -32 148 173 -32 -35 -143 59 -113 17 -83 -116 -85 104
6904 104 -395 146 138 73 -192 -408 -30 113 108 202 297 514 102 91 -90 98 210 113 148 -411 21 -157 428
$$ packed form
6746A84J6j54J7j54q2L57l57Q3K57M2k13k71K28k8L15o95M68k05L25M8l38L07
6768A50k40M29L7l94l73M33K1K0k44K71RR6n72P3K14J60K04m87Q4O3K33j98j40
6791a51K4L74j31J0l83L85j07M4j69K73k82J35j8K6M3l8j10K65J71k59j46M2j84
6814a86L86n3l15J48M35k54o9k96K32L24j98m30NJ66M27l0k71M3M1j08L31o46
6836c18K40J39k13K97J2l17K14j08k0m50M04M29m45l9j15M64o8j99k41N14j00
6857H0O1n01J91L69j82r5R6j60j90Q5L99j91L5J43O5k99q6p4M27k95j9K78k40
6880a03K1j48L57p1K17n12p3RN83l51r5J34J80K5k05lj08K02j72J30j00l3L1J89
6904A04m99N41qo5k65k16L78J43nR4R5K17m12j1j81J88J12r7L5n59M32j78N85
$$ plain form
6927 428 -42 4 -142 -52 -136 21 -79 147 -104 -5 -247 333 297 176 -148 83 -200 -22 -389 -3 50 127
6949 127 -112 -402 30 294 375 -201 -19 168 295 -15 -82 234 300 93 185 -17 -99 399 -34 19 -114 357
6971 357 353 12 -146 107 298 165 -23 -448 147 10 -240 -277 33 41 -142 -169 -91 271 -234 -69 -66 -36 111
6994 111 161 13 -198 -123 463 59 -326 -221 2 309 141 -140 -52 204 231 -245 -310 283 44 97 -270 -182
7016 -182 103 446 -116 -552 9 459 246 138 -307 136 341 -27 -365 82 279 306 -80 -388 -195 -100 -80
7037 -80 -129 -239 137 346 -38 22 -468 -19 254 -43 -205 109 9 17 -89 -361 -2 294 -85 -157 -179 239
7059 239 -83 38 78 310 -54 11 -21 -173 143 234 61 155 87 247 56 -33 -71 30 347 112 -238 -54 324
7082 324 -77 -461 -63 -64 418 13 181 -322 -248 616 3 -169 69 263 -34 -399 -352 282 234 236 -69 -150 -140
$$ packed form
6927D28m70M6j46R0q4J57j00K26k51R9k42N80l6j21l24K31k83J78l67L86N3P7
6949A27k39k90M32K64Q1n76J82J87J27l10o7L16O6k07R2k02q2M98m33N3j33M71
6971C57ml41j58K53J91j33j88m25N95j37k50l7L10Qj83k7P8L62n05J65LL0J47
6994A11N0j48k11P5N86m04l85J05K23L07j68k81Q8K56K7m76o5N93k39N3l67Q8
7016a82K85L43n62m36N61M50k13j08m45M43K05l68l38M47J97K7l86l08J93R5K0
7037h0m9j10L76K09l84O0m90M49K73k97j62L14j00Qj06k72L59K96l79p2k2M18
7059B39l22J21M0K32l64O5l2j52L16R1j73R4o8J60j91q9l8J01L17k35l50J84L78
7082C24m01l84L98jM82m05J68n03P4Q64o13j72K38J94k97l65M7O34m8Kl05q1J0
$$ plain form
7105 -140 7 -44 55 -73 251 -50 129 -185 -16 103 -116 -190 95 -30 -76 -149 159 6 105 205 57 -39
7127 -39 -193 -203 -58 68 100 60 -511 30 131 326 244 -383 -255 -83 126 -40 6 -77 26 344 91 13 -9
7150 -9 246 167 -286 -110 268 73 -134 -152 -102 -37 41 -240 -61 -129 202 81 -34 -216 58 13 -151 -21 -28 -132
7174 -132 40 -22 157 75 -75 58 210 288 -117 20 -360 369 -17 260 -129 21 -102 183 292 -26 -165
7195 -165 320 73 -216 -233 -142 -72 190 102 -324 -78 36 29 -268 -309 87 16 94 -329 -300 163 112 -17 -54 58
7219 58 -22 44 164 127 202 149 -172 -32 -208 321 115 -84 -96 -57 191 149 -23 -149 -96 -132 158 -77 40 -77
7243 -77 352 -120 -56 -190 79 -220 227 133 2 14 -91 270 -172 63 11 -14 37 -113 -347 128 -136 -33
7265 -33 208 53 -210 -26 65 115 -73 -321 -175 43 116 -210 62 69 19 -59 99 148 54 142 -411 323 366 98
$$ packed form
7105a40J47n1R9j28L24l01J79l14J69J19k19p4K85j25m6p3L08j53R9J00j48r6
7127c9j54j0J45J26L2m0n71N41J01J95q2o27J28J72K09j66M6q3J03L18k53p8k2
7150iK55p9m53J76L78j95k07j8N0O5P8k81J79o8L31j21j15j82K74m5j64J30pj04
7174a32J72o2J79q2j50J33J52P8m05J37l80P29l86K77l89J50j23K85J09l18j39
7195a65M85k47k89j7R1P0K62q8m26K46J14pk97m1L96p1P8m23K9M63n1j29l7J12
7219E8q0O6J20l7P5n3l21J40j76N29k06j99j2L9K48m2j72j26N3l6K90k35J17j17
7243g7M29m72O4j34K69k99M47r4j31J2j05L61m42K35n2k5N1j50k34M75k64J03
7265c3K41j55k63J84R1N0j88k48J46K18P3l26K72Pn0p8J58M9r4Q8n53P34M3k68
$$ plain form
7289 98 93 44 -197 -140 -167 41 -106 305 -144 -120 132 229 134 -224 -144 -311 51 110 -244 -18 170 134 184 -276
7313 -276 10 326 -52 229 -298 68 35 294 -157 -152 136 350 185 -84 4 165 -122 59 -348 -2 193
7334 193 224 -11 -27 278 300 -184 -120 -50 -266 401 144 -19 217 23 127 -12 -99 195 327 1 -259 -245
7356 -245 -131 -216 -261 -96 68 -176 140 278 -78 6 -242 -151 -335 -105 141 -132 45 -138 -13 158 16
7377 16 -49 -24 138 110 -85 -141 -58 178 244 -415 -91 255 22 -79 -216 -113 33 261 -281 -126 -113 -230 22
7400 22 17 -106 -103 106 177 226 -255 76 294 -157 -164 -97 23 -20 66 -34 -148 200 287 -242 -206 150 -274 -29 -111
7425 -111 315 147 -38 -51 122 167 -301 203 142 -8 -23 -111 -265 -62 -132 183 77 -137 393 87 -3 -10 138
7448 138 59 32 32 84 67 7 -181 69 -70 1 38 -289 -181 201 123 -87 96 -148 -111 -109 -14 -92 -99 -19 215 0
$$ packed form
7289I8nm9k41N7k7K08j47M11m49K4K52R7r5l58Q0j67L62N9l54K26J88l6N0m60
7313b76K86L16l78K81n27L66l3K59m51NK88K14j65k69Q8J61k87J81m07L46J95
7334A93L1k35j6L05K2m84O4P0k16O67k57j63K36j94J04j39q7K94J32l26k60J4
7356b45J14q5m5J65J64k44L16J38l56Q4k48R1j84K30K46k73J77j83J25J71j42
7377A6o5K5J62k8j95n6Q3K36O6o59L24L46k33j01j37J03J46K28n42J55J3j17K52
7400B2nj23LK09P1M9m81L31K18m51pO7J20m3Q6j00j14L48Q7n29L6L56m24K45q2
7425a11M26j68j85j3J73M5m68N04o1j50j5q8j54K03p0L15j06k14N30l06r0pJ48
7448A38p9k7%N2j7o0j88K50j39P1L7l27J08L82p8k10J83k44L7KR5p8pQ0K34k15
$$ plain form
7474 0 31 -138 -27 -127 335 136 347 253 364 -4 -78 -103 164 -167 93 -61 161 -82 65 79 121 -94 155
7497 155 -44 -27 -48 -122 -146 -270 -155 -72 116 244 -187 179 50 -243 -106 -25 38 -66 -263 -155 -54 137
7519 137 106 -202 131 45 -40 -300 155 204 -6 76 260 -155 172 25 -197 -141 -48 33 115 15 -274 6 129
7542 129 257 203 -29 47 15 65 -29 -195 3 378 472 -42 -322 100 101 70 25 84 221 175 96 -51 -125 -49 220
7567 220 -6 177 40 148 184 -32 -31 43 41 -34 44 -174 -144 -74 365 202 117 -86 -28 165 -2 -90 25 -168
7591 -168 24 213 -199 124 51 154 207 88 -42 -124 -91 -66 -65 -186 -56 8 -97 -142 -56 -296 -20 225 213 145
7615 145 -118 -205 -41 -198 453 248 87 174 99 -235 -243 271 99 24 -251 169 208 376 -213 -186 101 1 -137
7638 -137 -65 -88 264 -94 186 261 -593 92 -24 278 -96 -220 -385 -295 300 -127 25 65 237 -120 245 340
$$ packed form
7474@L1j69J11j00M62j99K11r4J11l68p4k5K67l31K60j54K22k43J47J4M2k15K49
7497A55j99J7k1p4k4j24J15Q3J88J28m31L66j29k93J37Q1O3j04j97J08J01J91
7519A37l1l08L33q6q5k60M55M9k10Q2J84m15L27j47k22N6R3Q1Q2j00k89K80J23
7542A29J28n4k32P6l2N0r4j66J98L75R4n14k80M22Jl1m5N9J37m6p9j47p4P6K69
7567B20k26J83j37J08L6k16JP4kp5P8k18L0P0M39j63q5k03N8J93j67q8J15j93
7591a68J92J89m12L23p3J03N3j19j30q2L3K5Jj21J30O4j05m5Q6k40K76K45j2o8
7615A45k63q7J64j57O51k05j61Q7p5l34qN14j72p5k75M20L9J68n89K7K87j00j38
7638a37P2k3L52l58K80P5q54O85j16L02l74j24j65R0N95m27J52M0J72l57L65R5
$$ plain form
7660 340 -210 145 162 94 57 -54 -175 -136 -288 -31 -53 -213 -169 -233 168 -35 -260 14 -169 -188 -297 80 -117
7683 -117 -159 9 94 -256 25 37 25 73 -162 107 -38 56 144 -44 -86 -67 22 -387 -51 156 -4 -122 53
7706 53 6 -389 -77 -66 163 102 321 -56 52 53 329 152 -42 49 -9 114 -64 29 -166 -83 -166 171 -47 92
7730 92 184 -76 -95 -54 -90 -23 69 -166 -54 -39 47 39 176 -49 245 -19 258 97 66 155 321 19 143 180 -89
7755 -89 200 -42 66 -162 150 -164 48 204 28 16 -296 -150 -189 153 90 75 155 -120 -8 -203 -160 -19
7777 -19 212 251 192 135 -105 17 -112 -42 145 -54 -128 138 -46 -315 -160 -129 -10 152 137 -10 411 -109 -31
7800 -31 186 170 7 -66 30 292 314 223 88 -94 71 81 151 76 58 118 5 60 -69 31 -88 -197 58 150
7824 150 47 172 -52 137 345 520 -183 -111 79 254 124 352 -67 -241 77 29 -72 261 -346 97 -94
$$ packed form
7660C40n50L55J7o8l7j11j21L9j52K57k2j60M4o4M01k03k25K74j83j9j09L77j97
7683a17m2J68Q5l50K81J2j2M8k35K69j45R4Q8j88m2J9Q9m09L36K07j60j18J75
7706E3m7l95L12J1K29o1K19l77J08JK76j77j94R1n8J23j78R3j95Q3q3L37k18J39
7730I2R2k60j9M1l6O7R2k35J12J5Q6qJ37k25K94k64K77j61l1Q9J66l02J24L7k69
7755h9K89k42J08k28L12l14K12J56j76j2l12J46l9L42o3j5Q0k75J12j95M3J41
7777a9K31L9n9n7k40J22j29P0J87j99p4K66j84k69J55L1J19J62j5j47M21n20P8
7800c1K17j6j63p3R6K62K2r1j35j82J65J0P0p5j8O0j13N5j29J00j19j09K55R2
7824A50j03J25k24J89K08J75p03P2J90J75j30K28m19j74L18m8j01L33o07M43j91
$$ plain form
7845 -94 -232 -74 -253 441 278 172 395 -30 106 122 -126 -80 82 -11 -167 -9 -57 -22 5 7 -211 -57 -2
7868 -2 47 -218 89 3 -289 -5 -150 87 326 138 -637 275 -9 35 -48 22 -99 -189 -164 42 -19 -184 -148 122
7892 122 151 90 3 6 11 30 -217 -10 230 -29 218 73 65 -165 -151 113 -25 195 -104 130 -6 478 33 18
7916 18 -338 -55 -70 -32 -54 13 -59 -148 -45 -241 43 -195 44 171 -243 -256 121 185 -52 118 100 39 227 -54
7940 -54 108 44 219 90 128 -4 -49 -141 -187 199 -163 163 -322 189 -148 -1 -53 -184 253 29 64 -305 -22
7963 -22 -345 59 -8 122 -22 -101 337 -144 182 -106 302 -109 54 46 -282 47 -3 -26 -177 -38 30 -176 205
7986 205 11 -44 65 173 -101 -81 -329 -147 57 183 283 -174 177 -161 -15 -127 92 98 140 -31 -135 86
8008 86 9 51 273 -236 -18 304 10 29 212 -1 95 123 -34 -287 210 175 9 -142 175 -180 4 42 -1
$$ packed form
7845i4j38J58j79O94j63j06K23m25J36J6k48M6J62r3j56J58m8L5K7Kk18J54N5
7868bM9k65L07q6k92K84j45K37K39j88p75R12k84M4q3P0j21r0K5K06o1j65L6K70
7892A22K9o1q7LNJ9k47K07K40k59K47j45qk30J4K64j38K20k99K34j36M84m45j5
7916A8l56K83j5L8k2O7p2q9J03j96K84k38K39J27m14j3L77O4k37J70j8o1J88k81
7940e4J62o4J75j29L8j32m5r2m6L86l62L26m85N11l37J47n2j31M37k24L5l69K83
7963b2l23M04o7J30j44p9M38m81L26k88M08m11J63ql28L29n0k3j51J39O8k06L81
7986B05j94n5J09J08k74K0k48J82K04J26J00m57L51l38J46j12K19OM2j71j04K21
8008H6p7M2K22n09K18L22k94J9J83k13R6K8j57k53M97l5j66j51L17l55J84L8m3
$$ plain form
8031 -1 -27 -45 -164 35 156 -326 90 49 -249 -177 23 -61 32 -12 45 -57 211 257 38 -12 261 -60 -86 -174 94
8056 94 8 123 -34 -321 -370 -106 -53 181 140 60 -91 35 39 119 380 -257 2 149 304 352 416 34 -16 -326
8080 -326 -158 79 -169 -209 -1 -4 19 -69 -20 288 22 -71 165 68 -219 -13 -8 40 143 7 20 187 209 -82
8104 -82 -18 170 168 -86 -54 -242 307 -134 -14 95 -66 -47 26 -38 -132 203 -99 -224 234 103 -167 68 -174
8127 -174 416 185 8 -267 136 305 -101 228 152 -78 66 -69 94 219 317 283 -88 -112 -146 -179 165 -31
8149 -31 -95 -173 167 -81 -91 132 -289 74 -53 -158 -104 -62 119 -112 -261 76 -331 166 -52 78 -88 -109
8171 -109 39 172 49 117 -219 -69 193 135 -117 -2 91 213 54 -360 113 -110 243 286 96 14
$$ packed form
8031ak6j8j19J99J21m82M16m1k98P2K00q4R3m4N7j02K68M6k19n0K73l21k6q8K68
8056I4q6J15j57k87m9K64N3K34m1q0j51J26MQ0K61o37K59J47J55M8O4l82n0l10
8080c26J68K37k48m0K08lK3q8M9L08k66r3K36r7k87K06NM8J03j36J3J67K2k91
8104h2O4J88kk54L2j88N49m41J20J09j61J9P3o4r4L35l02j25M58j31k70K35k42
8127a74N90k31j77k75M03J69m06L29p6k30J44j35J63J25R8l4l71k4l4l3L44j96
8149c1o4p8L40k48j0K23m21L63j27j05N4M2J81k31j49L37m07M97k18J30j66k1
8171a09J48J33j23O8l36J50K62n8k52J15R3J22j59m14M73k23L53M3j90q2
8191A4
$$ Imaginary data points
##PAGE= N=2
##DATA TABLE= (X++(I..I)), XYDATA
$$ plain form
0 0 0 0 0 0 0 0 8 -8 8 -8 11 -16 16 -24 27 -32 40 -48 56 -64 75 -90 104 -117 138 -155 178 -202 230 -258
30 -258 291 -327 367 -410 457 -509 566 -629 698 -771 855 -946 1049 -1161 1286 -1428 1587
47 1587 -1768 1977 -2220 2509 -2853 3279 -3819 4530 -5506 6949 -9294 13778 -25449 120358
61 120358 258856 22842 -59464 36002 155277 59104 -79374 -54165 127081 188127 65800
72 65800 -51491 23033 155955 144438 -8189 -75138 16968 115139 69897 -15238 19050 140720
84 140720 161216 45657 -45724 -1187 76556 57901 -12636 1442 89575 117329 40784 -18621
96 -18621 23520 83220 48840 -31272 -30515 53317 91036 35303 -6177 50048 119071 79698 -29818
109 -29818 -61297 17588 77803 31288 -33090 6406 104624 109554 190 -72359 -11493 75320
$$ packed form
0@%%%%%%Qj6J6j6J9k7L2m0N1n9P2q8J04j20J39j65J94k21K55k93L33l80M32m88
30b58N49o18O94p77Q67r66J075j195J327j469J626j801J995k210K447k714L015
47A587l355L745m197M729n362O132p098Q349j0036J2455j6243K3072l9227J45807
61A20358J38498k36014q2306R5466J19275r6173j38478K5209J81246O1046j22327
72F5800j17291P4524J32922j1517j52627o6949R2106R8171m5242q5135L4288J21670
84A40720K0496j15559r1381M4537P7743j8655p0537J4078Q8133K7754p6545n9405
96a8621M2141N9700l4380q0112P57Q3832L7719n5733m1480N6225O9023l9373j09516
109b9818l1479P8885O0215m6515o4378L9496R8218M930j09364p2549O0866Q6813
$$ plain form
121 75320 50029 -46349 -54977 49247 116235 55105 -31546 -13489 66744 69138 -23509 -80411
133 -80411 -20857 68655 70914 3946 -20142 29154 62450 17022 -49212 -48157 7452 32461
145 32461 1714 -20405 10641 54121 50066 10137 -13469 -9651 -9650 -23286 -23547 757 20391 14402
159 14402 3123 7843 11555 -8925 -34864 -27782 407 3241 -26510 -37473 -56 39823 26799
172 26799 -22860 -39719 -8559 11342 -20895 -59145 -37929 22829 39970 -12569 -61234 -39811
184 -39811 10237 5054 -51401 -73054 -24261 23907 4291 -46124 -45108 6280 28219 -16526
196 -16526 -68402 -61185 -16920 -2814 -30034 -45806 -18843 12403 -1213 -44187 -62854 -42419
208 -42419 -22429 -30146 -44171 -35366 -14977 -11793 -24380 -28563 -19738 -19774 -36393 -46508 -37323 -28461
$$ packed form
121G5320k5291r6378q628J04224O6988o1130q6651J8057Q0233K394r2647n6902
133h0411N9554Q9512K259o6968k4088M9296L3296m5428o6234J055N5609K5009
145C2461l0747k2119L1046M3480m055l9929k3606L818Jj3636k61K4304J9634n989
159A4402j1279M720L712k0480k5939P082K8189K834k9751j0963L7417L9879j3024
172B6799m9659j6859L1160J9901l2237l8250K1216O0758J7141n2539m8665K1423
184c9811N0048n183n6455k1653M8793M8168j9616n0415J016N1388K1939m4745
196a6526n1876P217M4265J4106k7220j5772K6963L1246j3616m2974j8667K0435
208d2419J9990p717j4025Q805K0389L184j2587m183Q825l6j6619j0115R185Q862
$$ plain form
222 -28461 -35045 -39005 -19917 1100 -11191 -48453 -63658 -40347 -19844 -35545 -59701 -44385
234 -44385 -1454 9772 -26742 -57525 -36338 2690 -5064 -56275 -78435 -38462 7467 -2572
246 -2572 -45499 -48410 -4353 15448 -28050 -78809 -66992 -13166 5664 -28512 -53694 -26049
258 -26049 15279 9889 -32566 -51198 -25593 203 -13442 -42809 -42569 -10464 10992 -1690 -23762
271 -23762 -26448 -15953 -16095 -28376 -34037 -23420 -8046 445 3155 1899 -5696 -14436 -13787 -5239
285 -5239 -5970 -20282 -25494 -4971 19354 14359 -10967 -16622 7112 19480 -8722 -42310 -32155
298 -32155 11912 32258 7087 -15291 4752 38787 30524 -14718 -34988 -2312 34175 22802
310 22802 -13453 -13346 27125 48411 18643 -17032 -10097 21177 23079 -6424 -17348 12586 43990
$$ packed form
222b8461o584l960J9088K1017j2291l7262j5205K3311K0503j5701k4156J5316
234d4385M2931J1226l6514l0783K1187L9028p754n1211k2160L9973M5929j0039
246b572m2927k911M4057J9801m3498n0759J1817N3826J8830l4176k5182K7645
258b6049M1328n390m2455j8632K5605K5796j3645k9367K40L2105K1456j2682k2072
271b3762k686J0495j42j2281n661J0617J5374Q491K710j256p595q740O49Q548
285e239p31j4312n212K0523K4325m995k5326n655K3734J2368k8202l3588J0155
298c2155M4067K0346k5171k2378K0043L4035q263m5242k0270L2676L6487j1373
310B2802l6255J07M0471K1286k9768l5675O935L1274J902k9503j0924K9934L1404
$$ plain form
323 43990 38475 14226 10377 24166 23916 4150 -4457 11914 29119 25609 16936 24623 37185 28363
337 28363 5928 2445 21183 27868 6936 -7720 17432 54157 50718 13430 781 32632 53310
350 53310 19713 -23927 -8487 49644 68507 21939 -14278 17233 66995 51756 -12900 -33780
362 -33780 19487 66247 36995 -17852 -8468 56918 81950 27178 -27785 -6665 51060 52592
374 52592 -2247 -26426 23305 74924 54297 -4541 -15225 29480 51427 13200 -26720 -7798
386 -7798 41210 50755 16220 -1629 24162 47019 27340 -7738 -8765 18688 29850 12277 2940
399 2940 21957 39837 27049 2150 909 17840 16855 -6529 -13123 12718 36747 24023 -1371
412 -1371 5145 33021 33336 -4021 -27184 -1136 34489 26476 -9910 -13215 25245 46243 13433
$$ packed form
323D3990n515k4249l849J3789k50j9766q607J6371J7205l510q673P687J2562q822
337B8363k2435l483J8738O685k0932j4656K5152L6725l439l7288j2649L1851K0678
350E3310l3597m3640J5440N8131J8863m6568l6217L1511M9762j5239o4656k0880
362c3780N3267M6760k9252n4847R384O5386K5032n4772n4963K1120N7725J532
374E2592n4839k4179M9731N1619k0627n8838j0684M4705K1947l8227l9920J8922
386g798M9008R545l4535j7849K5791K2857j9679l5078j027K7453J1162j7573r337
399B940J9017J7880j2788k4899j241J6931r85k3384o594K5841K4029j2724k5394
412a371O516K7876L15l7357k3163K6048L5625q013l6386l305L8460K0998l2810
$$ plain form
425 13433 -28682 -20891 21187 30793 -7498 -33470 -4207 40718 37187 -7322 -26474 3339 30670
438 30670 9092 -30663 -27909 16211 39480 13385 -19920 -13766 14653 15356 -15009 -33044 -15189
451 -15189 11042 10498 -8222 -12108 4598 15502 4732 -14350 -21309 -14936 -9134 -8143 -6075 -425
465 -425 2788 1053 -2545 -6830 -15390 -25105 -25099 -12804 -4142 -10699 -19902 -11018 7653 8849 -14392
480 -14392 -33214 -23658 -5077 -9208 -31160 -33076 -4712 18477 4049 -28624 -35162 -12869 -1884
493 -1884 -24191 -48265 -35594 -1322 9957 -14582 -34851 -20254 4618 -1326 -33847 -48265
505 -48265 -26609 -1754 -7778 -29153 -28534 -5525 4280 -15537 -38501 -36901 -19004 -13318 -23575
518 -23575 -28599 -17565 -6385 -9090 -20267 -24898 -21452 -20734 -24147 -23915 -17015 -11619 -12872 -13444 -8899
$$ packed form
425A3433m2115P791M2078R606l8291k5972K9263M4925l531m4509j9152K9813K7331
438C0670k1578l9755K754M4120K3269k6095l3305O154K8419P03l0365j8035J7855
451a5189K6231n44j8720l886J6706J0904j0770j9082o959O373N802R91K068N650
465d25L213j735l598m285q560r715OJ2295Q662o557r203Q884J8671J196k3241
480a4392j8822R556J8581m131k1952j916K8364K3189j4428l2673o538K2293J0985
493a884k2307k4074J2671L4272J1279k4539k0269J4597K4872n944l2521j4418
505d8265K1656K4855o024k1375O19K3009R805j9817k2964J600J7897N686j0257
518b3575n024J1034J1180k705j1177m631L446P18l413K32O900N396j253n72M545
$$ plain form
533 -8899 -8935 -21213 -35146 -31943 -16418 -10408 -20220 -24143 -7304 10352 1250 -25656 -34512 -15643
547 -15643 -1652 -16293 -36802 -26591 7699 21726 -1379 -26550 -17983 6175 3163 -28769
559 -28769 -44562 -18460 15829 14018 -13978 -21675 5544 24693 3786 -31417 -33267 -2025 15825
572 15825 -739 -19587 -6192 23524 26285 -1973 -23877 -14392 5903 5728 -11063 -14957 5018
585 5018 24015 19790 1962 -5254 2756 8882 920 -9226 -6313 7098 16482 15829 11614 9502
599 9502 8782 5941 2692 312 -1195 785 8540 17815 19237 11831 5902 8865 13616 8859 -1990
614 -1990 -3341 9627 23157 21965 11022 8033 17088 21609 8957 -7779 -7995 8909 22567 18006
628 18006 8390 13124 26911 28641 10494 -7355 -5060 10791 17896 9881 4237 14916 31577
$$ packed form
533h899l6j2278j3933L203J5525O010r812l923J6839J7656r102k6906q856J8869
547a5643J3991j4641k0509J0211L4290J4027k3105k5171Q567K4158l012l1932
559b8769j5793K6102L4289j811k7996p697K7219J9149k0907l5203j850L1242J7850
572A5825j6564j8848J3395K9716K761k8258k1904R485K0295j75j6791l894J9975
585E018J8997m225j7828p216Q010O126p962j0146K913J3411R384o53m215k112
599I502p20k841l249k380j507J980P755R275J422p406n929K963M751m757j0849
614a990j351J2968J3530j192j0943k989R055M521j2652j6736k16J6904J3658m561
628A8006r616M734J3787J730j8147j7849K295J5851P105q015n644J0679J6661
$$ plain form
641 31577 33118 16290 416 1197 11881 13169 1806 -3581 9177 29600 33784 18300 4835
654 4835 8316 18962 15395 -1088 -8424 7115 27585 29390 14753 5950 14853 25284 16884 -3937
668 -3937 -10657 5632 24387 22872 8834 7011 21871 30216 15768 -5997 -8868 7303 19538
681 19538 13893 4141 9621 25005 29201 14993 -1479 -2940 7737 12650 5521 -987 6244 20619
695 20619 26049 15929 3361 1822 7409 8891 2105 -2837 3272 15706 22252 16086 5114 1563
709 1563 5798 7755 540 -7283 -4218 9719 19425 14703 4157 2507 8998 9181 -3010 -14752
723 -14752 -11402 3799 13235 9112 1810 3820 11442 9994 -3656 -16641 -14553 -2332 4337 -809
737 -809 -5695 75 10351 10520 -1997 -13998 -14788 -6966 -3720 -8248 -12051 -5909 5575 8955 -1308
$$ packed form
641C1577J541j6828j5874P81J0684J288j1363n387J2758K0423M184j5484j3465
654D835L481J0646l567j6483p336J5539K0470J805j4637q803Q903J0431q400k0821
668c937o720J6289J8755j515j4038j823J4860Q345j4448k1765k871J6171J2235
681A9538n645r752N480J5384M196j4208j6472j461J0677M913p129o508P231J4375
695B0619N430j0120j2568j539N587J482o786m942O109J2434O546o166j0972l551
709A563M235J957p215p823L065J3937R706m722j0546j650O491J83j2191j1742
723a4752L350J5201R436m123p302K010P622j448j3650j2985K088J2221O669n146
737h09m886N770J0276J69j2517j2001p90P822L246m528l803O142J1484L380j0263
$$ plain form
752 -1308 -15583 -17912 -9532 -4712 -11618 -19731 -13917 2340 8508 -3063 -17869 -17455 -6134 -4980
766 -4980 -19321 -30182 -19636 1778 7705 -6850 -20014 -13742 -190 -5150 -26439 -35874 -19041
779 -19041 1754 228 -17324 -21616 -5379 6641 -5840 -28606 -32377 -14280 -2875 -11273 -24115
792 -24115 -17636 1484 6785 -10022 -27122 -24410 -10262 -6861 -17590 -23100 -11926 2617 1967
805 1967 -11343 -19216 -14052 -8470 -12147 -20511 -20264 -10914 -2441 -1482 -5158 -7531 -8400 -9710 -13588 -16281
821 -16281 -16640 -14111 -8186 -1452 946 -2223 -7267 -7820 -4893 -6087 -13659 -19213 -12982 -1209 3329
836 3329 -3757 -9267 -3157 6054 1247 -15208 -22322 -10400 4908 4476 -7312 -9128 5101 14237
850 14237 3094 -16735 -19298 -3041 8168 -581 -14080 -8972 11490 19633 3435 -14601 -12060
$$ packed form
752a308j4275k329Q380M820o906q113N814J6257O168j1571j4806M14J1321J154
766d980j4341j0861J0546K1414N927j4555j3164O272J3552m960k1289r435J6833
779a9041K0795j526j7552m292J6237J2020j2481k2766l771J8097J1405q398j2842
792b4115O479J9120N301j6807j7100K712J4148L401j0729n510J1174J4543o50
805A967j3310p873N164N582l677q364K47R350Q473R59l676k373q69j310l878k693
821a6281l59K529N925O734K398l169n044n53K927j194p572n554O231J1773M538
836C329p086n510O110R211m807j6455p114J1922J5308m32j1788j816J4229R136
850A4237j1143j9829k563J6257J1209q749j3499N108K0462Q143j6198j8036K541
$$ plain form
863 -12060 4350 7410 -8272 -18203 -3617 18583 20289 1355 -10303 -915 11913 6249 -12069
876 -12069 -16350 135 17015 13195 -2122 -4764 8914 17184 5271 -12114 -11947 3668 13537
889 13537 6777 -1690 3223 15742 17126 4341 -7097 -4482 5071 7283 2529 -53 6880 15396
903 15396 15020 6847 550 468 3065 3172 1995 3469 7493 11932 14332 13376 9211 4198 2026 3589
919 3589 6347 4522 1528 4709 14334 19554 12676 2155 2044 9763 11254 1962 -4682 3882 20000
934 20000 23110 10829 475 7126 18188 14233 -2242 -8483 6235 23152 19791 3410 -16
947 -16 15279 25000 11866 -7961 -8093 11201 22130 11373 -1103 6640 25112 27422 8222 -7965
961 -7965 -1125 14640 15587 1735 -3601 9802 25111 20911 4210 -2675 6178 14476 7819 -3905
$$ packed form
863a2060J6410L060j5682r931J4586K2200J706j8934j1658R388J2828n664j8318
876a2069m281J6485J6880l820j5317k642J3678Q270j1913j7385J67J5615R869
889A3537o760q467M913J2519J384j2785j1438K615R553K212m754k582O933Q516
903A5396l76q173o297q2K597J07j177J474M024M439K400r56m165n013k172J563
919C589K758j825k994L181R625N220o878j0521j11P719J491r292o644Q564J6118
934B0000L110j2281j0354O651J1062l955j6475o241J4718J6917l361j6381l426
947a6J5295R721j3134j9827j32J9294J0929j0757j2476P743J8472K310j9200j6187
961g965O840J5765R47j3852n336J3403J5309m200j6701o885Q853Q298o657j1724
$$ plain form
975 -3905 -3049 9708 18728 15123 7327 6481 10597 10582 4063 -2231 -2018 3650 9221 10712 8676 5918
991 5918 5213 6856 6330 992 -5115 -4228 3695 9757 6761 775 1474 9784 11718 1324 -10244 -8639
1007 -8639 3741 8673 -486 -8257 -914 11986 10276 -6274 -16004 -6963 5758 3302 -9557 -11913
1021 -11913 1705 12967 5146 -10271 -12545 -1427 4294 -4994 -16365 -12069 2399 7403 -1513
1034 -1513 -10606 -8194 -1364 -3070 -12725 -17119 -10497 -2152 20 -3327 -5108 -4094 -3406 -5175 -8737
1049 -8737 -11768 -13656 -11469 -5727 -2389 -4328 -8411 -6924 -1480 -2303 -12649 -21737 -16898 -4464 -687
1064 -687 -9039 -14419 -4857 8074 3671 -14344 -22654 -10686 2613 -4562 -20938 -19767 367 11617
1078 11617 -885 -19836 -17870 -657 3460 -13446 -26867 -15246 6763 9106 -8049 -18344
$$ packed form
975c905Q56J2757R020l605p796q46M116j5o519o294K13N668N571J491k036k758
991E918p05J643n26n338o107Q87P923O062k996n986O99Q310J934j0394j1568J605
1007h639J2380M932r159p771P343J2900j710j6550r730R041J2721k456j2859k356
1021a1913J3618J1262p821j5417k274J1118N721r288j1371M296J4468N004q916
1034a513r093K412O830j706r655m394O622Q345K172l347j781J014O88j769l562
1049h737l031j888K187N742L338j939m083J487N444q23j0346r088M839J2434L777
1064f87q352n380R562J2931m403j8015q310J1968J3299p175j6376J171K0134J1250
1078A1617j2502j8951J966J7213M117j6906j3421J1621K2009K343j7155j0295
$$ plain form
1090 -18344 -6702 7558 988 -17817 -22550 -6284 6817 -116 -14177 -13258 1154 5358 -6052
1103 -6052 -18508 -14892 -2818 -221 -7438 -10112 -2335 5081 2455 -6173 -10483 -7959 -5978 -7184
1117 -7184 -7139 -3705 -101 -181 -1462 -1176 -2251 -7096 -11583 -9809 -4305 -2146 -6026 -6221 1877 9392
1133 9392 4671 -7602 -11173 -3806 1380 -5472 -13858 -8090 7629 13235 1999 -10541 -7520 3522
1147 3522 2874 -10711 -17710 -5501 10486 10301 -2531 -7877 2834 13140 4859 -12079 -15478 -1579
1161 -1579 9803 5024 -5790 -3945 9923 15314 3212 -12130 -11290 1388 7983 384 -6561 -23
1175 -23 12927 15068 3839 -6164 -2683 7523 8404 -1342 -6208 1521 13244 13743 4104 -1761 2336
1190 2336 7970 4960 -3448 -5630 3349 13516 14172 7563 3672 6943 9946 5642 -633 -1489 5253
$$ packed form
1090a8344J1642J4260o570j8805m733J6266J3101o933j4061R19J4412M204j1410
1103f052j2456L616J2074K597p217k674P777P416k626q628m310K524J981j206
1117g184M5L434L604q0j281K86j075m845m487J774N504K159l880j95Q098P515
1133I392m721j2273l571P367N186o852q386N768J5719N606j1236j2540L021J1042
1147C522o48j3585o999J2209J5987j85j2832n346J0711J0306q281j6938l399J3899
1161a579J1382m779j0814J845J3868N391j2102j5342Q40J2678O595p599o945O538
1175b3J2950K141j1229j0003L481J0206Q81r746m866P729J1723M99r639n865M097
1190B336N634l010q408k182Q979J0167O56o609l891L271L003m304o275q56O742
$$ plain form
1205 5253 11731 11725 7822 6858 9765 11006 8006 2553 -129 923 4485 8313 9187 9310 11139 13946
1221 13946 14308 8937 1471 -655 4517 10782 10513 6483 6671 13048 16647 10479 48 -1481 6724
1236 6724 12040 6382 -1800 2222 15450 20909 11266 87 2387 12254 12122 -399 -6796 3888
1250 3888 19512 19294 5583 -2382 5544 13741 7088 -6896 -8713 4305 15668 10268 -1040 -186
1264 -186 11950 16668 6166 -6731 -5738 4663 8305 1645 -3396 3092 12840 11984 1450 -6811
1278 -6811 -5050 686 1199 -2337 -2751 1957 6991 6971 2546 -2232 -2989 -835 247 -1335 -4390 -4062
1294 -4062 1016 6418 5128 -1093 -5307 -3977 -1323 -4321 -11306 -11001 -1163 8008 5769 -3644 -6430
1309 -6430 -50 3145 -4248 -14318 -12047 237 6377 -770 -8564 -5600 3998 3876 -7875 -16633
$$ packed form
1205E253O478ol903r64K907J241l000n453k682J052L562L828Q74J23J829K807
1221A3946L62n371p466k126N172O265k69m030J88O377L599o168j0431j529Q205
1236F724N316n658q182M022J3228N459r643j1179K300R867j32j2521o397J0684
1250C888J5624k18j3711p965P926Q197o653j3984j817J3018J1363n400j1308Q54
1264a86J2136M718j0502j2897R93J0401L642o660n041O488R748q56j0534q261
1278f811J761N736N13l536m14M708N034k0m425m778p57K154J082j582l055L28
1294d062N078N402j290o221m214J330K654k998o985L05R838R171k239r413k786
1309f430O380L195p393j0070K271J2284O140p147p794K964R598j22j1751q758
$$ plain form
1323 -16633 -11627 -1645 -206 -7537 -9094 -921 6900 3460 -8144 -13263 -8199 -2474 -4551 -8556
1337 -8556 -6712 356 4149 -154 -6875 -9069 -7926 -6388 -7749 -9286 -8881 -5187 -136 1832 -199
1352 -199 -4924 -6818 -5577 -4561 -8523 -12608 -9623 -346 5459 948 -7569 -8540 -2176 -1498 -10126 -17984
1368 -17984 -11992 766 4466 -5079 -12040 -4972 5755 2169 -12038 -18269 -8065 3418 436
1381 436 -10143 -10416 2039 8947 -515 -15640 -16815 -6079 408 -6269 -13833 -7897 4751 7203
1395 7203 -3311 -12270 -9027 -679 -1431 -9813 -12764 -4997 3573 3367 -2830 -5673 -3023 -1188 -4666
1410 -4666 -10420 -11102 -6616 -1149 1031 -640 -2406 -2081 -1092 -1823 -4817 -7148 -6068 -1924 2289 2112
1426 2112 -1159 -2456 530 2026 -1800 -8045 -9103 -3214 2559 1181 -2999 -1624 4816 7165 725
$$ packed form
1323a6633N006R982J439p331j557Q173P821l440j1604n119N064N725k077m005
1337h556J844P068L793m303o721k194J143J538j361j537M05L694N051J968k031
1352a99m725j894J241J016l962m085K985R277N805m511q517r71O364O78q628p858
1368a7984N992J2758L700r545o961P068J0727l586j4207o231J0204J1483k982
1381D36j0579k73J2455O908r462j5125j175J0736O487o677p564N936J2648K452
1395G203j0514q959L243Q348p52q382k951P767Q570k06o197k843K650J835l478
1410d666n754o82M486N467K180j671j766L25R89p31k994k331J080M144M213j77
1426B112l271j297K986J496l826o245j058N889N773j378m180J375O440K349o440
$$ plain form
1441 725 -6792 -6494 571 4292 783 -2603 1064 8294 9688 2391 -4332 -3516 2482 4148 -1568 -4844
1457 -4844 -339 8302 10476 4886 -707 846 5982 6210 312 -3758 1174 10121 12977 6992 598
1472 598 3036 9339 8699 -107 -5737 235 10289 11886 3735 -261 6966 15393 11679 -239 -4641
1487 -4641 3870 12626 9384 333 1045 12067 18402 10178 -1721 -1494 7799 11454 3204 -3604 2170
1502 2170 13172 14795 5704 557 5454 11977 9172 389 -1210 5940 11784 9722 5160 5318 8421
1517 8421 8176 3307 -89 1634 4604 5172 5019 6425 8098 6090 3270 3601 5602 3771 -479 -970
1533 -970 5100 10352 7551 1893 3148 9305 8600 -1101 -8859 -3146 7394 8366 -704 -3803 5264
1548 5264 13905 7905 -6199 -8794 1963 9477 1822 -8605 -4628 10776 15443 3393 -8120
$$ packed form
1441G25p517K98P065L721l509l386L667P230J394p297o723Q16N998J666n716l276
1457d844M505Q641K174n590n593J553N136K28n898m070M932Q947K856n985o394
1472E98K438O303o40q806n630N972J0054J597q151l996P227Q427l714j1918m402
1487d641Q511Q756l242r051P12J1022O335q224j1899K27R293L655q250o808N774
1502B170J1002J623r091n147M897O523k805q783j599P150N844k062m562J58L103
1517H421k45m869l396J723K970N68j53J406J673k008k820L31K001j831m250m91
1533i70O070N252k801n658J255O157p05r701p758N713J0540R72r070l099R067
1548E264Q641o000j4104k595J0757P514p655j0427L977J5404M667j2050j1513
$$ plain form
1561 -8120 -4079 6710 5144 -8389 -13209 -2026 10818 8299 -3433 -5922 3001 8509 496 -10431
1575 -10431 -9230 1243 6389 1166 -3912 -658 5745 5693 -2370 -7937 -6171 -1603 -1408 -3428 -2929
1590 -2929 399 2312 1365 -645 -3193 -4772 -5288 -3495 -797 -924 -2542 -1585 2538 4156 -1713 -8249
1606 -8249 -8264 -2124 68 -4985 -8182 -3124 5242 4602 -4659 -10251 -5429 1018 -1526 -10088 -10484 -564
1622 -564 7297 3001 -6192 -7124 -261 1421 -7390 -14357 -10241 -46 3242 -2774 -6278 -2912 1838
1637 1838 -1425 -8927 -11589 -7224 -2218 -2644 -4654 -3249 -368 875 -1475 -5024 -7625 -8940 -8512
1652 -8512 -6640 -4160 -3700 -4519 -3248 14 -511 -6464 -11648 -8811 -2074 -1022 -7096 -9736 -2407 5606
1668 5606 2047 -8833 -12112 -4070 1652 -5003 -14810 -11264 2121 7943 -1686 -12170 -8929 2163
$$ packed form
1561h120M041J0789j566j3533m820J1183J2844k519j1732k489Q923N508q013j0927
1575a0431J201J0473N146n223n078L254O403n2q063n567J766M568J95k020M99
1590b929L328J913r47k010k548j579n16J793K698j27j618R57M123J618n869o536
1606h249j5O140K192n053l197N058Q366o40r261n592M822O447k544q562l96R920
1622e64P861m296r193r32O863J682q811o967M116J0195L288o016l504L366M750
1637A838l263p502k662M365N006m26k010J405K881J243k350l549k601j315M28
1652h512J872K480M60q19J271L262n25n953n184K837O737J052o074k640P329Q013
1668E606l559j0880l279Q042N722o655r807L546J3385N822r629j0484L241J1092
$$ plain form
1682 2163 1882 -9366 -15477 -5444 6898 5406 -6861 -10156 -497 6360 -817 -12610 -12384 -1136
1696 -1136 4520 -2193 -8511 -3619 5483 5311 -3799 -9745 -5380 432 -85 -4106 -3262 2515 5486 2620
1712 2620 -1602 -1908 -367 -1552 -3187 -2337 115 970 575 1839 4902 4345 -993 -3630 -803 2716
1728 2716 1118 -3035 -897 7356 11141 4720 -2492 -999 6135 5726 -2543 -6744 839 10862 10123
1743 10123 753 -2257 5466 11204 4922 -5624 -5502 5215 11193 5369 -1264 2807 11889 11967 2733
1758 2733 -4294 -296 6841 6993 1238 -63 5487 11030 8787 2551 -75 2466 5206 3967 1985
1773 1985 2196 5238 7960 8536 6977 3809 2228 3323 3916 2647 -131 401 5459 10220 8426 2547
1789 2547 617 4475 7559 2645 -4004 -2483 6854 11785 5622 -1036 2357 10230 9364 -462 -7012
$$ packed form
1682B163k81j1248o111J0033J2342j492j2267l295R659O857p177j1793K26J1248
1696a136N656o713o318M892R102j72r110n946M365N812n17m021Q44N777K971k866
1712B620m222l06J541j185j635Q50K452Q55l95J264L063n57n338k637K827L519
1728B716j598m153K138Q253L785o421p212J493P134m09q269m201P583J0023p39
1743A0123r370l010P723N738o282j0546J22J0717N978n824o633M071R082P8r234
1758B733p027L998P137J52n755j301N550N543k243o236k626K541K740j239j982
1773A985K11L042K722N76j559l168j581J095N93j269k778N32N058M761j794n879
1789B547j930L858L084m914o649J521R337M931o163o658L393P873q66r826o550
$$ plain form
1804 -7012 -1065 8450 7605 -706 -2614 5915 12152 6084 -4302 -5685 3114 7532 1966 -3684 1046
1819 1046 9407 10110 2292 -2889 366 4488 2099 -3138 -2487 3234 6401 4308 1788 2655 3525 1190
1835 1190 -2291 -2167 692 1308 -333 1757 6053 6844 2375 -1805 -368 3668 1116 -5316 -5497 2847
1851 2847 8963 4228 -3597 -2444 5489 6627 -3230 -10524 -3967 7208 7355 -2886 -6490 2748 10859
1866 10859 4704 -8357 -10563 874 7126 -139 -8981 -4315 8077 10004 -1621 -10469 -5062 4422
1880 4422 2665 -7199 -9529 -388 8066 4184 -4525 -5607 1069 3580 -2766 -8901 -6975 -19 1777
1895 1777 -1846 -3752 -1348 922 -1407 -5599 -5994 -4346 -3224 -3298 -2386 -525 -1013 -3476 -3702 -1925
1911 -1925 -1998 -6177 -8898 -5154 -268 -921 -5437 -6338 -946 2465 -2953 -10949 -10221 -2985 727 -4568
$$ packed form
1804g012N947R515q45q311j908Q529O237o068j0386j383Q799M418n566n650M730
1819A046Q361P03p818n181L255M122k389n237O51N721L167k093k520Q67Q70k335
1835A190l481J24K859O16j641K090M296P91m469m180J437M036k552o432j81Q344
1851B847O116m735p825J153P933J138r857p294O557J1175J47j0241l604R238Q111
1866A0859o155j3061k206J1437O252p265q842M666J2392J927j1625q848N407R484
1880D422j757r864k330R141Q454l882q709j082O676K511o346o135J926O956J796
1895A777l623j906K404K270k329m192l95J648J122p4R12J861m88k463k26J777
1911a925p3m179k721L744M886o53m516r01N392L411n418p996P28P236L712n295
$$ plain form
1927 -4568 -9432 -4885 3202 2972 -6003 -10900 -6034 228 -2499 -9435 -10477 -2453 3346 -438 -7176
1942 -7176 -7227 -1588 -276 -5919 -10762 -7399 -839 686 -2961 -5337 -3007 -783 -2747 -5278 -6707
1957 -6707 -5422 -3541 -2500 -1781 -1497 -1812 -2569 -1506 -873 -3463 -7583 -7089 -1902 1620 -580 -4433
1973 -4433 -2262 3481 4266 -3625 -9398 -5210 2641 2155 -5307 -7250 968 8962 4985 -6057 -7818
1988 -7818 1072 6277 -575 -9259 -5408 6257 9732 417 -6481 -1361 7098 5668 -4729 -8486
2002 -8486 -234 8248 5261 -2577 -2544 4791 8260 1484 -5811 -3298 4023 5023 450 -1685 3060
2017 3060 7493 4958 -194 -722 2340 2238 -435 -473 2739 5391 3900 1813 3059 5186 2904 -2196
2033 -2196 -1963 3200 5630 2040 -883 3156 9505 7355 -892 -4275 1525 7141 3228 -4224 -2264
$$ packed form
1927d568m864M547Q087k30q975m897M866O262k727o936j042Q024N799l784o738
1942g176n1N639J312n643m843L363O560J525l647k376K330K224j964k531j429
1957f707J285J881J041P19K84l15p57J063O33k590m120M94N187L522k200l853
1973d433K171N743P85p891n773M188P851m86p462j943Q218P994l977j1042j761
1988g818Q890N205o852q684L851J1665L475r315o898N120Q459j430j0397l757
2002h486Q252Q482k987p838L3P335L469o776p295K513P321J000m573k135M745
2017C060M433k535n152n28L062j02k673l8L212K652j491k087J246K127k282n100
2033b196K33N163K430l590k923M039O349k150q247l383N800N616l913p452J960
$$ plain form
2048 -2264 8098 12045 4343 -3688 -1130 7563 7289 -3148 -7717 837 10918 9483 -199 -2665
2062 -2665 5136 10559 3550 -5928 -5145 3978 8744 3159 -2594 1509 9485 8969 1271 -3680 -741
2077 -741 4244 3822 -742 -625 4267 7467 5462 1528 519 2221 2556 1076 857 1556 2659 4008
2093 4008 4695 4844 3034 552 -55 2153 3062 780 -744 2191 6848 6768 1554 -1726 1700 5561
2109 5561 3146 -2979 -3509 3235 8920 5747 -976 -851 5432 6397 349 -6048 -2769 5338 6832 1132
2125 1132 -2510 2018 7603 5298 -2319 -5172 -63 4260 1754 -2414 -1094 4411 6635 2873 -1817
2140 -1817 -2144 291 617 -1649 -2337 66 2562 2833 1943 780 371 -1340 -1747 -1719 -1407 -2029 -2441 -218
2158 -218 2797 2621 -1278 -3279 -1057 1020 -1731 -6288 -5908 37 4300 540 -5172 -4416 1662 2644
$$ packed form
2048b264J0362L947p702q031K558Q693k74j0437m569Q554J0081j435r682k466
2062b665P801N423p009r478P83R123M766n585n753M103P976n16p698m951K939
2077g41M985m22m564J17M892L200k005l934j009J702L35j480k19O99J103J349
2093D008O87J49j810k482o07K208R09k282j524K935M657q0n214l280L426L861
2109E561k415o125n30O744N685l173o723J25O283R65o048o397L279Q107J494n700
2125A132l642M528N585k305p617k853N109M323k506m168J320N505K224l762m690
2140a817l27K435L26k266o88K403K496K71q90j163m09j711m07K8L12o22m12K223
2158b18L015j76l899k001K222K077k751m557L80N945M263l760n712P56O078R82
$$ plain form
2174 2644 -4063 -9527 -5774 2246 2320 -4199 -7173 -1732 4535 954 -7257 -9661 -3240 2411 -1440
2189 -1440 -7547 -6020 1200 3931 -2345 -9143 -7405 -1184 231 -4947 -8510 -4310 1788 1462 -3588
2204 -3588 -6458 -3792 -1238 -2620 -6656 -7049 -3422 51 -266 -2816 -3919 -2868 -2341 -3367 -4847 -5557
2220 -5557 -4543 -2228 -1297 -1557 -2356 -2702 -1605 -942 -2885 -5570 -5759 -2956 214 -439 -2666 -3086 -725
2237 -725 608 -1791 -5640 -5349 -1752 201 -1705 -3847 -2319 1528 2911 -925 -5236 -4080 -622
2252 -622 336 -1884 -3701 -925 2846 3169 -502 -3584 -2723 345 608 -2271 -3885 -2082 2154 3456
2268 3456 693 -1982 -1306 1646 1826 -1974 -4970 -2302 2740 4687 1237 -2063 -441 3190 3255 -2143
2284 -2143 -5243 -1963 4221 4039 -750 -2975 1280 6507 4012 -2958 -4756 209 4849 2038 -3231
$$ packed form
2174B644o707n464L753Q020P4o519k974N441O267l581q211k404O421N651l851
2189a440o107J527P220K731o276o798J738O221J415n178l563M200O098l26n050
2204c588k870K666K554j382m036l93L627L473l17k550j103J051N27j026j480p10
2220e557J014K315R31k60p99l46J097O63j943k685j89K803L170o53k227m20K361
2237g25J333k399l849K91L597J953j906k142J528L847J383l836m311J156L458
2252f22R58k220j817K776L771L23l671l082Q61L068K63k879j614J803M236J302
2268C456k763k675O76K952J80l800k996K668N042J947l450l300J622L631O5n398
2284b143l100L280O184j82m789k225M255N227k495o970j798M965M640k811n269
$$ plain form
2299 -3231 -2168 4652 7208 2443 -3966 -3302 2570 4105 -402 -3974 -301 5452 5243 292 -1974
2314 -1974 748 4157 2389 -1952 -2612 1487 4084 3048 1421 1809 3030 2529 91 -1343 -407 1093
2330 1093 1483 2048 3059 3512 2303 1107 1607 2819 1431 -1315 -1198 2481 5316 2971 614 2146
2346 2146 5664 5331 -417 -4019 -450 5056 5235 28 -1175 4189 8759 5434 -2133 -3135 3303
2361 3303 6970 2039 -3361 -615 7607 9705 3087 -2763 275 6393 5633 -1483 -4444 1810 7900
2376 7900 7048 557 -1076 4120 7035 3782 -2922 -2652 3005 6190 3487 228 1968 5883 5589 1284
2392 1284 -2171 -973 2518 2787 1051 866 2652 4146 3720 2129 235 98 18 576 937 1208 1417
2409 1417 2223 3563 3696 1611 -1379 -1953 -419 1090 -401 -1639 573 4093 4428 422 -3091 -1329
$$ packed form
2299c231J063O820K556m765o409O64N872J535m507l572L673N753k09m951k266
2314a974K722L409j768m341o60M099K597j036j627L88J221n01k438j434R36J500
2330A093L90N65J011M53j209j196N00J212j388k746J17L679K835k345k357J532
2346B146L518l33n748l602L569N506J79n207j203N364M570l325p567j002O438
2361C303L667m931n400K746Q222K098o618n850L038O118p60p116k961O254O090
2376G900q52o491j633N196K915l253o704K70N657L185k703l259J740L915k94m305
2392A284l455J198L491K69j736j85J786J494m26j591j894j37q0N58L61K71K09
2409A417Q06J340J33k085k990n74J534J509j491j238K212L520L35m006l513J762
$$ plain form
2425 -1329 1954 1407 -2971 -4540 -98 4220 3011 -1466 -2899 610 2564 -1106 -6267 -5538 115
2440 115 3482 651 -2793 -1943 1449 1282 -2840 -5970 -4036 312 911 -2038 -3297 -721 2128 1140
2456 1140 -2646 -4948 -4267 -2758 -2300 -3558 -2777 -805 864 1146 -1529 -3699 -4744 -3297 -2336 -2677
2472 -2677 -3334 -2814 -511 834 -397 -3480 -4388 -2606 -830 -2684 -5267 -5332 -655 2325 80 -3805
2488 -3805 -4388 -741 99 -3845 -7093 -4956 1123 2844 -1482 -4710 -2706 1869 832 -4877 -8024
2503 -8024 -3862 1485 1063 -3673 -4996 -42 3738 621 -5172 -6260 -1441 1375 -1232 -4913 -2896
2518 -2896 1987 3577 -985 -4681 -3787 -355 110 -2986 -3874 -973 2058 1641 -1175 -2688 -1129 -170
2534 -170 -1504 -3049 -2640 -637 625 495 299 292 -264 -1083 -1829 -1605 -1665 -2616 -2135 -18 2099 1415 -1092
$$ packed form
2425a329L283n47m378j569M442M318j209m477j433L509J954l670n161P29N653
2440A15L367k831l444Q50L392j67m122l130J934M348N99k949j259K576K849r88
2456A140l786k302O81J509M58j258P81J972J669K82k675k170j045J447R61l41
2472b677o57N20K303J345j231l083r08J782J776j854k583o5M677K980k245l885
2488c805n83L647Q40l944l248K137O079J721m326l228K004M575j037n709l147
2503h024M162N347m22m736j323M954L780l117n793j088M819K816k607l681K017
2518b896M883J590m562l696Q94L432M65l096q88K901L031m17k816j513J559R59
2534a70j334j545M09K003J262j30j96pn56q19p46K24o0r51M81K117K117o84k507
$$ plain form
2553 -1092 -1540 371 1117 -1699 -4234 -3391 1250 2950 -447 -2912 -408 3456 3002 -2372 -5325 -1508
2569 -1508 3116 2021 -3064 -4107 1551 5626 2117 -4406 -4571 1391 4309 41 -4700 -2440 4479
2584 4479 6097 440 -4470 -1676 4365 3677 -2497 -4934 18 5270 3972 -1954 -2889 1897 5200
2599 5200 1962 -3020 -2820 2034 4679 1818 -1275 431 4090 4518 536 -1851 -280 2668 2922 513
2615 513 470 2240 3704 2810 1194 1190 1545 1551 1226 1452 2071 2607 2431 3240 3950 3564 1484 -237 1139 3034
2635 3034 2618 435 721 3825 5751 3654 368 394 3509 4939 1309 -2004 308 5421 6569 2396
2651 2396 -332 2460 5910 4261 -643 -2811 1316 5723 4257 -226 -523 3869 6567 3072 -1889
2666 -1889 -1756 2541 5003 1911 -1651 345 4959 5570 1636 -1843 -608 2747 2480 -606 -1887 303
$$ packed form
2553a092m48J911P46k816k535Q43M641J700l397k465K504L864m54n374k953L817
2569a508M624j095n085j043N658M075l509o523j65N962K918m268m741K260O919
2584D479J618n657m910K794O041o88o174k437M952N252j298n926r35M786L303
2599E200l238m982K00M854K645k861l093J706L659M28l982k387J571K948K54k409
2615E13m3J770J464q94j616mL55Ol25K26O19N36j76Q09P10l86k080j721J376J895
2635C034m16k183K86L104J926k097l286K6L115J430l630l313K312N113J148m173
2651B396k728K792L450j649m904k168M127M407j466m483k97M392K698l495m961
2666a889J33M297K462l092l562J996M614O11l934l479J235L355k67l086j281K190
$$ plain form
2682 303 4240 4040 514 -1366 -161 1481 1068 -588 -1804 58 2432 2760 996 -341 126 1287
2698 1287 680 -1095 -2855 -1763 739 1805 868 -1077 -576 1070 895 -1523 -3676 -2667 469 1519
2714 1519 -109 -2231 -968 1503 1382 -1571 -4040 -3120 -56 213 -2172 -2912 -687 2304 1107 -1905
2730 -1905 -4060 -2354 -105 -820 -3306 -3338 -635 1660 927 -1747 -3166 -1580 -648 -1615 -3448 -3465 -1151
2747 -1151 468 328 -1590 -2465 -1331 -500 -1007 -3365 -3812 -1849 412 501 -1048 -2366 -1238 121 -24
2764 -24 -3396 -4477 -2658 71 507 -1955 -3237 -1192 1573 277 -3476 -4926 -2262 176 -219 -2920
2780 -2920 -3253 113 2536 468 -3615 -4282 -1219 363 -1442 -4413 -3195 328 2220 -517 -3762
2795 -3762 -3033 96 431 -2236 -4628 -2722 680 1678 -910 -2879 -1878 610 239 -2702 -4223 -2919
$$ packed form
2682C03L937k00l526j880J205J642m13j656j216J862K374L28j764j337M67J161
2698A287o07j775j760J092K502J066r37j945N01J646j75k418k153J009L136J050
2714A519j628k122J263K471j21k953k469R20L064K69k385p40K225K991j197l012
2730a905k155J706K249p15k486l2K703K295p33k674j419J586R32r67j833j7K314
2747a151J619j40j918q75J134Q31n07k358m47J963K261Q9j549j318J128J359j45
2764b4l372j081J819K729M36k462j282K045K765j296l753j450K664K438l95k701
2780b920l33L366K423k068m083o67L063J582j805k971J218L523J892k737l245
2795c762P29L129L35k667k392J906L402R98k588j969J001K488l71k941j521J304
$$ plain form
2811 -2919 278 553 -1000 -3108 -1366 792 2 -2626 -4344 -2592 310 496 -1502 -2170 -290 1698
2827 1698 463 -1995 -3235 -2285 -169 -504 -2157 -2199 23 1699 834 -1445 -2683 -1352 -181 -628
2843 -628 -2207 -1885 324 1811 1394 79 -820 -643 -446 -518 -1469 -1894 -678 1387 1989 1112 -277 -523
2861 -523 489 826 -298 -2331 -1403 1344 3261 1810 -406 -20 2545 2961 41 -2693 -1142 2513
2877 2513 4227 1091 -1142 1100 4622 3830 -1025 -3086 213 3830 3393 -685 -1128 3446 7111 4049
2893 4049 -1440 -1775 2800 4632 1354 -2509 -33 5271 6636 2295 -1506 550 4078 3406 -561
2908 -561 -1691 1898 5774 4389 1178 758 3277 4490 2252 -1272 -442 2069 3681 2453 1568 2636
2924 2636 3788 2729 754 91 880 1367 896 1482 2860 3120 2156 1784 2202 2788 1016 -1199 -872 1924
$$ packed form
2811b919L197K75j553k108J742K158p90k628j718J752K902J86j998o68J880J988
2827A698j235k458j240R50K116l35j653m2K222J676q65k279j238J331J171m47
2843f28j579L22K209J487m17j315q99J77J97p2r51m25J216K065O02q77j389k46
2861e23J012L37j124k033R28K747J917j451k216L86K565M16k920k734J551L655
2877B513J714l136k233K242L522p92m855k061L299L617m37m078m43M574L665l062
2893D049n489l35M575J832l278l863K476N304J365m341l801K056L528o72l967
2908e61j130L589L876j385l211m20K519J213k238l524Q30K511J612j228q85J068
2924B636J152j059j975o63P89M87m71N86J378K60r64l72M18N86j772k215L27K796
$$ plain form
2942 1924 3344 1221 164 1880 4302 3380 -1131 -2619 421 3591 1860 -1686 -1105 3585 5748
2957 5748 1673 -2811 -1341 2789 3383 -987 -3580 -349 4360 4329 -561 -2815 25 3526 1516 -3391
2973 -3391 -3637 578 4078 1852 -1759 -1153 1923 2514 -502 -3465 -2586 819 1905 -418 -1509 -61
2989 -61 1561 1280 -630 -1843 -1604 -525 -543 -738 -556 -410 725 1055 736 -1035 -1726 -1587 62 144 -863
3008 -863 -2140 -498 1550 1346 -1229 -3135 -1272 488 -203 -2686 -3319 274 2812 919 -2556 -2688
3024 -2688 265 1566 -1214 -4290 -2873 977 2201 -704 -3036 -1517 1829 717 -3007 -4023 -1854
3039 -1854 659 306 -2312 -2138 163 1471 -441 -2615 -2297 -1444 -993 -1910 -2174 -1656 -374 -578 -523 -1019
3057 -1019 -1361 -2239 -2640 -2129 -1242 -1252 -2155 -1401 396 448 -1701 -3501 -2428 147 -464 -3663 -4211 -683
$$ packed form
2942A924J420k123j057J716K422r22m511j488L040L170j731l546N81M690K163
2957E748m075m484J470M130N94m370k593L231M709l1m890k254K840L501k010m907
2973c391k46M215L500k226l611O06L076N91l016k963Q79L405J086k323j091J448
2989f1J622k81j910j213K39J079j8j95J82J46J135L30l19j771o91J39J649Q2j007
3008h63j277J642K048k04k575j906J863J760o91k483o33L593K538j893l475j32
3024b688K953J301k780l076J417L850J224k905k332J519L346j112l724j016K169
3039a854K513l53k618J74K301J308j912k174L18Q53M51r17k64N18J282k04N5m96
3057a019l42q78m01N11Q87j0r03P54J797N2k149j800J073K575o11l199n48L528
$$ plain form
3075 -683 2153 426 -3258 -3693 -365 1339 -2125 -5861 -4427 865 2294 -2047 -5073 -1600 2359
3090 2359 1395 -3799 -6077 -2204 2173 508 -4204 -4498 491 3387 -508 -4874 -4139 299 1715 -2006
3106 -2006 -4514 -1962 2433 1876 -1805 -3306 -1452 1396 81 -2805 -2951 534 2170 567 -1203
3121 -1203 -1386 290 300 -1618 -2001 -1178 10 -201 -131 738 1376 622 -807 -359 286 126 -1315 -1008 1095
3140 1095 2746 1529 -272 43 2503 2210 -534 -2489 -502 3133 2724 66 -899 1601 4801 2572
3156 2572 -1519 -2227 1403 3700 1783 -1613 -179 3925 5045 1623 -1523 -214 3174 3039 -2
3171 -2 -1734 1220 4366 3843 813 -369 1668 3521 2122 -756 -921 1492 3834 2419 969 771
3187 771 2323 3152 1729 -89 -180 1395 2676 1954 1117 888 2023 2776 1979 761 -627 699 2129
$$ packed form
3075f83K836j727l684m35L328J704l464l736J434N292J429m341l026L473L959
3090B359r64n194k278L873M377j665m712k94M989K896l895m366P35M438J416l721
3106b006k508K552M395n57l681j501J854K848j315k886j46L485J636j603j770
3121a203j83J676J0j918l83Q23J188k11P0Q69O38p54j429M48O45j60j441L07K103
3140A095J651j217j801L15K460k93k744j955J987L635m09k658r65K500L200k229
3156B572m091p08L630K297j917l396J434M104J120l422l146J309L388j35l041
3171bj732K954L146n23l030j182K037J853j399k878j65K413K342j415j450j98
3187G71J552Q29j423j818r1J575J281p22q37k29J135P53p97j218j388J326J430
$$ plain form
3204 2129 2149 1276 575 2029 3151 2358 12 -1083 -44 1999 1865 -153 -389 1839 3720 2822 13
3221 13 -403 1029 2341 1083 -909 -935 1633 3350 1960 -376 -416 1633 1906 200 -1592 -556 1579
3238 1579 2236 941 -41 533 1609 1482 -62 -1031 -124 573 1077 765 -34 239 803 1614 682 -595
3256 -595 -1244 -342 933 985 25 -511 728 2007 1315 -742 -1819 -189 1084 774 -971 -1567 1285
3273 1285 3056 1265 -1395 -1545 284 1673 -425 -2381 -1715 1131 2612 430 -1918 -923 1538 1742
3289 1742 -1125 -3234 -1309 1699 1647 -1191 -2273 -308 1917 917 -2199 -2888 -1315 1145 566 -1808
3305 -1808 -1941 -574 1500 -12 -2154 -2621 -993 229 -515 -1958 -1767 -159 799 -53 -1580 -2294 -1463
3322 -1463 -654 -1270 -2521 -2444 -680 458 -127 -1555 -2314 -1570 -667 -1250 -2796 -2942 -1242 83 -403 -1792
$$ packed form
3204B129K0q73p01J454J122p93k346j095J039K043j34k018k36K228J881q98k809
3221A3m16J432J312j258j992k6K568J717j390k336m0K049K73j706j792J036K135
3238A579O57j295r82N74J076j27j544r69R07O97N04l12p99K73N64Q11r32j277
3256e95o49R02J275N2r60n36J239J279o92k057j077J630J273l10j745n96K852
3273A285J771j791k660j50J829J389k098j956O66K846J481k182k348R95K461K04
3289A742k867k109J925L008n2k838j082J965K225j000l116o89J573K460n79k374
3305a808j33J367K074j512k142m67J628J222p44j443J91J608R58q52j527p14Q31
3322a463Q09o16j251P7J764J138n85j428p59P44R03n83j546j46J700J325m86j389
$$ plain form
3340 -1792 -2314 -1205 -524 -1674 -3061 -3087 -1573 -583 -570 -1626 -1605 -674 -527 -1524 -2879 -2795 -1808 -1238 -1037
3359 -1037 -1626 -1474 -758 -9 -533 -1839 -2756 -2234 -1027 -582 -1944 -2067 -1239 458 462 -1586 -2806 -1998
3377 -1998 123 -239 -2503 -2733 -754 2134 701 -2204 -3100 -435 1376 -138 -3158 -2799 844 2629
3393 2629 308 -2773 -1942 1707 2309 -1425 -3518 -989 2288 2530 -810 -2505 372 2849 1650 -2324
3409 -2324 -2962 -25 2529 1127 -1626 -803 2489 2997 378 -1865 -976 1828 1544 -437 -1032 786
3425 786 2489 2214 -116 -159 1196 1278 -4 -808 489 1844 1523 547 1354 2131 1568 -121 -567 838
3443 838 1973 628 -752 592 2993 2707 229 -1210 1350 3083 1395 -1600 -1511 2273 4084 1435
3459 1435 -1188 -243 3376 3351 -550 -2554 -167 3890 3141 -664 -1366 2088 4573 2245 -2008 -2232
$$ packed form
3340a792n22J109O81j150j387k6J514R90J3j056K1R31J47r97j355Q4R87N70K01
3359a037n89J52P16P49n24j306r17N22J207M45j362j23Q28J697Mk048j220Q08
3377a998K121l62k264k30J979K888j433k905q96K665J811j514l020L59L643J785
3393B629k321l081Q31L649O02l734k093K529L277K42l340j695K877K477j199l974
3409b324o38K937K554j402k753Q23L292N08k619k243Q89K804k84j981n95J818
3425G86J703k75k330m3J355Q2j282q04J297J355l21r76Q07P77n63j689m46J405
3443H38J135j345j380J344K401k86k478j439K560J733j688k995Q9L784J811k649
3459A435k623R45L619k5l901k004K387M057p49l805p02L454K485k328m253k24
$$ plain form
3475 -2232 1865 3929 817 -2080 -578 3654 4083 445 -2278 162 2699 1993 -635 -1518 1621 3543
3491 3543 2183 -195 -453 1522 2106 494 -1053 28 1622 1621 833 610 1248 1627 1070 -4 444 226
3509 226 510 305 1051 1779 1113 481 384 1751 1253 -214 -1118 375 2372 2077 109 -580 1371 2786
3527 2786 1625 -1267 -1079 1398 2752 585 -1305 -242 2925 2996 397 -2140 -232 2472 1772 -1345
3543 -1345 -1833 841 3099 2091 -1308 -1700 1350 2082 223 -1927 -1093 1399 1971 403 -1036 384
3559 384 1459 1087 -705 -1492 -392 431 254 -136 -159 608 173 162 61 -486 -971 -1311 -365 301 361 -791
3579 -791 -1054 79 501 -570 -2185 -1932 -156 501 -857 -2550 -1146 1347 1108 -1806 -3180 -1769
3595 -1769 825 326 -2888 -3645 -520 1911 274 -3243 -3413 -326 757 -1308 -3803 -2627 602 1453
$$ packed form
3475b232M097K064l112k897J502M232M29l638k723K440K537p06k628q83L139J922
3491C543j360k378k58J975N84j612j547J081J594jp88k23O38L79n57j074M48k18
3509B26K84k05P46P28o66o32r7J367m98j467r04J493J997k95j968o89J951J415
3527B786j161k892J88K477J354k167j890J063L167P1k599k537J908K704p00l117
3543a345m88K674K258j008l399l92L050P32j859k150Q34K492N72j568j439J420
3559C84J075l72j792p87J100Q23j77l90k3P67m35j1j01n47m85l40R46O66O0j152
3579g91k63J133M22j071j615K53J776O57j358j693J404K493k39k914j374J411
3595a769K594m99l214p57L125K431j637l517j70L087J083k065k495J176L229Q51
$$ plain form
3611 1453 -1482 -3625 -1949 1098 252 -2596 -3797 -1693 625 136 -2493 -2781 -626 1042 -1195 -2996
3627 -2996 -2869 -792 -130 -1355 -2201 -1549 74 -204 -1527 -2047 -1183 -729 -1266 -1743 -1195 -934 -457 -647
3645 -647 -718 -512 -493 -1520 -1768 -982 -713 -1330 -1420 -712 712 560 -976 -1918 -1063 588 3 -2272 -2331 111
3665 111 1941 435 -1685 -1366 847 1445 -864 -2828 -1822 1401 1710 -599 -1822 -355 2187 1390
3681 1390 -1518 -2840 -363 2335 940 -1355 -1414 917 2528 489 -2074 -1578 440 1828 82 -1715
3697 -1715 -952 1861 2305 407 -1174 -409 1250 1082 -493 -1577 -37 1440 1858 68 -843 452
3713 452 1294 990 -432 -628 2 1357 1163 290 -161 415 959 586 30 -258 -193 600 1078 663 319 395
3733 395 861 887 105 -192 -344 681 1088 950 100 171 1117 1416 999 -237 -506 258 1282 562 -87 -139
$$ packed form
3611A453k935k143J676L047q46k848j201K104K318m89k629k88K155J668k237j801
3627b996J27K077O62j225q46O52J623k78j323n20Q64M54n37m77N48K61M77j90
3645f47p1K06J9j027k48P86K69o17r0P08J424j52j536r42Q55J651n85k275n9K442
3665A11J830j506k120L19K213N98k309j964J006L223L09k309j223J467K542p97
3681A390k908j322K477K698j395k295n9K331J611k039k563M96K018J388j746j797
3697a715P63K813M44j898j581P65J659j68j575j084J540J477M18j790r11J295
3713D52Q42l04j422j96O30J355j94q73m51N76N44l73n56k88O5P93M78m15l44P6
3733C95M66K6p82k97j52J025M07j38q50P1R46K99m17j236k69P64J024p20o49n2
$$ plain form
3753 -139 1368 2196 1423 -227 -491 867 1682 529 -499 -74 2020 2557 1149 -588 -62 1966 1769
3770 1769 132 -1029 60 1988 2468 737 -655 209 2382 1867 179 -982 552 2292 2026 411
3786 411 -284 1459 2626 1290 -333 -623 1146 2227 1548 -214 -24 1860 2520 1229 -639 -32 1044
3803 1044 1846 868 -340 300 1777 1959 1067 -90 276 1421 1339 321 -128 415 1214 1280 697 -100 184
3822 184 735 590 85 19 -90 758 1358 908 -41 -378 521 573 406 -460 -1042 -38 1126 673 -279 -766
3842 -766 532 1043 314 -1159 -1328 -140 881 -1 -1312 -1288 731 1133 104 -1572 -1070 -55 480
3859 480 -836 -2333 -1249 572 543 -815 -1627 -875 176 91 -1411 -2107 -1180 306 -99 -1131 -1666 -750
3877 -750 196 -144 -1380 -1734 -913 -369 -97 -994 -1472 -1063 -237 -210 -1086 -1797 -1524 -305 190 -953 -1965
$$ packed form
3753a39J507Q28p73j650k64J358Q15j153j028M25K094N37j408j737N26K028j97
3770A769j637j161J089J928M80j731j392Q64K173n15j688j161J534J740k66j615
3786D11o95J743J167j336j623k90J769J081o79j762J90J884O60j291j868O07J076
3803A044Q02r78j208O40J477J82q92j157L66J145q2j018m49N43P99O6n83p97K84
3822A84N51j45n05o6j09Q48O00m50r49l37Q99N2j67q66n82J004J164m53r52m87
3842g66J298N11p29j473j69J188J021q82j311K4K019M02j029j676N02J015N35
3859D80j316j497J084J821k9j358q12P52J051q5j502o96R27J486m05j032n35R16
3877g50R46l40j236l54Q21N44K72q97m78M09Q26K7q76p11K73J219M95j143j012
$$ plain form
3896 -1965 -1217 288 561 -859 -2137 -1519 204 66 -1595 -2230 -1268 807 542 -1458 -2615 -981 736
3913 736 73 -1913 -2339 -535 1299 4 -1515 -1729 387 907 -862 -2370 -1924 240 1015 -493 -1747
3930 -1747 -623 898 297 -1287 -2241 -786 617 -6 -1222 -749 332 906 -30 -1097 -839 -519 -185
3947 -185 -928 -466 -349 -61 123 -86 186 4 -781 -898 -684 75 -180 -858 -841 643 1151 137 -1553
3966 -1553 -1068 405 531 -1000 -1793 -275 1729 1115 -690 -1735 -73 1484 169 -2325 -1878 916
3982 916 2307 299 -1813 -1205 1454 1982 -1070 -2713 -1010 1620 1631 -1140 -1604 318 2177 1145
3998 1145 -1652 -2065 408 1644 148 -1357 -851 1778 1947 -29 -1151 -339 530 813 -443 -630 399
4015 399 1289 1331 315 -166 455 404 327 -532 -59 603 510 692 1079 896 363 75 415 828 550 -109 269
$$ packed form
3896a965P48J505K73j420j278O18J723j38j661o35R62K075k65k000j157J634J717
3913G36o63j986m26J804J834j295j519k14K116N20j769j508M46K164P75j508j254
3930a747J124J521o01j584r54J455J403o23j216M73J081N74r36j067K58L20L34
3947a85p43M62J17K88J84k09K72j82p85j17K14P59k55o78J7J484N08j014j690
3966a553M85J473J26j531p93J518K004o14j805j045J662J557j315k494M47K794
3982I16J391k008k112O08K659N28l052j643J703K630J1k771m64J922J859j032
3998A145k797m13K473J236j496j505N06K629J69j976j122Q12Q69K83j256j87J029
4015C99Q90M2j016m81O21n1p7q59M73O62r3J82L87j83n33k88L40M13k78o59L78
$$ plain form
4036 269 1127 1936 1069 -122 379 1295 1166 88 -691 26 1981 1971 426 165 918 2226 1605 -446
4054 -446 -629 997 2252 1415 231 301 2068 2212 947 -669 -179 1479 1774 725 87 678 1924
4071 1924 2057 761 -224 401 1129 1181 293 131 396 1410 1588 927 -123 44 469 898 469 -159 165
4090 165 923 1621 1054 -111 -254 382 1111 625 -805 -303 1204 1761 598 -942 -197 1014 923 -443
4108 -443 -1462 -727 1350 1133 -428 -1257 95 1418 633 -975 -1653 -160 1116 451 -962 -1148 746
4125 746 1180 -69 -1221 -1161 494 183 -633 -1441 -692 747 753 -240 -879 -496 -97 -460 -994 -1033 -532 -307
4145 -307 -460 -236 -380 -486 -882 -418 -732 -519 -931 -1348 -383 97 -487 -661 -1261 -270 334 -578 -1818 -1295
4165 -1295 381 883 -280 -1819 -647 616 353 -1378 -1980 -606 832 323 -1791 -1317 -10 1270
$$ packed form
4036B69Q58Q09q67j191N01R16j29j078p79P17J955j0j545k61P53J308o21k051
4054d46j83J626J255q37j184P0J767J44j265j616M90J658K95j049o38N91J246
4071A924J33j296r85O25P28N2q88j62K65J014J78o61j050J67M25M29m29o28L24
4090A65P58O98n67j165j43O36P29m86j430N02J507N57j163j540P45J211r1j366
4108d43j019P35K077k17j561q29J352J323p85j608o78J493J276o65j413j86J894
4125G46M34j249j152O0J655l11q16q08P49J439Or93o39L83L99l63n34l9N01K25
4145c07j53K24j44j06l96M64l14K13m12m17R65M80n84j74o00R91O04r12j240N23
4165a295J676N02j163j539J172J263k63j731o02J374J438n09k114M74J307J280
$$ plain form
4181 1270 140 -1767 -1474 263 1057 -608 -1915 -1311 807 1234 -452 -1497 -886 771 194 -1233
4197 -1233 -2105 -611 585 504 -949 -1419 -249 745 -160 -1413 -1407 -608 119 -277 -712 -948 -140 273 104
4216 104 -820 -1234 -562 -261 -167 -676 -624 -467 -183 328 -654 -900 -750 97 -260 -1013 -937 -758 287 361 -577
4237 -577 -1501 -932 103 -48 -1142 -1314 -349 377 261 -887 -1239 -240 96 -402 -1038 -1221 -400 561 400
4256 400 -436 -941 -457 273 183 -697 -887 -681 285 317 -428 -567 -67 525 269 -566 -967 -443 590 597 -405
4277 -405 -562 -280 1024 802 -727 -1166 44 1316 611 -580 -858 763 1596 871 -861 -806 710 1251
4295 1251 428 -673 -346 1182 1767 454 -707 -150 1285 1412 87 -517 377 1419 1207 398 -280
4312 -280 629 1633 1262 -32 -433 870 1561 1119 202 205 773 1523 1267 300 123 295 1021 960 746 408
$$ packed form
4181A270j130j907K93J737P94j665j307O04K118M27j686j045O11J657n77j427
4197a233q72J494J196q1j453m70J170R94r05j253OP99P27l96m35k36Q08M13j69
4216A04r24m14O72L01R4n09N2J57K84N11r82k46J50Q47l57p53P6J79J045P4r38
4237e77r24N69J035j51j094j72R65P26j16j148l52R99L36m98o36j83Q21R61j61
4256D00q36n05M84P30r0q80j90K06R66L2p45j39N00N92k56q35m01N24J033Pj002
4277d05j57K82J304k22j529m39J210J272p05j191k78J621Q33p25j732N5J516N41
4295A251q23j101L27J528N85j313j161N57J435J27j325o04Q94J042k12q09o78
4312b80R09J004l71j294m01J303O91m42r17LN68P50k56r67j77J72P26o1k14l38
$$ plain form
4332 408 931 1089 1200 773 70 411 697 1230 592 106 315 1059 1518 778 -124 134 1228 1367 420 -391
4352 -391 303 1371 1309 558 -226 235 1239 815 -224 -549 159 1513 782 -340 -378 272 1022 952 -380
4371 -380 -631 235 654 525 -391 -305 318 1086 483 -774 -350 133 456 380 -65 -644 480 563 760 -242
4391 -242 -459 -60 358 339 -507 -688 -233 750 625 -385 -998 137 761 400 -768 -1138 14 1165 666
4410 666 -834 -982 229 1003 -364 -1569 -1133 592 894 -101 -1122 -412 983 827 -811 -1809 -586
4427 -586 603 8 -962 -1052 186 1027 227 -1278 -1139 -15 362 -196 -867 -565 110 751 -58 -427 17
4446 17 -63 -212 -613 -491 -470 -243 -102 13 335 -50 -504 -555 -374 72 -334 -876 -906 462 347 -558 -900
4467 -900 -473 517 29 -1521 -1418 6 533 36 -1334 -934 622 905 -744 -1957 -970 548 507 -810
$$ packed form
4332D08N23J58J11m27p03L41K86N33o38m86K09P44M59p40r02K58J094J39r47q11
4352c91O94J068o2p51p84M61J004m24j039l25P08J354p31j122l8O50P50p0j332
4371c80k51Q66M19j29r16Q6O23P68o03j257M24M83L23p6m45n79J124Q3J97j002
4391b42k17L99M18j9q46j81M55R83j25j010o13J135O24l61j168l70J152J151m99
4410F66j500j48J211P74j367j205M36J725L02r95j021P10J395j56j638r98J223
4427e86J189n95r70r0J238Q41q00j505J39J124L77n58o71L02O75O41q09l69M44
4446A7q0j49m01J22K1K27J41J15L22l85m54n1J81M46m06n42l0J368j15r05l42
4467i00M27R90m88j550J03J424N27m97j370M00J556K83j649j213R87J518m1j317
$$ plain form
4485 -810 -1812 -402 1017 357 -1166 -1921 -715 296 -70 -1697 -1615 405 1176 -397 -1665 -1340 -32
4502 -32 78 -702 -1598 -970 11 458 -502 -1487 -766 12 -63 -1069 -1342 -989 71 129 -705 -1150 -522 -111
4522 -111 -216 -804 -1099 -1009 36 25 36 -858 -500 131 -97 -533 -699 -815 -297 341 -68 -653 -159 240 328
4543 328 110 -715 -592 -235 315 40 -241 -356 228 647 191 -316 -367 -18 293 49 -246 -342 441 757 395
4564 395 -172 -7 418 1238 332 -578 -432 852 1447 459 -434 -188 922 1148 64 -457 -163 1087 1395
4583 1395 140 -303 110 1455 1191 308 -803 90 1023 1043 -126 -236 695 1649 952 -539 -504 605
$$ packed form
4485h10j002J410J419o60j523p55J206J011l66j627Q2K020P71j573j268L25J308
4502c2J10p80q96O28R81M47r60r85P21P78p5j006k73L53J060N8q34m45O28M11
4522a11j05n88k95R0J045j1J1q94L58O31k28m36j66j16N18O38m09n85M94L99Q8
4543C28k18q25J23L57N50k75k81j15N84M19m56n07n1L49L11k44k95r6P83L16l62
4564C95n67J65M25Q20r06r10J46J284N95r88q93K46J110K26j084n21K94J250L08
4583A395j255m43M13J345k64q83j111Q93R33K0j169j10R31R54o97j491L5J109
$$ [...]
8191a82
##END NTUPLES=NMR FID
##END=
