##TITLE=1H_LR-713_CR3
 CDCl3, 8 sc, 
 8.7.2020
##JCAMPDX= 6.0         $$ Bruker NMR JCAMP-DX V2.0
##DATA TYPE= NMR FID
##DATA CLASS= NTUPLES
##ORIGIN= UXNMR, Bruker Analytische Messtechnik GmbH
##OWNER= root
$$ XWIN-NMR		Version 3.5
$$ Wed Jul  8 10:14:48 2020 Russian Standard Time (UT+4h)  she@DPX200
##.OBSERVE FREQUENCY= 200.1315
##.OBSERVE NUCLEUS= ^1H
##.DELAY= (6, 6)
##.ACQUISITION MODE= SIMULTANEOUS
##.ACQUISITION SCHEME= undefined
##.AVERAGES= 8
##.DIGITISER RES= 18
##SPECTROMETER/DATA SYSTEM= spect
##.PULSE SEQUENCE= zg30
##.SOLVENT NAME= CDCl3
##.SHIFT REFERENCE= (INTERNAL, CDCl3, 0, 15.7039)
##AUDIT TRAIL= $$ (NUMBER, WHEN, WHO, WHERE, WHAT)
$$ ##TITLE= Audit trail, XWIN-NMR		Version 3.5
$$ ##JCAMPDX= 5.01
$$ ##ORIGIN= Bruker BioSpin GmbH
$$ ##OWNER= she
$$ F:/spectra/data/she/nmr/H-F/1/audita.txt
$$ ##AUDIT TRAIL=  $$ (NUMBER, WHEN, WHO, WHERE, WHAT)
(   1,<2020-07-08 10:13:47.42 +0400>,<she>,<DPX200>,
      <created by zg, POWCHK disabled, PULCHK disabled
       configuration hash MD5:
       00 E9 B6 7A A2 85 ED C7 34 08 36 98 17 FE 4E 26
       data hash MD5: 16K
       42 D9 A2 C1 0F 92 50 8C BE 4C 11 44 8E 4A 70 55>)
$$ ##END=
$$ 
$$ hash MD5
$$ 5E 7A 5D B9 72 AE C6 C5 59 F1 AB 94 5D 05 2E 8A
##$RELAX= 
##$RELAX= 
##$RELAX= 
##$RELAX= 
##$RELAX= 
##$RELAX= 
$$ Bruker specific parameters
$$ --------------------------
##$DU= <F:/spectra>
##$EXPNO= 1
##$NAME= <H-F>
##$PROCNO= 1
##$TYPE= <nmr>
##$USER= <she>
##$AMP= (0..31)
100 100 100 100 100 100 100 100 100 100 100 100 100 100 100 100 100 100 
100 100 100 100 100 100 100 100 100 100 100 100 100 100 
##$AQSEQ= 0
##$AQ_mod= 1
##$AUNM= <au_zg>
##$AUTOPOS= <>
##$BF1= 200.13
##$BF2= 200.13
##$BF3= 200.13
##$BF4= 200.13
##$BF5= 200.13
##$BF6= 200.13
##$BF7= 200.13
##$BF8= 200.13
##$BYTORDA= 1
##$CFDGTYP= 0
##$CFRGTYP= 5
##$CHEMSTR= <none>
##$CNST= (0..31)
1 1 145 1 1 1 1 1 1 1 1 1 1 1 1 1 1 1 1 1 1 1 1 1 1 1 1 1 1 1 1 1 
##$CPDPRG= <>
##$CPDPRG1= <>
##$CPDPRG2= <>
##$CPDPRG3= <>
##$CPDPRG4= <mlev>
##$CPDPRG5= <mlev>
##$CPDPRG6= <mlev>
##$CPDPRG7= <mlev>
##$CPDPRG8= <mlev>
##$CPDPRGB= <>
##$CPDPRGT= <>
##$D= (0..31)
0 1.2 0 0 0 0 0 0 0 0.06 0 0.03 0 0 0 0 0.0002 0 0 0 0 0 0 0 0 0 0 0 0 
0 0 0 
##$DATE= 1594188826
##$DBL= (0..7)
120 120 120 120 120 120 120 120 
##$DBP= (0..7)
150 150 150 150 150 150 150 150 
##$DBP07= 0
##$DBPNAM0= <>
##$DBPNAM1= <>
##$DBPNAM2= <>
##$DBPNAM3= <>
##$DBPNAM4= <>
##$DBPNAM5= <>
##$DBPNAM6= <>
##$DBPNAM7= <>
##$DBPOAL= (0..7)
0.5 0.5 0.5 0.5 0.5 0.5 0.5 0.5 
##$DBPOFFS= (0..7)
0 0 0 0 0 0 0 0 
##$DE= 6
##$DECBNUC= <off>
##$DECIM= 24
##$DECNUC= <off>
##$DECSTAT= 4
##$DIGMOD= 1
##$DIGTYP= 9
##$DL= (0..7)
0 120 120 120 120 120 120 120 
##$DP= (0..7)
150 150 150 150 150 150 150 150 
##$DP07= 0
##$DPNAME0= <>
##$DPNAME1= <>
##$DPNAME2= <>
##$DPNAME3= <>
##$DPNAME4= <>
##$DPNAME5= <>
##$DPNAME6= <>
##$DPNAME7= <>
##$DPOAL= (0..7)
0.5 0.5 0.5 0.5 0.5 0.5 0.5 0.5 
##$DPOFFS= (0..7)
0 0 0 0 0 0 0 0 
##$DQDMODE= 0
##$DR= 18
##$DS= 0
##$DSLIST= <SSSSSSSSSSSSSSS>
$$ [...]
##$SUBNAM2= <"">
##$SUBNAM3= <"">
##$SUBNAM4= <"">
##$SUBNAM5= <"">
##$SUBNAM6= <"">
##$SUBNAM7= <"">
##$SUBNAM8= <"">
##$SUBNAM9= <"">
##$SW= 24.9337058887773
##$SWIBOX= (0..15)
0 0 2 0 0 0 0 0 0 0 0 0 0 0 0 0 
##$SW_h= 4990.01996007984
##$TD= 16384
##$TD0= 1
##$TE= 0
##$TE2= 300
##$TE3= 300
##$TEG= 300
##$TL= (0..7)
0 120 120 120 120 120 120 120 
##$TP= (0..7)
150 150 150 150 150 150 150 150 
##$TP07= 0
##$TPNAME0= <>
##$TPNAME1= <>
##$TPNAME2= <>
##$TPNAME3= <>
##$TPNAME4= <>
##$TPNAME5= <>
##$TPNAME6= <>
##$TPNAME7= <>
##$TPOAL= (0..7)
0.5 0.5 0.5 0.5 0.5 0.5 0.5 0.5 
##$TPOFFS= (0..7)
0 0 0 0 0 0 0 0 
##$TUNHIN= 0
##$TUNHOUT= 0
##$TUNXOUT= 0
##$USERA1= <user>
##$USERA2= <user>
##$USERA3= <user>
##$USERA4= <user>
##$USERA5= <user>
##$V9= 5
##$VALIST= <valist>
##$VCLIST= <CCCCCCCCCCCCCCC>
##$VD= 0
##$VDLIST= <DDDDDDDDDDDDDDD>
##$VPLIST= <PPPPPPPPPPPPPPP>
##$VTLIST= <TTTTTTTTTTTTTTT>
##$WBST= 1024
##$WBSW= 4
##$XGAIN= (0..3)
0 0 0 0 
##$XL= 0
##$YL= 0
##$YMAX_a= 240902
##$YMIN_a= -154790
##$ZGOPTNS= <>
##$ZL1= 120
##$ZL2= 120
##$ZL3= 120
##$ZL4= 120
##$ABSF1= 10
##$ABSF2= 0
##$ABSG= 5
##$ABSL= 3
##$ALPHA= 0
##$AQORDER= 0
##$ASSFAC= 0
##$ASSFACI= 0
##$ASSFACX= 0
##$ASSWID= 0
##$AUNMP= <proc_1d>
##$AZFE= 0.1
##$AZFW= 0.1
##$BCFW= 1
##$BC_mod= 2
##$BYTORDP= 1
##$COROFFS= 0
##$CY= 11.3945322036743
##$DATMOD= 1
##$DC= 2
##$DFILT= <>
##$DTYPP= 0
##$F1P= 16.9975609425685
##$F2P= -3.02152046262296
##$FCOR= 0.5
##$FTSIZE= 0
##$FT_mod= 4
##$GAMMA= 1
##$GB= 0.15
##$INTBC= 1
##$INTSCL= 1
##$ISEN= 128
##$LB= 0.24
##$LEV0= 0
##$LPBIN= 0
##$MAXI= 10000
##$MC2= 0
##$MEAN= 0
##$ME_mod= 0
##$MI= 1.114404
##$NCOEF= 0
##$NC_proc= 0
##$NLEV= 6
##$NOISF1= 3.799351
##$NOISF2= 2.8
##$NSP= 1
##$NTH_PI= 0
##$NZP= 0
##$OFFSET= 15.70392
##$PC= 1
##$PHC0= -9784.532
##$PHC1= 3.20086
##$PH_mod= 1
##$PKNL= yes
##$PPARMOD= 0
##$PSCAL= 0
##$PSIGN= 0
##$REVERSE= no
##$SF= 200.130013532006
##$SI= 16384
##$SIGF1= 3
##$SIGF2= 2
##$SINO= 400
##$SIOLD= 16384
##$SREGLST= <1H.CDCl3>
##$SSB= 0
##$STSI= 0
##$STSR= 0
##$SW_p= 3612.71676300578
##$SYMM= 0
##$S_DEV= 0
##$TDeff= 0
##$TDoff= 0
##$TI= <>
##$TILT= no
##$TM1= 0
##$TM2= 0
##$TOPLEV= 0
##$USERP1= <user>
##$USERP2= <user>
##$USERP3= <user>
##$USERP4= <user>
##$USERP5= <user>
##$WDW= 1
##$XDIM= 8192
##$YMAX_p= 0
##$YMIN_p= 0
$$ End of Bruker specific parameters
$$ ---------------------------------
##NTUPLES= NMR FID
##VAR_NAME=  TIME,          FID/REAL,        FID/IMAG
##SYMBOL=    X,             R,               I
##VAR_TYPE=  INDEPENDENT,   DEPENDENT,       DEPENDENT
##VAR_FORM=  AFFN,          ASDF,            ASDF
##VAR_DIM=   8192,          8192,            8192
##UNITS=     SECONDS,       ARBITRARY UNITS, ARBITRARY UNITS
##FACTOR=    0.0002004,     1,               1
##FIRST=     0,             0,               0
##LAST=      1.6414764,     0,               0
##MIN=       0,             -154790,         0
##MAX=       1.6414764,     240902,          0
$$ Real data points
##PAGE= N=1
##DATA TABLE= (X++(R..R)), XYDATA
$$ [...]
$$ plain form
2393 -16 1922 -171 -2927 -2654 -196 49 -3009 -5566 -4270 -800 1467 466 -1675 -1417 714 1450
2409 1450 -1321 -4410 -4355 -1710 1425 510 -1548 -1195 2249 3048 254 -3727 -3850 -647 1434 299
2425 299 -2361 -1056 2842 4782 1256 -3066 -2742 765 1727 -1163 -3673 -1197 3985 5460 1474 -2141
2441 -2141 -1203 2032 1744 -1750 -3520 -136 4421 4770 1573 -862 1156 3590 2232 -1673 -3224 -384
2457 -384 3172 3469 1408 588 2544 4179 3106 -726 -2606 -413 2206 3245 1524 1003 2531 4588
2473 4588 3817 584 -1923 -644 2423 2790 1258 -148 1858 5247 5128 1736 -1135 -117 2689 2523
2489 2523 251 -1103 1958 6287 5762 1525 -988 1117 3927 2818 -1635 -2264 2197 6040 5390 1021
2505 1021 -17 2984 5598 2263 -2398 -2328 2079 5728 3792 720 1155 4743 5413 1482 -2518 -1192
$$ packed form
2393a6J938k093k756K73K458K45l058k557J296L470K267j001k141K58K131P36
2409A450k771l089N5K645L135r15k058L53L444P99k794l981j23L203K081j135
2425B99k660J305L898J940l526m322L24L507R62k890k510K476N182J475l986l615
2441b141R38L235k88l494j770L384M557L49l197k435K018K434j358l905j551K840
2457c84L556K97k061q20J956J635j073l832j880K193K619J039j721n21J528K057
2473D588p71l233k507J279L067L67j532j406K006L389j19l392k871J018K806j66
2489B523k272j354L061M329n25m237k513K105K810j109m453o29M461L843o50m369
2505A021j038L001K614l335m661P0M407L649j936l072M35L588O70l931m000J326
$$ plain form
2521 -1192 2549 4335 2306 82 1791 5165 5111 1564 -1148 -241 2205 3074 1218 364 1815 4645
2537 4645 5015 2290 -54 573 1629 1639 397 -381 841 3169 4484 3055 922 255 1537 1935 791
2554 791 -1046 -672 2071 4074 3304 484 24 2077 3226 680 -2431 -2158 1550 3944 2052 -767
2570 -767 -397 2802 3791 115 -3542 -2915 1724 3407 237 -2389 -408 3690 3781 -1142 -4251 -2608
2586 -2608 1433 1522 -2081 -3802 -85 3880 2747 -1893 -4061 -1194 1578 -16 -3651 -3947 -675 3028
2602 3028 1214 -2258 -2768 -650 877 -1574 -4530 -4178 -757 1340 122 -2266 -2353 -754 37 -1823
2618 -1823 -4150 -4459 -1837 -360 -732 -1957 -1988 -926 330 -1063 -3515 -4539 -3324 -1291 -1030 -2395
2634 -2395 -2941 -1258 783 -247 -3228 -4683 -2985 -839 -1573 -3899 -3586 -1057 1402 47 -3021 -4488
$$ packed form
2521a192L741J786k029k224J709L374n4l547k712R07K446Q69j856q54J451K830
2537D645L70k725k344O27J056J0j242p78J222K328J315j429k133o67J282L98j144
2554G91j837L74K743K003p70k820m60K053J149k546l111K73L708K394j892k819
2570g67L70L199R89l676l657O27M639J683l170k626J981M098R1m923l109J643
2586b608M041Q9l603j721L717L965j133m640k168K867K772j594l635k96L272L703
2602C028j814l472n10K118J527k451k956L52L421K097j218k388q7J599P91j860
2618a823k327l09K622J477l72j225l1J062J256j393k452j024J215K033K61j365
2634b395n46J683K041j030k981j455J698K146p34k326L13K529K459j355l068j467
$$ plain form
2650 -4488 -2088 -418 -1680 -4910 -4602 -908 1970 13 -3381 -3765 -864 253 -2199 -5115 -4579 -354
2666 -354 1965 -519 -3427 -2517 39 1021 -2128 -4943 -3877 -575 923 -1475 -2923 -1495 1218 1161
2682 1161 -1947 -4472 -3338 -644 270 -1790 -2566 -1054 1772 1685 -1121 -3578 -2677 -326 20 -2030
2698 -2030 -3134 -1241 1354 2248 -231 -2555 -1895 327 156 -2141 -3498 -1259 1791 2554 -37 -1888
2714 -1888 -903 1566 700 -2168 -3580 -1601 1968 2156 -457 -1558 6 2117 1316 -2178 -3797 -1157
2730 -1157 1584 1820 -691 -1323 1363 3473 1743 -1515 -2784 -243 1666 887 -956 -812 1896 3292
2746 3292 1973 -841 -1413 373 1573 613 -1042 -927 1470 3739 2407 231 -451 329 1691 1093
2762 1093 -1266 -1395 1646 3739 3135 793 20 1417 2840 1434 -716 -1187 1212 3529 2954 1010
$$ packed form
2650d488K400J670j262l230L08L694K878j957l394l84K901J117k452k916N36M225
2666c54K319k484k908R10K556R82l149k815J066L302J498k398j448J428K713n7
2682A161l108k525J134K694R14k060p76J512K826q7k806k457R01K351L46k050
2698b030j104J893K595Q94k479k324O60K222j71k297j357K239L050P63k591j851
2714a888R85K469q66k868j412J979L569J88k613j101J564K111q01l494j619K640
2730a157K741K36k511o32K686K110j730l258j269K541J909p79j843J44K708J396
2746C292j319k814n72J786J200r60j655J15K397K269j332k176o82P80J362n98
2762A093k359j29L041K093o04k342p73J397J423j406k150m71K399K317n75j944
$$ plain form
2778 1010 270 2565 4056 1835 -882 -964 1685 3559 2575 814 749 3303 4378 2147 -1065 -704 1982
2795 1982 3424 1905 176 963 4330 4956 2138 -352 -4 2539 3463 1081 -686 1224 4131 4380
2811 4380 2395 72 757 2957 2708 447 -1001 690 4005 4174 1988 329 1808 3363 2776 -22
2827 -22 -1179 641 3400 3155 1682 604 1789 3317 2543 34 -1280 103 2060 2123 788 -63 1768
2844 1768 3073 2693 285 -1323 -63 1476 1353 -227 -794 1171 2722 2132 167 -1416 -582 789
2860 789 641 -1009 -1458 335 1999 2227 408 -1491 -542 941 507 -1611 -2831 -737 1977 1753 -539
2877 -539 -1791 -449 1165 647 -2400 -3658 -954 1622 1118 -1228 -1655 -117 2201 300 -2973 -3538
2893 -3538 -1046 1258 -115 -2262 -2124 864 2080 3 -3661 -3539 -811 722 -1538 -3054 -1854
$$ packed form
2778A010p40K295J491k221k717q2K649J874r84j761o5K554J075k231l212L61K686
2795A982J442j519j729P87L367O26k818k490L48K543R24k382j767J910K907K49
2811D380j985k323O85K200k49k261j448J691L315J69k186j659J479J555n87k798
2827b2j157J820K759k45j473j078J185J528p74k509j314J383J957O3j335q51J831
2844A768J305l80k408j608J260J539j23j580n67J965J551n90j965j583Q34J371
2860G89j48j650m49J793J664K28j819j899R49J483m34k118j220K094K714k24k292
2877e39j252J342J614n18l047j258K704K576n04k346m27J538K318j901l273n65
2893c538K492K304j373k147J38K988J216k077l664J22K728J533k260j516J200
$$ plain form
2908 -1854 1124 1931 -535 -2826 -2323 -512 -470 -2399 -3736 -2188 639 1186 -535 -2234 -1716 -549
2924 -549 -526 -2583 -3574 -2221 95 278 -560 -1645 -1546 -252 -410 -1932 -3387 -2773 -1211 -320 -560 -1824
2942 -1824 -1797 91 182 -1471 -3086 -3389 -1414 0 -1179 -2422 -1695 400 946 -968 -3520 -3149 -917
2959 -917 254 -1657 -2918 -1745 1249 1396 -1263 -3522 -2149 -421 -441 -2627 -4005 -1377 1290 1214
2975 1214 -1295 -2573 -1342 464 -507 -3125 -3583 -1181 995 478 -1629 -1669 -58 702 -559 -2828
2991 -2828 -3089 -1006 364 141 -1436 -1464 59 1143 40 -1960 -2665 -1395 351 -238 -1099 -1328 443
3008 443 1619 1012 -1548 -2419 -1238 341 -29 -1595 -1598 485 2573 1308 -1170 -2010 37 1115 24
3025 24 -2096 -1682 750 2857 1744 -823 -678 1082 1847 -109 -2293 -1376 1334 2595 1098 -438
$$ packed form
2908a854K978Q07k466k291N03J811M2j929j337J548K827N47j721j699N18J167
2924e49K3k057r91J353K316J83q38j085R9J294j58j522j455O14J562Q91k40j264
2942a824K7J888R1j653j615l03J975J414j179j243P27K095N46j914k552L71K232
2959i17J171j911j261J173K994J47k659k259J373J728k0k186j378K628K667p6
2975A214k509j278J231J806r71k618m58K402K176n17k107m0J611P60j261k269
2991b828k61K083J370k23j577k8J523J084j103k000p05J270J746n89q61k29J771
3008D43J176o07k560q71J181J579l70j566lK083K088j265k478q40K047J078j091
3025B4k120M14K432K107j113k567J45J760P65j956k184R17K710J261j497j536
$$ plain form
3041 -438 456 1928 1786 27 -1486 -287 1486 1891 749 136 528 2622 2309 497 -674 -221 1346
3058 1346 1463 659 559 1384 2598 2516 1450 -206 -4 1148 1800 906 262 615 2332 3225 2156 259
3076 259 245 1774 2365 947 -615 289 2549 3612 2231 -26 311 2430 2646 171 -1175 -74 2647
3093 2647 3484 1050 -342 1037 3332 2602 -301 -1279 757 2753 2504 328 -258 1990 3669 2300
3109 2300 -234 -639 938 2255 1247 -393 138 2343 3234 1782 -506 -572 1099 1353 609 -809 -18
3126 -18 1701 2155 1491 525 -23 844 1055 650 -493 -646 652 1953 1723 597 -249 183 851 299 -539
3145 -539 -1096 -339 1438 1339 60 -157 666 1757 839 -1136 -2007 -104 1640 1006 -761 -965 1035 2365
3163 2365 747 -1723 -1943 124 1468 332 -1669 -1005 1233 2097 337 -1595 -1482 587 721 -865
$$ packed form
3041d38Q94J472j42j759j513J199J773M05j142o13L92K094l13j812j171M53J567
3058A346J17q04j00Q25J214q2j066j656K02J152O52q94o44L53J717Q93j069j897
3076B59j4J529N91j418j562R04K260J063j381k257L37K119K16k475j346J101K721
3093B647Q37k434j392J379K295p30k903r78K036J996k49k176n86K248J679j369
3109B300k534m05J577J317j008j640N31K205Q91j452k288o6J671K54p44j418P91
3126a8J719M54o64r66n48Q67K11m05j143j53J298J301k30j126q46M32O68n52q38
3145e39n57P57J777r9j279k17Q23J091r18j975q71J903J744o34j767k04K000J330
3163B365j618k470k20K067J344j136k001O64K238Q64j760j932J13K069J34j586
$$ plain form
3179 -865 -1777 -1076 1297 1639 -97 -1228 -999 542 417 -1223 -2094 -1119 582 734 -353 -1097 -721 167
3197 167 329 -1328 -2452 -1339 181 547 -542 -1377 -674 582 485 -1244 -2784 -1765 -472 246 -978
3214 -978 -1729 -985 523 630 -1399 -2579 -1858 -12 -193 -1383 -2113 -937 1229 762 -1429 -2651 -1724
3231 -1724 -136 -731 -2550 -2585 -780 639 29 -1604 -1849 -757 -88 -809 -2384 -2280 -905 171 -383
3248 -383 -1622 -1833 -538 -15 -1036 -2113 -2498 -1353 -382 -786 -1600 -1617 -792 194 -1163 -1911 -2617 -1257
3266 -1257 -301 -820 -1400 -1642 -668 468 50 -1545 -2152 -1633 -195 -307 -1847 -1943 -357 914 241 -1791
3284 -1791 -2181 -759 345 -461 -1977 -1971 179 1181 65 -1330 -1410 159 891 -636 -2317 -1529 546
3301 546 1642 193 -1180 -715 781 1348 -472 -1802 -957 836 1272 -178 -914 -135 1479 982 -427
$$ packed form
3179h65r12P01K373L42j736j131K29J541j25j640q71R75J701J52j087p44L76Q88
3197A67J62j657j124J113J520L66j089q35P03J256r7j729j540J019J293P18j224
3214i78p51P44J508J07k029j180P21J846j81j190p30J176K166m67k191j222R27
3231a724J588n95j819l5J805J419o10j633k45J092O69p21j575J04J375J076n54
3248c83j239k11J295N23j021j077l85J145R71m04q14j7Q25R86j357p48p06J360
3266a257R56n19n80k42R74J136m18j595o07N19J438j12j540r6J586J271o73k032
3284a791l90J422J104q06j516OK150J002j116j395q0J569P32j527j681P88K075
3301E46J096j449j373M65J496N67j820j330Q45J793M36j450p36P79J614m97j409
$$ plain form
3318 -427 -1473 -651 627 845 -422 -450 444 1701 1604 175 -525 -139 935 721 -73 -575 712 1623
3336 1623 1724 593 -340 421 1107 803 -436 -761 495 2077 1780 494 51 624 1528 1471 -113 -340
3354 -340 359 1460 1691 601 346 966 2032 1616 -45 -416 277 1598 1689 1032 148 1259 2185 1650
3372 1650 -26 -560 251 1608 1438 274 -75 996 2145 1779 336 -386 315 1608 1235 -170 -331
3389 -331 1058 2511 1855 74 -192 626 1899 968 -444 -855 1394 2564 1522 -80 -381 1055 1946
3406 1946 750 -1013 -669 1023 2086 896 -245 257 1553 1529 275 -857 -301 1474 1446 215 34
3423 34 580 1543 1764 221 -773 -250 75 1231 418 416 718 1565 641 -562 584 -83 242 728 -53 -618
3443 -618 143 819 1499 868 -172 -127 308 525 119 -681 -664 491 1578 1003 -123 -625 460 921 -451
$$ packed form
3318d27j046Q22J278K18j267k8Q94J257r7j429p00L86J074k14p94n02J287R11
3336A623J01j131r33P61O86l04j239l25J256J582k97j286m43N73R04n7j584k27
3354c40O99J101K31j090k55O20J066m16j661l71O93J321R1o57q84J111R26n35
3372A650j676n34Q11J357j70j164l49J071J149l66j443p22P01J293l73j405j61
3389c31J389J453o56j781k66Q18J273r31j412m11K249J170j042j602l01J436Q91
3406A946j196j763L44J692J063j190j141N02J296k4j254j132N56J775k8j231j81
3423C4N46R63K21j543r94N23L25J156q13kL02Q47r24j203J146o67L25M86p81n65
3443f18P61O76O80o31j040M5M35K17m06q00J7J155J087n75j126n02J085M61j372
$$ plain form
3462 -451 -1522 -1254 880 1433 311 -975 -325 1019 832 -483 -1933 -1089 718 1154 -131 -1310 -283
3479 -283 1101 573 -898 -1841 -507 575 318 -1205 -840 1 1313 216 -1375 -1349 -534 -25 -659 -1619
3497 -1619 -1311 -123 405 67 -1435 -1064 -403 -291 -823 -1476 -1510 -449 -149 -151 -727 -1263 -824 -75 -793 -1460
3517 -1460 -1903 -1113 -115 76 -832 -1237 -832 287 -186 -1663 -2314 -1014 160 -305 -1111 -1770 -246 408
3535 408 -441 -2151 -2118 -471 175 -892 -2063 -1401 -38 490 -740 -2069 -1491 -573 -204 -1084 -1918 -1079
3553 -1079 125 418 -732 -1601 -899 106 -284 -1204 -1737 -1029 193 16 -416 -885 -575 -71 -133 -976 -1655
3572 -1655 -761 -23 70 -508 -349 -567 -90 194 -773 -959 -986 -293 487 -195 -429 -283 421 855 -160 -1040
3592 -1040 -1152 4 330 -206 -1131 -479 1118 1315 -263 -1225 -622 899 785 -396 -1218 -116 1601
$$ packed form
3462d51j071K68K134N53j122j286O50J344j87j315j450Q44J807M36j285j179J027
3479b83J384n28j471r43J334J082k57j523L65Q41J312j097j591K6Q15N09o34r60
3497a619L08J188N28l38j502L71O61J12n32o53l4J061L00kn76n36M39P49p18o67
3517a460m43P90R98J91r08m05M05J119m73j477o51J300J174m65q06o59J524O54
3535D08q49j710L3J647O46j067j171O62J363N28j230j329N78R18L69q80q34Q39
3553a079J204K93j150q69P02J005l90r20n33P08J222j77m32m69L10N04o2q43o79
3572a655Q94P38R3n78J59k18M77K84r67j86k7O93P80o82k34J46P04M34j015q80
3592a040j12J156L26n36r25O52J597J97j578r62O03J521j14j181q22J102J717
$$ plain form
3609 1601 1066 -192 -1004 279 1051 802 -935 -1221 287 1137 1126 -131 -561 756 1283 443 -1059 -845
3627 -845 320 733 710 -310 -34 1047 1369 256 -577 -328 621 728 157 99 212 935 1187 702 38
3646 38 -54 239 498 165 111 201 651 1245 1014 306 -161 297 1052 587 -395 -341 614 1399 1244 -76 -224
3667 -224 499 1245 783 -256 -410 722 1724 1493 213 -13 867 1619 881 -688 -373 852 1536 816
3685 816 -427 135 1325 1801 774 -600 -187 1010 1219 424 -230 571 1616 1583 496 -141 -174 1303
3703 1303 975 -177 -289 631 1833 1334 414 -57 436 1051 653 39 -242 593 1040 1268 296 -168 526
3722 526 929 674 -192 -345 376 1517 899 223 -63 555 973 876 -9 -481 -345 544 883 77 11 167
3742 167 1211 733 -226 -842 -253 478 307 -209 -330 197 1401 754 -365 -670 -326 508 172 -567 -881
$$ packed form
3609A601n35j258q12J283P72k49j737k86J508Q50j1j257m30J317N27q40j502K14
3627h45J165M13k3j020K76J081L22j113q33K49R49J07n71n8J13P23K52m85o64
3646C8r2K93K59l33n4R0M50N94k31p08m67M58P55m65r82N4R55P85j55j320j48
3667b24P23P46m62j039j54J132J002k31j280k26Q80P52p38j569L15J225O84p20
3685H16j243N62J190M76j027j374M13J197K09p95o54Q01J045l3j087o37l3J477
3703A303l28j152j12R20J202m99r20m71M93O15l98o14k81Q35M47K28r72m64O94
3722E26M03k55q66j53P21J141o18o76k86O18M18r7q85m72J36Q89L39q06o6J56
3742A67J044m78r59o16N89P31j71n16j21N27J204o47j119l05L44Q34l36p39l14
$$ plain form
3761 -881 7 1028 367 -455 -555 -390 558 -40 -929 -793 -17 781 584 -488 -764 -206 284 -350 -968
3780 -968 -1007 -431 441 350 -494 -631 116 447 -361 -1441 -1280 -243 474 -454 -1209 -721 31 350 -221 -1501
3800 -1501 -1392 -356 -125 -400 -999 -777 201 157 -44 -1265 -938 -298 -7 -787 -1374 -677 232 409 -416
3819 -416 -1098 -979 -3 3 -745 -1410 -827 48 264 -445 -832 -568 -34 -356 -932 -1186 -646 -252 220 -441 -868
3840 -868 -455 251 105 -780 -1195 -809 126 -108 -864 -827 -300 353 363 -684 -1250 -672 31 -199 -865 -1146
3860 -1146 -217 416 251 -894 -907 -635 116 134 -373 -768 -116 495 252 -387 -548 -322 302 165 -990 -981
3880 -981 -130 210 319 -776 -737 -15 419 -126 -893 -819 -257 -39 401 -673 -741 -157 380 243 -708 -1056
3900 -1056 -288 391 66 -489 -148 316 775 310 -763 -799 -128 754 82 -582 -597 215 1099 198 -548 -599
$$ packed form
3761h81Q88J021o61q22j00J65R48n98q89J36P76P98j97j072k76N58M90o34o18
3780i68l9N76Q72r1q44j37P47L31q08j080J61J037P17r28p55M88P52L19n71j280
3800a501J09J036K31k75n99K22R78m4k01j221L27O40K91p80n87O97R09J77q25
3819d16o82J19R76Op48o65N83Q75K16p09l87K64N34l22n76k54N40L94M72o61m27
3840h68M13P06j46q85m15L86R35k34p56L7N27O53J0j047n66N78P03k30o66k81
3860a146R29O33j65j145j3K72P51J8n07l95O52O11k43o39j61K26O24j37j155R
3880i81Q51L40J09j095L9P22M34n45p67P4N62K18M40j074o8N84N37j37r51l48
3900a056P68O79l25n55L41M64M59m65j073l6O71Q82o72o64j5Q12Q84r01p46n1
$$ plain form
3920 -599 269 477 -219 -393 -480 806 912 163 -443 -330 600 482 229 -607 -183 757 861 228 -112 -433
3940 -433 767 624 -105 -393 102 783 839 102 -107 492 1129 838 -167 -104 222 425 591 378 40 291
3960 291 893 1105 365 8 305 510 457 342 36 276 813 1106 737 204 237 918 758 460 -136 -163 1117
3981 1117 1482 492 -87 267 1087 955 433 -395 -33 1369 1370 123 -25 566 1025 855 -85 -533 180 1150
4001 1150 762 54 -12 1001 1155 692 -491 -424 499 1031 461 -402 -188 539 1161 339 -275 -278 435 592
4021 592 127 -491 -180 728 842 362 -221 -146 58 318 -32 -364 -506 179 815 434 102 -586 258 595
4041 595 246 -343 -484 -108 435 156 12 -304 415 353 -125 -875 -861 -86 316 62 -358 -431 226 641 -27
4062 -27 -1015 -542 284 309 -295 -691 -331 488 738 23 -982 -675 60 20 -259 -855 -623 207 142 -114 -666
$$ packed form
3920e99Q68K08o96j74q7J286J06p49o06J13R30j18k53q36M24R40J04o33l40l21
3940d33J200j43p29k88M95O81N6p37k09N99O37k91j005O3L26K03J66k13l38K51
3960B91O02K12p40l57K97K05n3j15l06K40N37K93l69n33L3O81j60k98n96k7J280
3981A117L65r90n79L54Q20j32n22q28L62J402Jj247j48N91M59j70r40m48P13R70
4001A150l88p08o6J013J54m63j183O7R23N32n70q63K14P27O22q22o14lP13J57
4021E92m65o18L11R08J14m80n83P5K04K60l50l32j42O85O36l81l32o88Q44L37
4041E95l49n89j41L76N43k79j44l16P19o2m78p50J4P75M02k54m20p3O57M15o68
4062b7r88M73Q26K5o04l96L60Q19K50p15j005L07P35m0k79n96K32Q30o5k56n52
$$ plain form
4083 -666 -505 97 63 -413 -1017 -458 -65 395 -449 -412 -208 133 -43 -461 -1094 -381 -75 317 -311 -328 -585
4104 -585 -59 265 -619 -889 -543 -26 -86 -536 -743 -513 273 141 -523 -1138 -526 416 -90 -744 -987 -146
4124 -146 435 381 -576 -1298 -300 182 -416 -902 -885 -10 540 -43 -703 -447 -192 92 -422 -655 -381 47 347
4145 347 -294 -640 -603 -298 27 -542 -1031 -811 -31 33 -39 -347 -332 -198 -19 -362 -590 -928 -270 114 -512
4166 -512 -704 -614 -238 224 -295 -799 -789 -148 260 -340 -878 -481 38 318 -28 -1042 -904 232 326 167
4186 167 -800 -580 173 506 133 -487 -553 -220 287 -377 -656 -388 619 536 -240 -430 -175 412 361 -425 -802
4207 -802 -200 112 79 -135 -550 -139 665 263 -29 -506 -163 389 591 -8 -372 244 358 745 271 -175
4227 -175 -68 522 258 140 -251 362 618 759 -68 -203 316 642 604 -51 -257 106 931 737 52 -175
$$ packed form
4083f66J61O02l4m76o04N59L93M60q44L7K04L41j76m18o33P13L06L92o28j7k57
4104e85N26L24q84k70L46N17o0m50k07K30P86j32o64o15O12R42n06o54k43Q41
4124a46N81n4r57p22R98M82n98m86J7Q75N50n83o60K56K55K84n14k33K74M28L00
4145C47o41l46L7L05L25n69m89K20P80O4p2l08J5J34J79l43k28l38O58L84o26
4166e12j92R0L76M62n19n04J0O41M08o00n38L97N19K80l46j014J38J136R4j59
4186A67r67K20P53L33l73o20o6L33N07o64k79K68J007q3p76j90K55N87n1p86l77
4207h02O02L12l3k14m15M11Q04m02k92m77L43N52K02n99l64O16J14L87m74m46
4227a75J07N90k64j18l91O13K56J41q27j35N19L26l8o55k06L63Q25j94o85k27
$$ plain form
4247 -175 404 651 482 -488 -447 356 908 579 -203 129 523 781 476 -382 -81 378 844 613 140 4
4267 4 753 941 336 166 -340 228 863 309 -158 137 361 832 350 -225 102 292 722 539 95 59 827
4288 827 1000 429 34 -113 347 684 768 -107 -461 636 812 394 -106 -164 509 964 63 -731 -144 80
4308 80 743 265 -259 -172 666 843 210 -320 -282 483 375 66 -329 -49 572 576 228 -234 -425 381 135 -64
4330 -64 84 284 291 362 196 -195 78 260 149 95 -71 0 550 187 -197 -243 96 231 279 -142 -548 -169 516
4353 516 285 -210 -150 -110 478 289 -115 -479 225 85 366 19 -499 153 480 193 -402 -642 -255 168 222
4374 222 -445 -223 78 713 214 -479 -750 -268 494 -258 -446 -422 27 13 154 -655 -594 -187 112 -72 -737
4395 -737 -678 -202 385 -59 -368 -595 -159 -2 -149 -585 -436 -134 127 -92 -581 -673 67 144 -132 -761 -899
$$ packed form
4247a75N79K47j69r70M1Q03N52l29p82L32L94K58l05q58L01M59M66k31m73j36
4267DP49J88o05j70n06N68O35n54m67K95K24M71m82n75L27J90M30j83m44l6P68
4288H27J73n71l95j47M60L37Q4q75l54J097J76m18n00n8O73M55r01p94N87K24
4308H0O63m78n24Q7Q38J77o33n30L8P65j08l09l95K80O21Ml48m62j91Q06k46j99
4330f4J48K00PP1j66l91K73J82j11n4j66P1N50l63l84m6L39J35M8m21m06L79O85
4353E16k31m95O0M0N88j89m04l64P04j40K81l47n18O52L27k87n95k40L87M23N4
4374B22o67K22L01O35m99o93k71M82P62p52j88K4M49j4J41q09O1M07K99j84o65
4395g37N9M76N87m44l09k27M36J57j47m36J49L02K61k19m89r2P40P7k76o29j38
$$ plain form
4416 -899 -225 218 -39 -810 -462 -138 12 -422 -790 -435 -65 -174 -456 -771 -332 72 -45 -93 -416 -1041
4436 -1041 -207 139 -443 -982 -839 -86 -36 -459 -649 -295 -24 81 -754 -262 -460 136 4 -517 -352 -160
4456 -160 63 -249 -483 -451 -289 -367 56 -115 -322 -142 42 154 54 -388 -622 38 251 -151 -398 -269 272
4477 272 124 -213 -429 -351 152 54 -83 -427 -42 558 189 -376 -727 49 175 336 -171 -133 -302 624 357
4498 357 -329 -548 201 381 368 -53 -481 198 476 419 -185 -435 423 373 -119 -289 -349 212 196 413 -167 -161
4520 -161 405 482 432 90 -304 366 154 415 -88 408 307 523 -289 -594 55 197 617 384 -405 109 639
4541 639 660 359 -136 -157 94 512 8 -196 54 649 638 367 -248 -130 428 387 377 -245 30 548 668 146
4563 146 -247 -153 332 487 -91 -261 -5 521 348 31 -133 232 325 415 267 -166 81 523 630 167 300
$$ packed form
4416h99O74M43k57p71L48L24J50m34l68L55L70j09k82l15M39M04j17m8l23o25
4436a041Q34L46n82n39J43P53N0m23j90L54K71J05q35M92j98N96j32n21J65J92
4456a60K23l12k34L2J62p8M23j71k07J80J84J12j00m42k34O60K13m02k47J29N41
4477B72j48l37k16P8N03r8j37l44L85O00l69n65l51P76J26J61n07L8j69R26k67
4498C57o86k19P49J80j3m21m28O79K78n7o04k50Q58n0m92j70o0N61j6K17n80O
4520a61N66P7n0l42l94O70k12K61n03M96j01K16q12l05O49J42M20k33p89N14N30
4541F39K1l01m95k1K51M18n04k04K50N95j1k71o15J18N58m1j0o22K75N18J20n22
4563A46l93R4M85J55n78j70K56N26j73l17j64L65R3R0j48m33K47M42J07m63J33
$$ plain form
4584 300 -182 349 662 260 -325 -73 523 793 49 -266 91 656 648 99 -169 -164 506 492 -109 -68 41 618
4606 618 528 307 -260 381 475 557 -198 -258 139 753 529 -366 43 309 348 167 -238 26 -192 541 299 18
4628 18 41 585 638 129 -450 -509 13 580 167 -70 57 73 313 274 -184 -119 0 138 4 -150 -368 242
4650 242 488 233 -210 -154 119 88 -204 -109 -403 82 653 260 -410 -388 -153 -50 -133 -555 -591 93 29 -478
4672 -478 -712 -331 40 88 -191 -594 -312 -28 301 -391 -368 -530 -111 108 -417 -440 -305 -101 279 -450 -723
4693 -723 -413 104 282 -300 -344 -688 -178 -227 -416 -447 -290 281 272 68 -551 -684 -38 -61 -484 -805 -549 261
4715 261 221 -57 -661 -337 245 260 -264 -793 -350 333 452 -579 -415 -275 134 -18 -466 -339 -239 480
4735 480 -127 -489 -583 333 322 -202 -571 -439 -57 116 41 -381 -458 37 130 100 -203 -397 220 144 -678 -203
$$ packed form
4584C00m82N31L13m02n85K52N96K70p44l15L57N65qn49k68NO70j4o01M1J09N77
4606F18r0k21n67O41R4Q2p55o0L97O14k24q95M09K66L9j81m05K64k18P33k42k81
4628A8K3N44N3n09n79n9N22N67m13k37J27J6K40l9m58O5J19J38j34j54k18O10
4650B42K46k55m43N6K73l1k92R5k94M85N71l93o70K2K35J03q3m22l6O84o4n07
4672d78k34L81L71M8k79m03K82K84L29o92K3j62M19K19n25k3J35K04L80p29k73
4693g23L10N17J78n82m4l44N10m9j89l1J57N71rk04o19j33O46k3m23l21K56Q10
4715B61m0k78o04L24N82J5n24n29M43O83J19j031J64J40M09j52m48J27J00P19
4735D80o07l62r4R16j1n24l69J32L82J73p5m22p7M95R3l0l03j94O17p6q22M75
$$ plain form
4757 -203 -297 22 91 163 -19 -380 -274 277 -19 -229 -197 -67 254 273 -275 -156 -204 277 319 -344 -554 81
4779 81 60 372 -363 -611 -176 231 113 -369 -510 -164 448 165 -244 -110 267 205 -239 -487 -187 421 412 27
4801 27 -326 -196 632 405 -134 -369 28 411 254 87 -556 -42 344 176 124 -522 6 409 110 -259 -483
4822 -483 85 212 323 387 -399 -89 546 489 48 28 -1 250 222 299 -152 -19 335 262 254 -78 -127 354 399 95
4846 95 -143 258 415 513 -199 -190 82 396 556 -269 -276 291 680 477 -380 -238 -139 512 -112 -525 -157 473
4868 473 358 363 -37 -234 149 281 562 79 316 430 499 546 63 38 443 284 233 99 -168 326 630 391
4890 391 141 186 118 247 372 6 -341 301 389 318 -137 -317 -94 536 484 -198 -228 130 306 370 44 -135
4912 -135 325 387 279 115 -245 122 407 -186 -503 -287 231 167 -160 -343 -55 101 153 -298 -346 -143 130
$$ packed form
4757b03r4L19O9P2j82l61J06N51k96k10L2J30L21J9n48J19m8M81M2o63k10O35
4779H1k1L12p35k48M35M07j18m82j41L46O12k83m09J34L77o2m44k48L00O08rl85
4801B7l53J30Q28k27n39k35L97L83j57j67o43N14L86j68n2o46N28M03k99l69k24
4822d83N68J27J11O4p86L10O35n7m41k0k9K51k8P7m51J33L54p3ql32m9M81M5l04
4846I5k38M01J57R8p12RK72L14J60q25pN67L89k03q57J42R9O51o24m13L68O30
4868D73j15Nm00j97L83J32K81m83K37J14O9M7m83k5M05j59n1j34k67M94L04k39
4890C91k50M5o8J29J25l66l47O42Q8p1m55j80K23O30n2o82l0L58J76O4l26j79
4912a35M60O2j08j64l60L67K85n93l17K16N18o4l27j83K88J56N2m51m8K03K73
$$ plain form
4933 130 420 -109 -138 1 -2 254 -306 -427 -301 -142 -236 -59 -170 54 157 196 -61 -123 -37 -6 19 -413 -325
4956 -325 88 134 221 -193 -158 -59 126 365 -345 -276 71 34 18 -180 -534 -264 190 228 -80 -567 -240 382 357
4979 357 -322 -685 46 447 -118 -350 -391 -527 428 -260 -222 -237 -187 -8 -398 -315 -505 154 199 -147 -264 -76
5001 -76 -94 50 -62 -49 -549 -242 -182 270 108 -387 -157 99 189 49 -364 -4 414 233 -291 -357 -252 237
5023 237 72 -126 -262 294 165 -33 -190 -408 89 391 235 -374 -274 -63 538 -225 -321 -466 64 108 -42
5044 -42 -420 -404 174 -115 -579 -591 -237 317 101 -94 -333 79 557 -114 -186 -216 265 -33 -7 -331 -419 34
5066 34 -129 75 -129 -69 -27 -118 159 79 120 94 21 154 187 -146 -362 -144 128 -259 -410 -248 235 268 229 -314
5090 -314 -328 70 219 -121 -592 3 458 177 -284 -15 141 355 255 -198 -64 -131 640 382 -60 -88 204
$$ packed form
4933A30K90n29k9J39lK56n60j21J26J59r4J77j11K24J03L9k57o2Q6L1K5m32Q8
4956c25M13M6Q7m14L5R9J85K39p10O9L47l7j6j98l54K70M54L8l08m87L27O22k5
4979C57o79l63P31M01n65k32m1j36R55o88L8j5N0J79l90Q3j90O59M5l46j17J88
5001g6j8J44j12J3n00L07O0M52j62m95K30K56R0j40m13L60M18j81n24o6J05M89
5023B37j65j98j36N56j29j98j57k18M97L02j56o09J00K11O01p63r6j45N30M4j50
5044d2l78J6N78k89m64j2L54N54k16j95k39M12M78o71p2l0M81k98K6l24q8M53
5066C4j63K04k04O0M2r1K77q0M1k6p3J33L3l33k16K18K72l87j51J62M83L3l9n43
5090c14j4L98J49l40m71N95M55k81m61K69J56K14j00m53J34o7P71k58m42k8K92
$$ plain form
5111 204 518 231 -198 -384 444 212 85 62 -17 349 379 149 -50 -63 -56 256 44 62 223 110 35 3 98
5134 98 107 -34 184 242 43 -210 -79 306 128 80 155 119 436 134 47 -260 224 226 406 86 -210 147 348
5157 348 113 -42 60 9 500 -55 63 -492 362 4 243 -171 -266 -46 25 69 -391 53 371 398 110 -58
5179 -58 103 127 131 244 -54 -88 15 23 214 -242 -76 -108 -105 113 -299 -4 231 185 211 159 -209 82 252 127
5203 127 -13 -86 277 106 267 -186 -211 258 390 112 -131 69 342 393 -47 -276 -162 315 292 -269 -503
5224 -503 -379 90 86 -419 -250 -102 168 2 -70 -115 243 624 154 -258 -221 137 209 -20 -136 -11 -4 269 -92
5247 -92 -289 298 -26 78 -146 378 -394 68 127 102 -135 -370 67 356 59 -194 59 111 -57 -100 -123 -211
5269 -211 -128 307 155 -256 -181 -104 213 -158 -280 -244 -135 -19 26 -302 120 200 286 -19 -260 -43 6 317 92
$$ packed form
5111B04L14k87m29j86Q28k32j27k3p9L66L0k30j99j3PL12k12J8J61j13p5l2R5
5134I8Rj41K18N8j99k53J31L85j78m8P5l6L17l02q7l07M84KJ80l20k96L57K01
5157C48k35j55J02n1M91n55J18n55Q54l58K39m14r5K20P1M4m60M44L18K7k88j68
5179e8J61K4MJ13k98l4J03QJ91m56J66l2LK18m12K95K35m6K6n2l68K91J70j25
5203A27j40p3L63j71J61m53k5M69J32k78k43K00K73N1m40k29J14M77k3n61k34
5224e03J24M69mn05J69J48K70j66p2m5L58L81m70m12L7L58P2k29j16J25PK73l61
5247i2j97N87l24J04k24N24p72M62N9k5k37k35M37K89k97k53K53N2j68m3k3q8
5269b11Q3M35j52m11P5P7L17l71j22L6J09J16M5l28M22Q0Q6l05k41K17M9L11k25
$$ plain form
5292 92 -468 0 46 239 76 -209 -58 100 260 -151 -263 -430 139 193 -103 -248 34 145 -41 -157 -353
5313 -353 -384 -75 -36 4 -200 -324 140 32 -87 -306 -232 161 -26 -394 -301 -430 420 168 66 -430 -163 -57
5335 -57 -52 -85 59 -34 408 172 -239 -311 -84 330 -30 -289 -585 95 301 -137 -248 -269 154 66 4 -310 -179
5358 -179 148 23 -28 -206 -41 -109 -20 -179 -116 -383 502 92 138 24 -136 -192 -196 -267 -228 -133 164 110 -173 -199
5382 -199 7 120 301 133 41 -45 -174 17 -6 111 -198 187 192 72 5 -239 35 426 -6 85 -185 -217 22
5405 22 173 -199 -215 329 710 205 -506 79 106 474 51 27 -132 89 376 -225 -308 -27 342 611 162 -177
5427 -177 -35 -87 79 96 -89 -71 72 -77 -105 85 5 548 88 47 2 121 40 -14 143 243 134 248 208
5450 208 154 66 -61 49 274 -73 -48 -173 19 251 287 -16 198 336 157 -79 259 57 367 18 37 -33
$$ packed form
5292I2n60M68M6J93j63k85J51J58J60m11j12j67N69N4k96j45K82J11j86j16j96
5313c53l1L09L9M0k04j24M64j08j19k19P4L93j87l68R3j29Q50k52j02m96K67J06
5335e7Nl3J44r3M42k36m11p2K27M14l60k59k96O80K06m38j11k1M23q8o2l14J31
5358a79L27j25n1j78J65o8Q9j59O3k67Q85m10M6j14j60n6mp1L9R5K97n4k83k6
5382a99K06J13J81j68r2q6j29J91k3J17l09L85Nj20o7k44K74L91m32R1k70l2K39
5405B2J51l72j6N44L81n05p11N85K7L68m23k4j59K21K87o01q3K81L69K69m49l39
5427a77J42n2J66J7j85J8J43j49k8J90q0N43m60m1m5J19q1n4J57J00j09J14m0
5450B08n4q8j27J10K25l47K5j25J92K32L6l03K14J38j79k36L38k02L10l49J9p0
$$ plain form
5472 -33 -141 400 475 -1 -408 -130 169 146 -124 -298 -26 427 235 -134 -261 18 156 -134 -128 -151 435 201
5494 201 155 126 93 31 160 -22 -458 61 138 68 357 -17 -4 14 103 186 -355 30 -23 93 223 -88 -251 -88
5518 -88 -154 -135 61 -339 -218 185 7 -136 -73 180 310 44 -127 100 24 372 90 -259 -73 471 338 334
5540 334 -464 -92 136 6 93 -113 109 264 192 -32 -300 -23 -128 272 -207 -172 -279 130 52 -398 -92
5561 -92 100 24 24 79 -303 52 313 354 63 124 -86 -81 169 -292 -472 -171 86 166 142 -171 66 -43 175 -116
5585 -116 -608 -228 143 -52 -241 -106 -45 -157 14 3 -23 -330 -175 223 -521 -184 -165 280 316 -144 -101 2
5607 2 126 -14 -118 -277 -113 -38 144 -142 -456 -53 -39 -25 -180 -362 15 156 175 -133 -129 15 104 -199 -403
5630 -403 -257 35 293 77 30 82 360 83 249 -373 -229 -4 -116 348 -2 119 -66 24 -120 -80 -217
$$ packed form
5472c3j08N41P5m76m07K78K99k3k70j74K72M53j92l69j27K79J38k90Ok3N86k34
5494B01m6k9l3o2J29j82m36N19P7p0K89l74J3J8Q9Q3n41L85n3J16J30l11j63J63
5518h8o6J9J96m00J21M03j78j43O3K53J30k66j71K27p6L48k82l49J86N44j33m
5540C34p98L72K28j30Q7k06K22J55p2k24k68K77j05M00m79L5j07M09p8m50L06
5561i2J92p6%N5l82L55K61M1k91O1k10NK50m61j80L01K57Q0k4l13K37j09K18k91
5585a16m92L80L71j95j89J35O1j12J71j1k6l07J55L98p44L37J9M45L6m60M3J03
5607BJ24j40j04j59J64P5J82k86l14M03J4J4j55j82L77J41J9l08MJ44Q9l03k04
5630d03J46K92K58k16m7N2K78k77J66o22J44K25j12M64l50J21j85R0j44M0j37
$$ plain form
5651 -217 161 176 -83 -248 -77 195 128 -65 -158 -204 123 74 -142 -251 174 -15 -75 -281 -17 -261 -50 167
5673 167 285 -82 232 134 36 10 -198 -17 253 234 -143 -22 -93 165 386 -24 -297 373 343 -6 -85 -261
5695 -261 15 -4 92 119 -197 -76 356 -5 -125 -118 -3 85 148 -263 -401 271 -22 126 -177 -238 99 326 209
5718 209 -113 -243 64 129 -75 342 97 12 159 275 -301 -319 308 273 67 -57 -171 161 357 198 -79
5739 -79 -188 34 -41 -30 -40 42 253 147 291 -168 -48 81 331 208 -193 -197 536 287 5 83 -152 11 172
5762 172 254 -251 -370 459 353 63 -120 -167 109 205 136 -229 -43 258 396 87 -110 -216 424 101 -172
5783 -172 -400 -62 142 215 176 169 4 22 -104 -346 164 -210 63 197 -316 59 102 94 43 59 -171 -27 121
5806 121 97 4 -205 -2 328 369 -135 157 -87 -9 114 -63 -203 -190 160 212 -154 -378 -57 111 111 -385 -419
$$ packed form
5651b17L78J5k59j65J71K72o7j93r3m6L27m9k16j09M25j89o0k06K64k44K11K17
5673A67J18l67L14r8r8k6k08J81K70j9l77J21p1K58K21m10k73O70l0l49p9j76
5695b61K76j9R6K7l16J21M32l61j20PJ15Q8O3m11j38O72k93J48l03o1L37K27j17
5718B09l22j30L07O5k04M17k45q5J47J16n76j8O27l5k06j24j14L32J96j59k77
5739g9j09K22p5J1j0Q2K11j06J44m59J20J29K50j23m01mP33k49k82P8k35J63J61
5762A72Q2n05j19Q29j06k90j83m7K76R6o9l65J86L01J38l09j97j06O40l23k73
5783a72k28L38K04P3l9pj65J8j26k42N10l74K73J34n13L75M3qn1J6k30J44J48
5806A21k4r3k09K03L30M1n04K92k44P8J23j77j40J3L50N2l66k24L21J68%m96l4
$$ plain form
5829 -419 -75 140 90 -337 -335 416 371 84 -538 -109 -29 112 -2 -176 198 -74 143 -57 192 219 166 -238
5851 -238 12 -180 -279 99 337 -53 -102 -256 -170 310 -142 -105 -231 29 6 -48 -149 -73 66 -118 91 64 -290
5874 -290 -115 202 19 -160 47 61 -169 8 -100 -251 279 213 -102 -118 -71 -145 303 -165 -160 -13 24 281 22
5897 22 -149 -177 8 120 113 -204 -499 -178 456 -210 -227 162 29 218 12 -146 -47 178 318 -127 -63 97
5919 97 259 -26 281 -109 -132 149 478 -36 -227 -160 119 257 -313 4 83 336 -310 58 -210 20 163
5940 163 212 -317 -237 -76 78 206 -82 -130 242 -12 -313 -338 -431 80 40 41 -139 -248 47 173 -34 -98 -46
5963 -46 197 234 177 64 -220 -171 216 213 96 -375 52 208 125 430 142 -37 -190 9 26 -44 85 373 90
5986 90 -28 15 83 231 277 -579 -14 4 188 93 -217 173 110 197 109 -73 -140 51 114 -143 -420 107 50 298
$$ packed form
5829d19L44K15n0m27KP51m5k87o22M29Q0J41j14j74L74k72K17k00K49K7n3m04
5851b38K50j92r9L78K38l90m9j54Q6M80m52L7j26K60k3n4j01P6J39j84K09k7l54
5874b90J75L17j83j79K07J4k30J77j08j51N30o6l15j6M7p4M48m68NJ47L7K57k59
5897B2j71k8J85J12pl17k95L21O34o66j7L89j33J89k06j58R9K25J40m45O4J60
5919I7J62k85L07l90k3K81L29n14j91O7K79J38n70L17P9K53o46L68k68K30J43
5940A63M9n29Q0J61J54J28k88m8L72k54l01k5r3N11m0Jj80j09K95J26k07o4N2
5963d6K43L7n7j13k84M9L87lj17m71M27J56q3L05k88j79j53J99J7p0J29K88k83
5986I0j18M3O8J48M6q56N65J8J84r5l10L90o3Q7q8j82o7J91O3k57k77N27n7K48
$$ plain form
6010 298 -342 -199 -201 146 267 -229 -213 -37 141 -65 144 -80 -128 130 -174 -51 36 242 189 152 137 -415 -135
6033 -135 455 -27 89 -233 336 484 245 342 -166 -113 -6 349 102 -66 -288 88 -53 276 -52 109 265
6054 265 47 -31 -32 151 239 -94 -27 -360 64 166 -42 -282 346 -305 106 79 -343 -348 74 -159 409 -77 -56
6077 -56 12 14 -5 -280 -10 263 -237 -43 -90 -257 110 -58 -42 -140 139 -248 -61 186 -314 -80 -62 188 75
6100 75 -51 26 -36 58 12 23 -99 -20 96 99 58 4 94 33 27 -99 -163 -241 -366 -151 -471 -193 -105 -120 248 43
6126 43 86 -68 189 -3 25 -157 -55 152 -57 -85 19 128 -87 11 -273 -167 21 -67 -320 -274 118 210 266
6149 266 45 -9 -338 141 292 -12 -76 124 9 -104 -354 -211 -10 -176 -26 27 -194 -87 398 -76 149
6170 149 48 -132 -123 464 -143 -223 -73 -52 145 198 21 84 -339 333 -66 -105 44 48 224 -107 -11 42 362 223
$$ packed form
6010B98o40J43kL47J21m96J6J76J78k06K09k24m8K58l04J23Q7K06n3l7j5n52K80
6033a35N90m82J16l22N69J48k39R7n08N3J07L55k47j68k22L76j41L29l28J61J56
6054B65k18p8jJ83Q8l33O7l33M24J02k08k40O28o51M11k7m22nM22k33N68m86K1
6077e6O8Kj9k75K70K73n00J94m7j67L67j68J6r8K79l87J87K47n00K34J8K50j13
6100G5j26P7o2R4m6J1j22P9J16Lm1n4R0o1oj26o4p8j25K15l20K78Q8j5L68k05
6126D3M3j54K57j92K8j82J02K07k09k8J04J09k15R8k84J06J88q8k53M6L92R2N6
6149B66k21n4l29M79J51l04o4K00j15j13k50J43K01j66J50N3k21J07M85m74K25
6170A49j01j80RN87o07q0J50K1J97N3j77O3m23O72l99l9J49MJ76l31R6N3L20j39
$$ plain form
6194 223 -192 -101 -159 107 -70 -200 264 -92 -79 268 -155 -195 105 205 11 -170 -184 -81 136 -118 -264 177
6216 177 215 -38 -133 -109 -268 49 -61 -303 -277 -179 -375 127 -62 -86 -53 62 62 230 -56 -345 392 34 26 14
6240 14 97 -175 106 -48 -228 -119 313 -78 72 -66 -105 217 56 -342 -103 -95 -65 -115 -78 111 -92 84 258
6263 258 126 89 -126 -413 372 -112 9 12 48 198 63 -352 65 12 217 108 83 -26 251 302 -338 83
6285 83 -203 306 79 93 -327 123 -23 381 247 -15 17 389 293 408 -235 -119 -104 169 130 -109 269 125
6307 125 237 55 26 31 -72 195 100 -152 42 219 -159 -168 -319 54 173 53 -258 -322 207 132 -265 -297 122
6330 122 -42 -178 16 -16 -147 312 253 36 65 310 8 4 -129 -163 -143 -125 121 110 -51 -56 159 241 185 17
6354 17 -103 -61 161 210 -96 120 -166 100 63 -120 -185 -273 105 217 -24 -97 64 -205 -91 -37 -96 295 -13
$$ packed form
6194B23m15R1n8K66j77j30M64l56J3L47m23m0L00J00j94j81j4J03K17k54j46M41
6216A77L8k53r5K4j59L17j10k42K6R8j96N02j89k4L3J15%J68k86k89P37l58qj2
6240A4Q3k72K81j54j80J09M32l91J50j38l9L22j61l98K39QL0n0L7J89k03J76J74
6263B58j32l7k15k87P85m84J21LL6J50j35m15M17n3K05j09k5j09K77N1o40M21
6285H3k86N09k27J4m20M50j46M04j34k62L2L72r6J15o43J16J5K73l9k39L78j44
6307A25J12j82k9Nj03K67r5k52J94J77l78rj51L73J19j20l11o4N29p5l97l2M19
6330A22j64j36J94l2j31M59n9k17K9K45l02mj33l4K0J8K46j1j61nK15Q2n6j68
6354A7j20M2K22M9l06K16k86K66l7j83o5q8L78J12k41p3J61k69J14N4n9L91l08
$$ plain form
6377 -13 168 279 75 -104 336 -208 227 -163 136 272 -40 146 9 244 -130 -185 -80 -288 190 28 -184
6398 -184 17 -37 249 -29 -48 188 33 -269 -124 -68 25 184 209 68 279 122 -146 42 390 -68 -309 108
6420 108 100 0 -5 -299 -146 260 -95 -202 0 -178 83 56 -85 -168 -133 -38 178 26 4 -140 450 91 -114
6443 -114 -208 -7 313 94 -257 73 -111 103 246 -192 3 119 366 43 -241 -92 24 225 57 143 -80
6464 -80 -164 238 360 118 -175 -141 -412 -151 -197 -150 -36 -26 -162 -167 -180 -25 10 164 -91 98 366 -344 173
6487 173 -107 123 -32 53 -14 455 163 -161 -202 153 -464 -207 105 -41 -179 -183 -196 74 316 3 -143 -273
6509 -273 229 -156 170 137 82 18 186 -199 182 -4 -238 289 69 265 -122 8 353 95 111 68 144 463
6531 463 76 -33 -55 63 392 -36 58 -42 302 1 15 30 107 296 132 241 -173 -163 67 -119 87 -257
$$ packed form
6377a3J81J11k04j79M40n44M35l90K99J36l12J86j37K35l74n5J05k08M78j62k12
6398a84K01n4K86k78j9K36j55l02J45N6R3J59K5j41K11j57k68J88L48m58k41M17
6420A08qj00nk94J53M06l55j07K02j78K61k7j41q3L5R5K16j52k2j44N90l59k05
6443a14r4K01L20k19l51L30j84K14J43m38J95J16K47l23k84J49J16K01j68Q6k23
6464h0q4M02J22k42k93L4k71K61m6M7J14J0j36nj3J55L5J54k55J89K68p10N17
6487A73k80K30j55Q5o7M69k92l24m1L55o17K57L12j46j38mj3K70K42l13j46j30
6509b73N02l85L26l3n5o4J68l85L81j86k34N27k20J96l87J30L45k58J6m3P6L19
6531D63l87j09k2J18L29m28R4j00L44l01J4J5P7J89j64J09m14J0K30j86K06l44
$$ plain form
6553 -257 121 42 -86 -11 20 -366 13 221 122 -47 63 -49 14 106 390 161 521 -97 110 -96 76 -144
6575 -144 280 143 -181 225 131 276 20 9 -159 227 119 -52 118 224 -430 50 -41 -95 116 -124 31
6596 31 -100 -81 -30 231 227 -23 -377 -35 355 25 -28 -166 -61 21 326 -361 -197 -229 -61 -183 223 -108 205
6619 205 80 -47 -234 -209 -132 -88 287 -34 -78 108 216 -55 -26 216 -16 -169 228 -220 -90 82 128 151
6641 151 -64 9 56 -33 92 -42 -79 215 314 -48 88 51 -124 27 -378 -87 -97 141 119 -263 51 -15 210
6664 210 47 -97 -9 286 43 -239 -133 -36 -173 -49 12 -229 113 91 318 97 -65 -131 -41 218 -3 -34
6686 -34 -27 358 96 308 78 -84 232 59 26 88 -151 9 44 -232 191 -148 166 -170 -24 -1 -278 -128
6708 -128 56 185 -228 -179 -82 30 -4 -119 -155 45 -3 175 -242 -197 -97 180 -187 -235 -248 162 95 -160 -70
$$ packed form
6553b57L78p9j28P5L1l86L79K08r9j69J10j12O3R2K84k29L60o18K07k06J72k20
6575a44M24j37l24M06r4J45k56j1j68L86j08j71J70J06o54M80r1n4K11k40J55
6596C1j31J9N1K61mk50l54L42L90l30n3j38J05Q2L05o87J64l2J68j22M06l31L13
6619B05j25j27j87K5P7M4L75l21m4J86J08k71K9K42k32j53L97m48J30J72M6K3
6641A51k15P3M7q9J25j34l7K94R9l62J36l7j75J51m05K91j0K38k2l82L14o6K25
6664B10j63j44Q8K95k43k82J06R7j37J24O1k41L42k2K27k21j62o6R0K59k21l1
6686c4PL85k62K12k30j62L16j73l3O2k39J60L5k76M23l39L14l36J46K3k77J50
6708a28J84J29m13M9R7J12l4j15l6K00m8J78m17M5J00K77l67m8j3M10o7k55R0
$$ plain form
6731 -70 -224 189 262 -255 -603 -237 -4 -111 12 -24 -49 67 -48 139 265 -247 87 -222 -79 -130 102 34
6753 34 250 152 109 -16 -313 56 117 41 -107 301 -330 -74 -314 305 -77 -221 -2 7 -328 76 -71 13 -209
6776 -209 -168 119 -87 -62 -403 55 -165 -108 -472 -78 -11 -359 183 -92 -211 8 227 -10 -79 -328 35 162
6798 162 203 -186 155 15 0 176 -304 -231 -61 50 -118 103 98 -199 114 95 162 17 125 266 32 -70
6820 -70 -162 50 206 -186 39 -26 -39 155 222 171 -30 -79 -136 -169 104 42 32 316 117 -61 -9 65 -6 -1 203
6845 203 29 184 133 -225 -51 65 426 166 -227 171 181 25 33 0 38 -57 105 50 -7 218 123 313 -206
6868 -206 -22 234 29 -94 44 113 314 125 -73 289 -306 266 -95 -440 72 137 106 -391 -43 -88 96
6889 96 189 71 -72 482 122 31 -45 162 192 -64 -368 9 54 -31 8 -99 -15 6 243 -180 -3 -122 337
$$ packed form
6731g0j54M13P3n17l48L66K33j07J23l6k5J16j15J87J26n12L34l09J43n1K32o8
6753C4K16r8m3j25k97L69O1p6j48M08o31K56k40O19l82j44K19Rl35M04j47Q4k22
6776b09M1K87k06K5l41M58k20N7l64L94O7l48N42k75j19K19K19k37o9k49L63J27
6798A62M1l89L41j40j5J76m80P3J70J11j68K21nk97L13j9O7j45J08J41k34j02
6820g0r2K12J56l92K25o5j3J94O7n1k01m9n7l3K73o2j0K84j99j78N2P4p1NK04
6845B03j74J55n1l58J74J16L61k60l93L98J0j56Ql3L8r5J62n5n7K25r5J90n19
6868b06J84K56k05j23J38O9K01j89j98L62n95N72l61l45N12O5l1m97L48m5J84
6889I6R3j18j43N54l60r1p6K07L0k56l04L77M5q5L9j07Q4K1K37m23J77j19M59
$$ plain form
6912 337 -47 -254 74 -14 329 -46 -112 -158 88 179 236 -237 -163 149 146 152 2 310 -208 4 -15 84 -77 -21
6936 -21 258 -175 -228 -147 74 307 231 64 -222 85 91 135 -74 171 12 185 -59 -421 -59 -15 -223 -112 22
6959 22 -346 141 213 -281 -99 2 -11 71 93 -121 35 308 270 25 5 15 -39 75 -215 -116 -166 266 127 131
6983 131 -7 -106 -31 -16 82 -103 35 152 305 236 443 -30 -212 -167 -107 56 -107 -194 307 -231 96 -105 -117
7006 -117 111 39 1 -192 -126 -137 191 -151 -70 63 30 -159 -31 62 -21 214 74 -230 14 61 349 -182 -474
7029 -474 -37 271 20 -68 -118 -71 142 176 -395 -45 -133 27 33 -279 194 298 120 -112 -80 -18 -182 -101 -218
7052 -218 76 -50 -40 14 -190 -12 178 -51 120 -199 -93 -75 34 -60 70 -139 -373 -77 -90 173 37 39
7074 39 -68 -43 108 -296 126 -92 196 107 -211 -168 123 174 -57 -217 -236 23 191 -125 162 3 186 64
$$ packed form
6912C37l84k07L28q8L43l75o6m6K46R1N7m73P4L12lOj50L08n18K12j9R9j61N6
6936b1K79m33n3Q1K21K33p6j67k86L07OM4k09K45j59J73k44l62L62M4k08J11J34
6959B2l68M87P2m94J82J01j3Q2K2k14J56K73l8k45k0J0n4J14k90R9n0M32j39M
6983A31j38r9P5J5R8j85J38J17J53o9K07m73j82M5O0J63j63q7N01n38L27k01j2
7006a17K28p2l8j93O6j1L28l42Q1J33l3j89J28R3q3K35j40l04K44M7K88n31k92
7029d74M37L08k51q8n0M7K13L4n71L50q8J60Ol12M73J04j78k32L2O2j64Q1j17
7052b18K94j26J0N4k04J78J90k29J71l19J06J8J09r4J30k09k34K96j3K63j36K
7074C9j07K5J51m04M22k18K88q9l18M3K91N1k31j60j9K59J68l16K87j59J83j22
$$ plain form
7096 64 59 186 -17 92 -12 38 -19 13 70 209 -3 -149 -78 -41 77 -80 161 127 79 118 -161 -76 -157 -72 49
7121 49 -222 10 62 118 265 -88 223 147 389 86 98 -8 -52 -6 129 368 7 -100 158 -54 -17 82 192
7144 192 31 384 -132 -283 -106 -204 49 265 -228 -116 202 -37 -64 19 -18 21 86 -57 -267 108 82 365
7166 365 64 -205 180 121 174 -426 -134 201 268 73 -103 205 126 -137 31 -120 121 49 97 97 194 -22 120
7189 120 -82 45 164 -157 -212 -34 20 1 128 42 149 -164 123 -110 -162 89 65 21 -365 -125 -24 -112 -63
7212 -63 -73 41 26 49 100 50 -42 -152 129 -22 216 -255 97 300 -168 89 224 538 30 -345 100 72 167
7235 167 91 28 126 -62 99 -118 -48 32 54 350 108 56 -329 -106 157 -144 -86 18 201 -290 317 -107 99
7258 99 -25 195 -116 252 51 79 226 57 -301 -98 -7 49 125 161 -175 178 -133 -114 -74 117 64 43 -36 -133
$$ packed form
7096F4nJ27k03J09j04N0n7L2N7J39k12j46P1L7J18j57K41l4m8L9k79Q5q1Q5J21
7121D9k71K32N2N6J47l53L11p6K42l03J2j06m4M6J35K39l61j07K58k12L7R9J10
7144A92j61L53n16j51J77r8K53K16m93J12L18k39k7Q3l7L9O5j43k10L75k6K83
7166C65l01k69L85n9N3o00K92L35O7j95j76L08p9k63J68j51K41p2M8%R7k16J42
7189A20k02J27J19l21n5J78N4j9J27q6J07l13K87k33n2K51k4m4l86K40J01q8M9
7212f3j0J14j5K3N1n0r2j10K81j51K38m71L52K03m68K57J35L14n08l75M45k8R5
7235A67p6o3R8j88J61k17P0Q0K2K96k42n2l85K23K63l01N8J04J83m91O07m24K06
7258I9j24K20l11L68k01K8J47j69l58K03R1N6P6L6l36L53l11J9M0J91n3k1p9r7
$$ plain form
7282 -133 -17 -34 -12 -74 -418 -47 -54 -164 -119 -230 341 -87 119 -136 20 210 77 146 -58 77 394 418 15
7305 15 -315 11 78 8 -133 -249 -1 -279 -141 -18 -48 -93 -119 -49 229 -316 303 138 407 85 -200 -151 118
7328 118 36 -258 -238 80 -73 -38 203 -260 5 -25 -191 284 249 -74 52 159 119 -101 53 -5 227 160 50
7351 50 145 311 210 159 -148 -173 175 12 101 48 139 -62 119 37 -247 126 196 11 27 -69 -115 42 117 -135
7375 -135 -162 63 -264 -69 -105 -200 -147 -216 138 -20 111 -102 11 240 -179 -11 -125 138 208 284 -76 47
7397 47 111 -364 65 -95 181 149 121 32 162 176 73 103 -98 -194 -147 -313 37 -291 45 97 -102 22 -72 195
7421 195 4 239 159 174 5 -127 -36 -193 -3 350 -147 63 244 11 154 261 -228 -47 -64 86 171 -3
7443 -3 11 29 63 249 26 149 -302 -59 -69 172 208 129 30 -115 -69 226 -126 215 109 59 -20 -141 204 55
$$ packed form
7282a33J16j7K2o2l44L71pj10M5j11N71m28K06k55J56J90j33O9k04J35L17K4m03
7305A5l30L26O7p0j41j16K48k78J38J23l0m5k6P0K78n45O19j65K69l22k85M9K69
7328A18q2k94K0L18j53L5K41m63K65l0j66M75l5l23J26J07m0k20J54n8K32o7j10
7351E0R5J66j01n1l07k5L48j63Q9n3R1k01J81q2k84L73P0j85J6r6m6J57P5k52
7375a35k7K25l27J95l6r5N3o9L54j58J31k13J13K29m19J68j14K63P0P6l60J23
7397D7O4m75M29j60K76l2k8q9J30J4j03L0k01r6M7j66L50l28L36N2j99J24r4K67
7421A95j91K35q0J5j69j32R1j57J90L53m97K10J81k33J43J07m89J81j7J50Q5j74
7443cJ4J8L4J86k23J23m51K43j0K41L6p9r9j45M6K95l52L41j06n0p9j21L45j49
$$ plain form
7467 55 22 -165 -89 -305 -10 77 -1 84 18 49 -15 159 -436 -34 -81 104 69 -23 -7 71 250 53 1 106 -140
7492 -140 -75 -234 -337 272 131 94 333 -84 36 247 72 -190 -247 -205 16 130 -148 -111 -38 418 203 132
7514 132 -63 128 166 -164 126 -316 -442 -139 77 112 -64 -205 256 122 238 -104 102 -122 -65 -72 -235 341
7536 341 333 -87 118 4 649 -8 278 -517 562 -27 -277 177 -109 3 81 102 -32 18 -59 103 75 213
7558 213 69 -124 48 112 10 111 -112 -241 38 -61 34 -49 -190 126 -121 116 111 323 186 79 -106 15
7580 15 -34 -52 12 -175 -264 279 50 -56 45 -76 28 -249 -134 -309 -79 267 38 26 -191 53 301 -13
7602 -13 21 141 4 111 16 26 129 107 11 -110 14 -229 -98 -140 106 -88 -100 173 -52 -88 -71 -24 -8 -106
7626 -106 23 -45 184 325 24 170 -188 -60 -147 -19 11 -14 -282 -251 206 -10 -267 -198 -71 55 9 207
$$ packed form
7467E5l3j87P6k16K95Q7p8Q5o6L1o4J74n95M02m7J85l5r2J6P8J79j97n2J05k46
7492a40O5j59j03O09j41l7K39m17J20K11j75k62n7M2K21J14k78L7P3M56k15p1
7514A32j95J91L8l30K90m42j26L03K16L5j76j41M61j34J16l42K06k24N7pj63N76
7536C41qm20K05j14O45o57K86p95J079n89k50M54k86J12P8K1j34N0p7J62k8J38
7558B13j44j93J72O4j02J01k23j29K79r9R5q3j41L16k47K37nK12j37j07j85J21
7580A5m9j8O4j87q9N43k29j06J01j21J04k77J15j75K30L46k29j2k17K44K48l14
7602a3L4J20j37J07r5J0J03k2r6j21J24k43J31m2K46j94j2K73k25l6J7M7J6r8
7626a06J29o8K29J41l01J46l58J28q7J28L0k5k68L1M57k16k57O9J27J26m6J98
$$ plain form
7648 207 -138 120 -85 304 110 -142 -55 -76 174 298 -320 -192 -180 7 -133 95 -54 74 -176 -378 54
7669 54 -174 19 -376 -242 -116 98 -270 34 282 40 228 128 -34 -291 187 105 152 -273 377 -75 -289
7690 -289 -180 42 96 337 -94 -135 327 -299 -275 -91 45 -8 350 115 -83 21 4 98 -292 -50 217 61
7712 61 -274 -326 -91 300 -17 -84 -63 -286 69 108 -125 -117 13 219 -98 152 -47 -98 32 226 116 -149 244
7735 244 -171 261 11 -299 -73 183 -215 -158 113 146 17 162 -71 -97 -72 224 130 -255 -272 68 86 38 12
7758 12 -296 212 219 -87 -5 -124 -182 290 62 -239 122 269 -249 128 332 -341 -295 37 -43 20 -46 84 70
7781 70 -121 1 80 -178 -28 -87 -166 313 -299 5 -7 -287 -116 -223 -25 10 127 -194 76 -382 -247 212
7803 212 -398 -61 106 274 224 -187 249 116 115 39 128 -165 -53 189 98 -119 -29 -120 -108 -60 95 61 -57 -49
$$ packed form
7648B07l45K58k05L89j94k52Q7k1K50J24o18J28J2J87j40K28j49J28k50k02M32
7669E4k28J93l95J34J26K14l68L04K48k42J88j00j62k57M78q2M7m25O50m52k14
7690b89J09K22N4K41m31m1M62o26K4J84J36n3L58k35j98J04j7R4l90K42K67j56
7712F1l35n2K35L91l17o7K1k23L55L9k33QJ30K06l17K50j99n1J30J94j10k65L93
7735B44m15M32k50l10K26K56l98N7K71L3j29J45k33k6K5K96r4l85j7L40J8m8k6
7758A2l08N08Pl06Q2j19n8M72k28l01L61J47n18L77K04o73M6L32q0O3o6J30j4
7781G0j91J22P9k58J50n9p9M79o12L04j2k80J71j07J98L5J17l21K70m58J35M59
7803B12o10L37J67J68n0m11M36j33jp6Q9k93J12K42r1k17R0r1J2M8J55l4j18Q
$$ plain form
7827 -49 -285 -3 308 66 71 158 363 -197 259 -255 61 -217 67 125 237 -21 -180 185 260 210 -246 235
7849 235 -135 109 73 144 104 178 175 151 202 -10 50 132 -189 -43 164 -69 -217 -241 -48 137 138 -233 33 -92
7873 -92 -63 82 56 -39 160 -414 -66 94 -240 -237 59 87 -216 18 -225 -121 73 239 51 26 -244 228 78
7896 78 -79 -104 -93 81 -207 -174 11 1 -262 -180 143 65 214 -173 65 190 -94 92 -6 11 -152 -91 -3 235
7920 235 -28 -223 101 -16 -315 51 -98 -75 -215 -196 28 35 21 10 60 -55 72 85 289 -216 -6 -265 -325
7943 -325 -185 -161 51 -182 -100 -34 174 -171 -21 -525 266 -17 -335 -66 66 -31 -71 123 -41 -176 -46 -8
7965 -8 13 -2 124 206 -225 11 -152 -171 -40 188 148 -234 -234 10 -8 -165 -72 -168 94 76 7 245 267 158 253
7990 253 109 103 83 -114 120 -40 35 274 -189 239 -414 -5 -47 -42 270 -218 -222 15 8 -96 -44 100 -340 226
$$ packed form
7827d9k36K82L11k42NQ7K05n60M56n14L16k78K84N8J12k58j59L65P5n0m56M81
7849B35l70K44l6P1m0P4lk4N1k12O0Q2l21J46K07k33j48k4J93J85Jl71K66j25
7873i2K9J45k6r5J99n74L48J60l34LK96K8l03K34k43J04J94J66j88k5k70M72j50
7896G8j57k5J1J74k88L3J85j0k63Q2L23p8J49l87K38J25k84J86r8J7j63O1Q8K38
7920B35k63j95L24j17k99L66j49K3j40J9K24Pj4j1N0j15J27J3K04n05K10k59o0
7943c25J40K4K12k33Q2O6K08l45J50n04P91k83l18K69J32r7m0J94j64j35J30L8
7965hK1j5J26Q2m31K36j63j9J31K28m0l82%K44j8j57R3r6K62j8o9K38K2j09R5
7990B53j44ok0j97K34j60P5K39m63M28o53M09m2NL12m88mK37pj04N2J44m40N66
$$ plain form
8014 226 -205 -44 132 221 -156 -325 -82 -193 -7 148 -303 -481 -681 72 235 13 38 -29 13 89 -134 163
8036 163 32 -91 -194 -294 -68 109 48 -243 -83 244 171 -50 73 -14 182 -303 202 -49 -93 -209 -382
8057 -382 -41 -5 62 -26 134 69 -171 -268 58 -193 139 -49 -35 -39 218 39 -98 -73 -116 -25 -14 -186 -60 -119
8081 -119 21 -147 -137 -72 130 -248 -65 -25 94 338 177 103 -35 368 -128 178 5 378 -127 -185 4 349
8103 349 -321 -212 268 151 10 207 -35 -285 92 -222 336 60 273 68 12 61 -74 -91 -66 235 159 -411
8125 -411 48 -142 154 -14 -346 -181 73 -24 152 45 183 38 125 256 75 39 -72 88 15 -175 -61
8146 -61 -1 316 -58 -436 -96 -62 -61 107 -83 -57 -24 205 -92 -63 89 57 130 13 -174 212 75 73 -164 57
8170 57 -153 44 -99 -50 71 135 4 507 65 -137 32 -58 79 201 50 -262 -66 -28 -159 167 -106
$$ packed form
8014B26m31J61J76Q9l77j69K43j11J86J55m51j78k00P53J63k22K5o7M2P6k23K97
8036A63j31j23j03j00K26J77o1k91J60L27p3k21J23q7J96m85N05k51m4j16j73
8057c82L41L6O7q8J60o5k40r7L26k51L32j88J4mK57j79j37K5m3R1J1j72J26n9
8081a19J40j68J0O5K02l78J83M0J19K44j61p4j38M03m96L06j73L73n05n8J89L45
8103C49o70J09M80j17j41J97k42k50L77l14N58k76K13k05n6M9j35j7K5L01p6n70
8125d11M59j90K96j68l32J65K54r7J76j07J38j45Q7J31j81l6j11J60p3j90J14
8146f1O0L17l74l78L40L4JJ68j90K6L3K29k97K9J52l2P3j17j87L86j37kk37K21
8170E7k10J97j43M9J21O4j31N03m42k02J69r0J37J22j51l12J96L8j31L26k73
8191a06
$$ Imaginary data points
##PAGE= N=2
##DATA TABLE= (X++(I..I)), XYDATA
$$ plain form
0 0 0 0 0 0 0 0 1 -8 8 -8 8 -16 16 -19 24 -32 35 -41 50 -58 70 -81 94 -107 125 -143 162 -183 209 -235 266
31 266 -299 335 -373 419 -465 517 -573 637 -705 782 -864 958 -1060 1176 -1305 1450 -1615
48 -1615 1805 -2027 2291 -2607 2994 -3486 4131 -5020 6330 -8459 12519 -23093 110042 240902
62 240902 59799 -1285 57861 146879 78208 -23563 -19135 111259 176756 116552 26213 48867
74 48867 128362 138254 43105 -26080 8778 89841 101809 59759 51825 105021 134188 91712 25884
87 25884 10753 35143 49712 44064 52636 76968 87292 74152 65249 67744 55495 20013 2875
100 2875 30414 65759 60408 35969 52178 104171 116725 56174 -9364 -2929 49979 62726 17875
113 17875 -2564 54687 125891 110950 24060 -20349 27287 79626 44539 -29172 -24381 65976
$$ packed form
0@%%%%%%JrJ6j6J6k4L2l5M3n6O7p6R1j08J28j51J75k01K32k68L05l45L92m44N01
31B66n65O34p08P92q84R82j090J210j342J487j646J822k018K236k481K755l065
48a615L420l832M318m898N601o480P617r151J1350j4789K0978l5612J33135J30860
62B40902j81103o1084N9146Q9018o8671j01771M428J30394O5497o0204r0339K2654
74D8867P9495R892r5149o9185L4858Q1063J1968m2050p934N3196K9167m2476o5828
87B5884j5131K4390J4569n648Q572K4332J0324j3140q903K495j2249l5482j7138
100B875K7539L5345n351k4439J6209N1993J2554o0551o5538O435N2908J2747m4851
113A7875k0439N7251P1204j4941q6890m4409M7636N2339l5087p3711M791R0357
$$ plain form
125 65976 122572 76024 7280 15024 74224 77271 3462 -52154 -16823 61321 84001 39160
137 39160 6059 33166 72681 53672 -11553 -45346 -13999 31401 32034 3942 1794 37257 64158
150 64158 44994 -1528 -30365 -25969 -8675 -2777 -8944 -10409 6358 29448 33379 5359 -31447
163 -31447 -40746 -19820 -6092 -25334 -50377 -35543 12854 37214 6823 -38215 -42924 -14187
175 -14187 -8928 -47980 -79418 -51574 9359 27772 -16976 -59685 -43251 -1428 -10210 -69138
187 -69138 -98375 -55135 2114 -1033 -46544 -57197 -14957 15443 -18189 -77919 -91981 -51944
199 -51944 -17941 -30319 -56558 -46637 -7330 7464 -27116 -71000 -76503 -49803 -34176 -47201
211 -47201 -61113 -47796 -18898 -5169 -19101 -43014 -55069 -49851 -43319 -48735 -62207 -63639 -39255
$$ packed form
125F5976N6596m6548o8744P744N9200L047p3809n5616L5331P8144K2680m4841
137C9160l3101K7107L9515j9009o5225l3793L1347M5400O33k8092k148L5463K6901
150F4158j9164m6522k8837M396J7294N898o167j465J6767K3090L931k8020l6806
163c1447r299K0926J3728j9242k5043J4834M8397K4360l0391m5038m709K8737
175a4187N259l9052l1438K7844O0933J8413m4748m2709J6434M1823q782n8928
187f9138k9237M3240N7249l147m5511j0653M2240L0400l3632n9730j4062M0037
199e1944L4003j2378k6239R921L9307J4794l4580m3884n503K6700J5627j3025
211d7201j3912J3317K8898J3729j3932k3913j2055N218O532n416j3472j432K4384
$$ plain form
224 -39255 -7829 -3372 -32947 -61771 -57549 -36975 -40650 -71679 -83494 -48974 -4455 -4744 -42830
237 -42830 -62911 -37144 -9474 -31499 -82313 -95605 -51234 -7625 -17574 -55829 -55401 -12891 5306
250 5306 -37548 -91578 -88352 -38864 -13966 -39985 -65425 -42338 1780 7237 -34308 -69546 -59137
263 -59137 -28462 -25585 -50486 -62700 -35211 1801 7029 -21601 -46635 -43142 -27107 -28398 -47339
276 -47339 -55738 -34761 -1428 12367 -3049 -25709 -28325 -13432 -7600 -27853 -50723 -40947 -2135
289 -2135 22891 6994 -20738 -15944 13770 17761 -20910 -55456 -39168 8873 27781 2854 -16829
302 -16829 6523 42044 34527 -13297 -41924 -16706 22947 23346 -7058 -12691 24213 56642 39119
315 39119 -4352 -18613 5520 23832 8124 -12645 -1161 35679 55900 42181 17517 10466
$$ packed form
224c9255L1426M457k9575k8824M222K0574l675l1029j1815L4520M4519k89l8086
237d2830k0081K5767K7670k2025n0814j3292M4371M3609r949l8255M28M2510J8197
250E306m2854n4030L226M9488K4898k6019k5440K3087M4118N457m1545l5238J0409
263e9137L0675K877k4901j2214K7489L7012N228k8630k5034L493J6035j291j8941
276d7339q399K0977L3333J3795j5416k2660k616J4893N832k0253k2870R776L8812
289b135K5026j5897k7732M794K9714L991l8671l4546J6288M8041J8908k4927j9683
302a6829K3352L5521p517m7824k8627K5218L9653L99l0404n633L6904L2429j7523
315C9119m3471j4261K4133J8312j5708k0769J1484L6840K0221j3719k4664p051
$$ plain form
327 10466 18552 20887 10723 446 6382 27367 46650 49043 35003 22058 22198 29408 26310 8419
341 8419 -4018 10390 42111 58456 43099 22158 28600 51068 48051 10326 -16578 7059 52814
354 52814 62435 29317 11036 41123 74840 55507 675 -18556 20638 58634 43346 4941
366 4941 10563 60776 87741 51134 -982 -2183 38734 53995 20663 -7592 19163 70937 79495
379 79495 37900 6180 21369 49028 38592 2266 -7601 24521 58231 56232 32772 25276 38457
392 38457 45485 29351 6138 1628 17624 35345 40686 36182 33484 36222 38087 32692 18048 2825
406 2825 169 14416 32009 34374 24382 21721 36886 47416 29560 -3604 -12990 11913 34621
419 34621 23972 1352 9084 43639 56081 22951 -15638 -12378 19998 28966 -106 -21790 3117
$$ packed form
327A0466Q086K335j0164j0277N936K0985J9283K393j4040j2945J40P210l098j7891
341H419j2437J4408L1721J6345j5357k0941O442K2468l017l7725k6904K3637M5755
354E2814R621l3118j8281L0087L3717j9333n4832j9231L9194L7996j5288l8405
366D941N622N0213K6965l6607n2116j201M0917J5261l3332k8255K6755N1774Q558
379G9495m1595l1720J5189K7659j0436l6326r867L2122L3710j999k3460p496J3181
392C8457P028j6134k3213m510J5996J7721N341m504k698K738J865n395j4644j5223
406B825k656J4247J7593K365r992k661J5165J0530j7856l3164r386K4903K2708
419C4621j0649k2620P732L4555J2442l3130l8589L260L2376Q968k9072k1684K4907
$$ plain form
432 3117 46364 50737 11381 -16590 -38 27257 16389 -21833 -31585 5521 43109 34132 -1202
445 -1202 -11873 10770 24526 916 -31780 -31840 -804 20559 10989 -6662 -3879 14853 19807
458 19807 -1363 -27848 -32355 -15195 498 -804 -9058 -6651 7820 15233 1465 -23120 -36013
471 -36013 -26537 -10716 -9205 -20888 -23838 -5508 15208 8910 -20893 -39888 -28460 -9555 -16140
484 -16140 -39457 -40871 -9351 18016 5607 -28217 -40297 -20155 -7240 -27742 -56178 -49960
496 -49960 -13213 8951 -8633 -36152 -32838 -7921 -3811 -34206 -61280 -49138 -15489 -4908
508 -4908 -23680 -37568 -22735 -1608 -8059 -37956 -56138 -45020 -23998 -20061 -31336 -34934 -21120
521 -21120 -5925 -9425 -29636 -45223 -43030 -30806 -25876 -32072 -35533 -25158 -7278 -2561 -17055
$$ packed form
432C117M3247M373l9356k7971J6552K7295j0868l8222r752L7106L7588q977l5334
445a202j0671K2643J3756k3610l2696o0L1036K1363r570j7651K783J8732M954
458A9807k1170k6485m507J7160J5693j302q254K407J4471P413j3768k4585j2893
471c6013R476J5821J511j1683k950J8330K0716o298k9803j8995J1428J8905o585
484a6140k3317j414L1520K7367j2409l3824j2080K0142J2915k0502k8436O218
496d9960L6747K2164j7584k7519L314K4917M110l0395k7074J2142L3649J0581
508d908j8772j3888J4833K1127o451k9897j8182J1118K1022L937j1275l598J3814
521b1120J5195l500k0211j5587K193J2224M930o196l461J0375J7880M717j4494
$$ plain form
534 -17055 -37549 -43010 -33233 -24829 -31843 -42258 -33697 -7723 6873 -7951 -33799 -37026 -19394
547 -19394 -13039 -33025 -52054 -38446 -3298 11393 -8475 -30214 -22303 -618 -3638 -34836 -54425
560 -54425 -34601 -521 6445 -16430 -27421 -7221 15491 3997 -31729 -46204 -24131 1635
572 1635 -2435 -22087 -20599 6691 24246 7617 -23151 -31146 -13426 232 -8903 -23355 -15950
585 -15950 10347 25305 13071 -9634 -15642 -3553 3614 -7671 -21012 -14411 8824 24373 18212
598 18212 1947 -2975 5165 9770 -1402 -16795 -15840 4948 23488 21857 6829 1955 13485
611 13485 20928 7749 -13980 -16048 4789 24093 21126 7682 8308 24336 32482 14848 -9793
624 -9793 -14006 5306 22316 16847 4760 10897 32980 41614 22375 -3721 -7005 10794 21269
$$ packed form
534a7055k0494n461R777Q404p014j0415Q561K5974J4596j4824k5848l227J7632
547a9394O355j9986j9029J3608L5148J4691j9868k1739P911K1685l020l1198j9589
560e4425J9824L4080O966k2875j0991K0200K2712j1494l5726j4475K2073K5766
572A635m070j9652J488K7290J7555j6629l0768p995J7720J3658r135j4452P405
585a5950K6297J4958j2234k2705o008J2089P167j1285j3341O601K3235J5549o161
598A8212j6265m922Q140M605j1172j5393R55K0788J8540j631j5028m874J1530
611A3485P443j3179k1729k068K0837J9304k967j3444O26J6028Q146j7634k4641
624i793m213J9312J7010n469j2087O137K2083Q634j9239k6096l284J7799J0475
$$ plain form
637 21269 10697 -720 10825 36221 45859 28235 6073 4469 18241 22196 6534 -6166 5994
650 5994 33628 45165 30008 10981 13570 27553 26710 5944 -8491 3759 30467 40504 25997
663 25997 14000 20623 35942 32569 8389 -8729 2414 26878 34674 20933 12132 25362 43080
676 43080 37204 10108 -6966 3425 24064 26274 12745 9156 26763 44972 39077 13748 -1276
689 -1276 7857 22198 19388 4196 2625 22858 42805 37823 15890 3947 12678 22793 14603
702 14603 -1787 -2794 18082 36798 33839 15968 7751 16077 23175 12681 -6212 -8645 9889
715 9889 28918 27017 12691 8509 19962 26526 11940 -10268 -14503 2385 18706 16834 5747
728 5747 6110 20508 26998 12502 -10245 -16809 -2985 9848 5308 -5068 -1651 16812 26268 12626
$$ packed form
637B1269j0572j1417J1545K5396R638j7624k2162j604J3772L955j5662j2700J2160
650E994K7634J1537j5157j9027K589J3983q43k0766j4435J2250K6708J0037j4507
663B5997j1997O623J5319l373k4180j7118J1143K4464P796j3741q801J3230J7718
676D3080n876k7096j7074J0391K0639K210j3529l589J7607J8209n895k5329j5024
689a276R133J4341k810j5192j571K0233J9947m982k1933j1943Q731J0115q190
702A4603j6390j007K0876J8716k959j7871q217Q326P098j0494j8893k433J8534
715I889J9029j901j4326m182J1453O564j4586k2208m235J6888J6321j872j1087
728E747L63J4398O490j4496k2747o564J3824J2833m540j0376L417J8463R456j3642
$$ plain form
742 12626 -9611 -15429 -4304 4155 -4352 -15745 -10219 10195 22187 11177 -9877 -15859 -5029
755 -5029 1066 -10047 -25102 -20175 2970 16441 5854 -12624 -14772 -1577 1877 -15863 -34106
768 -34106 -28574 -4261 9406 -947 -16896 -13106 2772 3138 -18629 -38843 -31892 -8220 1197
781 1197 -11874 -22861 -11862 7086 5083 -19706 -37384 -28637 -10066 -8251 -22717 -27384 -11010
794 -11010 7519 3730 -18984 -32697 -24391 -11601 -14834 -29381 -30655 -11809 5049 582 -16882
807 -16882 -25106 -17897 -11037 -18305 -31505 -32266 -16555 -1207 -1409 -12548 -18570 -13311 -8389 -15937
821 -15937 -29390 -34099 -21702 -6222 -3048 -11403 -16383 -10075 -2297 -8337 -24344 -33781 -24840 -8998
835 -8998 -4927 -14100 -18849 -7507 4998 -173 -20989 -33240 -23552 -7369 -6439 -18832 -21060 -4225
$$ packed form
742A2626k2237n818J1125Q459q507j1393N526K0414J1992j1010k1054n982J0830
755e029O095j1113j5055M927K3145J3471j0587j8478k148J3195L454j7740j8243
768c4106N532K4313J3667j0353j5949L790J5878L66k1767k0214O951K3672R417
781A197j3071j0987J0999J8948k003k4789j7678Q747J8571J815j4466m667J6374
794a1010J8529l789k2714j3713Q306J2790l233j4547j274J8846J6858m467j7464
807a6882q224P209O860p268j3200p61J5711J5348k02j1139o022N259M922p548
821a5937j3453m709J2397J5480L174q355m980O308P778o040j6007r437Q941J5842
835h998M071r173m749J1342J2505n171k0816j2251R688J6183R30j2393k228J6835
$$ plain form
849 -4225 11694 4385 -18091 -28154 -16396 -2904 -8941 -23785 -23222 -1811 14914 6478 -14748
862 -14748 -20505 -6608 1861 -11544 -28684 -23636 636 15289 5462 -11572 -10416 3741 6895
875 6895 -10189 -27084 -20496 751 10910 1317 -9652 -3693 11552 12056 -6635 -22511 -16551
888 -16551 1423 6940 -2052 -8032 2457 16966 15802 -1436 -14528 -10281 2074 4432 -3912
901 -3912 -6894 3655 18194 19413 5524 -6333 -4294 4271 5229 -3649 -7928 2362 18038 21802
915 21802 11905 1306 2371 9520 9078 -1327 -8590 -306 16412 23735 15377 4355 6612 16684
929 16684 15852 1173 -10126 -2100 16757 23970 14243 5401 12116 24989 22635 3639 -9121 -311
943 -311 17942 22276 10098 3921 16522 32018 26987 5000 -6825 4005 19470 17042 3007
$$ packed form
849d225J5919p309k2476j0063J1758J3492o037j4844N63K1411J6725q436k1226
862a4748n757J3897Q469j3405j7140N048K4272J4653r827j7034J156J4157L154
875F895j7084j6895O588K1247J0159r593j0969N959J5245N04j8691j5876N960
888a6551J7974N517q992n980J0489J4509j164j7238j3092M247J2355K358q344
901c912k982J0549J4539J219j3889j1857K039Q565R58q878m279J0290J5676L764
915B1802r897j0599J065P149m42j0405p263Q284J6718P323q358j1022K257J0072
929A6684q32j4679j1299Q026J8857P213r727q842O715J2873k354j8996j2760Q810
943c11J8253M334j2178o177J2601J5496n031k1987j1825J0830J5465k428j4035
$$ plain form
956 3007 2171 20462 35808 28043 7550 -197 11366 20497 12250 -1339 1033 20289 32773 25301
970 25301 9635 6661 16954 21220 9732 -3967 -685 16072 26710 21800 11680 11757 20037 21729
984 21729 10852 -2463 -2449 10123 21003 18381 10030 9940 19486 24014 13521 -2342 -5469 5874
998 5874 15881 12839 3422 5795 19318 26374 15042 -2080 -6531 5589 13936 6629 -4113 724
1012 724 18221 26189 12555 -4716 -5360 7197 10825 -1509 -11523 -2955 15831 21427 7815
1025 7815 -4705 -873 9586 8059 -6956 -15995 -5774 10636 13831 3620 -3833 1853 9438
1038 9438 4516 -10516 -17923 -10035 2617 5902 -258 -4188 1700 8644 5629 -7267 -16767 -14147
1052 -14147 -4471 788 -4604 -8956 -2511 8495 8826 -4840 -18535 -17258 -5753 -1905 -10753 -17233
$$ packed form
956C007q36J8291J5346p765k0493p747J1563R131q247j3589K372J9256J2484p472
970B5301j5666k974J0293M266j1488j3699L282J6757J0638m910j0120P7Q280J692
984B1729j0877j3315J4J2572J0880k622q351r0R546M528j0493j5863l127J1343
998E874J0007l042r417K373J3523P056j1332j7122m451J2120Q347p307j0742M837
1012G24J7497P968j3634j7271o44J2557L628j2334j0014Q568J8786N596j3612
1025G815j2520L832J0459j527j5015r039J0221J6410L195j0211p453N686P585
1038I438m922j5032p407P888J2652L285o160l930N888O944l015j2896r500K620
1052a4147R676N259n392m352O445J1006L31j3666j3695J277J1505L848q848o480
$$ plain form
1066 -17233 -7632 8518 11119 -4620 -18688 -14541 -1203 -2268 -17581 -24561 -10484 8725 8481
1079 8481 -8999 -18514 -8078 2828 -5447 -24156 -27524 -10071 6112 1621 -13327 -15096 -1572
1092 -1572 5006 -7473 -25069 -25181 -8779 1456 -6090 -16034 -11703 1298 4328 -9168 -23029
1105 -23029 -22136 -10965 -6358 -11858 -16499 -10048 844 3180 -6341 -17009 -18589 -12748 -9606 -13110
1119 -13110 -16758 -12791 -2545 3466 -1865 -12364 -16741 -12116 -8417 -13117 -20627 -18809 -6518 3862
1133 3862 1474 -9969 -14019 -7493 -2605 -10901 -23353 -22525 -6796 5145 10 -11283 -11763 -742
1147 -742 2609 -10163 -24611 -22555 -6483 2585 -4537 -14069 -8295 5778 7746 -7414 -21493 -17848
1161 -17848 -3753 810 -8622 -14836 -4753 10426 10506 -5607 -16826 -12056 -1157 -1158 -11407 -15013
$$ packed form
1066a7233R601J6150K601j5739j4068M147J3338j065j5313o980J4077J9209k44
1079H481j7480r515J0436J0906q275j8709l368J7453J6183m491j4948j769J3524
1092a572O578j2479j7596j12J6402J0235p546r944M331J3001L030j3496j3861
1105b3029Q93J1171M607n500m641O451J0892K336r521j0668j580N841L142l504
1119a3110l648L967J0246O011n331j0499m377M625L699m700p510J818J2291J0380
1133C862k388j1443m050O526M888q296j2452Q28J5729J1941n135j1293m80J1021
1147g42L351j2772j4448K056J6072R068p122r532N774J4073J968j5160j4079L645
1161a7848J4095M563r432o214J0083J5179Q0j6113j1219M770J0899jj0249l606
$$ plain form
1175 -15013 -3505 10784 10474 -2598 -10612 -5088 3759 583 -10922 -14436 -2625 10806 11142 450
1189 450 -4440 2044 8059 1909 -10559 -13409 -2447 9808 10337 2357 -310 7462 12850 6210 -6642
1204 -6642 -9896 -480 9402 8987 2332 2093 11233 17388 11243 -930 -5841 319 7330 6261 1179
1219 1179 2275 12300 20322 16491 4657 -1554 3205 9791 7835 687 557 11650 21373 18657
1233 18657 7090 1345 7690 13848 9068 -1592 -3193 9276 21188 18782 7720 4281 12879
1246 12879 18244 9533 -4523 -4663 10143 21232 16521 6082 6780 17677 21344 8703 -4956
1259 -4956 -3239 10059 17110 9467 1762 7260 20309 22403 9658 -2703 -172 10287 12392 3944
1273 3944 -304 8276 20529 21151 9631 449 2215 8811 8504 1216 -2600 5043 15672 18243 9813
$$ packed form
1175a5013J1508J4289l10j3072q014N524Q847l176j1505l514J1811J3431L36j0692
1189D50m890O484O015o150j2468k850J0962J2255N29p980k667P772N388o640j2852
1204f642l254R416R882m15o655k39R140O155o145j2173m911O160P011j069n082
1219A179J096J0025Q022l831j1834o211M759O586j956p148j30J1093R723k716
1233A8657j1567n745O345O158m780j0660j601J2469J1912k406j1062l439Q598
1246A2879N365q711j4056j40J4806J1089m711j0439O98J0897L667j2641j3659
1259d956J717J3298P051p643p705N498J3049K094j2745j2361K531J0459K105q448
1273C944m248Q580J2253O22j1520r182J766O596l07p288l816P643J0629K571q430
$$ plain form
1288 9813 2388 3692 9718 9022 575 -5274 160 11791 16015 9704 2902 4957 11186 10093 -1102
1303 -1102 -9883 -4720 7856 12508 5924 -582 4724 13940 11679 -2229 -11494 -4737 7573 8751
1317 8751 -181 -3794 5826 15339 11617 -2847 -10092 -3442 5092 1918 -6936 -6836 5330 14235 9000
1332 9000 -3481 -7783 -1828 2998 -2363 -9736 -8009 3221 10771 6972 -1678 -4493 -445 1741
1346 1741 -4010 -11628 -12157 -3576 4630 4279 -1583 -4575 253 3379 -2351 -12785 -15627 -7618 2102
1361 2102 2587 -3858 -6730 38 5514 -798 -13818 -18396 -9111 735 -1662 -10879 -10676 721 7864
1376 7864 -560 -15173 -17727 -7699 -951 -7856 -16087 -11333 3007 8336 -2122 -14846 -14356 -4898
1390 -4898 -3328 -13160 -20130 -12402 1311 4662 -4867 -13110 -9730 -2661 -4678 -15036 -20230 -13079
$$ packed form
1288I813p425J304O026o96q447n849N434J1631M224o311o802K055O229j093j1195
1303a102q781N163J2576M652o584o506N306R216k261j3908r265O757J2310J178
1317H751q932l613R620R513l722j4464p245O650Q534l174q854J00J2166Q905n235
1332I000j2481m302N955M826n361p373J727J1230P550l799q650k815M048K186
1346A741n751p618n29Q581Q206l51n862k992M828L126n730j0434k842Q009R720
1361B102M85o445k872O768N476o312j3020m578R285R846k397r217K03J1397P143
1376G864q424j4613k554J0028O748o905q231M754J4340N329j0458j2724M90R458
1390d898J570r832o970P728J3713L351r529q243L380P069k017j0358n194P151
$$ plain form
1404 -13079 -2072 265 -6206 -10126 -6313 -1041 -4087 -13929 -19557 -14727 -5713 -3024 -7431 -9853
1418 -9853 -5711 -452 -2251 -11282 -17761 -14872 -6809 -4110 -7846 -11079 -5726 2153 1926 -7764 -15807
1433 -15807 -13565 -5806 -4185 -10749 -13787 -6070 4150 4366 -5558 -12847 -9442 -2703 -3806 -11645 -14071
1448 -14071 -5154 5168 5132 -3651 -8348 -4000 1423 -2201 -11773 -13929 -5154 4404 4568 -2909 -5389
1463 -5389 647 5095 -30 -9575 -12711 -4274 4340 4630 -1742 -3177 3906 9642 4729 -6846 -10471
1478 -10471 -2876 5255 3679 -3777 -3447 6309 13359 7616 -4142 -7092 551 7151 2341 -5501 -2703
1493 -2703 9014 15821 8631 -2039 -2311 6467 8945 777 -6883 -1872 9885 14397 6763 -301
1507 -301 2832 10011 9267 166 -5398 -159 9207 11461 6722 3500 6989 12025 10108 1639 -2899
$$ packed form
1404a3079J1007K337o471l920L813N272l046r842n628M830R014K689m407k422
1418i853M142N259j799r031o479K889Q063K699l736l233N353P879k27r690q043
1433a5807K242P759J621o564l038P717J0220K16r924p289L405O739j103p839k426
1448a4071Q917J0322l6q783m697M348N423l624r572k156Q775R558J64p477k480
1463e389O036M448n125r545l136Q437Q614K90o372j435P083N736m913j1575l625
1478a0471P595Q131j576p456L30R756P050n743j1758k950P643O600m810p842K798
1493b703J1717O807p190j0670k72Q778K478q168p660N011J1757M512p634p064
1507c01L133P179p44r101n564N239R366K254m739l222L489N036j917q469m538
$$ plain form
1522 -2899 225 6653 9241 6570 4344 7062 11510 11668 5756 -484 -554 4002 7813 6527 3049 5309
1538 5309 12429 15768 9567 722 -1128 5185 9369 4598 -1153 2390 13200 17046 9546 78 1134
1553 1134 9351 10418 1255 -5760 1344 13757 16686 7225 133 5646 14007 10361 -1891 -7087
1567 -7087 2371 12958 12172 3338 866 8974 14889 8595 -2897 -4984 3260 10095 6874 1019 2416
1582 2416 10927 14480 8272 -586 -2313 3115 6265 3616 -208 1498 8138 12005 8207 1460 -1389
1597 -1389 1082 4271 2573 -1885 -1728 5057 11396 10116 2872 -1842 1538 5587 2359 -4986 -5889
1612 -5889 2202 10756 8603 97 -2358 3273 6898 884 -8826 -9189 930 8157 4506 -2560 -1085
1627 -1085 6249 8633 -496 -10712 -8887 89 3880 -906 -5342 -1297 6626 6756 -2169 -9003 -7433
$$ packed form
1522b899L124O428K588k671k226K718M448J58n912o240p0M556L811j286l478K260
1538E309P120L339o201q845j850O313M184m771n751L543J0810L846p500r468J056
1553A134Q217J067r163p015P104J2413K929r461p092N513Q361l646j2252n196
1567g087R458J0587p86q834k472Q108N915o294j1492k087Q244O835l221n855J397
1582B416Q511L553o208q858j727N428L150k649l824J706O640L867l798o747k849
1597a389K471L189j698m458J57O785O339j280p244m714L380M049l228p345r03
1612e889Q091Q554k153q506k455N631L625o014r710l63J0119P227l651p066J475
1627a085P334K384r129j0216J825Q976L791m786m436M045P923J30q925o834J570
$$ plain form
1642 -7433 -1620 -429 -4990 -7639 -2607 4548 5251 -797 -6711 -6625 -3496 -3284 -6861 -9420 -5724 971
1658 971 3871 -845 -6657 -7783 -4047 -2917 -7520 -12521 -10239 -1700 3444 -1364 -8016 -7373 -1047
1673 -1047 -367 -8974 -16330 -12447 -1809 2269 -4192 -10018 -5691 1891 303 -10970 -17565 -11367 -1176
1688 -1176 -746 -8579 -11176 -3031 4694 303 -10898 -14931 -8310 -2401 -4960 -12128 -10558 -1191 4390
1703 4390 -765 -9492 -10831 -5905 -3751 -7663 -12335 -9770 -2187 1950 -935 -5668 -6596 -3964 -2983
1718 -2983 -6619 -10807 -9995 -4935 229 736 -3311 -5020 -3395 -709 -3514 -9882 -11764 -6616 811
1733 811 1647 -3163 -4932 -359 4215 -252 -8836 -11526 -4955 2004 267 -5287 -5177 2852 7430 1627
1749 1627 -8304 -9686 -2145 2552 -2360 -8067 -4033 5029 8608 2036 -5908 -4496 1364 2152 -3550
$$ packed form
1642g433N813J191m561k649N032P155P03o048n914Q6L129K12l577k559L696O695
1658I71K900m716n812j126L736J130m603n001K282Q539N144m808o652O43O326
1673a047O80q607p356L883J0638M078o461n826M327P582j588j1273o595O198J0191
1688a176M30p833k597Q145P725m391j1201m033O621N909k559p168J570R367N581
1703D390n155q727j339M926K154l912m672K565P583M137k885m733r28K632R81
1718b983l636m188Q12N060N164N07m047j709J625K686k805o368j882N148P427
1733H11Q36m810j769M573M574m467q584k690O571O959j737n554J10Q029M578n803
1749A627r931j382P541M697m912n707M034R062L579o572p944J412N860P88n702
$$ plain form
1764 -3550 -7613 -2980 5448 7621 1985 -2790 -818 2953 2209 -3484 -6969 -3225 3719 6462 3292
1779 3292 -58 1233 5033 4850 -907 -6146 -4250 2633 6713 3817 -190 1884 7232 7794 796
1794 796 -5733 -4093 3451 6432 1640 -2291 2467 10496 10492 2033 -4683 -1362 5809 5585 -1009 -3333
1810 -3333 4074 12007 10304 1705 -2531 2649 7095 3751 -3221 -2586 5536 11598 8874 2585 1718
1825 1718 6372 7604 2648 -2339 -1526 4435 8394 7116 4242 4713 7536 7660 4462 116 -1117 1936
1841 1936 5914 6733 5214 4356 6813 9478 7778 2463 -1775 901 5834 7635 3839 1592 5805
1856 5805 11764 10478 2353 -2849 1444 7437 6486 -235 -1096 6812 13654 10437 672 -1935 4528
1871 4528 8711 3670 -4248 -2415 8209 13221 7735 -332 616 7535 8525 413 -5712 -1850 6992
$$ packed form
1764c550m063M633Q428K173n636m775J972L771p44n693l485L744O944K743l170
1779C292l350J291L800j83n757n239J896O883M080k896m007K074N348N62o998
1794G96o529J640P544K981m792l931M758Q029mq459o716L321P171k24o594k324
1810c333P407P933j703q599m236N180M446l344o972O35Q122O062k724o289q67
1825A718M654J232m956m987Q13N961L959j278k874M71K823J24l198m346j233L053
1841A936L978Q19j519q58K457K665j700n315m238K676M933J801l796k247M213
1856E805N959j286q125n202M293N993r51o721q61P908O842l217r765k607O463
1871D528M183n041p918J833J0624N012n486q067R48O919R90q112o125L862Q842
$$ plain form
1886 6992 9286 3087 -317 3590 8813 6858 -678 -4721 -1006 4559 4659 1463 168 3816 7366
1901 7366 5291 263 -3260 -2117 1041 2176 200 -1116 1449 5545 6144 2074 -2949 -3477 -297
1916 -297 1588 -1563 -4411 -1967 4017 6387 1951 -4451 -4129 337 1347 -4099 -8262 -4432 3737
1931 3737 5607 -765 -5277 -2493 2428 593 -6545 -10356 -4939 2273 2374 -3514 -5146 -648 3336
1946 3336 -669 -8407 -10198 -4728 163 -1108 -5136 -4687 -86 2582 -635 -6674 -8228 -4986 -2554
1961 -2554 -3220 -5831 -5315 -1035 1937 391 -4617 -7172 -5827 -3018 -3548 -6896 -8029 -3161 1907 1716
1977 1716 -3999 -7398 -4682 -1038 -2635 -8813 -10119 -3855 2453 1557 -4989 -7188 -2140 1614 -2935
1992 -2935 -10536 -11053 -3041 2522 -840 -6746 -5848 1201 3037 -3849 -10859 -9067 -1787 955 -3564
$$ packed form
1886F992K294o199l404L907N223j955p536m043L715N565J00l196j295L648L550
1901G366k075n028l523J143L158J135j976j316K565M096N99m070n023n28L180
1916b97J885l151k848K444N984K370m436o402L22M466J010n446m163L830Q169
1931C737J870o372m512K784M921j835p138l811N417P212J01n888j632M498L984
1946C336m005p738j791N470M891j271m028M49M601K668l217o039j554L242K432
1961b554o66k611N16M280K972j546n008k555J345K809n30l348j133M868N068j91
1977A716n715l399K716L644j597o178j306O264O308q96o546k199N048L754m549
1992b935p601n17Q012N563l362n906Q98P049J836o886p010J792P280K742m519
$$ plain form
2007 -3564 -7145 -3074 3040 2889 -4050 -8363 -5922 -1184 -1931 -5739 -6733 -2055 2484 2159 -2391 -5040
2023 -5040 -4098 -2306 -2717 -5249 -5578 -3349 993 2205 8 -2828 -3755 -2055 -1347 -3971 -6382 -5397
2039 -5397 -483 3043 1392 -2843 -3183 347 1462 -2678 -8013 -6733 149 3906 388 -4015 -1807
2054 -1807 3953 4480 -2895 -8527 -5334 1640 2980 -2111 -4608 382 6820 4914 -2980 -6541 -2265
2069 -2265 2865 1012 -4063 -4053 2335 7530 4748 -1618 -3040 828 3092 346 -3771 -2803 2850 6562
2085 6562 4400 397 -76 2292 3372 1200 -2666 -2674 1800 5256 5033 2352 1156 3210 5036 2753
2101 2753 -1784 -3240 708 5511 5622 2505 1362 4525 7627 4948 -1136 -2852 1289 6432 5044
2116 5044 543 1033 6913 9852 5705 -1059 -1741 3663 6371 3068 -1319 1323 8026 10264 5548
$$ packed form
2007c564l581M071O114j51o939m313K441M738p47l808r94M678M539l25m550k649
2023e040R42J792m11k532l29K229M342J212k197k836r27J700P08k624k411R85
2039e397M914L526j651m235l40L530J115m140n335J280O882L757l518m403K208
2054a807N760N27p375n632L193O974J340n091k497M990O438j906p894l561M276
2069b265N130j853n075J0O388N195k782o366j422L868K264k746m117R68N653L712
2085F562k162m003m73K368J080k172l866qM474L456k23k681j196K054J826k283
2101B753m537j456L948M803J11l117j143L163L102k679o084j716M141N143j388
2116E044m501M90N880K939m147o764o82N404K708l303m387K642O703K238m716
$$ plain form
2131 5548 -135 1053 5212 5566 912 -1914 1491 7592 8695 4792 1762 3055 6066 4846 184
2146 184 -1560 1195 5512 6424 4709 3066 3712 5749 4968 1720 -1086 -208 3481 5619 4279 2101
2162 2101 2767 5619 6298 2908 -1620 -1640 2588 5115 3054 -1 1456 6484 7569 2701 -2559 -1874
2178 -1874 2945 4432 408 -2998 630 7022 7551 1406 -3308 -647 3932 3091 -2343 -4873 503
2193 503 6878 5555 -155 -2656 808 4161 1261 -4045 -5085 327 4760 2830 -1503 -1698 2415
2208 2415 3870 173 -4573 -4857 -515 2335 1084 -1640 -938 2049 3304 315 -3999 -4364 -1982 337
2224 337 -742 -2740 -2291 1101 3216 1061 -3004 -4752 -2541 -348 -1641 -4142 -3414 455 3387 1657
2240 1657 -2551 -4137 -2037 -35 -2070 -5651 -5277 -774 2971 1029 -2867 -3936 -893 379 -2946
$$ packed form
2131E548n683J188M159L54m654k826L405O101J103l903l030J293L011j220m662
2146A84j744K755M317R12j715j643O46K037p81l248k806Q78L689K138j340k178
2162B101O66K852O79l390m528k0M228K527k061l055J457N028J085m868n260O85
2178a874M819J487m024l406L628O392N29o145m714K661M579q41n434k530N376
2193E03O375j323n710k501L464L353k900n306j040N412M433j930m333j95M113
2208B415J455l697m746k84M342K850j251k724P02K987J255k989m314l65K382K319
2224C37j079j998M49L392K115k155m065j748K211K193j293k501P28L869K932j730
2240A657m208j586K100K002k035l581L74M503L745j942l896j069L043J272l325
$$ plain form
2255 -2946 -6797 -6208 -990 2093 227 -3533 -3202 180 1078 -2589 -7067 -6514 -1849 813 -1738 -4495
2271 -4495 -3165 925 1943 -2374 -6816 -6386 -2604 -350 -2990 -5402 -3335 1443 2307 -2228 -6420
2286 -6420 -5842 -1920 -776 -3947 -6703 -3933 1382 2498 -1722 -5888 -4101 -399 -1086 -5894 -7810
2301 -7810 -3540 1621 1650 -2387 -4753 -2670 688 -1411 -6029 -7637 -3530 940 47 -3499 -3947 -696
2317 -696 1478 -812 -5481 -6566 -3599 -381 -931 -3192 -2881 404 2007 61 -4057 -5225 -3199 -837
2333 -837 -1491 -3125 -3193 -184 2026 1204 -2055 -4041 -2552 -951 -1138 -3190 -3667 -725 3330 2845 -492
2350 -492 -3148 -1207 686 20 -3640 -4578 -710 4058 3399 -813 -2468 975 3527 925 -4490 -4444
2366 -4444 367 4545 2755 -450 -1009 3281 5228 1535 -3832 -3803 1518 4139 1576 -1320 102 5004
$$ packed form
2255b946l851N89N218L083j866l760L31L382Q98l667m478N53M665K662k551k757
2271d495J330M090J018m317m442M30L782K254k640k412K067M778Q64m535m192
2286f420N78L922J144l171k756K770N315J116m220m166J787L702o87m808j916
2301g810M270N161K9m037k366K083L358k099m618j608M107M470q93l546m48L251
2317f96K174k290m669j085K967L218n50k261L11L285J603j946m118j168K026K362
2333h37o54j634o8L009K210q22l259j986J489J601j87k052m77K942M055m85l337
2350d92k656J941J893o66l660r38L868M768o59m212j655L443K552k602n415M6
2366d444M811M178j790l205n59M290J947l693n367K9N321K621k563k896J422M902
$$ plain form
2382 5004 6022 1678 -2492 -1381 2045 3166 200 -1713 1581 5547 6388 2427 -838 309 2912
2397 2912 2727 -44 -1328 1565 5260 5677 3156 1009 1643 3283 3089 273 -1660 396 3866 5719
2413 5719 3828 1728 2638 4315 3976 851 -1976 -305 3824 5086 3118 950 2455 5504 5236 1303
2429 1303 -1993 -528 3589 4137 1531 58 3206 6405 5955 874 -1959 401 3590 3046 -27 -663
2445 -663 3065 6701 5215 892 -1044 1313 3525 1732 -1511 -1333 2589 5299 4775 1666 758 2412
2461 2412 3421 771 -1562 -2036 1568 4115 3672 1393 619 2198 3073 1578 -1485 -2301 266 2941
2477 2941 2815 1002 192 2436 3961 2756 -1325 -3092 -711 2471 2222 -468 -764 2368 5508 3027
2493 3027 -1964 -3456 -361 2438 858 -2205 -1656 2948 5539 2271 -2163 -2586 1007 2567 -746
$$ packed form
2382E004J018m344m170J111L426J121k966j913L294L966Q41l961l265J147K603
2397B912j85k771j284K893L695M17k521k147O34J640j94k816j933K056L470J853
2413E719j891k100R10J677l39l125k827J671M129J262j968k168J505L049k68l933
2429A303l296J465M117N48k606j473L148L199m50n081k833K360L189n44l073o36
2445f63L728L636j486m323j936K357K212j793l243J78L922K710n24l109r08J654
2461B412J009k650k333m74L604K547m43k279p74J579Q75j495l063q16K567K675
2477B941j26j813q10K244J525j205m081j767K381L182k49k690k96L132L140k481
2493C027m991j492L095K799j580l063N49M604K591l268m434m23L593J560l313
$$ plain form
2508 -746 -4132 -2306 2651 4681 1108 -2097 -1368 1683 1759 -2537 -4774 -2397 2019 2918 -221 -2337
2524 -2337 -85 2048 982 -2931 -4361 -2448 663 673 -1281 -1535 18 1800 802 -2479 -3868 -2786
2540 -2786 -967 -645 -2076 -1854 -878 1083 1137 -1270 -3354 -3536 -2351 -1203 -2832 -3402 -2319 958 1757
2557 1757 -679 -3685 -3871 -1541 -750 -3162 -5100 -3862 124 1678 -1547 -4393 -3560 -295 -161 -4054
2573 -4054 -6494 -3711 839 1105 -2363 -4555 -2128 1281 -296 -5106 -6890 -3332 746 -36 -3948
2588 -3948 -4608 -649 1754 -869 -5449 -6322 -2357 172 -1721 -4585 -3449 85 2081 -958 -4309
2603 -4309 -4282 -1793 -575 -2605 -4528 -3116 570 1515 -735 -3182 -2889 -1166 -507 -2596 -3959 -2746
2619 -2746 -63 1131 -57 -1918 -1799 -471 -228 -1873 -3556 -3171 -929 997 498 -1041 -1097 410
$$ packed form
2508g46l386J826M957K030l573l205P29L051P6m296k237K377M416Q99l139k116
2524b337K252K133j066l913j430J913L111J0j954k54J553J782r98l281j389J082
2540b786J819L22j431K22R76J961N4k407k084j82J185J148j629n70J083L277P99
2557A757k436l006j86K330P91k412j938J238L986J554l225k846Q33L265J34l893
2573d054k440K783M550K66l468k192K427L409j577m810j784L558M078p82l912
2588c948o60L959K403k623m580q73L965K529j893k864J136L534J996l039l351
2603d309K7K489J218k030j923J412L686R45k250k447K93J723O59k089j363J213
2619b746K683J194j188j861J19J328K43j645j683L85K242J926m99j539n6J507
$$ plain form
2635 410 1363 -344 -3093 -3126 -833 1312 627 -1037 -1330 1533 3097 633 -2632 -2970 126 1422 -111
2652 -111 -2176 -1231 2753 4036 972 -2200 -1776 1520 2217 -515 -2289 -307 3481 4460 1065 -1539
2668 -1539 -138 2713 2192 -983 -2814 26 3586 3606 1086 -462 1482 3213 2082 -934 -2597 -182
2684 -182 3091 3285 1220 143 1893 3839 2578 -435 -1649 -209 2402 2071 632 196 1958 3904
2700 3904 3277 288 -1151 240 2602 2063 168 162 2268 4753 4020 642 -919 455 2163 2493 -215
2717 -215 -743 1996 4419 3860 1013 -275 1683 3383 1453 -1381 -1379 1681 4907 3637 955 543 2763
2734 2763 3835 1365 -1434 -1282 1842 3633 2532 721 855 3246 4340 1865 -1050 -1110 1550 3114
2750 3114 2082 304 1024 3345 4159 1998 -503 -752 1431 2415 1514 213 748 2864 4104 2491
$$ packed form
2635D10R53j707k749l3K293K145o85j664k93K863J564k464l265l38L096J296j533
2652a11k065R45L984J283l064l172M24L296O97k732j774J982L788R79l395k604
2668a539J401K851n21l175j831K840L560K0k520j548J944J731j131l016j663K415
2684a82L273J94k065j077J750J946j261l013j214J440K611l31j439m36J762J946
2700C904o27k989j439J391K362n39j895oK106K485p33l378j561J374J708L30k708
2717b15n28K739K423n59k847j288J958J700j930k834KL060L226j270k682m12K220
2734B763J072k470k799J52L124J791j101j811J34K391J094k475k915o0K660J564
2750C114j032j778P20K321Q14k161k501k49K183R84r01j301N35K116J240j613
$$ plain form
2766 2491 -286 -314 1399 2137 799 -777 -140 2560 3884 2646 26 56 1564 2550 353 -1968 -1094
2783 -1094 1928 3556 1746 -662 -133 2090 2549 -511 -2445 -1282 1771 2448 565 -1156 275 2695
2799 2695 1960 -1109 -3112 -1412 1313 1282 -738 -1887 206 2775 1647 -1418 -3192 -1591 865 440
2815 440 -2110 -2518 -261 2374 1460 -1505 -2777 -1258 304 -717 -2807 -3165 -534 1620 596 -1570
2831 -1570 -2403 -989 -83 -1392 -3297 -3711 -1346 347 423 -1553 -2038 -630 262 -1173 -3640 -3782 -1998
2848 -1998 -443 -677 -2074 -2155 -513 683 -893 -3095 -3548 -2382 -781 -1048 -2394 -2791 -948 695
2864 695 -373 -2808 -3778 -2338 -915 -1413 -3183 -3427 -817 1042 44 -2642 -3630 -1720 -440 -1565
2880 -1565 -3865 -3588 -483 1300 -53 -2785 -2817 -596 752 -1798 -4339 -3914 -433 1671 -620 -2789
$$ packed form
2766B491k777k8J713P38j338j576O37K700J324j238k620L0J508R86k197k321Q74
2783a094L022J628j810k408N29K223M59l060j934J163L053O77j883j721J431K420
2799B695p35l069k003J700K725l1k020j149K093K569j128l065j774J601K456m25
2815D40k550m08K257K635r14k965j272J519J562j021k090l58K631K154j024k166
2831a570q33J414R06j309j905m14K365J693P6j976m85J408Q92j435k467j42J784
2848a998J555k34j397q1J642J196j576k202m53J166J601k67j346l97J843J643
2864F95j068k435r70J440J423m98j770k44K610J859r98k686r88J910J280j125
2880a565k300K77L105J783j353k732l2K221J348k550k541M25L481K104k291k169
$$ plain form
2896 -2789 -2115 494 1132 -1901 -4265 -3045 4 912 -951 -2530 -670 1628 1153 -1442 -3492 -2485
2912 -2485 197 -97 -1733 -2418 -305 1787 1545 -1063 -2514 -1584 -284 -221 -1860 -1802 -374 1613 1123
2929 1123 -413 -1480 -611 -20 -372 -1545 -1965 -659 1059 1846 465 -524 -574 769 472 -1193 -2355
2946 -2355 -1307 926 1955 172 -847 -156 1842 1609 -1036 -2588 -1203 1352 1959 -325 -1037 537
2962 537 2802 2144 -728 -2165 -477 1821 1050 -1022 -824 1647 3386 2476 -619 -1498 673 1990
2978 1990 865 -1412 -915 2024 3200 2090 -210 -604 1238 2063 545 -1149 -635 1932 3066 2280
2994 2280 559 565 1923 2331 751 -1014 -438 1409 2936 2373 757 897 2401 2880 1498 -613 -728
3011 -728 1090 2482 1829 522 965 2688 3466 1931 -402 -394 1711 2737 1232 -96 558 3261 4333
$$ packed form
2896b789O74K609O38l033k364J220L049R08j863j579J860K298m75k595k050J007
2912b485K682k94j636o85K113K092k42k608j451R30J300O3j639N8J428J987m90
2929A123j536j067Q69N91l52j173m20J306J718P87j381r89n0J343k97j665j162
2946b355J048K233J029j783j019O91J998k33k645j552J385K555O07k284p12J574
2962E37K265o58k872j437J688K298p71k072J98K471J739r10l095q79K171J317
2978A990j125k277M97K939J176j110k300l94J842Q25j518j694N14K567J134p86
2994B280j721OJ358M08j580j765N76J847J527n63j616J40J504M79j382k111j15
3011g28J818J392o53j307M43J723P78j535k333QK105J026j505j328O54K703J072
$$ plain form
3028 4333 1638 -305 -32 1962 2493 705 -784 930 3278 3777 1673 -17 913 2180 2008 226
3044 226 -859 827 2945 2914 1010 362 1197 2186 1696 -258 -817 276 1863 2172 1395 757 1385 2166
3062 2166 1473 200 -552 -284 1140 1456 730 -169 611 1955 1983 418 -1215 -652 604 1374 -93 -980
3080 -980 -53 2244 2601 -122 -1722 -557 1177 1050 -1156 -2062 -127 2310 1945 -790 -2134 -151
3096 -151 1458 254 -2468 -2531 72 2198 1084 -1244 -1523 492 1187 -613 -2942 -2556 58 1214
3112 1214 -274 -1729 -1196 808 1234 -730 -2527 -2320 -313 -144 -1275 -1756 -1139 541 1018 -829 -1844
3129 -1844 -1560 -900 -701 -1454 -2033 -1627 -414 370 -157 -1580 -1984 -821 -269 -1352 -2254 -2385 -720 641
3147 641 162 -1710 -1816 -611 -28 -1176 -2470 -2286 -620 1285 -285 -1867 -1790 -103 527 -1387 -3581
$$ packed form
3028D333k695j943K73J994N31j788j489J714K348M99k104j690R30J267j72j782
3044B26j085J686K118l1j904o48Q35R89m90j954n59J093J587L09p77o38O28P81
3062B166o93j273p52K68J424L16p26q99P80J344K8j565j633N63J256P70j467q87
3080i80R27K297L57k723j600J165J734j27k206r06J935K437l65k735j344J983
3096a51J609j204k722o3K603K126j114k328k79K015O95j800k329L86K614J156
3112A214j488j455N33K004M26j964j797K07K007J69j131m81O17J680M77j847j015
3129a844K84O60J99p53n79M06J213P84n27j423m04J163N52j083r02j31J665J361
3147F41m79j872j06J205N83j148j294J84J666J905j570j582P7J687O30j914k194
$$ plain form
3164 -3581 -2709 -129 669 -754 -1968 -1210 784 802 -1544 -3114 -2143 -166 303 -1698 -2317 -958 1170
3181 1170 512 -1327 -2335 -2016 -7 -710 -1654 -2355 -782 921 731 -1120 -2053 -1206 -312 -474 -1704
3198 -1704 -1877 -994 454 549 -645 -1797 -812 261 -329 -1889 -2173 -1146 799 760 -864 -1234 -535 697
3216 697 270 -1951 -2419 -1163 658 647 -963 -1585 -80 1131 272 -1448 -2113 -687 580 169 -1416
3233 -1416 -1334 503 1577 379 -1005 -1818 149 628 -290 -1338 -839 766 1702 610 -959 -580 367
3250 367 763 -95 -1029 -1118 1133 1596 881 -419 0 677 1218 375 -800 -763 607 1623 1193 65 345
3269 345 1295 1764 663 -752 -545 571 1854 807 -90 540 2091 2473 1237 -441 -500 1224 2037
3286 2037 873 -166 352 2045 2666 846 -376 22 1574 2048 391 -799 559 2486 2970 729
$$ packed form
3164c581Q72K580P98j423j214P58J994J8k346j570R71J977M69k001o19J359K128
3181A170o58j839j008L19K009p03r44p01J573J703j90j851r33Q47Q94j62j230
3198a704j73Q83J448R5j194j152R85J073n90j560k84J027J945l9j624l70O99J232
3216F97m27k221m68J256J821j1j610o22J505J211q59j720o65J426J267m11j585
3233a416Q2J837J074j198j384q13J967M79r18j048M99J605R36j092j569L79R47
3250C67L96q58r34q9K251M63p15j300M19O77N41q43j175L7J370J016m30j128K80
3269C45R50M69j101j415K07J116J283j047q97O30J551L82j236j678n9J724Q13
3286B037j164j039N18J693O21j820j222L98J552M74j657j190J358J927M84k241
$$ plain form
3302 729 -242 578 2122 2157 48 -861 677 2818 2255 753 182 1428 2117 1632 -5 -501 803 2242
3320 2242 1835 605 282 1491 2358 1372 -6 -65 491 1652 1276 437 380 1305 2159 1985 188 -475 316
3339 316 1269 1109 -2 137 1112 2368 1618 294 -428 305 1387 773 -313 -283 805 1899 1543 204
3357 204 -364 550 1311 521 -846 -1017 404 1643 1229 50 -218 855 1309 168 -949 -1155 241
3374 241 1138 818 -269 -274 772 1091 24 -1286 -1572 -74 999 250 -456 -582 836 1648 73 -1083
3392 -1083 -1554 10 819 -51 -1267 -839 829 1352 -78 -1546 -1152 195 603 -878 -1933 -626 915
3409 915 1146 -234 -1435 -950 601 467 -1244 -2002 -756 433 657 -692 -1145 -625 184 207 -1494 -1833
3427 -1833 -753 -26 -3 -1572 -1269 -1160 543 11 -1277 -2551 -1564 -698 -1121 -780 -994 -561 219 -198
$$ packed form
3302G29r71Q20J544L5k109r09J538K141n63j502n71J246O89m85j637m96J304J439
3320B242m07j230l23J209Q67r86j378n9N56J161l76q39n7R25Q54j74j797o63P91
3339C16R53j60j111J39R75J256p50j324p22P33J082o14j086L0J088J094l56j339
3357B04n68R14P61p90j367j71J421J239m14j179k68J073M54j141j117k06J396
3374B41Q97l20j087nJ046L19j067j310k86J498J073p49p06j26J418Q12j575j156
3392a083m71J564Q09q70j216M28J668N23j430j468L94J347M08j481j055J307J541
3409I15K31j380j201M85J551j34j711p58J246J189K24j349m53N20Q09K3j701l39
3427a833J080P27K3j569L03J09J703n32j288j274R87Q66m23L41k14M33P80m17
$$ plain form
3445 -198 -973 -1433 -1489 -728 -315 -800 -1750 -1020 204 467 -944 -1616 -1475 -270 -274 -1301 -1981 -1116 360
3464 360 603 -866 -2043 -1367 83 -394 -1728 -2078 -1173 576 20 -1063 -1939 -497 334 -740 -2024
3481 -2024 -2510 -632 306 -370 -1718 -1202 -51 308 -887 -2127 -1987 -448 115 -455 -1628 -695 352
3498 352 484 -452 -1381 -1120 -411 -271 -747 -1331 -884 -22 476 -28 -1046 -1261 -520 -180 -608 -1016 -987 203
3518 203 629 -53 -719 -647 -128 807 -386 -1343 -1126 556 876 264 -926 -558 646 1067 -25 -1361
3536 -1361 -1049 472 1324 240 -425 3 1006 1686 -120 -1180 -216 713 1052 -84 -371 681 2039
3553 2039 1658 65 -636 97 1118 606 54 -255 878 1329 887 131 2 580 813 808 160 -115 465
3572 465 1272 1233 707 348 222 961 809 114 -534 413 1168 1703 572 -21 385 1442 1203 183 -670
$$ packed form
3445a98p75m60n6P61M13m85r50P30J224K63j411o72J41J205mj027o80Q65J476
3464C60K43j469j177O76J450m77j334l50R05J749n56j083q76J442Q31j074j284
3481b024m86J878R38o76j348N16J151L59j195j240J40J539N63n70j173R33J047
3498C52J32r36r29K61P09J40m76n84M47Q62M98n04j018k15P41L40m28m08K9J190
3518B03M26o82o66P2N19R35j193r57K17J682L20o12j190L68J204M21j092j336
3536a361L12J521Q52j084o65M28J003O80j806j060R64R29L39j136k87J052J358
3553B039l81j593p01P33J021n12n52l09J133M51m42p56j29N78K33no48k75N80
3572D65Q07l9n26l59j26P39j52o95o48R47P55N35j131n93M06J057k39j020q53
$$ plain form
3591 -670 115 1137 973 382 67 834 1712 1705 -248 -685 113 1630 1449 4 -352 846 1953 1349 -437
3610 -437 -662 855 1401 1026 -415 -368 1503 1928 886 -483 -247 950 1416 66 -790 -144 1369 1617
3628 1617 491 -242 100 1155 1397 -46 -420 -31 787 1055 689 215 403 918 844 332 -382 -127 322
3647 322 952 377 -105 178 886 1027 571 -197 -256 242 684 577 -183 244 720 1377 770 -101 -625 257
3667 257 693 297 -466 -235 757 1356 693 -361 -94 548 840 -205 -927 -513 890 1288 118 -974
3685 -974 -230 912 561 -515 -1212 -409 889 955 -140 -802 -103 988 631 -748 -1206 -395 724 301
3703 301 -746 -892 169 898 385 -826 -1178 -314 373 -280 -927 -655 -263 650 259 -756 -954 -309 -191
3722 -191 -514 -1255 -953 -46 259 -137 -895 -1231 -443 130 -261 -1287 -998 -385 208 26 -860 -1067 -211 -120
$$ packed form
3591f70P85J022j64n91l15P67Q78pj953m37P98J517j81j445l56J198J107o04j786
3610d37k25J517N46l75j441M7J871M25j042j369K36J197M66j350q56O46J513K48
3628A617j126p33L42J055K42j443l74L89Q18K68l66m74J88N15p4n12p14K55M49
3647C22O30n75m82K83P08J41m56p68n9M98M42j07p60M27M76O57o07q71n24Q82
3667B57M36l96p63K31R92N99o63j054K67O42K92j045p22M14J403L98j170j092
3685i74P44J142l51j076o97Q03J298O6j095o62O99J091l57j379m58Q11J119m23
3703C01j047j46J061P29n13j211l52Q64O87o53o47K72L92R13l91j015j98O45J18
3722a91l23p41L02R07L05l96p58l36P88N73l91j026K89O13N93j82q86k07Q56R1
$$ plain form
3742 -120 -625 -1319 -1336 -562 -9 -136 -1289 -1147 -241 189 -310 -1207 -1609 -781 -124 -547 -1372 -1058 5 62
3762 62 -346 -1132 -1431 -426 -68 -604 -1265 -739 -242 504 -238 -1092 -1228 -497 95 -803 -1131 -972 38 449
3782 449 23 -1209 -922 -102 153 -760 -1452 -919 -58 550 -88 -778 -472 258 215 -937 -1378 -638 281 567
3802 567 -237 -554 -187 525 374 -531 -1060 -446 101 556 -460 -811 -35 831 441 -451 -547 -319 428 -14
3822 -14 -450 -697 19 671 373 -237 -705 -140 453 -143 -615 -562 -119 460 734 74 -477 243 623 113 -491
3843 -491 -544 364 858 728 141 -227 646 810 600 -180 -676 -117 848 630 -42 -172 458 895 579 -239
3863 -239 -721 182 813 345 -158 -218 711 951 770 -218 -362 304 596 120 -318 -324 782 1162 890 54 -257
3884 -257 381 919 440 -5 201 729 912 671 41 81 543 1056 341 -233 -61 701 1151 747 167 186 861
$$ packed form
3742a20n05o94j7P74N53j27j153J42R06M30m99q97m02Q28O57m23q25L14J063N7
3762F2m08p86k99J005L58n36o61N26M97P46p42q54j36P31N92q98l28J59J010M11
3782D49m26j232K87Q20K55r13o92N33Q61O08o38o90L06P30m3j152m41P40R19K86
3802E67q04l17L67P12j51r05n29O14N47M55j016l51P76Q66l90q92r6K28P47m42
3822a4m36k47P16O52k98o10m68N65N93n96m72N3M43N79K74o60n51P20L80n10o04
3843d91n3R08M94j30n87l68Q73J64k10p80m96N59R65k18o72j30O30M37l16q18
3863b39m82R03O31m68n03o0R29K40j81r88j44O66K92m76m38oJ106L80k72q36l11
3884b57O38N38m79m45K06N28J83k41o30M0M62N13p15n74J72P62M50m04n80J9O75
$$ plain form
3905 861 1063 640 -271 -71 752 1190 548 -42 327 914 1018 327 -362 58 1000 726 446 -99 354 1002
3925 1002 1045 396 -345 189 685 784 151 -306 -53 1057 1038 30 -195 399 997 367 -199 -93 462 714
3945 714 1146 3 123 544 945 454 -145 -345 129 771 614 352 502 398 803 698 106 70 165 350
3965 350 493 332 -175 65 731 531 -90 -569 52 -17 585 -57 -555 183 722 676 -191 -348 -376 470 272
3986 272 -760 -732 -27 565 472 -370 -867 35 574 151 -812 -987 -71 541 27 -865 -487 67 617 -511
4006 -511 -1362 -1090 13 320 -309 -894 -495 222 370 -656 -1101 -694 -140 218 -675 -1140 -501 99 -11
4025 -11 -251 -840 -594 -261 37 -348 -950 -466 58 -96 -398 -699 -411 -218 -167 -684 -922 -623 222 318 -345
4046 -345 -655 -837 -206 -8 -459 -1029 -548 -105 96 -185 -743 -579 -95 196 -826 -1233 -581 -17 393 -298
$$ packed form
3905H61K02m23r11K00Q23M38o42n90L69N87J04o91o89M20R42k74k80n45M53O48
3925A002M3o49p41N34M96R9o33m57K53J110j9j008k25N94N98o30n66J06N55K52
3945G14M32j143J20M21M01m91n99k00M74O42j57k62J50j04M05j05n92l6R5J85
3965C50J43j61n07K40O66k00o21m79O21o9O02o42m98P38N39m6q67j57k8Q46j98
3986B72j032K8P05N92r3q42m97R02N39m23r63j75R16O12n14q92L78N54N50j128
4006e11q51K72J103L07o29n85L99P17J48j026m45M07N54L58q93m65O39O00j10
4025a1k40n89K46L33K98l85o02M84N24j54l02l01K88J93N1n17k38K99Q45R6o63
4046c45l10j82O31J98m51n70M81M43K01k81n58J64M84K91j022m07O52N64M10o91
$$ plain form
4066 -298 -368 -395 201 197 -596 -925 -409 -67 388 -410 -647 25 496 112 -404 -644 -223 81 48 -720 -442 -114
4088 -114 408 292 -534 -614 -353 177 -180 -592 -789 -216 416 -9 -125 -477 -282 337 -17 -537 -789 -216
4108 -216 165 538 -313 -389 198 452 4 -1004 -687 42 508 -51 -594 -233 418 746 -97 -801 -484 46
4128 46 655 -387 -314 -142 538 518 14 -555 -255 257 716 50 -628 79 608 581 158 -265 -230 479 497 63
4150 63 -305 -127 143 503 38 -53 -80 249 180 -44 -63 -322 65 895 352 -252 169 -3 607 351 -243 -230
4172 -230 286 622 299 -182 282 641 880 458 -225 -94 353 853 303 29 321 963 1023 -69 -409 21
4192 21 709 747 303 7 401 1318 589 -35 -6 111 1061 491 -11 -203 389 860 943 224 57 245 1035
4213 1035 607 -134 -83 506 657 452 260 -61 449 704 421 -411 -6 -15 269 500 -1 -95 438 666 494
$$ packed form
4066b98p0k7N96mp93l29N16L42M55p98k37O72M71l84n16k40M21L04l3p68K78L28
4088a14N22j16q26q0K61N30l57m12j97N73O32m25j16l52J95O19l54n20k52N73
4108b16L81L73q51p6N87K54m48j008L17P29M66n59n43L61O51L28q43p04L17N30
4128D6O09j042P3J72O80k0n04n69L00N12M59o66o78P07N29k7m23m23L5P09J8m34
4150F3l68J78K70L60m65r1k7L29o9k24j9k59L87Q30n43o04M21j72O10k56n94J3
4172b30N16L36l23m81M64L59K39m22o83J31M47N00n50k74K92O42O0j092l40M30
4192B1O88L8m44k96L94R17p29o24K9J17R50n70n02j92N92M71Q3p19j67J88P90
4213A035m28p41N1N89J51k05j92l21N10K55k83q32M05rK84K31n01r4N33K28j72
$$ plain form
4234 494 -63 -175 241 673 649 -334 120 366 805 435 -310 -269 218 567 189 -278 -291 455 539 450 -249 -388
4256 -388 352 392 45 -521 72 260 529 147 -244 -190 94 422 23 -693 -210 161 469 276 -222 -68 273
4277 273 587 -117 -610 -554 39 266 87 -142 -222 1 434 -183 -663 -512 49 60 67 -470 -268 457 270 100
4299 100 -661 -593 -19 168 -454 -751 -397 241 383 -104 -847 -280 260 87 -499 -954 -88 301 433 -410
4319 -410 -457 -499 69 353 -460 -893 -485 -78 84 -650 -562 199 141 -286 -691 -399 -313 87 6 -449 -599 328
4341 328 238 -168 -409 -521 -403 191 -72 -743 -356 -78 -48 29 -336 -601 -303 162 17 -727 -711 -181 262
4362 262 270 -245 -391 -233 147 -218 -555 -366 -369 117 -101 -299 -366 -117 110 -265 -685 -857 -113 144 -304 -407
4384 -407 -318 120 460 -117 -631 -829 73 241 -337 -319 -472 -54 210 -241 -699 -646 -240 195 -96 -733 -346
$$ packed form
4234D94n57j12M16M32k4r83M54K46M39l70p45M1M87L49l78m67j3P46Q4q9o99j39
4256c88P40M0l47n66N93J88K69l82l91N4K84L28l99p16M83L71L08j93m98J54L41
4277B73L14p04m93N6N93K27j79k29q0K23M33o17m80J51N61J1Pn37K02P25j87j70
4299A00p61O8N74J87o22k97L54O38J42m87p43N67N40j73n86m55Q66L89J32q43
4319d10m7m2N68K84q13m33M08M07J62p34Q8P61n8m27m05K92Q6M00q1m55j50R27
4341C28r0m06k41j12J18N94k63o71L87K78L0P7l65k65K98M65j45p44J6N30M43
4362B62Qn15j46J58L80l65l37J89lM86k18j98o7K49K27l75m20j72P44K57m48j03
4384d07Q9M38L40n77n14j98R02J68n78J8j53M18K64m51m58N3M06M35k91o37L87
$$ plain form
4405 -346 85 434 71 -536 -359 -51 92 -353 -705 -135 205 554 -25 -616 -474 314 372 -106 -455 -279
4425 -279 540 157 131 -299 -107 457 515 36 -469 13 613 156 44 -76 421 829 382 144 -304 -10 496
4446 496 242 -152 -76 545 345 475 397 -92 195 490 275 144 -63 215 686 308 187 -13 36 521 456
4467 456 73 -262 147 642 691 122 -118 209 552 519 166 -255 199 598 487 77 81 -61 571 457 -168
4488 -168 71 230 1141 505 -139 -93 229 451 458 -192 -284 710 340 343 33 -65 661 789 808 -160 -153 417 564
4511 564 -1 -195 135 408 596 435 -87 232 480 439 373 -309 -103 375 302 277 8 42 604 356 12 -504
4533 -504 -200 535 756 15 -209 176 296 356 55 -90 -259 323 268 -190 -64 -142 245 178 41 -325 -34
4554 -34 58 177 49 -156 -140 206 453 -225 -446 -326 21 -43 -1 -275 -124 444 470 79 -317 8 438 29
$$ packed form
4405c46M31L49l63o07J77L08J43m45l52N70L40L49n79n91J42P88N8m78l49J76
4425b79Q19l83k6m30J92N64N8m79n05M82O00m57j12j20M97M08m47k38m48K94N06
4446D96k54l94P6O21k00J30p8m89K87K95k15j31k07K78M71l78j21k00M9M85o5
4467D56l83l35M09M95M9n69k40L27L43l3l53m21M54L99j11m10Mj42O32j14o25
4488a68K39J59R11o36o44M6L22K22Po50r2R94l70Ll10r8P26J28J9r68PN70J47
4511E64n65j94L30K73J88j61n22L19K48m1o6o82K06M78p3k5k69L4N62k48l44n16
4533e04L04P35K21p41k24L85J20O0l01j45j69N82n5m58J26p8L87o7j37l66K91
4554c4R2J19j28k05J6L46K47o78k21J20L47o4M2k74J51N68K6l91l96L25M30m09
$$ plain form
4576 29 -421 -315 84 340 307 23 -448 134 73 151 -273 -539 -107 260 108 -347 -274 -105 482 39 -420 -446
4598 -446 -199 169 272 -495 -291 15 373 294 -377 -497 -41 201 148 -238 -883 179 199 -41 -329 -574 2
4619 2 243 35 -710 -440 201 515 6 -238 -355 -136 -7 -122 -515 -481 -130 322 -359 -682 -644 -70 -273
$$ packed form
4576B9m50J06L99K56l3k84m71N82o1P8m24k66M32L67j52m55P3J69N87m43m59k6
4598d46K47L68J03p67K04L06L58p9o71j20M56K42n3l86o45J062K0k40k88k45N76
4619BK41k08p45K70O41L14n09k44j17K19J29j15l93L4L51M52o81l23L8N74k03
$$ [...]
8191F1
##END NTUPLES=NMR FID
##END=
