##TITLE=1H_LR-713_CR2
 CDCl3, 8 sc, 
 7.7.2020
##JCAMPDX= 6.0         $$ Bruker NMR JCAMP-DX V2.0
##DATA TYPE= NMR FID
##DATA CLASS= NTUPLES
##ORIGIN= UXNMR, Bruker Analytische Messtechnik GmbH
##OWNER= root
$$ XWIN-NMR		Version 3.5
$$ Wed Jul  8 10:05:24 2020 Russian Standard Time (UT+4h)  she@DPX200
##.OBSERVE FREQUENCY= 200.1315
##.OBSERVE NUCLEUS= ^1H
##.DELAY= (6, 6)
##.ACQUISITION MODE= SIMULTANEOUS
##.ACQUISITION SCHEME= undefined
##.AVERAGES= 8
##.DIGITISER RES= 18
##SPECTROMETER/DATA SYSTEM= spect
##.PULSE SEQUENCE= zg30
##.SOLVENT NAME= CDCl3
##.SHIFT REFERENCE= (INTERNAL, CDCl3, 0, 15.7039)
##AUDIT TRAIL= $$ (NUMBER, WHEN, WHO, WHERE, WHAT)
$$ ##TITLE= Audit trail, XWIN-NMR		Version 3.5
$$ ##JCAMPDX= 5.01
$$ ##ORIGIN= Bruker BioSpin GmbH
$$ ##OWNER= she
$$ F:/spectra/data/she/nmr/H-F/1/audita.txt
$$ ##AUDIT TRAIL=  $$ (NUMBER, WHEN, WHO, WHERE, WHAT)
(   1,<2020-07-08 10:04:17.89 +0400>,<she>,<DPX200>,
      <created by zg, POWCHK disabled, PULCHK disabled
       configuration hash MD5:
       00 E9 B6 7A A2 85 ED C7 34 08 36 98 17 FE 4E 26
       data hash MD5: 16K
       11 04 2D 87 6A 0A B7 F1 E1 F9 16 9F 33 1A D7 C2>)
$$ ##END=
$$ 
$$ hash MD5
$$ 39 CA F6 69 92 AA 33 E4 2E 88 21 5D 74 A8 72 85
##$RELAX= 
##$RELAX= 
##$RELAX= 
##$RELAX= 
##$RELAX= 
##$RELAX= 
$$ Bruker specific parameters
$$ --------------------------
##$DU= <F:/spectra>
##$EXPNO= 1
##$NAME= <H-F>
##$PROCNO= 1
##$TYPE= <nmr>
##$USER= <she>
##$AMP= (0..31)
100 100 100 100 100 100 100 100 100 100 100 100 100 100 100 100 100 100 
100 100 100 100 100 100 100 100 100 100 100 100 100 100 
##$AQSEQ= 0
##$AQ_mod= 1
##$AUNM= <au_zg>
##$AUTOPOS= <>
##$BF1= 200.13
##$BF2= 200.13
##$BF3= 200.13
##$BF4= 200.13
##$BF5= 200.13
##$BF6= 200.13
##$BF7= 200.13
##$BF8= 200.13
##$BYTORDA= 1
##$CFDGTYP= 0
##$CFRGTYP= 5
##$CHEMSTR= <none>
##$CNST= (0..31)
1 1 145 1 1 1 1 1 1 1 1 1 1 1 1 1 1 1 1 1 1 1 1 1 1 1 1 1 1 1 1 1 
##$CPDPRG= <>
##$CPDPRG1= <>
##$CPDPRG2= <>
##$CPDPRG3= <>
##$CPDPRG4= <mlev>
##$CPDPRG5= <mlev>
##$CPDPRG6= <mlev>
##$CPDPRG7= <mlev>
##$CPDPRG8= <mlev>
##$CPDPRGB= <>
##$CPDPRGT= <>
##$D= (0..31)
0 1.2 0 0 0 0 0 0 0 0.06 0 0.03 0 0 0 0 0.0002 0 0 0 0 0 0 0 0 0 0 0 0 
0 0 0 
##$DATE= 1594188257
##$DBL= (0..7)
120 120 120 120 120 120 120 120 
##$DBP= (0..7)
150 150 150 150 150 150 150 150 
##$DBP07= 0
##$DBPNAM0= <>
##$DBPNAM1= <>
##$DBPNAM2= <>
##$DBPNAM3= <>
##$DBPNAM4= <>
##$DBPNAM5= <>
##$DBPNAM6= <>
##$DBPNAM7= <>
##$DBPOAL= (0..7)
0.5 0.5 0.5 0.5 0.5 0.5 0.5 0.5 
##$DBPOFFS= (0..7)
0 0 0 0 0 0 0 0 
##$DE= 6
##$DECBNUC= <off>
##$DECIM= 24
##$DECNUC= <off>
##$DECSTAT= 4
##$DIGMOD= 1
##$DIGTYP= 9
##$DL= (0..7)
0 120 120 120 120 120 120 120 
##$DP= (0..7)
150 150 150 150 150 150 150 150 
##$DP07= 0
##$DPNAME0= <>
##$DPNAME1= <>
##$DPNAME2= <>
##$DPNAME3= <>
##$DPNAME4= <>
##$DPNAME5= <>
##$DPNAME6= <>
##$DPNAME7= <>
##$DPOAL= (0..7)
0.5 0.5 0.5 0.5 0.5 0.5 0.5 0.5 
##$DPOFFS= (0..7)
0 0 0 0 0 0 0 0 
##$DQDMODE= 0
##$DR= 18
##$DS= 0
##$DSLIST= <SSSSSSSSSSSSSSS>
$$ [...]
##$SUBNAM2= <"">
##$SUBNAM3= <"">
##$SUBNAM4= <"">
##$SUBNAM5= <"">
##$SUBNAM6= <"">
##$SUBNAM7= <"">
##$SUBNAM8= <"">
##$SUBNAM9= <"">
##$SW= 24.9337058887773
##$SWIBOX= (0..15)
0 0 2 0 0 0 0 0 0 0 0 0 0 0 0 0 
##$SW_h= 4990.01996007984
##$TD= 16384
##$TD0= 1
##$TE= 0
##$TE2= 300
##$TE3= 300
##$TEG= 300
##$TL= (0..7)
0 120 120 120 120 120 120 120 
##$TP= (0..7)
150 150 150 150 150 150 150 150 
##$TP07= 0
##$TPNAME0= <>
##$TPNAME1= <>
##$TPNAME2= <>
##$TPNAME3= <>
##$TPNAME4= <>
##$TPNAME5= <>
##$TPNAME6= <>
##$TPNAME7= <>
##$TPOAL= (0..7)
0.5 0.5 0.5 0.5 0.5 0.5 0.5 0.5 
##$TPOFFS= (0..7)
0 0 0 0 0 0 0 0 
##$TUNHIN= 0
##$TUNHOUT= 0
##$TUNXOUT= 0
##$USERA1= <user>
##$USERA2= <user>
##$USERA3= <user>
##$USERA4= <user>
##$USERA5= <user>
##$V9= 5
##$VALIST= <valist>
##$VCLIST= <CCCCCCCCCCCCCCC>
##$VD= 0
##$VDLIST= <DDDDDDDDDDDDDDD>
##$VPLIST= <PPPPPPPPPPPPPPP>
##$VTLIST= <TTTTTTTTTTTTTTT>
##$WBST= 1024
##$WBSW= 4
##$XGAIN= (0..3)
0 0 0 0 
##$XL= 0
##$YL= 0
##$YMAX_a= 128363
##$YMIN_a= -73095
##$ZGOPTNS= <>
##$ZL1= 120
##$ZL2= 120
##$ZL3= 120
##$ZL4= 120
##$ABSF1= 10
##$ABSF2= 0
##$ABSG= 5
##$ABSL= 3
##$ALPHA= 0
##$AQORDER= 0
##$ASSFAC= 0
##$ASSFACI= 0
##$ASSFACX= 0
##$ASSWID= 0
##$AUNMP= <proc_1d>
##$AZFE= 0.1
##$AZFW= 0.1
##$BCFW= 1
##$BC_mod= 2
##$BYTORDP= 1
##$COROFFS= 0
##$CY= 11.3945322036743
##$DATMOD= 1
##$DC= 2
##$DFILT= <>
##$DTYPP= 0
##$F1P= 16.9975609425685
##$F2P= -3.02152046262296
##$FCOR= 0.5
##$FTSIZE= 0
##$FT_mod= 4
##$GAMMA= 1
##$GB= 0.15
##$INTBC= 1
##$INTSCL= 1
##$ISEN= 128
##$LB= 0.24
##$LEV0= 0
##$LPBIN= 0
##$MAXI= 10000
##$MC2= 0
##$MEAN= 0
##$ME_mod= 0
##$MI= 1.114404
##$NCOEF= 0
##$NC_proc= 0
##$NLEV= 6
##$NOISF1= 3.799351
##$NOISF2= 2.8
##$NSP= 1
##$NTH_PI= 0
##$NZP= 0
##$OFFSET= 15.70392
##$PC= 1
##$PHC0= -9788.929
##$PHC1= 8.20086
##$PH_mod= 1
##$PKNL= yes
##$PPARMOD= 0
##$PSCAL= 0
##$PSIGN= 0
##$REVERSE= no
##$SF= 200.130013532006
##$SI= 16384
##$SIGF1= 3
##$SIGF2= 2
##$SINO= 400
##$SIOLD= 16384
##$SREGLST= <1H.CDCl3>
##$SSB= 0
##$STSI= 0
##$STSR= 0
##$SW_p= 3612.71676300578
##$SYMM= 0
##$S_DEV= 0
##$TDeff= 0
##$TDoff= 0
##$TI= <>
##$TILT= no
##$TM1= 0
##$TM2= 0
##$TOPLEV= 0
##$USERP1= <user>
##$USERP2= <user>
##$USERP3= <user>
##$USERP4= <user>
##$USERP5= <user>
##$WDW= 1
##$XDIM= 8192
##$YMAX_p= 0
##$YMIN_p= 0
$$ End of Bruker specific parameters
$$ ---------------------------------
##NTUPLES= NMR FID
##VAR_NAME=  TIME,          FID/REAL,        FID/IMAG
##SYMBOL=    X,             R,               I
##VAR_TYPE=  INDEPENDENT,   DEPENDENT,       DEPENDENT
##VAR_FORM=  AFFN,          ASDF,            ASDF
##VAR_DIM=   8192,          8192,            8192
##UNITS=     SECONDS,       ARBITRARY UNITS, ARBITRARY UNITS
##FACTOR=    0.0002004,     1,               1
##FIRST=     0,             0,               0
##LAST=      1.6414764,     0,               0
##MIN=       0,             -73095,          0
##MAX=       1.6414764,     128363,          0
$$ Real data points
##PAGE= N=1
##DATA TABLE= (X++(R..R)), XYDATA
0@%%%%%%%%%%%Qj6J6j6J6k0K8l2L7m5N1n9P0q1R2j06J22j39J57j74J96k21K46
$$ 0 0 0 0 0 0 0 0 0 0 0 0 8 -8 8 -8 8 -12 16 -16 21 -24 27 -32 38 -43 49 -57 65 -74 83 -91 105 -116 130
34A30k76L09l43L82m26M72n21N77o41P09p86Q72r64J071j197J339j504J701j940
$$ 130 -146 163 -180 202 -224 248 -273 304 -337 372 -414 458 -506 565 -632 707 -797 904 -1036
53a036K236k610L109l812M878o713J0768l9984L2970M0469n9936k9853K8072M1960
$$ -1036 1200 -1410 1699 -2113 2765 -3948 6820 -33164 -194 40275 -19661 -49514 -21442 20518
67B0518k6687n3542j3384M4486L3908q103k5713O164K8893J5107k1592l0186r583
$$ 20518 -6169 -59711 -73095 -28609 5299 -2804 -28517 -22353 6540 21647 55 -30131 -39714
80c9714J5437J4340J592m809N919J6845J4968m636k2205j9337L233J6960O222
$$ -39714 -24277 -9937 -8345 -13154 -7235 9610 24578 19942 -2263 -21600 -18367 -1407 4815
93D815j0721m759J9191K5212J663k2781j8328N470J1731m183j5732k048K1307
$$ 4815 -5906 -10665 8526 33738 35401 12620 -5708 -238 11493 7310 -8422 -10470 10837
106A0837K5734P242j3455j5715l328P208J297j4914j5046J1697L5920K1208j9567
$$ 10837 36571 43813 30358 14643 11315 18523 19820 4906 -10140 1557 37477 58685 39118
119C9118k9749N745K9783l75m2460k5587L1080M5993j13l5598p996L4676K3670
$$ 39118 9369 15114 44897 44522 2062 -23525 7555 53548 53435 17837 9841 44517 68187
132F8187k7343m4856m454L4634K1724j6408k0337J2824L1134P232k5679k4234
$$ 68187 40844 -4012 -8466 26168 47892 31484 11147 23971 55105 62337 36658 12424
144A2424J796J4485K044j0870n624J1146J9055J1242n550j7216j3139K802R019
$$ 12424 14220 28705 30749 19879 14255 25401 44456 55698 50148 32932 19793 22595 31614
157C1614l322j5087k410K2931K5375l786k5296j1228J4691J1439j7352k6151J901
$$ 31614 28292 13205 10795 33726 59101 55315 30019 18791 33482 44921 27569 1418 3319
170C319K9735K0539r070j7325Q10J4632J564j9459k0992J088K1164J7804m096
$$ 3319 33054 53593 44523 27198 28008 42640 44204 24745 3753 4841 26005 43809 39713
183C9713j5763j153J7283R835j8778k8239l188K3258J5897j2947j7557R116K8357
$$ 39713 23950 22797 40080 49915 31137 2898 -290 22968 38865 25918 8361 17477 45834
196D5834Q264k5235k6885K444K0930L488j9470j0894J8882K6730Q44k2504j5070
$$ 45834 54098 28863 1978 4422 25352 28840 9370 -1524 17358 44088 44932 22428 7358
209G358O068R224o569j5153l809J2537J5718N907n782j1161l370M683J152j1976
$$ 7358 13426 22650 16081 928 -2881 9656 25374 31281 25499 14338 10968 15651 16803 4827
223D827j5956K346K3059J8005r001j9950r84J7566L256k4588k2853R730K7472
$$ 4827 -11129 -8783 14276 32281 23280 3330 2346 19912 23168 -1420 -24273 -14543 12929
236A2929Q232j7764j2172J3763K0070n028k6834j6943J0276J7846K01j5332l785
$$ 12929 21161 3397 -8775 4988 25058 20030 -6804 -23747 -13471 4375 4576 -10756 -14541
249a4541J7510J6773m837k2339j4450O762J1743l181j3570m072J5679J9513L84
$$ -14541 2969 19742 14905 -7434 -21884 -15122 -3379 -6560 -20130 -24202 -8523 10990 11374
262A1374j8660j4315O157J1609o760j9618n534J9487K2352j473j7904q064R932
$$ 11374 -7286 -21601 -15444 -3835 -10595 -30213 -35747 -16260 6092 4619 -13285 -21349 -11417
275a1417O288j1758j8877k660J6299J5644O98j0202m657O577P611o370j9032j0643
$$ -11417 -5129 -16887 -35764 -38424 -22125 -6481 -5783 -15985 -20642 -14065 -6454 -12824 -31856 -42499
289d2499J1041J9093L278j3983o686J5072J6284q973k6923j1655J5115J7724n855
$$ -42499 -31458 -12365 -9087 -23070 -29756 -14684 1600 -7373 -34296 -45951 -30836 -13112 -18967
302a8967j7481J932K4398J4601j4260k4605l602J6252P261j4345j3668R435K3989
$$ -18967 -36448 -34516 -10118 4483 -9777 -34382 -37984 -21732 -14471 -28816 -42484 -33049 -9060
315i060Q712j2358j4004J279P988j897j2252p968O523J6295J0651j953r874l512
$$ -9060 -348 -12706 -26710 -25431 -17443 -19340 -31592 -39560 -33037 -16742 -6091 -8044 -17918 -21430
329b1430N266K532r035j3608j69J6349J5402k769j1329q21J1356N096j2631j7707
$$ -21430 -16164 -13632 -22667 -36275 -36444 -20095 -4693 -7462 -18791 -19612 -8256 -3160 -15791 -33498
343c3498j598J5304J2760l591r724K574J5571P728j3231k0205l670J5723J1312
$$ -33498 -35096 -19792 -7032 -10623 -20347 -17773 -2202 5526 -7705 -27910 -31580 -15857 -4545
356d545p683j2785O260K2190J0566j6168k1475m53J6854N910j6164j3456J3088
$$ -4545 -12228 -25013 -18753 3437 14003 -2165 -23640 -24093 -7239 -1329 -17493 -30949 -17861
369a7861K6845P708j8848j6898O960J5968m424k1749q222J9213K2157M80j5739
$$ -17861 8984 16692 -2156 -19054 -12094 3874 -550 -22299 -30521 -11308 10849 11329 -4410
382d410m657J0637O743j0551j6179k674J2028J2189J583m849p79N230N334m168
$$ -4410 -9067 1570 8313 -2238 -18417 -21091 -9063 3126 4709 -140 -919 4311 9645 5477
396E477j2103q739L717J1573N550l739l879O574J1011M43j3912j3117J963J1618
$$ 5477 -6626 -15365 -11648 -75 5475 1736 -2143 4431 15442 15885 1973 -11144 -9181 2437
410B437M060q116n269J0739J7246K456j5971j4144L556J1879m53j3245m752J5029
$$ 2437 6497 -1619 -6888 3851 21097 23553 7582 -6562 -3006 8873 8420 -4825 -9577 5452
424E452J9104J647j6228j1055O239J1326m998j7119n535J6473K0872p11j5861
$$ 5452 24556 26203 9975 -1080 5159 16485 11487 -5632 -11167 5306 26178 25467 9606
437I606o743J2320R893j1739k0496k098J9471J5635n409j2370J697J3744N183
$$ 9606 2863 15183 25076 13337 -7159 -9257 10214 25849 20440 8070 9767 23511 28694
450B8694j3673j6131N8J2174Q155m767o040L909J2607O126q906j3893m854O704
$$ 28694 15021 -1110 -1052 11122 19277 14510 8470 12379 24986 31112 22206 8313 3459 10163
464A0163O450k189o628K223J3579J0342n703j4750p461P028O887n798j1066J263
$$ 10163 16613 14424 7796 10019 23598 33940 28237 13487 6026 13054 19941 14143 3077 4340
478D340J7168J3676o171j5226m199R807M386j2148j3528M047J8757J0705o886
$$ 4340 21508 35184 29013 13787 9588 19395 23781 11633 -1895 2152 20909 31614 24728
491B4728j1549L34J0285J523j3944j3454K724J5984Q827p124r362M106J2938J229
$$ 24728 13179 13513 23798 25321 11377 -2077 647 16631 25458 18334 8972 13078 26016 27245
505B7245j5283j4293K914J3222M879q863o127Q515J3036M09j3694j2296J899R038
$$ 27245 11962 -2331 583 13805 18684 9821 3694 12209 25245 25654 11960 -336 1563 10601
519A0601P20q199m110Q734J2597K103j0548j0369l52N848M16q325n747O971J3670
$$ 10601 11321 3122 -988 7746 20343 22446 11898 1529 1177 7025 7441 -884 -6631 340 14010
534A4010O632q295j1267j640P314M93j1721r696O364J7856O761j0332j0376M103
$$ 14010 20642 12347 1080 -560 6754 7247 -4474 -14170 -7806 10050 16811 6479 -3897 206
548B06J0400k720j6011j0596Q515J5950K620j0156n155Q869J0346m498j6713r379
$$ 206 10606 7886 -8125 -18721 -10206 5744 8364 -1792 -6947 1922 12268 7770 -8943 -18322
562a8322P169J1239L06r926k116J1368J1742m442j5660p997O351Q046l736r727
$$ -18322 -11153 86 392 -9534 -11650 -282 11460 7018 -8642 -16639 -10288 -2242 -5978 -15705
576a5705j77J3316J2223l547j3567o720N463N842o241j0918L55J3560J1561k564
$$ -15705 -15882 -2566 9657 6110 -7457 -14177 -8714 -2872 -9113 -20031 -19676 -6116 5445 2881
590B881j0636l894N697L616p440j1463r02J1521J0426j47p672l215O455M549o481
$$ 2881 -7755 -11649 -5952 -2336 -9776 -21239 -22141 -10620 -194 -341 -8013 -11228 -4773 -224 -6705
605f705j3390m314J0318J1593j582q413j019J0380O914q173j4807l681R121Q305
$$ -6705 -20095 -24409 -14091 -2498 -4080 -12493 -13512 -3132 3782 -4391 -19198 -22879 -13758 -5453
619e453l474p674J890J2604P698q115j3901m076P434N431n743p773M158J4335
$$ -5453 -8927 -16601 -14711 -2107 5591 -2524 -16425 -20501 -13067 -7636 -13379 -21152 -16994 -2659
633b659P956p075j2016k917O276K758p626q543L468J4553R266n126j0748j156
$$ -2659 5297 -1778 -13794 -16711 -10435 -7677 -15303 -23846 -20378 -5825 3441 -1685 -12433 -13589
647a3589P476J931j0258j1391L541J4614Q375n993q342K967R232M52j2134j0690
$$ -13589 -6113 -4182 -14440 -25831 -22290 -7676 699 -5294 -13636 -10669 -1437 -985 -13119 -23809
661b3809K826J1732O016n434n397M948J0738J401j1778j1804J462J0355L911o841
$$ -23809 -20983 -9251 -3235 -8669 -14066 -9118 1620 3021 -8757 -20561 -19099 -8744 -4833 -11674
675a1674m273P417J2811J817j1575j0614J584Q057J041q226m196R539J3683K650
$$ -11674 -15947 -8530 4281 6098 -5477 -16091 -14507 -6450 -5409 -13635 -17831 -8292 5391 8041
689H041j0127r092K701O865j776j0102l807R135J3073K493p836o012M266N363
$$ 8041 -2086 -11178 -8477 -1612 -3388 -13490 -17297 -8162 4911 7404 -432 -6444 -2178 3185
703C185l169j0577m852Q051J1304L471p049l815N153P313l294j1884o905O926
$$ 3185 16 -10561 -15413 -7362 3942 7413 364 -3451 1702 9015 5721 -6163 -13068 -6142
717f142J0751J391o436k070Q859Q080l786j2322o754N350Q000j18o442l2J0041
$$ -6142 4609 6000 -436 -2506 6353 14433 10647 -1675 -8429 -3079 4921 4803 -1639 -1671 8370
732H370R543k471j2165o551M574O306k837p617l9J0945J0918j573j0327n159M253
$$ 8370 17913 15442 3277 -3274 1300 7606 4769 -2848 -2887 8058 18976 17403 7076 1917 6170
747F170M590m362r623q34J1497J1322j232r548l596N990N127o676j1584r38J0847
$$ 6170 10760 6398 -3225 -4059 7438 18760 17528 7980 4384 10374 15501 8825 -2759 -3697 7150
762G150R497j657q263j76Q019M424q344j1366k456R380P679k892o359K050J0365
$$ 7150 16647 14990 6727 6551 14570 18994 10650 -716 -3172 6208 13887 10995 4636 6686 17051
777A7051M551q288j1993k217P826M970m902o069M106J2092M961q209j0622j343
$$ 17051 21602 13314 1321 -896 6930 11900 6998 929 5035 17127 22088 13879 3257 1914
791A914O220K240o953n464N303J1802N292o688q891j80N358o6p595o323N002J0738
$$ 1914 8134 10374 3421 -2043 3260 15062 20354 13666 4775 4595 9953 9887 2292 -4031 971 11709
807A1709N189n004o539R67M681K20q166p640K395J0054N457l838n393K080P087
$$ 11709 16898 11894 5355 6322 11003 11223 3057 -4583 -2188 7866 13323 9485 4092 6172 13259
822A3259N14r522r375J730R150M200m852m394M194R532J212r630r825J129P476
$$ 13259 13773 4251 -5124 -3394 5756 9956 5104 710 4904 14436 15648 6018 -3807 -2678 4798
837D798K291n802m470O082J0966K299r625r424J349O752N6p701m065P740J1163
$$ 4798 7089 1287 -3183 2899 13865 16164 6539 -2885 -1536 5216 5272 -2429 -6494 1246 12409
852A2409J820q864p556K992N667j952r410m455Q027J1509J044q564m549M734N837
$$ 12409 14229 5365 -2191 801 6468 4516 -4894 -9349 -1322 10187 11231 2667 -1882 2852 8689
867H689m577j0709m149P595R107J7o371j894O425N530m708j0920m608N834P309
$$ 8689 4112 -6597 -10746 -3151 5956 5973 -398 -2292 4133 9663 4955 -5965 -10573 -4739 2570
882B570q04o634n3Q238O414m875j0585m028M859M611k574n630L55R149O615l418
$$ 2570 1766 -4868 -4921 3317 9731 4856 -5729 -9757 -4898 -287 -2861 -8491 -8136 1013 7628 4210
898D210q958m046L525L570l661o434O95Q895P263k267p935l013L682K392m164
$$ 4210 -4748 -8794 -5269 -1699 -5360 -11794 -11099 -2204 5059 2792 -5143 -8156 -4474 -2082 -6246
913f246p506k73P455P806j154o171k473M993L356n328r058k130Q044P478j437
$$ -6246 -13752 -14025 -6570 1236 82 -6089 -8562 -3569 -213 -5541 -14599 -16729 -8685 -1207 -2644
928b644o575l57P222M411o465j0790j842P709O114l252n895J785R421M792p328
$$ -2644 -9219 -9576 -2354 2057 -4408 -15198 -17040 -9331 -3217 -6469 -12364 -10579 -1158 3634 -3694
943c694j0181j753P274L981n451n595M293J0912M140p418q808O4O683P03o987
$$ -3694 -13875 -15628 -8354 -4373 -9824 -15419 -11126 -214 3926 -3492 -12300 -12236 -5553 -4850 -11837
958a1837n233N524J0318L903n910o692J309N281k77p368n253M560R432L199n098
$$ -11837 -17070 -11546 -1228 2675 -3235 -9927 -8618 -3337 -3614 -10982 -16235 -11675 -2243 956 -4142
973d142m093K890N290q71p918n471K736P517L008l370l004L411O441N53q042p119
$$ -4142 -8235 -5345 -55 -926 -8844 -14315 -11579 -4062 -1054 -4424 -7428 -4017 2424 2977 -5065 -12184
989a2184J546O791L131m686l201N230Q246J011q190p314J428O612O79n629k996
$$ -12184 -10638 -3847 -716 -5402 -8603 -3373 4873 5884 -2306 -9620 -8192 -1580 -901 -6530 -9526
1004i526O258J0050P76p825o769K768N676j210p745k143P560R091M83p390m192
$$ -9526 -3268 6782 7558 -267 -7036 -4268 1408 198 -7547 -9690 -2130 6961 7444 54 -4138
1019d138L972M611k999q319k149O813P833J46n575k133N054M049l776q244l099
$$ -4138 -166 4445 1446 -6873 -9022 -2209 5624 5770 195 -1938 3116 7165 3389 -4855 -7954
1034g954N583O701k43m162n03N457M527l330p873m255L835N390k26m528k65O626
$$ -7954 -2371 4330 4087 -75 -578 4879 9406 6076 -1797 -6052 -2217 3173 2947 -1581 -1846 4780
1050D780O352j989q842m643L518N046j683n630m7Q334P439k097q813l988M826
$$ 4780 11132 9143 301 -4342 -824 4222 2539 -3091 -3138 5196 12635 10538 1725 -2263 2563
1065B563L983m035p604M02R808P617l168q128j078O264L011o392q246J013R420
$$ 2563 6546 2511 -5093 -4691 5117 12734 9566 1438 360 6624 9635 3243 -5003 -3990 5430
1080E430N564l829n132J123P113J575p658p341R54P192L909l545l780L200O912
$$ 5430 10994 7165 2033 3156 10269 11844 4186 -3155 -2201 4991 8900 5355 1575 4775 11687
1095A1687J065o594o740N37N397K038l673k404L803O874J966n436o292p87L755
$$ 11687 12752 6158 -582 -45 5352 7390 3717 1313 5116 11990 13956 8520 2228 1441 5196
1110E196J779l844k899L257P675L614m926o603k90L923J176n050m932L515Q214
$$ 5196 6975 3131 232 3489 11164 14778 9852 3249 2959 6882 8058 3008 -1924 1591 9805
1125I805M052m283n397J4N128K74p030o464L361R173L294m746m731L011O239o89
$$ 9805 13857 9574 4177 4191 9319 9593 2563 -3901 -540 8633 11927 7181 2450 5461 11700 11011
1141A1011q861o229L327P447J530m541k684M956O394j145q078o556K975N250M34
$$ 11011 2150 -4079 -752 6695 8225 3684 1000 5956 12350 11205 3127 -3429 -454 4796 5230
1156E230n063j778O135O854j322p403n034K245L988j451n139j347O460O935l94
$$ 5230 167 -1611 4524 11378 10056 2653 -2381 -136 3852 2401 -2738 -4085 2375 9310 8916
1171H916o481m581K209L667k214o337k088O116P033k03o199k717L725L464l520
$$ 8916 2435 -2146 63 3730 1516 -4821 -6909 -793 6240 6037 -162 -2879 846 4310 790
1186G90p004k346N996O024q13m668j180M818L392m272p748k430M704N294r94m306
$$ 790 -6214 -8560 -2564 3460 2647 -2021 -3201 1617 5009 737 -7011 -9441 -4737 557 -437 -4743
1202d743K92N378M191m213p597k623L799L877j667l851J061O479M301l205o936
$$ -4743 -4451 927 5118 905 -6692 -9315 -5516 -1639 -3306 -7157 -6096 383 4684 1479 -5457
1217e457k957L128L014k526m566R06O706N241j709p041k295L484K547l468n712
$$ -5457 -8414 -5286 -2272 -4798 -9364 -8458 -1752 3489 1780 -5261 -7556 -4072 -1525 -4993 -10705
1232a0705N72P105N597k312o094o15M635K683n410o821K55O612N210l013m715
$$ -10705 -10133 -3028 2569 257 -5837 -6452 -1817 866 -4544 -11365 -11110 -4498 712 -2301 -7016
1247g016J542O196J395o310p835R50O779L345l678l285L037O750J164o423o260
$$ -7016 -5474 722 2117 -4193 -12028 -11078 -4299 -954 -4632 -7917 -4880 1870 3034 -3389 -9649
1262i649O17N376R00m170k810M515P033J331n799n114Q45L362J37m329k358M063
$$ -9649 -9032 -3656 -2756 -6926 -9736 -5221 1812 3143 -2656 -7770 -6925 -3563 -3426 -7755 -10113 -6050
1278f050O499K383m578m594P18L301J59n033l148L038O672K271l598l481J605
$$ -6050 449 2832 -1746 -6340 -5622 -2321 -2162 -7195 -10343 -7305 -633 1638 -1960 -5441 -3836
1293c836L728j67n800m492K173O924K296l760l096L294N788q66p355n174K500
$$ -3836 -108 -275 -6075 -10567 -8394 -1470 826 -2934 -6030 -2736 3052 2186 -5169 -10343 -7843
1308g843O192J349m444k044N246N945j168p386m623L056M536m66m737m19N726
$$ -7843 -1651 -302 -4746 -6790 -1544 4401 3233 -4153 -8776 -5720 -1184 -1650 -6387 -6806 -1080
1323a080O017j014o145l362K655L264k213m859rN942N458o41n029k218K334L071
$$ -1080 4937 3923 -2222 -5584 -2929 335 -1878 -6737 -6746 -804 4654 4013 -1016 -3234 -900 2171
1339B171k592n145q30M930N627r4m063j562L548K938k537o333k124M674N402j8
$$ 2171 -421 -5566 -6396 -1466 4161 4067 4 -1558 1990 4928 2391 -3942 -6066 -1392 4010 3992
1355C992m036l10M825L875l232p222k705M699M803j464l522k2O431M311l270p852
$$ 3992 -44 -354 4471 8346 5114 -2108 -4813 -114 4689 3225 -297 -319 6112 10423 7153 -699
1371f99j654M682L133k744m592J897O927M366m164o136m54L923J393l507m481
$$ -699 -2353 2329 5462 2718 -1874 23 6950 11316 7152 1016 562 4485 5878 2371 -2110
1386b110K433O863L328k986m734L62L690K97m900l704J907N573L009k195k949
$$ -2110 323 7186 10514 7528 2794 3156 6846 7143 2243 -1461 446 6019 9028 6833 3884
1401C884O26L423O37m154n242K37N017L049j580k446J217M668J017m644n938k43
$$ 3884 4510 7933 8570 4416 -826 -589 4428 7477 5897 3451 4668 9336 10353 5709 -229 -472
1417d72M866K361k690k493K517N514J282n159n401n60M725J543m066k848L436
$$ -472 4394 6755 4065 1572 4089 9603 10885 5726 325 -235 4490 6033 1967 -881 2555
1432B555O862J376n176n300J284L793m48m580k930M007O301J317m371l664J512
$$ 2555 9417 10793 5617 317 1601 5394 4946 366 -2564 1443 7744 9061 4690 1026 2538
1447B538L670j582n138l331L885N197J479l664k239K686L229j486o027l232K716
$$ 2538 6208 4626 -512 -3843 42 5239 6718 3054 815 3501 6730 5244 -783 -4015 -1299
1462a299M770Q04k635j467K996L946j497n762l999K168M340K44l454j439M793
$$ -1299 3471 4275 1640 173 3169 7115 5618 -144 -4143 -1975 2365 2609 -845 -2284 2509
1477B509N213j855o012l637K407L564j133m397l60N425N326j680n734k752L089
$$ 2509 7722 5867 -145 -3782 -1375 2189 1056 -3341 -3701 1724 7050 5370 -364 -3116 -27
1492b7K741k697m812M9N252M350j112m912r31L283K163l812m789k83M612L617
$$ -27 2714 17 -4795 -4746 506 4856 3744 -1168 -2099 1184 3347 -465 -5254 -5537 -925 2692
1508B692j423l059Q8L344J381l050m997j316L915K547m16k654O03L796J912l046
$$ 2692 1269 -1790 -1702 1642 3023 -27 -5024 -6340 -2425 122 -294 -2948 -2345 1451 3363 317
1524C17n104j641K776K890l53l216q1M664L364k843n487k212L369K131j753l917
$$ 317 -4787 -6428 -3652 -762 -1115 -4331 -4412 252 3616 773 -4714 -6926 -3557 -1426 -3179 -7096
1540g096R21O089L306k607o072m37L496K057l955m846J966N880L645l942m277
$$ -7096 -6175 -86 3220 613 -5459 -5896 -2400 -343 -4298 -9144 -7178 -1298 2347 -1595 -5872
1555e872O66M444M25n105m553K028N946K202l730k654K488L960r6n541m079J804
$$ -5872 -5206 -762 -337 -5442 -9995 -7967 -2021 181 -3549 -6203 -3715 245 149 -5392 -9471 -7667
1571g667M544P30k534j598L043M031m01m749l393Q62L226N30k383j140L015M226
$$ -7667 -3123 -2393 -4927 -6525 -3482 549 148 -4601 -7994 -7132 -3906 -3376 -5759 -6899 -3884 342
1587C42O25m421l456M27K740P56l085j824K990M357J689l123m162J074L241j52
$$ 342 967 -3454 -6910 -6483 -3743 -2987 -6072 -7896 -4906 -549 1140 -1983 -6145 -5071 -1830 -1982
1603a982m526j809K775N588J176l435k666J744L707r16n180k859L549M950P71
$$ -1982 -6508 -8317 -5542 46 1222 -2213 -4879 -3135 572 -344 -5524 -8383 -4834 116 887
1618H87l183k238M446K866k632m821k166K988L841k71k654q7M063L353k138m970
$$ 887 -2296 -4534 -88 2778 146 -4675 -6841 -3853 -12 -283 -2937 -3024 1039 4392 2254 -2716
1634b716k179K203L328o01l179M50M045L610j204m770j864J831K568j356k785
$$ -2716 -4895 -2692 636 35 -3144 -2694 1351 4961 3757 -1013 -2877 -1046 1522 166 -2619
1649b619n49M142M483q63m316j927K651K228j713m511k66M017M817r23l874j200
$$ -2619 -3168 974 5457 4594 278 -1649 1002 3230 1517 -2994 -3260 757 5574 4651 777 -423
1665d23L559K042k796m943o63M758L418j650l373R73L973J894l951n318l3M342
$$ -423 3136 5178 2382 -2561 -3224 1534 4952 3302 -71 902 4875 6769 2818 -2500 -2533 1809
1681A809K646j939k716J658M430J289l478m604K21K812J549k064k305K135M260
$$ 1809 4455 2516 -200 1458 5888 7177 3699 -905 -684 2128 3677 1613 -692 1443 5703
1696E703J286k762l592p1K536M01k251j935J371M072K104j688l309p04K467O95
$$ 5703 6989 4227 635 564 3100 3501 1250 -685 686 4758 6862 5174 1865 1161 3628 4323
1712D323k700l069J409L986K664k085k835N02L230M64l519m028L63M425L090k525
$$ 4323 1623 -1446 -37 3949 6613 4528 1693 2195 5425 5889 2370 -1658 -1295 3130 6220 3695
1728C695k565J769L896L44m944m099J402M430J271l042j569K415M545j11n089
$$ 3695 1130 2899 6795 7139 2195 -1904 -502 3928 5199 2157 588 3003 7548 7437 2348
1743B348l272J715L258J64l518j163L829L973l20m072k782J608K341j059l140
$$ 2348 -924 791 4049 4213 695 -468 3361 7334 7014 2942 160 1768 4109 3050 -90
1758i0j051L788L827n00k847j949J328K249j069l824j384K273L905P63k696j586
$$ -90 -1141 2647 6474 5974 3127 1178 2506 4755 3686 -138 -1522 751 4656 5419 2723 1137
1774A137J941K209j347m090k580K325M338L27l037r60K378L598j888m801l105
$$ 1137 3078 5287 3940 -150 -2730 -405 3933 4260 1223 263 2641 6239 4351 -450 -3555
1789c555K719L465L0l467L6L645L103j794n141k220K635K849j836l239O97M185
$$ -3555 -836 2629 2659 -808 -772 2873 5976 4182 -959 -3179 -544 2305 469 -2770 -2073 2112
1805B112K502j747m153p68K156J210k594k839Q14L908K699j626l053l62J928O58
$$ 2112 4614 2867 -1286 -2054 102 1312 -1282 -4121 -3307 601 3300 1674 -1379 -1741 187 845
1821H45k542k676j01L193K125n90k081j07K022R52k532l516q07K463L171n38k467
$$ 845 -1697 -4373 -4474 -1281 844 254 -1827 -1934 88 1040 -1492 -5008 -5815 -3352 -181 -719 -3186
1838c186L06L095J368k579m325j558L137K929j367k815Q87M073K310l352m851
$$ -3186 -2880 215 1583 -996 -5321 -6879 -3742 -813 -2180 -4995 -4108 -35 2275 -1077 -5928
1853e928l54L291K019k852k830J956M882J775l430l997M69L375K54l570k480K374
$$ -5928 -6282 -2991 -972 -3824 -6654 -4698 184 1959 -1471 -5468 -4999 -1624 -1370 -4940 -7420 -5046
1869e046M990N10k733k545J869K145j73m321k008K706L370Q54k054j418J723K214
$$ -5046 -56 454 -2279 -4824 -2955 -810 -983 -5304 -7312 -4606 -1236 -382 -2436 -3854 -2131 83
1885H3j094l367k200J865K275J122j336o21J610K259k40l344k710Q72K650P11
$$ 83 -1011 -4378 -6578 -4713 -2438 -1316 -2652 -3273 -1663 596 356 -2988 -5698 -4826 -2176 -1465
1901a465j352j057J948L021N64l746k713Q12K698m3k257j457K742L968K2k901
$$ -1465 -2817 -3874 -1926 1095 1659 -2087 -4800 -3988 -1290 -1333 -3590 -5047 -2305 1663 1685 -1216
1917a216l041J846K223o28l419j033L018M085j25l265j555K125K183j579l795
$$ -1216 -4257 -2411 -188 -816 -4235 -5268 -2250 1835 1710 -1555 -3110 -985 1198 -381 -4176
1932d176j194L013L371m6k594q61L353J330k056l688j214K671K646m42k240L52
$$ -4176 -5370 -2357 1014 968 -1626 -2487 866 2196 140 -3548 -4762 -2091 555 113 -2127 -1775
1948a775K910J854k075l328j645K320J953n09j959J73L022K646j521l799j034
$$ -1775 1135 2989 914 -2414 -4059 -1739 214 -295 -2254 -2081 941 3587 2066 -1733 -2767
1963b767J896J917j013k828K62L678K783j451l346q06K405J595j792l779P47L802
$$ -2767 -871 1046 33 -2795 -2533 1145 3928 2477 -869 -1675 730 2325 533 -3246 -2499 1303
1979A303K750j499l076M12K588P29k801l109L08L890K103j356k421J443K673M84
$$ 1303 4053 2554 -522 -110 2478 3207 406 -2703 -2395 1495 3598 2242 -179 1264 3937 4421
1995D421l235l415Q71K980J247j404j192J617K832K19k932k561L70K067P72j426
$$ 4421 1186 -2229 -1358 1622 2869 1465 273 1890 4722 4941 2009 -552 -182 1885 2657 1231
2011A231o99J103K938J196k348k612k09J826P64j476j857J053L467J406j705l003
$$ 1231 532 1635 4573 5769 3421 809 600 2426 3190 1714 -143 910 4377 5783 4078 1075
2027A075L85K428L93k440k401R39M113J499k012k584R94K655n3l419k732J533
$$ 1075 1460 3888 4281 1841 -560 379 4492 5991 3979 1395 2389 5044 4991 1572 -1160 373
2043C73L887R58k396k011K444K714q03m068k378J716L263J01k389r99K975K900
$$ 373 4260 5218 2822 811 3255 5969 5166 1098 -1280 436 3699 3800 1411 412 3387 6287
2059F287j281l453k256J484K184m60k063n88K879K587r54l098j184J100J347o37
$$ 6287 5006 1553 -703 781 2965 2505 442 -146 2733 5320 4366 1268 84 1184 2531 1894
2075A894k245p18K447K763o6k551j642J233J429q80k904o31K024K868K12k189
$$ 1894 -351 -1069 1378 4141 4075 1524 -118 1115 2544 1664 -1240 -1871 153 3021 3233 1044
2091A044j084J322J843j311l414j674K532L014k58j921l13K094J176j916l249
$$ 1044 -40 1282 3125 1814 -1600 -3274 -742 2272 2014 93 -220 1874 3050 1134 -2115
2106b115j491K984J487k17j914K39L020J864k568l965m08K353J619j614j797M97
$$ -2115 -3606 -622 865 648 -1266 -1027 1993 3857 1289 -2676 -3084 -731 888 -726 -2523 -2026
2122b026L339J837k074l202k37K117R95k321k114R83L013J734j241j951n39J677
$$ -2026 1313 3150 1076 -2126 -2363 -246 749 -1572 -3686 -2703 310 2044 803 -1148 -1687 -10
2138a0N52k017k452K72L090J815r96j997J70J817Q65k655k506K1K539K068j062
$$ -10 542 -1475 -3927 -3655 -565 1250 254 -1743 -1573 244 1109 -1546 -4052 -4031 -1492 576 -486
2155d86j648L20K743P17k836l072k85L199J372j411j903J660L257M17k983l152
$$ -486 -2134 -1814 929 1646 -1190 -4262 -4547 -1348 24 -1387 -3290 -1630 1627 2044 -939 -4091
2171d091N32K503M31j905j423J817L296K26k444k458O18K064M3k478j407J950
$$ -4091 -3559 -1056 -625 -2530 -3953 -2136 1160 1386 -1058 -3516 -2898 -834 -791 -3269 -4676 -2726
2187b726L133O52k328j837J442J338m72k940j411K052K633P45j910j175J515J475
$$ -2726 407 1059 -1269 -3106 -1664 -326 -798 -3738 -5149 -3097 -464 281 -1629 -2804 -1289 186
2203A86q54k807j560J471K109L88j523l07J616J757l95l149k089J447K315M29
$$ 186 -668 -3475 -5035 -3564 -1455 -1067 -2590 -2897 -1281 476 81 -3068 -5157 -3710 -1395 -966
2219i66j697r56K425K143j008k234j662Q45K254l47k171o01K569K696l52k473
$$ -966 -2663 -3619 -1194 949 -59 -2293 -3955 -3110 -856 -1203 -3374 -3975 -1406 1290 938 -1535
2235a535j788J458J590q17k529l55K202K886m06k127j079J402J793j180k953q54
$$ -1535 -3323 -1865 -275 -1092 -3621 -3976 -1774 1112 706 -1421 -2500 -1098 695 -485 -3438 -4292
2251d292K809K331k88j676n43K091J108j614k928n32K414K423p24j756j03K451
$$ -4292 -1483 848 560 -1116 -1659 432 1540 -74 -3002 -3534 -1120 1303 579 -1177 -1280 1171
2267A171J501j876k925q74K174K141r38j877M90K752J944k362k408q44K687Q75
$$ 1171 2672 796 -2129 -3003 -829 1312 374 -1503 -1013 1739 3683 1321 -1087 -1931 756 1631
2283A631j624j657J040K933J431j831k455RK203N68j791k208J010L407N97j184
$$ 1631 7 -1650 -610 2323 3754 1923 -532 -523 1680 2248 457 -1751 -741 2666 3263 2079
2299B079j700L60J691J80k233k006J187K245J159j098j108O13J981o8k221k224
$$ 2079 379 739 2430 2610 377 -1629 -442 1803 2962 1864 756 1369 3350 3282 1061 -1163
2315a163Q35K087J046p58j273N12J905O35k242k133m1K282J197j326j534J197
$$ -1163 -328 1759 2805 2047 774 1286 3191 3826 1584 -549 -590 1692 2889 1563 29 1226
2331A226K302N82k188k248J76K433P58k233j620J193L241P75k372k041P48K109
$$ 1226 3528 4110 1922 -326 -150 2283 3041 808 -812 381 3622 4397 2025 -16 732 2841
2347B841l89k371j559J934K727P91k029j849J407K041q19k907j753K386K321L88
$$ 2841 2452 81 -1478 456 3183 3974 1945 96 1503 3544 2725 -182 -1935 451 2772 3160
2363C160k634k67K093J465j194l121p64J315K424n38j667KK134J400j143k553
$$ 3160 526 259 2352 3817 2623 -498 -1262 53 2477 1939 272 274 2408 3808 2665 112
2379A12j061J020J987o26j743L00J932J711n65k533r66J188J184q59j472j84J624
$$ 112 -949 71 2058 1432 -311 -11 1921 3632 3067 534 -432 756 1940 1081 -391 -575 1049
2396A049K203n19j848r42Q05J290q54k149m39K137K269j76k051o94J476J104j360
$$ 1049 3252 2733 885 -57 748 2038 1184 -965 -1404 733 3002 2826 775 81 1557 2661 1301
2413A301k747n96J953K764p38j948kJ840J171j922k968j43K186J676p79j746L00
$$ 1301 -1446 -2042 -89 2675 1937 -11 -13 1827 2998 1076 -1892 -2035 151 1827 1048 -698 -398
2430c98K526O64j952k658p4K351O03j430j556J157K382J120k044k271m2J798K03
$$ -398 2128 2792 840 -1818 -1892 459 1062 -368 -1924 -767 1615 2735 691 -1580 -1622 176 379
2447C79j476j121N67K821P79j445j593k10J754n2k018j507P12K186J168j002j459
$$ 379 -1097 -2218 -1651 1170 1949 504 -1089 -1299 455 403 -1615 -3122 -2410 -224 944 -58 -1517
2464a517J33J793Kj771k178L96K593P51r17j103K89J663K92j947k288L20K164
$$ -1517 -1384 409 411 -1360 -3538 -3142 -549 202 -715 -1818 -1529 134 426 -1521 -3809 -3489 -1325
2481a325J073j470j008J325K332P4k748j980L23K211l5j343p79J547K470k01k236
$$ -1325 -252 -1722 -2730 -1405 927 1001 -1747 -3727 -3404 -1193 -1228 -2571 -3350 -1803 667 466 -1770
2498a770j393N13J805k20j932r56K093K415j64k397n69J084J037q31k366j64J819
$$ -1770 -3163 -2650 -845 -1065 -2997 -3953 -1860 555 391 -2006 -2575 -1491 -454 -1285 -3651 -3815 -1996
2515a996J718J54j079r26J497P18j050k123p23J677J472J76j026k09J135J402
$$ -1996 -278 -124 -1203 -2129 -632 86 -964 -3087 -3810 -2133 -661 -485 -1511 -1720 -585 817
2531H17j217j950r33J081J591K41j237j28J394J206l14k157j196R94J532R7k067
$$ 817 -400 -2350 -3283 -2202 -611 -370 -1607 -1735 -341 865 551 -1606 -2802 -1808 -276 -179 -2246
2548b246k55K141K317p17k524j283J328K069j179k044j71K472K128o36k436l99
$$ -2246 -2501 -360 1957 1240 -1284 -2567 -1239 830 -349 -2393 -2564 -92 2036 1400 -1036 -1435
2564a435J694R71j440k659K76K593J745q62k103L46K143N75k034k291M42K629
$$ -1435 259 1230 -210 -2869 -2593 0 1745 883 -1220 -874 1269 1844 -190 -2481 -2039 590
2580E90P65j138j507J115J879L92k303j983Q08J383R56j119q49P84J797N00j758
$$ 590 1355 217 -1290 -175 1704 2096 -207 -2190 -1382 1 957 -162 -1011 -227 1570 2070 312
2597C12j465L32J310O7r90p75P29K273M47j076j402j19J108L44j044j438P40K164
$$ 312 -1153 -821 489 556 -434 -1209 -480 1793 2240 1164 -238 -357 751 1095 51 -1387 -647 1517
2615A517Q64r50j431J1J280L84j222j968N40K149J453j055j545L18J820L35k132
$$ 1517 2381 1431 0 11 1291 1675 453 -1515 -975 1174 2627 1572 27 345 2165 2500 368
2632C68j898O36K407R24j352j138J341J832j48k294j843O73K385L66j884o91J628
$$ 368 -1530 -894 1513 2437 1085 -53 1288 3120 2972 678 -1165 -492 1893 2259 375 -316 1312
2649A312K484m97k339j496J037J891p31j715l40J843K102o28j778p74J209P04
$$ 1312 3796 3299 960 -536 501 2392 1661 -54 -394 1449 3551 2923 1145 371 1580 2284
2665B284l15j900n04J934J760l14j639o66J455O65q52j939m10J367J670k22j205
$$ 2284 1969 69 -435 1499 3259 2945 1306 640 2095 2760 1908 -31 -441 926 2596 2374 1169
2682A169k46J246N57p39j972q15J446J760k21j218k49J123J173q36k170o70J002
$$ 1169 923 2169 2726 1987 15 -800 646 2406 2185 967 718 1841 3014 2178 8 -662 340
2699C40J499j60j533K36J293J234o91j972p40J207Q73n72j568k7J791J745r95
$$ 340 1839 1679 146 382 1675 2909 2218 246 -494 713 1586 1014 -554 -581 1210 2955 1960
2716A960j930o91J582O38j077j613k9J525J689p37j634M8J026J043j786j978L32
$$ 1960 30 -661 921 1559 482 -1131 -1160 365 2054 1317 -317 -269 757 1800 14 -1964 -1632
2733a632J839J215o07j428J71J742L13j611k105M1J853R79r73q41N87J638J76
$$ -1632 207 1422 815 -613 -442 1300 1613 2 -2103 -2062 -209 770 -203 -1044 -457 1181 1357
2750A357j734j717J55J683M30j241q37R50J671N46j529j662K46J438L15j262j435
$$ 1357 -377 -2094 -1939 -256 174 -1067 -1904 -954 717 1263 -266 -1928 -1682 -244 71 -1191 -2626
2767b626Q89K107N31j256j240L10J036j44j195j403J297J639O96r96j165L72J684
$$ -2626 -1737 370 901 -355 -1595 -1285 -249 -393 -1588 -2991 -1694 -55 641 -355 -1520 -1148 536
2784E36n02j892j097Q44J612R75j523r31Q50J564P8k247j235J187J621L04j450
$$ 536 34 -1858 -2955 -2111 -499 476 -1047 -1978 -1128 436 514 -1733 -2968 -1781 -160 144 -1306
2801a306o72J149J454j87j949j240J215R61L12j759m74J741J635l39j961q94J002
$$ -1306 -1978 -829 625 438 -1511 -2751 -1536 -575 -263 -2022 -2496 -755 880 541 -1420 -2314 -1312
2818a312J250o47j277m06J825J285l91j424p18J122N80m74j688m41J586J594n45
$$ -1312 -62 -709 -1986 -2392 -567 718 327 -1097 -1815 -693 -113 -587 -2275 -2716 -1130 464 -81
2835h1j516N73M43O88o81j740n20J246J558r6j174j12R98R55m79k129o02R70J446
$$ -81 -1597 -1024 -581 107 -574 -2314 -2834 -1588 -30 -126 -1300 -1412 -414 541 62 -2067 -2669 -1699 -253
2854b53j13j292k15J456J433q78k103n12J163J206n52j714J63K380J004p76k070
$$ -253 -366 -1658 -1873 -417 1016 138 -1965 -2477 -1314 -108 -660 -2374 -2211 169 1173 397 -1673
2871a673l49J797K77q93j257K0K103J689j310j923L18J437L68j701j285P04K051
$$ -1673 -2022 -225 52 -841 -2098 -2078 25 1714 404 -1519 -1201 236 604 -1097 -2382 -1678 373
2888C73O98p28j367P07J472j87j556j286N91J361N82p64k39M39J166K06j664j171
$$ 373 1071 343 -1024 -317 1155 968 -588 -1874 -1283 78 660 -104 -343 96 1262 1468 -196 -1367
2906a367N27J411K62l17p61J20J460M40j061j320lJ041O22p22j168J141J549P10
$$ -1367 -840 571 833 516 -245 -125 1335 1775 714 -606 -609 432 1054 332 -836 305 1854 2564
2924B564j301j732N38J231L49j175j438R23K227O45j438j117J22J873j35j853
$$ 2564 1263 -469 69 1300 1649 474 -964 -41 2186 2831 1393 276 398 2271 2136 283
2940B83j428J420J966N73j608j166J153J483m82k080j245J609J915q9j643l20
$$ 283 -1145 275 2241 2814 1206 40 1193 2676 2194 114 -1131 478 2393 2304 661 341
2956C41J441R07p17j838o98J230J361k14j108l44J150J397p05j510n28O07J028
$$ 341 1782 2689 1972 134 -564 666 2027 1813 705 361 1511 2908 2203 693 165 772 1800
2973A800n98q94k95J446J170m71j135p83N88Q17k76j612M6J075J601k81j547n56
$$ 1800 1202 308 13 1459 2629 2158 1023 240 828 1645 1369 -243 -197 878 2479 2198 651 95
2991I5J009M99j77j955m73J369J250K88j297o77P79J148q74j486o93J910Q72m09
$$ 95 1104 1603 1426 -529 -1002 367 1617 1905 608 -69 710 1858 984 -502 -1195 715 1587 1178
3009A178j302N8J551P79j366j623l52J508P13q73p12J88J643M82j128j751N31
$$ 1178 -124 -66 1485 2264 898 -725 -1077 431 1144 271 -441 -253 1390 1872 744 -1007 -476
3026d76R64O12p95j317L91J794Q79j376q17l80R08K77j064j030O74J405K30k70
$$ -476 488 1100 305 -1012 -621 1173 2052 676 -141 -521 387 664 -400 -1430 -756 649 879 609
3044F09j082l0J541l55n34j971K6K345J078o96j280L46J163J92p53k725N07J935
$$ 609 -473 -503 1038 683 149 -1822 -1796 549 1627 931 -349 -3 1160 1352 599 -2126 -1619 316
3062C16P87r10j166M47J681L50j680j574L39J724K50j486l25O07J706n8j461j036
$$ 316 1103 193 -973 -526 1155 1505 -175 -1749 -1410 314 564 -922 -1247 -640 1066 1008 -453 -1489
3080a489J2J776j88j461k20P42J667q8j133j175P17J158o35j506m08J344J289
$$ -1489 -1477 299 111 -1350 -1570 -828 839 751 -382 -1557 -840 318 -317 -1823 -2231 -887 402
3097D02n2j024n90L64J009m83j166j034J049J272P5q68m63O39R06m30j530p05
$$ 402 350 -674 -1264 -900 109 -374 -1540 -2574 -1525 -253 -178 -1046 -1509 -870 36 -394 -1924 -2629
3115b629Q47J351l17n31p99J246J074n48j196q94P14J207l37j186pJ006J326l42
$$ -2629 -1782 -431 -748 -1279 -2078 -832 242 -306 -1502 -2396 -1682 -475 -812 -1998 -2005 -999 327 -15
3133a5j517n98Q21R44n07j253q2J222J361l92j374n96J076J139j264j261l16J758
$$ -15 -1532 -2130 -1309 -365 -872 -2125 -2207 -985 376 -16 -1390 -1986 -910 229 -1035 -2296 -2612 -854
3151h54J213n39j304K3R25P12j095j257n57K102J014p46j094J07J388L73n90j845
$$ -854 359 -180 -1484 -1461 -536 176 -919 -2176 -2733 -631 383 -363 -1457 -1350 38 411 -179 -2024
3169b024K14J103J119p36p39K6J591L87r34j514J40J353L6o04o93N04J201P97
$$ -2024 -1810 -707 412 -324 -1063 -1037 554 941 7 -1507 -1367 -14 22 -582 -1275 -771 430 1227
3187A227r67j012j71P95M97p76j060O10J422P20o78j146J42J034L02q60j021J71
$$ 1227 260 -752 -923 -128 369 -407 -1467 -857 565 1285 607 -539 -397 637 939 79 -942 -771
3205g71J626N46q89q79P28M03L59j171j200P59J217L89n69p22M04J278K59j485
$$ -771 855 1401 512 -367 361 764 1123 -48 -1248 -489 728 1117 548 -174 230 1508 1767 282
3223B82j373O78J072O11j164l39N67J288K02j423j031O04J011K43r35o37L29J769
$$ 282 -1091 -413 659 1270 106 -233 334 1622 1824 401 -630 -26 985 1228 293 -344 -15 1754
3241A754j2j016j033L51J095r3j050p86Q08J723J76j235j030O26J080k43j439
$$ 1754 1742 726 -307 44 1139 1046 -4 -790 18 1741 1917 682 -348 278 1358 1115 -324
3258c24m96J116J493k56j026m33Q03J001n94j245q53O76J805k50j029j99R39Q28
$$ -324 -820 296 1789 1533 507 74 877 1878 1284 39 -814 -138 1667 1417 388 189 1128 1956
3276A956q12j179l40P84J084j82j108J04J016J050r70q13n74Q25N77j10j208r5
$$ 1956 1144 -35 -375 409 1493 1311 203 307 1323 2373 1403 590 16 841 1418 1308 100 5
3294EJ003R78m88j085k76P32Q66n79j339J92J058R18j15j000o31Q00O40q11j155
$$ 5 1008 1986 1498 413 137 869 1735 1156 -183 9 1067 1985 1870 870 239 1039 1679 868 -287
3313b87j23J416R62m36j085j46J085N02p57j487q3J175J047p34j050M15P56P05
$$ -287 -410 1006 1968 1532 447 301 1386 1888 1131 -356 -439 736 1783 1049 -1 414 1170 1875
3331A875j295r24j75J492M57o10r86N07J023Q2o72j429M11J068J98p42n41J64
$$ 1875 580 -344 -519 973 1430 820 -166 341 1364 1446 774 -655 -244 824 1022 280 -261 -97
3349i7Q46O44p28r23k6O50M25j044p87J31J308P96r45r04J14R17K17j003j390
$$ -97 749 1393 665 -258 -284 366 791 -253 -1040 -909 399 1195 250 -654 -540 377 594 -409 -1799
3368a799O03J579L78r90o10J93J126J80j525p86N72J165j21n09p81P97J219m80
$$ -1799 -1196 383 761 -229 -839 -646 480 660 -865 -1651 -1079 86 -35 -544 -1325 -528 691 211
3386B11j259m78L02J382j29j250k55Q64J154m17j126j002J086O44o8j118j90J041
$$ 211 -1048 -1526 -1224 158 29 -1221 -1476 -612 542 125 -1001 -2003 -917 -273 -341 -1459 -1649 -608
3404f08N45l2q20k38M53M49n09m77p76O84J102J4o44l43RR96j08j194q18R12J168
$$ -608 -63 -95 -915 -1153 -700 -251 -760 -1237 -2013 -1329 -227 -213 -857 -1200 -1191 -195 -303 -1497 -2315 -1403 -235
3425b35K05o19n93N70N76o4q57j216Q46J176r5p99m60P65J072j33j606m94J312
$$ -235 -30 -649 -1242 -672 -96 -160 -1017 -2233 -1387 -211 -306 -1105 -1565 -800 272 139 -1467 -1961 -649
3444f49M77k44j172k89J807P30n47j448n17J379Q08r01q87l7J576O00r15j264
$$ -649 -172 -416 -1588 -1877 -70 660 113 -1335 -1852 -473 335 -566 -1453 -1490 86 686 -229 -1493
3462a493J44J197K69j116o38L57J221O07q18m94J04Q68o3q32p36L29R51M21p16
$$ -1493 -1349 -152 117 -999 -1637 -1280 -59 548 -270 -764 -660 208 145 -687 -1423 -1094 -143 278 -438
3481d38n67M52Q10J32n94j152Q7Q30N79l76o05Q7O04N84o39o29n66J185O85p23
$$ -438 -1005 -553 257 389 -205 -1357 -1270 -440 139 -237 -842 -755 -151 433 -206 -835 -1401 -216 469 -254
3501b54q62K48J290N99q28p57j90P83M29q69p22K00J588L36r61p11k16J248J37
$$ -254 -1116 -868 422 1021 193 -564 -754 29 458 -411 -1133 -933 655 991 30 -681 -897 351 488
3520D88r22o36O53Q55Q11j014q32M50R33lj256n97O24J068N9m62o85O25R61n40
$$ 488 -434 -1070 -417 438 1249 235 -597 -147 786 783 -473 -1070 -446 622 681 219 -466 159 1120 580
3540E80n83o15L22J114p4n89l06M28J136m05r14m75P40M79j82m85l74P54P93J00
$$ 580 -3 -618 -296 818 744 155 -151 277 1413 1008 94 -381 359 838 656 171 -203 551 1344 1444
3560A444q22n23L22N31p0m83n14P73J090j10r86n49O74N71k75j144j18N75J268
$$ 1444 622 99 421 952 882 399 -115 658 1748 1638 652 103 777 1348 1073 -71 -189 386 1654
3579A654m1j017l74Q80O85p45r47m15J203J032o53n98j97O56O87n51j018q0P40
$$ 1654 1613 596 222 1102 1787 1042 95 -320 883 1915 1262 664 467 1123 1810 1259 241 161 901
3598I01L97m88m92K40P32L80o90o68k16O73L64j36j122K01P99P66k79j281p8O25
$$ 901 1298 810 318 558 1290 1670 980 312 96 769 1133 997 -125 76 875 1641 1362 81 3 628
3618F28N64m67o93N1J052L67k88j225M3N65J75l44n69l77J186N98n84n40m15P51
$$ 628 1192 725 32 83 1135 1502 1214 -11 32 597 772 428 -141 -518 668 1266 682 142 -273 478
3638D78P34j031p78K45O74P44o61n69K8O57Q15r74j282L15R94M58n18p47L61R97
$$ 478 1212 181 -597 -352 322 1066 405 -164 -136 521 1336 362 -920 -605 389 847 329 -418 -57 940
3658I40K25r88q37M16O10L80q04o75N74O17N02r86r01O76Q27j61q30p00N54Q68
$$ 940 1165 177 -660 -244 366 746 -58 -733 -159 458 960 -26 -927 -251 576 415 -415 -1115 -561 307
3678C07M40p02p06J14P23J08r45m61L65J220K63o83o55K95O17J7p36p78L17P20
$$ 307 747 45 -661 -547 176 284 -661 -1122 -757 463 726 43 -612 -317 300 317 -419 -1197 -880 -160
3698a60N13p80n41P54P65j64p32q52N03O84J31o91p3J90Q61O4j056n06N08M40
$$ -160 353 -427 -968 -214 551 387 -345 -1197 -694 -10 121 -570 -643 -453 408 472 -584 -1090 -582 -142
3718a42p2p61j19O25Q11P8p64p31O19J91j9o86n39J063N23J52r98m16R67K03j96
$$ -142 -214 -975 -1094 -469 342 420 -344 -1075 -456 -265 -284 -970 -1509 -446 77 229 -769 -1185 -218 -15 -211
3739b11j015k70R42N50j95p15r1O24M46m89p46l82R67N00l15p16j00R23M49n23
$$ -211 -1226 -1496 -554 -4 -199 -914 -1005 -381 65 -424 -1170 -1552 -585 -85 -400 -1116 -1216 -293 156 -367
3759c67r69n7M61Q00n84o91L45N91N53k86j138J73P14N20q90o35M11O37N79o90
$$ -367 -1336 -1393 -932 -132 -716 -1407 -1062 -471 82 -204 -1342 -1169 -455 65 -825 -1460 -1049 -412 167 -523
3779e23k42j25N23q7l96n40J82R06J99m5r58M18P03qn57q93M64P77O72n72p27
$$ -523 -765 -890 -367 -454 -850 -1390 -1208 -302 -103 -148 -1106 -688 15 7 -550 -1443 -979 -202 470 -102 -829
3800h29K68N46L8m64p24J53Q01L73n09k89J22P77P8p36n00J25R20J82n61p93Q21
$$ -829 -561 -15 23 -441 -1165 -1012 -211 162 -347 -636 -514 263 341 -395 -895 -770 150 332 -229 -1022 -201
3821b01Q93o3m74q52K65P57ln11n14N11J059j4o26n85J57Q81J14j157l77O73R40
$$ -201 692 629 155 -697 -432 325 322 -189 -703 -192 867 853 227 -358 -201 680 794 -363 -740 -67 873
3842H73j46l84o43M71P16j65q51k28Q37L91k05l74r2L54L76L8q40l36M99L47K35
$$ 873 727 343 -300 171 887 722 -129 -357 480 871 666 292 200 554 930 968 128 -208 291 638 873
3863H73o01j96K22R87k30o91o47M78N82j68p70j23Q76N86k64n04o86O97L79o5
$$ 873 272 76 298 1285 1055 364 -283 195 777 609 -161 -284 592 1178 914 410 -276 421 800 735
3883G35o74q1M13P36oq52m35N31P69o46o83m9J025L26l50o32r3N53O70o07p34
$$ 735 61 -20 393 1129 1123 271 -164 367 1136 490 -193 -242 783 1109 759 127 34 587 1257 650 -84
3904h4r5O26M82j2q53o3N00L84k90q92O4R97O6j21p77J11J110j44m89k92l58O22
$$ -84 -179 447 929 917 64 1 501 885 595 -297 -233 764 830 709 -68 43 1153 1009 520 228 -130 492
3926D92K56m48l75L70N07K20k39n39k94N58J60k64p38L02P99L59k96n44m6M03
$$ 492 748 300 -75 295 802 1022 783 244 -50 508 668 404 -334 -32 767 1126 830 286 240 643
3946F43Q3n93n78L04R21L85n10q54M54O23J11q23l84m3J062Pk38q68M07P46Q7
$$ 643 726 133 -445 -141 780 1165 655 -199 255 878 989 166 -218 -261 801 808 570 -298 109 855 942
3967I42p55n65L71O25j60m31k65N66P08j10p27o73K74N25K03m92m85L53Q35K1
$$ 942 187 -378 -7 618 458 27 -238 328 1036 926 199 -474 -200 325 528 36 -449 -96 739 760
3987G60o61o27M43R7K51o44k54M72M31M1l46m68L65M61p9p17j83R1Q48j80m18
$$ 760 99 -528 -85 12 263 -381 -635 -163 268 309 -37 -505 -140 321 242 -475 -658 -567 281 101 -317
4008c17l95N16J98R6n58n37N86M15O6o60j57J20Q07o11k60j12K34P72q3p14l58
$$ -317 -712 -196 2 98 -460 -997 -411 4 70 -590 -747 -627 180 -431 -691 -803 -569 203 120 -594 -952
4029i52L34P18p2r33j80M87N55l27m59l81R07M34j79q28m18R09L18o82k42k81
$$ -952 -618 100 28 -905 -1085 -598 -43 -370 -829 -1210 -303 131 -48 -876 -1294 -385 -67 -749 -991 -1272
4049a272P95L44K2o65k19Q45pl4j117l5R17K09k02m07k03P01M05n61k79j20N35
$$ -1272 -477 -133 -111 -776 -995 -150 -157 -191 -1308 -1343 -426 -217 -419 -826 -1029 -328 77 -484 -763 -883 -348
4070c48O07o73l60k92P67M05l1r52j78Q39J71l52q36M66M51M70m18n31oN06K93
$$ -348 259 -414 -774 -1066 -299 106 75 -877 -1055 -216 -45 -397 -1233 -767 -316 154 -264 -795 -801 -295 -2
4091bm23o11L46P48M81o49l59N7J93L10o79n38O22N07M52m74m03L04J46K20l98
$$ -2 -425 -1036 -690 58 539 -110 -469 -412 -219 91 -588 -1126 -504 3 455 -19 -422 -118 28 248 -150
4112a50q33M16O27M44j82p41k8M92L15o98m03K66M49L29l74n87L10Q38K11q11
$$ -150 -983 -567 60 504 322 -419 -447 45 360 -338 -741 -475 -26 303 -71 -658 -348 490 701 -110
4132a10n93L28N02K67n99n65N63M06K69n73m25l1R72Q7q32o09O15Q19J94m70q98
$$ -110 -703 -375 127 394 -205 -770 -207 199 468 -105 -530 -561 411 498 -334 -943 -328 491 685 215 -683
4153f83L62Q84m00l91j76L3R06J29p98n12O92N57m7o29n07N29N03n15J46k62M79
$$ -683 -321 563 163 -228 -404 -371 535 664 -134 -646 46 603 556 -73 -580 -51 452 -63 83 -179 300
4174C00K40n3p35J60K56L10K66q17j91M26N48K4o80l21K32N54J02m97m32R62J76
$$ 300 540 487 -248 -88 168 478 744 -73 -264 162 710 734 54 -267 -35 519 621 124 -308 654 830
4195H30N3o75l79K15N14K51o13m79J087K33j55o50j55K17M62m07l99P4N36L02
$$ 830 883 208 -171 44 558 809 196 -283 804 1037 882 232 77 294 756 349 -50 24 560 862
4215H62p0n66l96P91N09o0j433L68P31L24l81m82J82N41K2p80j92K9M37R00j012
$$ 862 792 226 -170 621 1130 1070 -363 5 736 1060 679 197 379 920 942 162 -30 -1 436 1336 324
4236C24j21J38L47N22p76l35K00L78Q9l77m54L33P05j12j30p80L96J95K47p23
$$ 324 203 341 688 1210 434 99 299 677 766 389 -65 268 973 861 731 -49 347 542 789 66
4256F6j98K13N29K58j99o46j9P42j99o24J29n1O32N19q92m31J14O11J72o68p85
$$ 66 -132 81 610 868 669 23 4 746 547 -77 52 1 633 1152 260 -171 -57 554 726 58 -727
4277g27L34P22M04n59n29O21K43O0o21m43K57O75P8o11o67K89R72O2p36o29P42
$$ -727 -393 329 733 174 -355 266 509 569 -52 -495 -238 437 515 -96 -763 -474 498 560 -176 -805 -63
4298f3L16J8m13m29L23M50K17l58p08L21J102p75n90J86j72O42K32p70J63j40
$$ -63 253 271 -142 -571 -248 202 419 61 -647 -326 776 1 -589 -403 -575 67 299 -471 -308 -448
4318d48N55k33n99m1O12M16R2o07l60J89P40j1r84L27J47O95l32o82J31N71J11
$$ -448 107 -126 -725 -766 -154 262 354 -253 -613 -424 316 305 -679 -352 -205 490 158 -524 -393 178 289
4339B89j08p31k83Q07j22J5m02Q6L00O48p28l67j44L87L87k76o36J46N72L37N8
$$ 289 181 -550 -833 -26 -148 -133 -535 -449 -149 499 -229 -596 -740 -353 34 -242 -878 -732 -160 177 235
4360B35o15l52M35M64l53p08J9N38M86q1m18k85Q15l43k98l73K66N43J6j43m77
$$ 235 -380 -732 -297 167 -186 -894 -875 -337 149 68 -350 -635 180 -163 -461 -834 -568 -25 -9 -152 -629
4381f29n9M94M03n66m09K37L08K50l18n68M43L14J39n85j44q4M84L37l09m92j31
$$ -629 -688 -194 209 -357 -766 -529 -221 29 -289 -857 -414 -100 39 -546 -690 -774 -290 47 -262 -754 -885
4402h85P19J76l85m02m0N91j4J20j015O50L28r3j52j94j16P66k03m97k53K21J002
$$ -885 -166 10 -375 -777 -817 -226 -240 -120 -1135 -485 -157 -250 -402 -596 -712 54 -149 -646 -899 -678 324
4423C24k24n01n62N87R1K41n69L81l65N27J11j65j87p2O61j53k64o57K46R04l06
$$ 324 100 -401 -963 -376 -285 -44 -613 -232 -597 -70 41 -124 -311 -383 278 125 -139 -796 -550 354 48
4444D8k77l74M27N63j17m64l07J29L96M28q19j02M62K83p5m66k35O85M21n50l26
$$ 48 -229 -603 -176 387 270 -194 -501 -372 24 452 -367 -469 -7 276 201 -265 -500 185 606 56 -270
4465b70k21N54P68k89q44J67L10L33k45n18j18O13J81N4m60K0K61M26l10j45l00
$$ -270 -491 63 831 542 -302 -135 175 508 263 -255 -373 240 421 475 15 35 296 722 412 267 -33
4486c3J88K57k4J4m06N68j8l26o9l98M24J52K48l98k11M98K2P4l95k17L16M91
$$ -33 155 412 388 402 -4 564 546 220 151 -247 177 329 577 179 -32 466 488 562 167 -50 266 757
4508G57l03m91J71K88L73l70k83j21J59M95m09q5o29R59L52o4o18QN53N6n61o52
$$ 757 454 -37 134 422 795 425 142 21 180 675 266 181 -448 511 863 799 181 189 742 798 237 -415
4530d15N09N50L6k49m36M58Q9K1k29m68J77N36J34k89k42k63O94p7j80n08K24
$$ -415 94 644 680 431 -5 453 542 563 334 -134 43 579 713 424 182 -81 613 536 356 -152 72
4551G2L09J04j62m86L95K32J58l60n38L43L69J03l93m25K09K76O33n01o79J75
$$ 72 381 485 323 -163 232 464 622 262 -276 67 436 539 146 -279 -70 206 839 338 -341 -166
4571a66O54j09m32k24L70M17J44m48m15N9N93k47l8m31M73K06j04k83j20L14J00
$$ -166 488 379 -53 -277 93 510 654 206 -209 -150 443 196 158 -273 200 406 302 19 -101 213 313
4592C13M06p34m16M42O18j10l93j89L26J71R4n25l66R8N48n5j37k39M27O49l15
$$ 313 719 -15 -431 11 629 519 126 -63 263 434 528 3 -363 -265 283 228 91 -148 279 928 613
4613F13o37k94K22N39n7p15K44K63P88n59k18m09K39L72k58o38M27K82J52N6l90
$$ 613 -24 -318 -96 443 386 -329 -85 178 966 407 189 -220 19 391 133 -505 -78 204 356 412 22
4634B2n07N04K85p4o10J7N53k6J77o29o2J62L70l78l47j65N72K87l71k48J21K72
$$ 22 -485 19 304 230 -380 -363 190 164 341 -288 -350 -188 182 -196 -543 -708 -136 151 -220 -468 -347 -75
4656g5M19n92O8j81M4N58k81p50K40P00j11k08k86j07P0N77n16j98M4N38K20l49
$$ -75 344 -248 -180 -361 -317 241 -40 -790 -550 150 39 -169 -455 -562 -492 85 -431 -629 -585 -47 173 -176
4678a76n97J13K99L60l22m63J56M67K90k29o11M15J4Q2k15n47L28O22J88n81j03
$$ -176 -773 -660 -361 -1 -323 -786 -630 -163 127 -102 -713 -298 -284 -202 -417 -964 -636 -14 174 -407 -510
4699e10k19P69r0j71n35L74K37J21m63j02M65L85l07j01l35k07N40p6n6l11L56
$$ -510 -729 40 -50 -221 -756 -382 -145 -24 -487 -589 -124 261 -46 -147 -482 -689 -149 -225 -281 -592 -236
4720b36J91J62n13k50J68K18n4J75k49j88Q83r3k21l03n2M18J30n59j24p1J185
$$ -236 -45 117 -396 -646 -478 -260 -314 -139 -388 -576 307 214 -7 -310 -362 56 186 -373 -497 -568 617
4741F17m26m9m94j54P19j00m65l41N9M47K17l45J59L07J55J83o49m13J91P97j70
$$ 617 191 142 -352 -506 213 113 -352 -693 -634 -187 30 -315 -156 151 306 489 -160 -573 -382 415 245
4762B45n51j09M55L81j58m88j43M34L35j66n38q1L62K62j31k68L05j91K53r5o40
$$ 245 -306 -415 40 421 263 -225 -368 66 401 235 -303 -384 -22 240 109 -159 146 -45 208 113 -527
4783e27K50L44M54j53m63j7M52l61k0l01k31M25N97k36j79l98N60J77k78k69J6
$$ -527 -277 67 521 368 -95 -112 340 -21 -41 -342 -573 -148 449 213 34 -364 196 373 95 -174 -158
4804a58L71J5j3j72k96M79J30j86p3j43ML94k52m60K88L06M28n75k98k88Q11J61
$$ -158 213 228 215 43 -253 226 356 170 97 -46 -42 352 100 -360 -72 234 662 87 -211 -499 312 473
4826D73o36K36j34N22K99l68m28j82N36J68j98l69j3N27K36p04K09p1L33j39k7
$$ 473 -163 73 -61 461 760 392 -36 -218 318 486 288 -81 -94 433 669 -35 174 103 436 297 270
4847B70m45P8N51R8n3m51q7N09M4l67k37j08O62J41m17l50L51M47j93L0p05M13
$$ 270 -175 -97 454 552 499 48 -39 470 514 147 -90 -198 464 605 188 -162 189 636 443 473 -232 181
4869A81M02j67j6k40R9K49k25k61n6J1K52J38Rm41L44L85j45m39l3L5L20ll57
$$ 181 583 416 400 160 259 508 283 22 -34 -23 229 367 376 -65 279 664 519 80 47 82 402 399 42
4892D2j58J06K98j4j77j04L28J33r5n46J74R4K38K29p02J08qL37o2j98j35O1K23
$$ 42 -116 -10 288 274 97 -7 321 454 359 -187 -13 81 319 548 -154 -46 -54 283 221 23 -112 -51 172
4915A72O9k2n69L14O84o11p1k15l0O68j57l78n0j41O90m40J49q0J50n4Mn11J00
$$ 172 241 219 -350 -36 648 37 -34 -249 -279 389 232 -146 -196 -337 353 -87 62 -18 132 78 82 -429 -329
4938c29K48L52l33k38P6p4L78j38l18LM69P3m69j14J22L30P7m07J02r6M59k23
$$ -329 -81 271 -62 -300 -224 -298 80 -58 -376 -373 96 169 -300 -414 -292 38 115 -292 -190 -286 173 -50
4960e0k26QJ75R4J18l75J7m55O30J77K4k09r0K45j80K5m58J45R3P28p15O7j43
$$ -50 -276 -268 -93 1 119 -256 -239 -694 -64 113 137 -72 -162 83 -97 -72 -530 -385 -292 436 -279 -212 -355
4983c55K02N52k06l37l10M69j39j29j22K0J91N26l97o09K13K54L06m46L3o6P22
$$ -355 -153 399 193 -144 -454 15 -124 -253 -375 -355 -164 362 -35 -644 -431 -177 129 -317 -284 -350 372
5004C72j77k73m80L52M57j79m44k44M77L85m43N16p69M83K37j67p8o19L10L94
$$ 372 195 -78 -558 -206 251 72 -372 -616 -139 246 -197 319 -450 33 270 103 25 -594 -284 110
5024A10J93n60l4K08K73n3l64l0j37M24p3k47J68m0L89k37k59j14k13P28l9m25
$$ 110 303 -257 -291 -83 190 137 -227 -257 -394 30 -43 -290 -122 -162 227 -10 -269 -383 -596 132 93 -332
5046c32k58K47K96K25j55o66J32P23j53p13l9N11K11j16j92j2K57m4J13k77l90
$$ -332 -590 -343 -47 178 23 -643 -511 212 59 -654 -693 -182 29 -87 -279 -291 -34 -78 35 -242 -632
5067f32N22K76j46k98l14M85M0P7l01p0L09R1j72j28j47L19J98K23m20j39N04
$$ -632 -110 166 20 -278 -592 -107 -67 10 -291 -361 -52 39 -133 -261 -408 -89 109 332 -88 -227 277
5088B77J22k36m41N3K16K99r8j46l76J94M0L67n56K49k51M62J91m19j30K88L01
$$ 277 399 163 -278 -225 -9 290 192 46 -330 -136 -96 271 -285 -36 -287 175 366 -53 -183 105 406
5109D06j20n49J39m3P05k00l35k67L00J81j0j41m9N01k08N6k39Q6J1K59k01n08
$$ 406 286 -263 -124 -167 538 338 3 -264 36 217 207 66 17 518 310 366 127 213 224 483 282 -226
5131b26K57R3M06l12j13L6M56L4l04r9n88N41r3J94l07R5K15K9R5p09M29o9N89
$$ -226 31 124 530 218 105 141 597 631 327 228 -360 181 88 282 -25 70 285 314 409 -300 129 60 649
5154F49n89l05L39J65j79K5j90O4L92j62o9n10L68K34j65J07m70K32M36k54L22
$$ 649 60 -245 94 259 80 105 -85 -21 371 209 140 -370 -2 232 67 174 -296 -64 372 118 440
5175D40k16k07L39Ok21l65L82R0O7j41m35J14L29k6j46j85K93J45r0k21o1l6N57
$$ 440 224 17 356 362 141 -224 158 248 315 174 -261 -147 182 156 10 -175 118 263 173 -48 -109 -145 412
5198D12j40k63j7j0N78r2m38j52K17K17n5j98K17q7p2P0J12j05rO4K34o26k48
$$ 412 272 9 -8 -18 560 468 30 -122 95 312 257 59 276 189 117 187 299 194 185 249 483 -143 -391
5221c91L35J51O7j61Q0l09N93n1l99l53M01K21J8j51l13N60j84J40o3n46Q46j03
$$ -391 -56 95 162 1 81 -228 365 314 -85 -438 -37 184 202 51 -262 298 114 254 191 -355 491 388
5243C88l76j68m2K77M27m73l08N6M23P3n8m83m5Q4P19m22l52K26J2K60k48K1l24
$$ 388 12 -156 -198 79 506 33 -275 -219 204 277 219 -264 -309 -225 494 72 -280 -54 -42 218 -30 -9 -333
5266c33O04j31j45l51N39ok70J36l53j00L03l3K37k48LJ84R2l98K81j36Q7J11
$$ -333 271 140 -5 -356 183 177 -93 43 -310 -410 -107 -140 97 -151 -148 36 128 -270 11 -125 -38 73
5288G3J33l94o9K68L40n42J73m77N13K71m13k69J18M51Q2k82k47J6K67K09j055
$$ 73 206 -188 -257 11 351 -191 -18 -495 18 289 -124 -393 -275 176 258 -24 -271 -255 12 221 -834
5309h34N81k78N56M3n26N2K18J54o5L3l41Q0K14L62p17J31K71q9K94n32J29K0
$$ -834 -253 -531 25 68 -458 -406 -188 -34 -99 -66 -407 -327 -113 249 -468 -337 -66 -155 139 -393 -264 -244
5331b44J08K11m80K5K72J29On04K02L3K97j17l52O7L51N5N4n8o33M08K65k23l66
$$ -244 -136 75 -405 -380 -108 21 27 -477 -275 -242 55 -62 -414 -347 4 59 113 55 -578 -170 95 -128 -494
5354d94N3K28J64J19j54m31M07J4MP8l44K39M85j33o10M39k63K24J90l31n2J21
$$ -494 -441 -213 -49 70 -84 -515 -108 -94 -90 -12 -356 -117 368 235 -375 64 -199 25 215 -116 -168 -47
5376d7J70J00m24R3K48J45k79j17K5L51Lj54k7j81K53m81N66l45K12l1p7J10p7
$$ -47 123 223 -201 -108 140 285 6 -111 -86 265 268 114 87 -94 159 -322 244 -101 111 80 3 113 36
5399C6k77K31J35j38j0k15L92n0o2Oj71J55L24l35k31K08q7L80j69j26n9K08J55
$$ 36 -241 -10 125 -13 -23 -238 154 104 42 48 -123 32 356 21 -210 -2 -89 291 122 -4 -63 145 300
5422C00m3j15k86K34K45om35j25K56K85l33j05r8N53j94q0J52k90L83k32M0l01
$$ 300 257 142 -144 90 335 329 -106 -231 25 310 -23 -128 -226 327 133 53 205 -85 298 66 106 -195
5444a95J93M8L29m47k3K4p1N57m29m6L4J53L4l09J42j72L29q0l05O1K55P5j3K36
$$ -195 -2 46 375 -72 -95 -71 -142 415 -14 -60 -26 127 161 -148 -6 -178 151 71 -234 -173 82 157 144 380
5468C80p03M04J01L25l64l33K94k6R5j46j20q4N08R7p83L15J06J87k78R7j27L15
$$ 380 -323 81 182 507 143 -190 104 78 173 27 -93 -177 331 428 -355 -40 66 253 -25 72 -55 260
5490B60k24K43k32J68J2o1K7k69J54j87L41j74P5l01N26M6l04j8q3J88j12O6J06
$$ 260 36 279 47 215 227 166 193 -76 78 -109 232 58 133 -168 358 404 100 82 -1 187 75 141 247
5513B47o3p4K29J50l69m67N64j84J66l76k00N30R5l12J83K4p1K94l29N0J2r2K18
$$ 247 184 110 339 489 120 -347 217 33 199 -177 -377 153 248 -64 119 143 72 366 37 87 99 7 225
5536B25q4j06m17M60J66j01k63m50P04R3o72L50O3J00O5pm12j10O81l59J76j25
$$ 225 141 35 -382 78 244 143 -120 -570 134 227 -445 -95 -32 68 133 126 -286 -396 285 -74 102 -23
5558b3k33M86j62j45k53J73K71m4l5k69J31j06J85%j97K38j09J56k05J33j91K35
$$ -23 -256 230 68 -77 -330 -157 114 70 35 -234 -103 -209 -24 -24 -221 17 -92 64 -141 -8 -199 36
5580C6j43K20l61m2L23J27K5l60m2K22J76n8j88m73M58M4j9j52Q4RM15n01k12
$$ 36 -107 113 -248 -290 33 160 185 -175 -217 5 181 123 -65 -538 -80 -36 -55 -207 -123 -114 301 -200 -412
5603d12K57J79M7o8n32K60K19L68o3p28N06J44j99N4l93J90K21K8j23o2J46k66
$$ -412 -155 24 71 3 -529 -269 -50 318 255 -473 33 177 -22 32 -361 -171 50 78 -45 -107 39 -227
5625b27N68m56J23K6J04j41j04M6q3K53k17L5J40MJ47K3k9m32K12j82M69n21j28
$$ -227 341 -115 8 34 138 -3 -107 -61 -144 109 -108 -73 67 71 218 241 212 -220 -8 -190 279 -242 -370
5648c70L13J9K78l10k36M49N4m6l93n4K2M01R0m37r3J38N15l19j15j01j88M83
$$ -370 -57 -38 240 -70 -306 143 197 151 -242 -296 -274 127 217 -220 -313 -175 340 21 -94 -195 -383 100
5670A00r9l59K34M15L6k50J6l01R5J64pk74m9O50k47p8p1j89K39J2l6k41J54M46
$$ 100 1 -358 -124 291 327 77 93 -208 -113 51 44 -230 -279 371 124 46 -25 -214 25 37 1 -240 -86 360
5694C60k44Pm87L94n3j93J56m18L27J82K04k61j83j4p3N15Ok96M7J0L45j93k99
$$ 360 116 123 -364 30 -23 -216 -60 -478 -151 31 235 -26 -209 -223 -296 219 225 -71 -24 -14 331 138 -161
5717a61OM52k21n0p2j99J80K58k40r2p9L15K44k08j79j5J40j27m3Kk9k4J33l22
$$ -161 -155 297 76 26 -46 -245 -65 193 -47 -139 -218 97 341 133 -46 -61 79 -48 -91 -89 -118 -142 -9 -331
5741c31M77K4j43kR0J23j75k03L33n65L04M17m31N2r4o6M00k87L47j21k87K37
$$ -331 146 170 27 25 115 238 63 -140 193 -372 -68 349 -82 -30 -124 -190 210 -77 270 149 -138 99
5763I9K64k52J02m59M34r1K24j72j50J62k54M93m76K17k09K29j30q0o6J53K17
$$ 99 363 111 213 -246 188 97 321 149 -1 161 -93 400 -76 141 -68 161 31 -49 -115 38 255
5784B55O3j22j80J57Q8j23l5Q2j48L16k07m3k26K11l7L68k96r0j02J20M22l71
$$ 255 318 196 16 173 261 138 103 185 37 353 146 103 -123 88 51 419 123 33 -69 51 473 102
5806A02n22K98M39l84K03m64K11J21K74o7o5O0j74K34j43k24j39O02j26j98k06
$$ 102 -420 -122 317 -67 136 -328 -117 4 278 211 146 206 32 266 123 -101 -240 362 236 38 -168
5827a68L62j2J8l58j77M68k0j27J11P3j99j21K08m7l48O55j85K52j02n03K81o2
$$ -168 194 182 200 -158 -335 133 113 -14 97 170 -29 -150 58 11 -337 318 133 385 283 -220 61 -1
5849aM9l91K20L98l5j57l48K08JL67j53j23o9K27k62L48m28j50J83M31j82j66
$$ -1 48 -343 -123 275 240 83 -265 -57 -56 311 158 35 -34 193 -69 279 -149 -299 -116 315 133 -33
5871c3p2L98J05m88K09k75K33L65l50k89k24L67M84m16n29M50j96O2J27J90jN2
$$ -33 -105 293 398 -90 119 -156 77 442 92 -197 -421 -54 430 14 -515 -65 -261 -199 -72 118 117 169
5893A69Q3j68Km29M93p3l5l14J59O8j56L20k22m9J89l27J87p2L27O0j94j11J71
$$ 169 252 84 86 -343 150 77 42 -272 -113 -45 -201 119 -103 -152 37 -290 -103 -175 152 212 18 -93 78
5916G8m01L60m8J9l37N7K95k16L09l18K58k2J63q3k13M8L02l37O8k45k01M78K98
$$ 78 -323 37 -11 8 -329 -272 23 -193 116 -202 56 34 197 114 -99 -51 251 -86 -18 -263 -464 14 312
5939C12k75n40L07K58j50Q4l78K04K74N5l66k28M27O4k15n7k6N7L36K11o08K56
$$ 312 37 -503 -196 62 -88 -4 -382 -178 96 151 -215 -443 -16 48 -167 -224 -250 -193 143 354 -254 2
5961Bj01K81k59k0J16KJ07k90L8j21l1M80k83R4j39J14J31j73j61j45M16m7k00
$$ 2 -99 182 -77 -97 19 21 128 -162 -124 -245 -276 204 -79 15 -124 -10 121 -52 -213 -358 58 11 -189
5984a89K84j23J57J59m68q2O5J88R1J1J3K6L5l8q7k16K84m97M62L7k63RK21k67
$$ -189 95 -28 129 288 -180 -262 -197 -9 82 93 106 132 167 129 42 -174 110 -387 75 112 -151 -142 79 -188
6008a88K26j76M1K66o8J07k56J73q0J09j59K1k29J44J38J1j58K14l47RJ70o3o8
$$ -188 38 -138 -97 169 101 208 -48 125 45 154 -5 16 -213 -69 69 80 -78 136 -211 -202 -32 -95 -163
6031a63J40K67M8j05k52J93J30k51l29N9R1L14l39N24o46N34kj16j67P5L69m06
$$ -163 -23 244 292 187 -65 128 258 7 -322 -263 -172 142 -197 327 -319 215 213 97 -70 5 374 -32
6053c2M1j80J91k82L63j59M0M1J06j52N7J32m19M42k16k2J20J01M7j76N2k48R0
$$ -32 9 -171 20 -262 101 -58 -18 23 129 -23 34 166 -253 189 -27 -49 71 172 219 43 95 -153 -63
6076f3K41m8r7J39j59K63Pj10j60J6J10j07qk32L66j53J43l6r1O5k5J64k84M3
$$ -63 178 130 33 172 13 276 283 173 13 29 139 32 24 -208 158 5 148 112 21 86 61 225 -59 -16
6100a6P2L70m25P9l16L61k23J37L11k75j73j17M99r6k25Q9r2m9kJ37P6K6J43l36
$$ -16 56 426 1 80 -236 125 -98 39 350 75 -98 -215 284 188 -37 52 -40 -89 -91 46 122 148 291 -45
6124d5q9L3K69K08r9m90K29R4J99n77L15K86k21k00N9J21J0J77l1o49Q9M59l56
$$ -45 -134 -101 168 376 277 -213 16 110 309 -268 47 333 112 -88 -29 92 102 279 248 -401 -312 147 -209
6147b09M55l08n1J51J09j63Rk38K88L21m28K02q5n4J60oj20k11L50m7j03J69j86
$$ -209 246 -62 -113 38 147 -16 -7 -245 43 364 -64 138 53 -1 159 153 33 -178 172 125 22 191 5
6170EJ21L5j34j1q7L04l97K91J97r7l06M6o4J87O4j12j6N9l8k44K93m9Q0k21o3
$$ 5 126 161 27 16 -71 233 -164 127 324 227 -79 -33 -97 90 154 42 26 85 47 -197 96 47 127 -94 -157
6195a57J58K02r4k69N5K89m30J52M3J54k83r9M61l33O4L85k50k2o6P8L5K7j36
$$ -157 1 203 109 -160 -105 184 -246 -94 -51 103 -180 -279 182 -151 -87 298 48 26 -40 38 73 100 -36
6218c6j34j0O9K18p5j53j72J70K30k76R6J61M5L4l0k71j22N35l65J91m93K46k03
$$ -36 -170 -180 -111 107 32 -121 -293 -123 107 -169 -73 88 133 167 137 -134 -256 279 -86 105 -388 -142 -345
6241c45o9M16m59M78K84k70q0j27o8J47J51n2m0l42L26on6j12K52R5k11k15M03
$$ -345 -414 2 -457 21 305 35 -45 -172 -240 -93 58 6 -34 -376 -50 -56 -112 -224 28 123 -88 -303 100
6264A00j08J33m85K27J2k3rJ40j52qj46R2K24O2mj16M81m39l3o9Q5j43J21L0n3
$$ 100 -8 125 -360 -133 -121 -144 -153 -13 -165 -173 -319 -227 -3 59 55 -61 420 -19 -52 -121 -36 -179 -58 -28 -81
6289h1P6%J16k26N7L6m7J32jj81N4J89K41m92l1k00K58j34M7J83n4M94k91k02
$$ -81 -5 -5 111 -115 -58 -22 -69 63 62 -119 -65 124 365 -127 -158 -358 -100 -234 -187 -4 -58 436 145 -57
6313e7j15N1Q4K33L5l16J84j4k01r3J01L42k52M9J63j67K1L9l5k7k53P37m14k65
$$ -57 -172 -121 -37 196 231 -85 99 85 -116 -209 -108 234 -18 31 194 27 48 87 52 25 -228 509 95 -170
6337a70J05J77P8l89N49n82L50p1p7m4N2J92P0l39K21nj08J26l6k45o5n2N35m23
$$ -170 -65 112 190 -199 350 -232 118 47 -30 -74 -22 170 240 -99 122 117 9 135 99 -146 -211 -263 272 -151
6361a51O9l1J6J78k24M57l93K02O6l12j3K10j38r9N3pL01l57M74KQ4m75K67k19
$$ -151 -82 -113 -97 81 -143 314 -79 123 189 -123 -136 74 -64 -163 -110 -117 184 -173 301 303 387 -88 179 -40
6385d0N5j11Q9O9n5J63k27J43o8P2Q4l20o4M95q4j33j18k0K67J03m1j79k76J56
$$ -40 15 -96 -7 62 7 170 -57 86 18 90 174 -146 -210 285 201 68 -50 -70 197 300 259 80 -196 -40
6409d0K69J5O5k13l63J58K86q0k66O55m00j84k14J74L71k03L8R0j50K02j13R1
$$ -40 229 244 309 96 -267 -109 177 97 -169 486 86 -98 -312 -138 233 30 68 158 8 210 97 188
6431A88k12K18j22r8j72K11R5o6L27k77j00JL57j48l02O6o7J98j21J9J86j6k50
$$ 188 -24 194 72 -26 -198 13 108 42 369 92 -8 -7 350 202 -100 -34 -101 97 -24 -5 181 165 -85
6454h5K3K38p9o6j87K85O2m39M94j83r9J84l50J4K42J68RL6m30J75K67Pk02J47
$$ -85 -62 176 97 31 -156 129 191 -248 246 63 -36 148 -202 -188 54 222 231 267 -163 12 279 286 84 231
6478B31l28K96p3l30L07r1K46k66J1Q8j92P4J34N7k24K86k59O2P3qo1J44k56k23
$$ 231 -97 199 126 -204 103 12 258 -8 3 91 -101 -27 107 164 -60 226 -33 29 102 94 33 177 -79 -302
6502c02J89q6K01J57Q8n29K44O8J50Q3m35N6J60N9J39k11L43ql76K82k27O4k21
$$ -302 -113 -199 2 159 247 -282 -38 30 180 263 -172 -116 44 103 242 31 374 366 -10 272 45 109 -112
6525a12L2J82l60M20k3r3j64JO4p4Q8j01j34K61M08m06j08P3K90l02K15k31K29
$$ -112 -80 102 -258 162 139 46 -118 -117 -53 -127 -39 -140 -274 -13 395 -11 -119 -46 244 -58 157 -74 155
6548A55m91j3K04L5K04r7J65k37J70J75qk57j85J13n4q4P2K40k82L07K1k73R6
$$ 155 -336 -349 -145 -110 94 -3 162 -75 95 270 262 5 -180 -67 -121 -205 -133 107 -175 132 153 -120 -24
6571b4j5K33j40K03m45J3J28j43J27l80K46J41O7j76K76k52nJ59j26Mk5K17O6
$$ -24 -39 194 54 257 -188 -175 -47 -190 -63 -443 -197 -56 11 -165 111 -141 -146 13 -113 -109 -134 83 149
6594A49k61j15J11p0M21k86P0q6o3J72l45J37L47m51M39p9l06L75r0j12KJ43m1
$$ 149 -112 -227 -116 -186 235 -51 19 -67 -130 42 -303 -166 181 -270 169 90 -216 159 69 -43 -41 102 61
6617F1j85J27Km01M25k20L77m16K5J33q6L40l09M2P1j82N15l80k05K58n6M69m35
$$ 61 -124 3 5 -396 29 -191 186 -230 -205 -72 -158 182 -127 -85 -14 -196 319 -61 -266 -8 -64 405 -30
6640c0j22N1R7jk30K57K17m11q1K53k3J27q6j03J46k3j00J50j19j09R8JN3J52
$$ -30 -152 -101 -4 -5 -235 22 239 -172 -253 0 -23 104 18 -85 61 38 -62 88 -31 -140 -42 -41 12 164
6664A64j30m1N3M44n03l19J26Q4K55j69P5k16J10J07k34M29o9k69l5P0J56Qk06
$$ 164 34 -7 46 490 -13 -332 -206 -122 133 -36 39 -177 -67 40 -194 235 166 -103 -138 -68 88 96 -110
6687a10K50j75k57J71K60Mk63pn1lR2J36j52J35K52j53L4j23qR5n16K81L43k72
$$ -110 140 -35 -292 -121 139 143 -120 -127 -178 -181 -89 47 -105 30 282 129 163 40 32 127 -389 -108 235 -37
6711c7J82k8J16j32l33J79r3K35k77L15J58l65L08j87o3K80k10J15N6l90K91l47
$$ -37 145 117 233 101 -232 -53 -146 89 -188 127 285 -80 228 41 -22 258 48 163 219 -171 120 -227
6733b27L08k29l9L77j33k1l22J75J99L7j85j99R2L81j41L8j54P0j27L08j72j73
$$ -227 81 -148 -187 190 57 36 -286 -111 88 125 -60 -259 -167 214 73 111 -43 27 -100 208 36 -137
6755a37K37r2M32l79r0j1J2K57k25j14J91k9L0j79J40J31k98K2K50O3j61J75j80
$$ -137 100 8 440 61 -29 -40 -28 229 4 -110 81 52 82 -97 43 174 -124 -102 148 211 50 225 45
6778D5n5j76K80j5Q5K53m88J09m21L75j27O8n1m6L00k73l2q2K93K6j45n7J49J04
$$ 45 -10 -186 94 79 164 417 -71 38 -383 -8 -135 -67 -118 -164 136 -137 -169 -251 42 68 -77 -134 15 119
6802A19j66k53M50l12L97k16N2n7K5N7j77P5j80k92O49Q7l66J37j59R8K28j86
$$ 119 -47 -300 150 -162 235 19 71 14 39 96 -81 -6 -186 -478 171 258 -108 29 -130 -32 196 10
6824A0j48L08n08K75J70j29J50J00k24m4j26N8l3K19k63Q2j06J30J25Pm10P8M60
$$ 10 -138 170 -338 -63 107 -22 128 228 4 -40 -166 -108 -141 78 -185 -103 -209 -79 46 53 -357 -279 181
6847A81l8n44M27k6L49l12l94L23j31L10j95k82M33q6K7J56m50L31K42n49K05
$$ 181 143 -401 26 0 349 37 -357 -34 -165 145 -50 -332 101 15 42 198 -252 79 321 -228 -23
6868b3j54J6L46m70K01J07j79J03L7L46k43N2j71J6R6m39M99l31q4K95J38l49
$$ -23 -177 -161 185 -285 -84 23 -156 -53 -16 330 87 139 -32 -16 80 -359 140 -191 -275 20 158 -191
6890a91N2L98l48L5oL0j8J42O6j80j56K98P2k13K4j24J56M6j01j85K27j43j10
$$ -191 -139 259 -89 -54 -60 -30 -48 94 160 -20 -176 122 194 -19 5 -119 37 83 -18 -203 24 -119 -229
6913b29M09k49oOk55M03j93L14j17O9l11K51J56k62J91l59K84J06l39n1K11j52
$$ -229 180 -69 -75 -69 -324 79 -114 200 83 152 -159 92 248 -14 177 -182 102 208 -131 -182 29 -123
6935a23N5J60j06l44L60j01K33n5ojj44K25n9j97r5J79J49l15R4J12L53j36m21
$$ -123 -68 92 -14 -358 2 -99 134 79 73 72 -72 153 94 -103 -198 -19 130 -185 -91 21 374 238 -183
6958a83K25l13L44l49L33j2j36J21K47o5j47J05l89L47P0j44j0K08j14l75J64
$$ -183 42 -271 73 -276 57 45 -91 30 277 212 65 170 -219 128 198 54 44 252 138 -237 -73
6979g3j96J69L44j00j43k70J74o7J38j67K65j1L2J37k48j57m5M98m92P7L84m98
$$ -73 -269 -100 244 144 1 -269 -95 -162 -24 -191 74 63 95 232 -16 -173 -218 280 -212 -135 249 -249
7001b49L65m0j36K5M66n04p5j02J80K62k91K0J54k12K80J06l26l8j51K74p6m07
$$ -249 116 76 -60 -35 431 -73 -148 -250 -70 192 -99 -79 75 -137 143 249 -77 -115 -266 8 -68 -475
7023d75L94K23J23l50J83p6K55m10K39l03J75J51k00m21P50k27L0L87l32j44j35
$$ -475 -81 142 265 -85 98 22 277 -133 106 -197 -22 129 -71 -492 258 31 61 448 116 -28 -163
7044a63J09J25k79J59O5J11j36k48K15J05J1j69K00J28l33Q7Kj1O2K7k2M1O9l45
$$ -163 -54 71 -208 -49 16 127 -9 -257 -42 63 74 -95 105 233 -100 -13 -11 -22 40 67 45 86 155 -190
7068a90K31j07Q7l0l08J73R9N6m01L86J11K01k37k27L36k73M9p6K60n82J60L04
$$ -190 41 -66 21 -9 -317 -144 -45 11 -390 -4 107 308 71 -156 180 -93 -44 -120 140 -442 -282 22
7090B2p8q6O19o89J54o1j14R5J19P5j60J26L2p4k44M18k06K26o5k89k9M62n28
$$ 22 -56 -142 477 -212 -58 -119 -233 -138 -19 56 -104 22 54 -20 -264 154 -52 174 109 -180 -209 253 -275
7113b75L61J08j30M2j00n4m5J3j30M5L45k75J22M8o7o1K46j63k53R7L35k45L50
$$ -275 86 194 64 106 6 -48 -93 -80 -210 -165 180 -95 27 75 8 -53 193 30 -223 -126 209 -36 314
7136C14m54J12J50j26kj23J56J02k22j51K12l56J58N6n3J35P8j95K02j19K54J9
$$ 314 -140 -28 122 -4 -6 -129 27 129 -93 -244 -32 -388 -230 -174 -227 -92 -14 -209 -7 -126 128 147
7158A47j13j1k68J3L12q1K4J37k6k33J80L6l87L63j25Q7K1l2J6k7m9J07k50L08
$$ 147 34 23 -245 -232 80 -1 23 160 134 -99 81 117 -270 93 -32 55 76 44 60 33 -16 91 -159 149
7182A49j50J60k29L37l54K75j59J78j18k86K15k62N56j92j01j18M86o12R3J29
$$ 149 -1 159 -70 267 -87 188 29 207 89 -197 18 -244 312 120 19 -99 387 -225 -132 -3
7202cK14k16J5K30l44J58j48K82k68j16p8L21J21j76M0k97K31j57Q1K56P4m77
$$ -3 211 -5 10 240 -104 54 -94 188 -80 -196 -274 47 168 -8 32 -265 -34 -191 -110 146 220 -257
7224b57L27O8j76J0K98m68L63kJ08l67K71j2k38R6j36J31j12q5K57R0k12J86j34
$$ -257 70 138 -38 -28 270 -198 165 163 271 -96 175 163 -75 21 -115 16 -96 -181 76 166 -46 140 6
7247FjJ22J57o6J43j24J7k90K61m06K7J02K2M9K02j99N6j94K26k15J84o9j33N25
$$ 6 5 127 284 218 361 237 254 -36 225 -181 -154 -52 -30 19 221 22 78 -116 110 -105 79 10 -123 402
7271D02l42l1k5J02j01l94L73p3J43j55K58k02J58P3m44L99k14J94j96K02J20
$$ 402 60 29 4 106 5 -389 -16 -89 54 -101 157 -45 113 186 -258 141 -73 121 -75 127 247
7292B47k28n8J1j72J40K46j0k01r0N8L5K80k80Q6j10J56pL38k1l28m73L70K99
$$ 247 19 -39 -28 -200 -60 186 176 -25 -115 -57 -22 258 -22 64 -46 110 103 441 420 92 -381 -11 288
7315B88l58J03j51L17l54R3K73k20L16l53nJ81L8j60j0j34J22K92j89M7p0j40
$$ 288 -70 33 -118 199 -155 -62 211 -9 307 -46 -51 130 168 8 -2 -136 -14 278 89 136 66 -74
7337g4j76J55K08r4j55N1K28l22J40j3M6l6J56j50k9j01O3%j01K07j60J36O6P9
$$ -74 -250 -95 113 19 -136 -85 143 -179 -39 -52 -6 -42 114 -36 -65 -166 -103 -103 -204 3 -157 -21 45 124
7361A24j6p6Jk35J40p0Lr8KK84J30j14L8k09J66j46K68N7l73J64P1rL6o9j63n1
$$ 124 108 32 33 -202 -62 -132 -129 -227 -225 59 189 75 113 -96 70 -76 192 249 -124 40 111 102 138 69 -94 -145
7387a45m4j73N93m91K40K66j54K58n07L44j23j64J53k80J83Q2K65l73q4Q6K15
$$ -145 -189 -362 231 -260 -20 246 92 350 -157 187 64 -100 53 -227 -44 38 303 -70 -154 -68 147
7408A47J09r4k61K42N0j78j00K72j51J19o2J30L6k80J96K2M2n82J71J05L86n97
$$ 147 256 162 -99 143 193 15 -85 187 36 155 93 223 259 -21 175 197 239 -343 -172 -67 319 -278
7430b78J9K94R4j19k8j9R0j9p7m6O7j99M25k61j54K48o8J50l89K79j69K03J1P2
$$ -278 -259 35 129 10 -18 -37 53 34 -43 -89 -22 -221 204 -57 -211 37 -31 119 -270 9 -160 43 54 126
7454A26j90L65j54m60K62j09M87l02k08L65k62Ok74O95l24Qk17J28P6K44j2k44
$$ 126 -64 301 147 -313 -51 -160 327 25 -183 182 -80 -74 -348 347 23 31 -186 -58 18 262 250 6
7476FJ26j42o6R7k29Q1K14k69J94K73j91M8Q5j59k0Q0j20j41P4k1l48M16n9l2
$$ 6 132 -10 -76 21 -208 -127 87 -182 12 285 94 142 227 68 48 128 8 -133 -59 -80 -428 -12 -71 -103
7500a03n2J91J61l3l34L71K7M1j50Jj25k00M19k64K67k54k10J36j38M00k62P9
$$ -103 -155 36 197 164 -170 201 228 269 119 120 -5 -205 214 -50 217 -37 -247 -111 -249 151 -111 -32
7522c2J25P8k28N8K44l96J75j28j13M08P1k86j30o1K22O1j47K26j16N9n46K19
$$ -32 93 171 -57 1 245 -151 24 -104 -217 191 262 -24 -154 -215 7 68 -79 147 31 90 -456 -237
7544b37J40L24r0l9m4k00K51j00j07kP7p1K04N6l13O9q2P0P8M8P1l23L92k71K26
$$ -237 -97 227 137 98 54 -146 105 5 -102 -104 -27 -98 106 162 -151 -82 -164 -94 -16 32 103 -220 172 -99 127
7569A27j68K2j8J52k90K90N0j47K64k66O2N2K17j09m39L12Q2o1k67K60J17k35
$$ 127 -41 -19 -37 115 -175 115 165 18 282 16 78 130 347 238 -201 111 193 132 -135 125 242 7
7591GK31k54q3K45k44K00K04n10L42k10R3J4N3l03L13L2k87K31K12k31j79k10
$$ 7 238 -16 -99 146 -98 102 306 -204 138 -72 21 35 88 -215 98 130 -157 74 286 55 -124 -334
7613c34N45k97J19r5J35j01O5j60M4K3J31k81m8M67j39Q9p5k72K09p7J27J57M9
$$ -334 211 -86 33 -62 73 -28 37 -123 -79 -56 75 -206 -254 213 74 163 88 -184 25 -52 75 232 281
7636B81n00J37J73k14J26l37L66K17o30N81m6J8J54n92M78k87L01k38J24k23k5
$$ 281 -219 -82 91 -123 3 -334 32 249 -381 200 154 172 326 -266 212 -75 226 -12 112 -111 -136
7657a36L16k50J6J60j18l0J26l1m4l4Q5j29q6K41qJ22k40o0R1N2j08j43L69j64
$$ -136 180 -70 -54 106 -12 -42 84 53 9 -25 60 -69 -155 86 78 200 -40 -100 -9 43 -65 -208 161 -3
7681cn3J06RJ63k5k57J83q6N7J84l14J43l39M63l08J44o3J0j5J14k04J23j95L30
$$ -3 -56 50 59 222 197 -60 123 37 94 278 -36 107 -232 231 -77 67 4 14 -1 113 -91 32 -163 167
7705A67k44J07j31M6O4j61L5p5M13l11J51m42L73K48k83N6q4L49k31j97K59j76
$$ 167 -77 30 -101 -55 9 -152 -117 -192 221 -90 61 -381 -8 240 -43 13 -71 278 47 -150 109 -67
7727f7qo3J13P1l0P1k63K81l27J27R0j72M27k77j68K92k49NL63l36J63l2j56K10
$$ -67 -75 -138 -25 46 16 87 -176 105 -222 -95 -5 -177 250 -27 -195 97 -152 -147 216 -120 43 11 -145 65
7751F5p8J95j34L94k66l18M16m66J48L11m82P9L48j53k48Q0J85K04j57k09m0j10
$$ 65 -13 182 48 442 176 -142 274 -192 -44 267 -215 -136 212 59 -189 -109 76 280 123 -86 -126 -236
7773b36M00Mj13q8K62j0J41m18j3J83k68J08K1j32LK25n1J04j4l03L82j88M1j20
$$ -236 164 168 55 -33 229 219 360 -58 -71 112 -156 -48 -27 -159 -156 69 18 122 108 -195 187 -1 40 -80
7797h0j94M38k67J95p4r0k6j45K79o1J0N2k40K96r7j2rj4ol31M78k55K53k30j78
$$ -80 -274 164 -103 92 18 -72 -98 -243 36 -25 -15 37 -203 93 -4 -16 -25 -39 -45 -376 102 -153 100 -130 -308
7822c08L02J05j43R3K33j40l51J28Q0j47L41j52j72K37l41J70J82j92L12k18j76
$$ -308 -6 99 -44 49 282 142 -209 -81 -1 -148 193 41 -131 106 -235 -65 117 -75 237 19 -157
7843a57J52k9j07J04O2j87M63j88k70Q3j86N60k5k44k22j77M11J4l18L45K2p0
$$ -157 -5 -34 -141 -37 25 -162 301 113 -157 -74 -260 300 275 31 -191 -368 43 57 -261 84 106 36
7865C6j65N15l07k29J76J28j19r5JJ04M0j19J45j48J17j26J02J10j94j93O30k68
$$ 36 -129 386 79 -150 26 154 35 -60 -59 45 85 -34 111 -37 80 -46 56 166 -28 -221 409 141
7887A41k57J63k55K46J7j52j34p5M51j39j28J37M8o9L10m62J68m2J18k10P7J73
$$ 141 -116 47 -208 38 55 -97 -231 -306 145 6 -122 15 63 -6 304 -158 10 -32 86 -124 -47 126
7909A26m07L29Rl4M3k20J85l58N74m30j35N22j7j36J82J4k90k59L15M6k12M15
$$ 126 -281 48 57 23 66 -154 31 -327 247 -183 -318 204 187 51 233 247 -43 -302 13 59 -153 262
7931B62o8j75j40N7J02J09n1L3j7J7j64P3l94K63J97J48k87K4j62K60O5q4J6r7
$$ 262 194 19 -121 -64 38 147 96 129 112 129 -35 38 -356 -93 104 252 -35 -11 -173 87 152 68 84 -13
7955a3J56L5K3k63O7J56q6k73o2K56lK17o58K52N43k64j9j25J81m13N14m32J58
$$ -13 143 178 201 -62 5 161 75 -198 -260 -4 -7 210 -448 -196 347 83 64 -61 120 -293 221 -211 -53
7978e3J12l47L02k2J43j26j31J58j83J43K5Q0J22l63K36K01l06j74O8K9Q1r4O6
$$ -53 59 -288 14 -8 135 9 -122 36 -147 -4 21 101 223 -140 96 297 -9 -183 -115 -86 -5 -99 -33
8001c3L37l19k05K43L2J7k2r4O1K05j50j93p4K25p5K86j12j80J3P9j12qJ99j60
$$ -33 304 -15 -220 23 55 72 50 -44 17 222 72 -121 -195 30 -45 241 129 -51 -38 41 -71 -79 120 -40
8025d0m9J93p3R4N4k19r2n2J9r7K17k51J26j4M44j33k04J18mk88J74J48Q4j31
$$ -40 -89 104 31 125 179 -40 -132 -184 -165 -262 -45 -296 -170 -184 260 127 -77 41 37 -251 -77 71 155 24
8049B4K11l71L11k91N8p5k47N58r4k05j43K88l84K76l8L13k08j55L89K82l43k87
$$ 24 235 -136 175 -116 -58 -133 -380 178 84 -121 -264 24 -360 -84 -122 191 -17 -172 217 499 156 -131
8071a31k7J68k4q1K34j60J93k61J97J23j70l3k47M26JNk03J80k42L21n65K93K0
$$ -131 -158 10 -14 -95 139 -21 172 -89 108 231 61 28 -219 207 208 213 10 190 -52 269 -296 -3 17
8094A7q8P8k81J66q1J92J6qK22j49Q3l82J73j48N6q5K32R2p2j67L25k70J84l32
$$ 17 -71 7 -274 -108 -189 3 19 11 233 84 167 -215 -42 -190 -134 -219 13 105 33 -134 191 -79 105 -227
8118b27L49j92J79k36k6K58j49K0k27N6J16K29J0k83J13l2L20l95j37K30j6M11
$$ -227 122 -70 109 -127 -153 105 -44 -24 -251 -195 -79 150 160 -123 -10 -42 278 -117 -254 -24 -40 371
8140C71k75l23M90k45k02K28j57N10l13j37j41J23J74m8J30l03O0J6k97M34J80
$$ 371 96 -227 263 18 -184 44 -113 397 84 -53 -194 -71 103 55 185 -118 -58 -42 -339 95 275
8161B75l14O6M2j1j1J76l64L2K65r2K1k4j79K15J64l36o6J77k83L54k32M01j02
$$ 275 -39 27 69 58 47 223 -141 -109 156 64 85 61 -118 97 261 -75 -141 36 -247 107 -125 276 174
8184A74j54N7k46L20l05K78L86
$$ 174 20 77 -169 151 -154 124 510
8191E10
$$ Imaginary data points
##PAGE= N=2
##DATA TABLE= (X++(I..I)), XYDATA
0@%%%%%%%%JrJ6j6J6j7K5l2L4m2N2o0P2q4R4j08J26j48J70j91K16k46K78l13L51
$$ 0 0 0 0 0 0 0 0 0 1 -8 8 -8 8 -9 16 -16 18 -24 28 -32 40 -44 50 -58 68 -80 90 -101 115 -131 147 -166 185
33A85l92M39m88N44o07O72p44Q24r15J014j121J243j377J527j699J898k128K394
$$ 185 -207 232 -256 288 -319 353 -391 433 -482 532 -589 654 -723 804 -895 1003 -1125 1269
51A269k712L104l594M223n071O285q182J1591j9647P4331O6766r2111k5356K9234
$$ 1269 -1443 1661 -1933 2290 -2781 3504 -4678 6913 -12734 61597 128363 36252 10896 40130
65D0130M0412l5938m4284N652N8101K6308k1267l3168O712K3438K276l0957k5453
$$ 40130 80542 44604 320 5972 64073 90381 69114 35946 42658 66096 68372 37415 11962
78A1962M556K7233J5169j940q714L217R188J658j6934k3243j0361J3755K0905
$$ 11962 16518 43751 58920 56980 48266 51483 60671 62329 45395 22152 11791 25546 46451
91D6451M879j2063l456J5292J3551j2498k9272j4305J2086J5952k972j1664M357
$$ 46451 51330 39267 35811 51103 64654 52156 22884 8579 20665 36617 33645 21981 26338
104B6338K1772J5275r522k5208j7161J212J0063K106r557n051J7440K8252L922
$$ 26338 48110 63385 53863 28655 11494 12706 22769 24875 15318 10267 27707 55959 59881
117E9881l2001l0019Q944K7284n123l7210r773M0761L9602j4494m3227o767L2700
$$ 59881 27880 -2139 6805 34089 28966 -8244 -18017 22744 62346 47852 4625 -2142 30558
130C0558J2131l5087l7046J2113M2988J6825k4041k1084J3799K4989o638l3352
$$ 30558 42689 7602 -29444 -17331 25657 42482 18441 -2643 11156 36145 29507 -3845
142c845j9306J2560K0982J896j0269j905J2809J3024j740j6584j9533o823R119
$$ -3845 -23151 -10591 10391 12287 2018 113 12922 25946 24206 7622 -11911 -18734 -9615
155i615J1638j242j0260L736K1617J3413j6412k9670p156J8494J0125j6252j7774
$$ -9615 2023 781 -9479 -5743 15874 29287 12875 -16795 -23951 -5457 4668 -11584 -29358
168b9358J3029L1624J0858k0474k1918K151J3152j966j8695j1314J2407K4885
$$ -29358 -16329 15295 26153 5679 -16239 -14088 -936 -2902 -21597 -32911 -20504 4381
180D381J1222j3122j8251p29J4508K662k0658k0830R161K8915J1666j6861j5816
$$ 4381 15603 2481 -15770 -16499 -1991 671 -19987 -40817 -31656 -2741 8925 -7936 -23752
193b3752J0836K2030l467l0492k0954J3428K5601K206j8296n423K1146J8722j1171
$$ -23752 -12916 9114 5647 -24845 -45799 -32371 -6770 -4564 -22860 -28283 -7137 11585 414
206D14k8442j1494J2757J1941n719j0535L232J6551J1745l600j3663j1964j378
$$ 414 -28028 -39522 -26765 -14824 -20543 -31078 -27846 -11295 450 -3150 -16813 -28777 -30155
219c0155O026J709q003o485R579K2618Q747j7648k1885J582J6790Q4k2161j2026
$$ -30155 -24129 -22420 -30423 -36908 -27329 -4711 4036 -13612 -35497 -33915 -17125 -17041 -39202 -51228
233e1228J9816K8531J104k2910j1430J5023J4753j2254k5930o858K0038K0209
$$ -51228 -31412 -2881 -1777 -24687 -36117 -21094 -6341 -18595 -44525 -51383 -31345 -11136
245a1136k748j5179r92J6313R841j3975k3458o196J4962J4722k893j0771J633
$$ -11136 -13884 -29063 -30055 -13742 -3901 -17876 -41334 -47530 -32568 -17846 -20739 -31510 -29877
258b9877J7022J2324r551k2175r697J1692J2839n190j3919L242K3225J5244j1146
$$ -29877 -12855 -531 -10082 -32257 -41954 -30262 -17423 -22613 -36532 -33290 -10065 5179 -5967
271e967k2192n741J2246O112j1000j1364P407K1260J2329o903j4536m335P359
$$ -5967 -28159 -33900 -21654 -15542 -26542 -37906 -30499 -9239 3090 -3813 -18349 -22684 -15325
284a5325M796p719j3575q7J7773J7685j644j6511m749J3737J0177j4014k3395
$$ -15325 -10529 -18248 -31823 -31910 -14137 3548 1904 -14607 -19356 -5619 4558 -9456 -32851
297c2851j240K3887J7737q548j5658M959K1976N688k1553k2492M903K1507P607
$$ -32851 -34091 -10204 7533 -1015 -16673 -11714 10262 15950 -5603 -28095 -23192 -1685 5922
310E922j3122q906J4640K0378K8j9933j3664M856J0910j215q782p10J2697J5180
$$ 5922 -7200 -16106 -1466 18912 18940 -993 -14657 -9801 1109 -106 -8888 -9598 3099 18279
324A8279L312j0060j2273k686O095K950o862p108P500J8252R896r154j4568o09
$$ 18279 21591 11531 -742 -3428 2667 5617 -1245 -8353 -853 17399 27295 18141 3573 2964
338B964J0181J477j3450j1277P442J9820R667q369j1233L003J2501K27j6320j5712
$$ 2964 13145 14622 1172 -10105 -2663 17157 26824 18455 7222 10225 22726 22953 6633 -9079
352i079N554K0371R773j0301j0512P902J7590M35k1889j8398P675J9999M396j4829
$$ -9079 -3525 16846 26619 16318 5806 13708 31298 31733 9844 -8554 -879 19120 23516 8687
366H687p497J6667K1507l102k5539j5204J1825J6233n124j8200J59K3222J7546
$$ 8687 1190 17857 39364 36262 10723 -4481 7344 23577 18453 253 412 23634 41180
379D1180r580k0669m837J1371M569j1610j1620N575J6639J0336m324q825k811
$$ 41180 31600 10931 6094 17465 22034 10424 -1196 4379 21018 31354 27030 18205 15394
392A5394M386J194o575j0142j982J0291J2401K760p142m728M164O452n388j4721
$$ 15394 19780 20974 14399 4257 2275 12566 24967 27727 20585 15857 20021 26473 21085 6364
406F364q071Q831J4216K717q546m038J0415J0900o073j9454j0446R548J3819o52
$$ 6364 -1707 7124 21340 24057 15511 11473 21888 32788 26715 7261 -3185 6363 20182 19530
420A9530j1352n09J5787J2555q364k0426r173J0440J0969n815j3475J742J9192
$$ 19530 8178 7669 23456 36011 27647 7221 -1952 8488 19457 13642 167 1909 21101
433B1101J4734r201k0588n528J3067O917j2903j5436O374K2759J0545j2402j5044
$$ 21101 35835 26634 6046 518 13585 20502 7599 -7837 -1463 21296 31841 19439 4395
446D395J926J1943m08j5774j1672P134J6103O063p415o888M101Q438j262j3042
$$ 4395 6321 18264 17856 2082 -9590 -2456 13647 19710 12295 5407 9508 17946 16684 3642
460C642j1972Q65J1424P249l297n309L082J0029K343j1898j5315k779J0458P865
$$ 3642 -8330 -7465 3959 11208 7911 2602 5684 15713 18056 6158 -9157 -11936 -1478 6387
474F387n161q374N271J5800N657j3581j7712r39J1274L653j0718q202J0132J7987
$$ 6387 1226 -7148 -1877 13923 19580 5999 -11713 -12652 -1378 2275 -8443 -16645 -6513 11474
488A1474L962j4144j3454K111Q961j075j2868p502R742J7224M106j1906r933M486
$$ 11474 15436 1292 -12162 -10051 -1090 -2165 -15033 -22535 -12793 4431 8537 -3369 -13302 -8816
502h816R522l199j5586r112J0146J5427K031j0090n259Q526Q740o006j5946p810
$$ -8816 706 -2493 -18079 -27191 -17045 -1618 413 -9677 -14936 -6410 2330 -3676 -19622 -27432
516b7432P493J1714Q30p692r41Q802Q462m451j4127q668M548Q639P47n929j317
$$ -27432 -19939 -8225 -7395 -15087 -16028 -7226 1236 -3215 -17342 -26010 -21462 -12823 -12076 -18005 -19322
531a9322R260J0929j258j2917j1020K084Q350J162q555l903J1325J5641K00j4567
$$ -19322 -10062 867 -391 -13308 -24328 -22244 -13894 -12732 -21287 -25190 -13865 1776 1976 -12591
545a2591j0901N807R917m784j3602l048J4725J5278j714j3243m430Q835O712q345
$$ -12591 -23492 -17685 -7768 -12552 -26154 -29202 -14477 801 -913 -14156 -18586 -9751 -3039 -11384
559a1384j5097k426J3364J2921k301j0035p47J1038O358j0211j5338k460J1344
$$ -11384 -26481 -28907 -15543 -2622 -4923 -14958 -15705 -4667 1691 -8520 -23858 -26318 -14974
572a4974R716l416p879L343J2638O065r819j4780l180R257O643n002o698N156
$$ -14974 -5258 -8674 -16553 -13210 -572 5493 -4326 -19106 -22286 -13029 -6386 -11388 -18086 -12930
586a2930J4107O737q879j3388k156P323L459o332o296M802J3282P224n373j0404
$$ -12930 1177 7914 -965 -14353 -16509 -9186 -5727 -12059 -18355 -13553 -271 6953 1580 -8824
600h824k406N982K540o770q947K205J4034R247m607j0043j92Q777K875j0564j1869
$$ -8824 -11230 -5248 -2708 -9478 -18425 -16220 -2186 7061 2454 -7589 -7781 996 3871 -6693 -18562
615a8562K479J3789P823n365o890L591J0148J688j2112j2564J600J1672N943n177
$$ -18562 -16083 -2294 5529 164 -6726 -3135 7013 8701 -3411 -15975 -14375 -2703 3240 -1937
629a937n003O112J1892J290j1434j2382P09R301L508o159m026P784J3272L282
$$ -1937 -6940 -828 11064 12354 920 -11462 -10753 -1452 2056 -4103 -8129 -345 12927 16209
643A6209j0859j1559M54Q658J459q934n844R005J5043L841j0613r103L244P939
$$ 16209 5350 -6209 -5755 2903 4362 -4572 -10416 -1411 13632 17473 6860 -2243 1001 8940
657H940k056j1510n456R177J3423K962p748n757M962P510l183j2721p058P537
$$ 8940 6884 -4626 -10082 -905 12518 15480 7732 1975 6937 14447 11264 -1457 -8515 -978
671i78J2319K907p170l620P646R003m376j3745q104O585J0632O30o992j008J0441
$$ -978 11341 14248 7078 3458 11104 20107 15731 1986 -6118 467 11099 11729 4737 3729 14170
686A4170R220l745j3933p743O063P929j931p747P08J1445J0275l978j1640n829
$$ 14170 23390 19645 5712 -2031 4032 11961 10030 2283 2991 14436 24711 20733 9093 3264
700C264M961M910m056p490L62J0555J0417k060r404m465M405M686n269r943j612
$$ 3264 8225 13135 9079 1589 1951 12506 22923 20863 11459 6994 11399 16085 10816 873 -739
715g39J1163J0305j670q585k193P776L555q022j1611j997R516Q921j549o414O08
$$ -739 10424 20729 19059 10474 8281 16057 19612 11590 -21 -2018 7498 16419 14870 8456 9064
730I064Q374M148q221j2658k953Q003P100k785o339K849J0455N266q073j2187
$$ 9064 17438 21586 13365 707 -2246 5757 12857 10072 3733 6582 17037 22303 14230 2043
744B043l675O831M704l863p190L241J1883O956p481j1916k829P353L438p542q017
$$ 2043 -1632 5199 9903 6040 -1150 2091 13974 20930 13449 1533 -1296 6057 9495 1953 -6064
759f064M197J2678O174o483r470p04P482J050r600q550L521J1900O102n313p385
$$ -6064 -1867 10811 16985 10502 1032 328 7810 8860 -740 -9290 -5769 6131 12233 6920 -465
774d65K366P246M32j1202r912L258J0573M597n642m675N384Q462m50j1943r477
$$ -465 1901 9147 9579 -1623 -11535 -8277 2296 6893 1251 -3424 1960 10422 9972 -1971 -11448
789a1448K235Q935K159n543k892O480R833o07j0773q433J801O726J99o543j974
$$ -11448 -9213 -278 1881 -3662 -6554 -74 9759 9152 -1621 -10054 -8253 -1527 -1328 -7871 -9845
804i845P804R452K63q605p013J651M486q49o845l680O695J0217K557p137o332
$$ -9845 -2041 7411 7674 -931 -7944 -6293 -1807 -2656 -9501 -13181 -6486 3731 6288 -849 -7181
819g181K219N447k359r151n289O845J0076K522o124m412M083O074k494j0665o958
$$ -7181 -4962 485 -1874 -11025 -16314 -9469 607 3129 -2995 -7407 -3324 2750 256 -10409 -17367
834a7367N583R635J636o217k495O690P552l179j2343o981N340P976K85o555o76
$$ -17367 -11784 -2149 -513 -6730 -9225 -2535 5017 1838 -10505 -17486 -12146 -4170 -3885 -10440 -11116
849a1116Q812Q114l483j1677o222M385O931j878p823O5J0092Q848l204j1116m198
$$ -11116 -2304 5810 2327 -9350 -15572 -11187 -4256 -6134 -13957 -13892 -3800 5048 1844 -9272 -13470
864a3470N809M813n580q414J140J0271Q427l608q145j615N843L212o993q913J68
$$ -13470 -7661 -2848 -8428 -16842 -15702 -5431 2996 -612 -8757 -10372 -4529 -1317 -8310 -17223 -17055
879a7055R689P386k869o748Q04P147K437p925r362m60Q088N835k801m526K461
$$ -17055 -7366 20 -2849 -9597 -8793 -1646 791 -7134 -16496 -16956 -8868 -3033 -5834 -10360 -7899
894g899P934K445p485q989j376O566M445l341l974L570Q421L630o349q946j441
$$ -7899 35 2480 -5005 -13994 -15370 -8804 -4359 -7700 -11674 -8104 317 3947 -2402 -11348 -12789
909a2789N221L263m068m261L303R102M919m825p743j822N163K589n130o200K309
$$ -12789 -7568 -4305 -8373 -12634 -9331 -229 4690 -135 -7878 -9700 -4537 -1948 -7078 -13278 -10969
924a0969J0346N990m552p061M59O655J474p784p739K561J0330N674n178n096K682
$$ -10969 -623 5367 815 -6246 -5787 868 2342 -5442 -13181 -10620 -290 5384 206 -4890 -2208
939b208P968L29r161q477K591R949L697n098m311N608R052q07j0018p950L587
$$ -2208 5760 6089 -3072 -11549 -8958 991 4688 -410 -4721 887 9939 9132 -886 -8836 -5249
954e249P912J291o071k288P448Q795p72r146o003K880O061j137o413j413P488
$$ -5249 2663 3954 -2117 -4405 3043 11838 11066 1920 -4083 -1203 4858 3721 -2692 -4105 3383
969C383Q288l37p206m275L120M367k823o415k542O614P917Q77m974l135L025M265
$$ 3383 11671 11334 4128 -147 2973 7340 4517 -1898 -4440 2174 10091 10968 5994 2859 5884 10149
985A0149k704p899m125N264Q404J460m983k689N119N512l109r238n411M837P458
$$ 10149 7445 -454 -4579 685 9089 10549 5566 2877 7996 13508 10399 1161 -4250 587 8045
1000H045P34n358j218P098O173l168j0187n267N034O463j601o276P24Q835O381
$$ 8045 8779 3421 2203 9301 15474 12306 2119 -3148 1886 8349 6748 472 1196 10031 16412
1015A6412m147r362l675N215L988l502o133N97Q963O119l021p552j898M772K387
$$ 16412 12265 2903 -772 4443 8431 4929 -1204 -607 8356 14475 11454 3902 2004 6776 9163
1030I163m546o918N10P954N924k464n200n43M565J857n570p174l97O492N877j516
$$ 9163 4617 -2301 -1791 6163 12087 9623 4423 3880 8445 10302 4732 -2442 -2839 3653 9530 8014
1046H014m468L39N386L356n942q466j852N788N816j694n179J660P696L664o588
$$ 8014 3546 3885 9271 12627 6685 -1781 -3633 2155 7971 6277 1098 2758 10454 14118 7530
1061G530r505j716O678M289m135n516L368R627L864p022q873k12O766K128o903
$$ 7530 -1975 -3691 2987 7276 3141 -2375 993 10620 14484 7462 -1411 -1623 5143 7271 368
1076C68n402M592J0121K705o704o342K185N492p35p753n130M889Q295K347n074
$$ 368 -5034 -442 9679 12384 5680 -662 1523 7015 6280 -1473 -6603 -1714 6581 8928 3854
1091C854l965K990M989j956p406m790L618O727J672l957k234L952M931k018p674
$$ 3854 -111 2879 7868 5912 -1494 -6284 -2666 4061 5733 1776 -458 3494 8425 6407 -1267
1106a267m932J473N428J772l003j854L637N843j80p242o132N00N753J061m394
$$ -1267 -6199 -4726 702 2474 -529 -2383 1254 7097 6917 -325 -6457 -5957 -204 857 -3537
1121c537k046M807O812Q61p760o178J853M933m91o360k903O091Q560O61p032m791
$$ -3537 -5583 -776 6036 6897 -863 -7041 -5188 -255 -746 -7106 -10009 -3918 4642 5303 -1729 -6520
1137f520K956M706k787p840l264O801Q010l59n928k422M627L837m082q603k918
$$ -6520 -3564 1142 -1645 -9485 -12749 -5948 2062 1703 -4225 -6647 -2020 1817 -2265 -10868 -13786
1152a3786O075O727p50m829q02O138L844m349q659l066N215N087j440m360P14
$$ -13786 -7711 -984 -1734 -6563 -7365 -1227 2617 -1732 -10391 -13457 -8242 -3155 -4595 -8955 -8241
1167h241O376M593m245p876l156M081M443k328m554Q64P444M834l461o988k146
$$ -8241 -1865 2728 -1517 -9393 -12549 -8468 -4025 -6353 -10907 -10043 -2599 2235 -1226 -8214 -10360
1182a0360M278K649l496n478R79P986N119k903n821o96M196J685m805o093Q12
$$ -10360 -6082 -3433 -6929 -12407 -11428 -3442 1677 -1226 -7047 -7743 -3547 -1862 -6667 -12760 -11948
1197a1948P576M986k436m509M17M906J173n665o094L13O741L781k174k965J974
$$ -11948 -4372 614 -1822 -6331 -5914 -1008 165 -5500 -11594 -11281 -4540 -759 -2933 -5898 -3924
1212c924M997J529n724o572k28N142L312k021k956K519O318K190n509o511p04
$$ -3924 1073 2602 -3122 -9694 -9922 -4780 -1468 -3489 -6445 -3926 2392 4582 -927 -7438 -8142
1227h142M847K847l461l668K960P234L256n100o237o1N020J628n164m892L319
$$ -8142 -3295 -448 -3909 -7577 -4617 2617 5873 773 -5464 -5525 -505 1123 -4041 -8933 -5614
1242e614Q531L372n475m892J824N290n00o725n044L852Q307K213m648l298L621
$$ -5614 2917 6289 814 -4078 -2254 3036 2536 -4189 -9233 -5381 2926 5139 491 -2807 814
1257H14M951j914p787m534M285O757L91l679j560M843M975j941p498l705K747
$$ 814 5765 3851 -3936 -8470 -4185 2572 2963 -716 -2276 2567 7542 5601 -1897 -5602 -2855
1272b855M755l0l283n15N118M966j301o081m220K280L588j45m193j077N032N622
$$ -2855 1900 1870 -1413 -1928 3190 8156 6855 774 -3446 -1166 2422 2277 -1916 -2993 2039 7661
1288G661K7n303l954K382L833j336n461j706N140O769K83n004l306L667L814k917
$$ 7661 7688 2385 -1569 813 4646 3310 -2151 -3857 1283 8052 8335 3331 25 3692 7506 4589
1304D589o912k394N389O902j88n036r02M895L162l730p267j818N228N110j217
$$ 4589 -2323 -4717 672 7574 7386 2350 1448 6343 9505 5775 -1492 -3310 1918 7028 5811
1319E811m025M80N882L379m180p180j600M322L279k087l377J982O030K954l716
$$ 5811 1786 2266 8148 11527 7347 167 -1433 2889 6168 4081 704 2686 8716 11670 7954
1334G954o276j204L668K206k553l028J069N833L764k575n069j362L252K154l775
$$ 7954 1678 474 4142 6348 3795 767 1836 7669 11433 8858 3789 2427 5679 7833 4058
1349D058m788Q09N954M851k356m512m22M027J545m973o575Q30O429M830k494m246
$$ 4058 -730 79 6033 10884 8528 4016 3594 7621 9166 4193 -2382 -1552 4877 9707 7213 2967
1365B967R15N433J183o347o986J054O337L193l602l549K903O385L87o680o019
$$ 2967 3882 9315 10498 4151 -2835 -1781 4556 7749 4147 598 3501 9886 10273 3593 -2426
1380b426J393M970J256m194k039L916N659R40n938n049J114L774k25m285j874
$$ -2426 -1033 3937 5193 999 -1040 2876 8535 9475 3537 -1512 -398 3376 3151 -1134 -3008
1395c008L892N434P14m108l394J111K543q89m544k615K727N545K068l312l092
$$ -3008 884 6318 7032 2924 -470 641 3184 2295 -2249 -4864 -2137 3408 5476 2164 -928
1410i28J570L175r78n878l857K612N935J702l164k513K351L999j115o331m927
$$ -928 642 3817 2839 -3039 -6896 -4284 1651 3353 189 -2324 27 4026 2911 -3420 -8347
1425h347K865N815Q98l835j634M232M603j567o782m610L322M362n37m360m75N238
$$ -8347 -5482 333 1231 -2604 -4238 -6 4597 3030 -3752 -8362 -5040 -678 -1215 -5575 -6050 -812
1441h12M579j451o073l241K943L055j680m210m61N213M703j096m803k484L251
$$ -812 3767 2316 -3757 -6998 -4055 -1000 -2680 -6890 -7351 -2138 2565 1469 -3334 -5818 -2567
1456b567K116k716m776r94M974M616k75m068r34K958K133k850o069j237M397N424
$$ -2567 -451 -3167 -7943 -8937 -3963 653 378 -3690 -4624 -1666 467 -2383 -8452 -9689 -5292 132
1472A32o85l766l31M038K628l641o285j785M653M105j390m061J322N083K971l968
$$ 132 -553 -4319 -4650 -612 2016 -1625 -7910 -9695 -5042 -937 -2327 -6388 -5066 17 2988 -980
1488i80o176j520M221K833k622l408J843O030K204l633n360j80M139J231l622
$$ -980 -7156 -8676 -4455 -1622 -4244 -7652 -5809 221 2425 -1208 -6568 -6748 -2609 -1378 -5000
1503e000l629K388N346K413k877l837O09K817J16l622l324J666M698K556j902
$$ -5000 -8629 -6241 -895 1518 -1359 -5196 -4587 -1770 -1654 -5276 -8600 -6934 -2236 320 -1582
1518a582k637Q42K665N84m177l991Q08M003L471j809k467P15L596J292l938n362
$$ -1582 -4219 -3377 -712 -128 -4305 -8296 -7488 -3485 -14 -1823 -4290 -3575 21 1313 -2625 -7987
1534g987J27M555L018j975l143K170N159J344m913n446M82M645J615l418k719
$$ -7987 -7860 -3305 -287 -2262 -5405 -3235 1924 3268 -1645 -7091 -6609 -1964 -349 -3767 -6486
1549f486L411O185O68m971m445J513M472j87n111k093M015O103M78m186k852K632
$$ -6486 -3075 3110 3778 -1193 -5638 -4125 347 160 -4951 -7044 -3029 3074 3552 -634 -3486 -854
1565h54L550j741n749j686L886N607j88l094j185L120K455k043m989k322L471
$$ -854 2696 955 -4794 -6480 -2594 3013 2825 -269 -1454 1666 4121 2078 -2911 -5233 -1762
1580a762L936L47k255o12L036L232j982n037k227K072L446O70k424m62L514L104
$$ -1762 2174 2521 266 -346 2690 5922 3940 -1097 -3324 -1252 2194 2864 440 -22 3492 6596
1596F596q61m700l228K074L599p0l361q98M469M009m89m960k385K465K603j082
$$ 6596 5735 1035 -2193 -119 3480 3410 49 -849 3620 7629 7140 2180 -205 2260 4863 3781
1612C781m337o74M905M627n36m583k300L784K352m561k696r29M384L975p08l388
$$ 3781 -556 -1230 3675 8302 7766 3183 883 4667 7019 2458 -238 -1167 3217 7192 6484 3096
1628C096Q8L315J085l114n019l96L922K943n74k536N19L966R82l378m325j515
$$ 3096 3184 6499 7584 4470 -549 -945 2977 5920 5346 2810 3329 7295 8277 4899 574 -941
1644i41L844K475j523k454P92M406K275l195m336j389L246K067k337l038J059
$$ -941 2903 5378 3855 1401 2193 6599 8874 5679 1343 -46 3200 5267 2930 -108 951
1659I51M832L114l501m304k29L128J409l428l745J443N288K629k533m053R66L419
$$ 951 5783 8897 5396 1092 863 3991 5400 1972 -1773 -330 4958 7587 5054 1001 1967 5386
1675E386j80m656l699J952N497J840k886k419J471L553q00m940k879J508M086
$$ 5386 5206 550 -3149 -1197 4300 6140 3254 835 2306 5859 5059 119 -2760 -1252 2834
1690B834J493k816j058K347L065p50m439k927J436K690M84j756j095K049L423
$$ 2834 4327 1511 453 2800 5865 5115 676 -2251 -815 1875 2359 603 -492 1557 4980
1705D980K8l627l072N99K449O59k898j515K323M322O47l396k873R86K726m50l625
$$ 4980 5008 1381 -1691 -1092 1357 2016 -882 -2397 -74 4248 4895 1499 -1374 -388 2338 1888 -1737
1722a737k368K485M755J449l343k781J505L131j228m693k868L391M983M60l529
$$ -1737 -4105 -1620 3135 4584 1241 -1540 -35 3096 1868 -2825 -5693 -2302 2681 3141 -388
1737c88j560K741L011k303n060j974L503L777q88l261j44M046K471k671m995j671
$$ -388 -1948 793 3804 1501 -3559 -5533 -2030 1747 859 -2402 -2546 1500 3971 1300 -3695 -5366
1753e366K737K242r83k325M65L770J988j266m198j410J691K016j632k479n3L621
$$ -5366 -2629 -387 -1370 -3695 -3230 540 2528 1262 -2936 -4346 -2655 -639 -2271 -4750 -4803 -1182
1769a182K868p90l466j367J609J820k087l671j84L593L654o16l078j181K477J369
$$ -1182 1686 896 -2570 -3937 -2328 -508 -2595 -6266 -6450 -2857 797 181 -2897 -4078 -1601 -232
1785b32k656m284m79M120L390r05l123j76L892Q95l341m903J77L747K681j852
$$ -232 -2888 -7172 -7651 -3531 -141 -1046 -4169 -4345 -453 442 -2899 -7802 -7625 -3878 -1197 -3049
1801c049k717J787L808J310l922m051K6L427J355k324j866J938M273Q16l105l110
$$ -3049 -5766 -3979 -171 1139 -2783 -6834 -6808 -3381 -2026 -4350 -6216 -4278 -5 811 -2294 -5404
1817e404r7K738K85k380j643J775L579J562j906k401k76K160L3k386k292P49M221
$$ -5404 -5501 -2763 -2478 -4858 -6501 -4726 -1147 415 -1491 -3892 -4168 -2008 -1975 -4361 -6653 -5904 -1683
1834a683K346j373k378J93K196L48k983l648Q64M178K974k120k346R36L511O17
$$ -1683 663 -710 -3088 -2895 -699 -351 -3334 -6982 -6118 -1940 1034 -1086 -3432 -2496 1015 1632
1850A632m069m122J430M720J404k893j691K692L945l74m749l051J878L873j65
$$ 1632 -2437 -6559 -5129 -409 995 -1898 -3589 -897 3048 2674 -2075 -5126 -3248 625 460
1865D60l048q70L020M257n82m461k032K024K944j716k889o58L708L843n71l226
$$ 460 -2588 -3458 -438 3819 3237 -1224 -3256 -1232 1712 -4 -2893 -3551 157 4000 3429 203
1881B03j263J832J487j763l064m23L067K953%j805n33J459J383j791l220j597
$$ 203 -1060 772 2259 496 -2568 -2991 76 3029 3029 1224 691 2150 3533 1742 -1478 -3075
1897c075K570K960P16j815q34J960J916j265l753j855K217L058K15k568o35L029
$$ -3075 -505 2455 3171 1356 522 2482 4398 3133 -620 -2475 -258 2800 3015 447 -188 2841
1913B841K839j830m027j974K431L170j352l046L07L929K811j903l701j048K295
$$ 2841 5680 3850 -177 -2151 280 3450 2098 -948 -641 3288 6099 4196 495 -553 1742
1928A742J868k077l060R48L819K735j906k996l11K170J266k650l284O59L679K440
$$ 1742 3610 1533 -1527 -579 3240 5975 4069 1073 762 2932 4198 1548 -1736 -1077 2602 5042
1944E042j338k154K52K039Q98k680l293Q0L297K274j411j599O70K222J038k677
$$ 5042 3704 1550 1802 3841 4739 2059 -1234 -1154 2143 4417 3006 1407 2077 4299 5337 2660
1960B660l403K4K975K074j481k209R58L409J353k732l861mL068J337k717j969
$$ 2660 -743 -719 2256 4330 2849 640 1598 5007 6360 3628 -233 -237 2831 4168 1451 -518
1976e18J741L903J560l218l021N37K611L00l048k149K060M220R02k634k315J292
$$ -518 1223 5126 6686 3468 447 984 3595 3895 847 -1302 758 4978 5880 3246 931 2223
1992B223K252q26l298j976K127L229P25j798j423J283J656n36l163k076J352K958
$$ 2223 4475 3649 351 -1625 502 3731 4456 2658 1235 2518 4174 3638 475 -1601 -249 2709
2008B709P52j489j112J633J805p54k553k671O80L055N14j878j021J649K908j87
$$ 2709 3461 1972 860 2493 4298 3544 991 -1680 -1000 2055 2569 691 -330 1319 4227 4040
2024D040k887k902J040K170J66k288j560K490L348K37l564k032J323K159p75l471
$$ 4040 1153 -1749 -709 1461 1627 -661 -2221 269 3617 3854 290 -1742 -419 1740 965 -2506
$$ [...]
8191c0
##END NTUPLES=NMR FID
##END=
