##TITLE=1H_LR-710-C1-K2
 CD3OD, 8 sc, 
 7.2.2020
##JCAMPDX= 6.0         $$ Bruker NMR JCAMP-DX V2.0
##DATA TYPE= NMR FID
##DATA CLASS= NTUPLES
##ORIGIN= UXNMR, Bruker Analytische Messtechnik GmbH
##OWNER= root
$$ XWIN-NMR		Version 3.5
$$ Fri Feb  7 14:31:35 2020 Russian Standard Time (UT+4h)  she@DPX200
##.OBSERVE FREQUENCY= 200.1315
##.OBSERVE NUCLEUS= ^1H
##.DELAY= (6, 6)
##.ACQUISITION MODE= SIMULTANEOUS
##.ACQUISITION SCHEME= undefined
##.AVERAGES= 8
##.DIGITISER RES= 18
##SPECTROMETER/DATA SYSTEM= spect
##.PULSE SEQUENCE= zg30
##.SOLVENT NAME= MeOD
##.SHIFT REFERENCE= (INTERNAL, MeOD, 0, 15.7039)
##AUDIT TRAIL= $$ (NUMBER, WHEN, WHO, WHERE, WHAT)
$$ ##TITLE= Audit trail, XWIN-NMR		Version 3.5
$$ ##JCAMPDX= 5.01
$$ ##ORIGIN= Bruker BioSpin GmbH
$$ ##OWNER= she
$$ F:/spectra/data/she/nmr/H-F/1/audita.txt
$$ ##AUDIT TRAIL=  $$ (NUMBER, WHEN, WHO, WHERE, WHAT)
(   1,<2020-02-07 14:30:24.35 +0400>,<she>,<DPX200>,
      <created by zg, POWCHK disabled, PULCHK disabled
       configuration hash MD5:
       00 E9 B6 7A A2 85 ED C7 34 08 36 98 17 FE 4E 26
       data hash MD5: 16K
       9C 88 4D E3 A3 3E 7B 93 6E 89 B8 64 8A 42 B4 FD>)
$$ ##END=
$$ 
$$ hash MD5
$$ BA 1C 6D 6A 06 0A 43 23 73 63 0D DF 99 AC 7C 58
##$RELAX= 
##$RELAX= 
##$RELAX= 
##$RELAX= 
##$RELAX= 
##$RELAX= 
$$ Bruker specific parameters
$$ --------------------------
##$DU= <F:/spectra>
##$EXPNO= 1
##$NAME= <H-F>
##$PROCNO= 1
##$TYPE= <nmr>
##$USER= <she>
##$AMP= (0..31)
100 100 100 100 100 100 100 100 100 100 100 100 100 100 100 100 100 100 
100 100 100 100 100 100 100 100 100 100 100 100 100 100 
##$AQSEQ= 0
##$AQ_mod= 1
##$AUNM= <au_zg>
##$AUTOPOS= <>
##$BF1= 200.13
##$BF2= 200.13
##$BF3= 200.13
##$BF4= 200.13
##$BF5= 200.13
##$BF6= 200.13
##$BF7= 200.13
##$BF8= 200.13
##$BYTORDA= 1
##$CFDGTYP= 0
##$CFRGTYP= 5
##$CHEMSTR= <none>
##$CNST= (0..31)
1 1 145 1 1 1 1 1 1 1 1 1 1 1 1 1 1 1 1 1 1 1 1 1 1 1 1 1 1 1 1 1 
##$CPDPRG= <>
##$CPDPRG1= <>
##$CPDPRG2= <>
##$CPDPRG3= <>
##$CPDPRG4= <mlev>
##$CPDPRG5= <mlev>
##$CPDPRG6= <mlev>
##$CPDPRG7= <mlev>
##$CPDPRG8= <mlev>
##$CPDPRGB= <>
##$CPDPRGT= <>
##$D= (0..31)
0 1.2 0 0 0 0 0 0 0 0.06 0 0.03 0 0 0 0 0.0002 0 0 0 0 0 0 0 0 0 0 0 0 
0 0 0 
##$DATE= 1581071423
##$DBL= (0..7)
120 120 120 120 120 120 120 120 
##$DBP= (0..7)
150 150 150 150 150 150 150 150 
##$DBP07= 0
##$DBPNAM0= <>
##$DBPNAM1= <>
##$DBPNAM2= <>
##$DBPNAM3= <>
##$DBPNAM4= <>
##$DBPNAM5= <>
##$DBPNAM6= <>
##$DBPNAM7= <>
##$DBPOAL= (0..7)
0.5 0.5 0.5 0.5 0.5 0.5 0.5 0.5 
##$DBPOFFS= (0..7)
0 0 0 0 0 0 0 0 
##$DE= 6
##$DECBNUC= <off>
##$DECIM= 24
##$DECNUC= <off>
##$DECSTAT= 4
##$DIGMOD= 1
##$DIGTYP= 9
##$DL= (0..7)
0 120 120 120 120 120 120 120 
##$DP= (0..7)
150 150 150 150 150 150 150 150 
##$DP07= 0
##$DPNAME0= <>
##$DPNAME1= <>
##$DPNAME2= <>
##$DPNAME3= <>
##$DPNAME4= <>
##$DPNAME5= <>
##$DPNAME6= <>
##$DPNAME7= <>
##$DPOAL= (0..7)
0.5 0.5 0.5 0.5 0.5 0.5 0.5 0.5 
##$DPOFFS= (0..7)
0 0 0 0 0 0 0 0 
##$DQDMODE= 0
##$DR= 18
##$DS= 0
##$DSLIST= <SSSSSSSSSSSSSSS>
$$ [...]
##$SUBNAM2= <"">
##$SUBNAM3= <"">
##$SUBNAM4= <"">
##$SUBNAM5= <"">
##$SUBNAM6= <"">
##$SUBNAM7= <"">
##$SUBNAM8= <"">
##$SUBNAM9= <"">
##$SW= 24.9337058887773
##$SWIBOX= (0..15)
0 0 2 0 0 0 0 0 0 0 0 0 0 0 0 0 
##$SW_h= 4990.01996007984
##$TD= 16384
##$TD0= 1
##$TE= 0
##$TE2= 300
##$TE3= 300
##$TEG= 300
##$TL= (0..7)
0 120 120 120 120 120 120 120 
##$TP= (0..7)
150 150 150 150 150 150 150 150 
##$TP07= 0
##$TPNAME0= <>
##$TPNAME1= <>
##$TPNAME2= <>
##$TPNAME3= <>
##$TPNAME4= <>
##$TPNAME5= <>
##$TPNAME6= <>
##$TPNAME7= <>
##$TPOAL= (0..7)
0.5 0.5 0.5 0.5 0.5 0.5 0.5 0.5 
##$TPOFFS= (0..7)
0 0 0 0 0 0 0 0 
##$TUNHIN= 0
##$TUNHOUT= 0
##$TUNXOUT= 0
##$USERA1= <user>
##$USERA2= <user>
##$USERA3= <user>
##$USERA4= <user>
##$USERA5= <user>
##$V9= 5
##$VALIST= <valist>
##$VCLIST= <CCCCCCCCCCCCCCC>
##$VD= 0
##$VDLIST= <DDDDDDDDDDDDDDD>
##$VPLIST= <PPPPPPPPPPPPPPP>
##$VTLIST= <TTTTTTTTTTTTTTT>
##$WBST= 1024
##$WBSW= 4
##$XGAIN= (0..3)
0 0 0 0 
##$XL= 0
##$YL= 0
##$YMAX_a= 374721
##$YMIN_a= -216997
##$ZGOPTNS= <>
##$ZL1= 120
##$ZL2= 120
##$ZL3= 120
##$ZL4= 120
##$ABSF1= 10
##$ABSF2= 0
##$ABSG= 5
##$ABSL= 3
##$ALPHA= 0
##$AQORDER= 0
##$ASSFAC= 0
##$ASSFACI= 0
##$ASSFACX= 0
##$ASSWID= 0
##$AUNMP= <proc_1d>
##$AZFE= 0.1
##$AZFW= 0.1
##$BCFW= 1
##$BC_mod= 2
##$BYTORDP= 1
##$COROFFS= 0
##$CY= 11.3945322036743
##$DATMOD= 1
##$DC= 2
##$DFILT= <>
##$DTYPP= 0
##$F1P= 16.9975609425685
##$F2P= -3.02152046262296
##$FCOR= 0.5
##$FTSIZE= 0
##$FT_mod= 4
##$GAMMA= 1
##$GB= 0.15
##$INTBC= 1
##$INTSCL= 1
##$ISEN= 128
##$LB= 0.24
##$LEV0= 0
##$LPBIN= 0
##$MAXI= 10000
##$MC2= 0
##$MEAN= 0
##$ME_mod= 0
##$MI= 1.114404
##$NCOEF= 0
##$NC_proc= 0
##$NLEV= 6
##$NOISF1= 3.799351
##$NOISF2= 2.8
##$NSP= 1
##$NTH_PI= 0
##$NZP= 0
##$OFFSET= 15.70392
##$PC= 1
##$PHC0= -9791.452
##$PHC1= 20.00082
##$PH_mod= 1
##$PKNL= yes
##$PPARMOD= 0
##$PSCAL= 0
##$PSIGN= 0
##$REVERSE= no
##$SF= 200.130013532006
##$SI= 16384
##$SIGF1= 3
##$SIGF2= 2
##$SINO= 400
##$SIOLD= 16384
##$SREGLST= <1H.CDCl3>
##$SSB= 0
##$STSI= 0
##$STSR= 0
##$SW_p= 3612.71676300578
##$SYMM= 0
##$S_DEV= 0
##$TDeff= 0
##$TDoff= 0
##$TI= <>
##$TILT= no
##$TM1= 0
##$TM2= 0
##$TOPLEV= 0
##$USERP1= <user>
##$USERP2= <user>
##$USERP3= <user>
##$USERP4= <user>
##$USERP5= <user>
##$WDW= 1
##$XDIM= 8192
##$YMAX_p= 0
##$YMIN_p= 0
$$ End of Bruker specific parameters
$$ ---------------------------------
##NTUPLES= NMR FID
##VAR_NAME=  TIME,          FID/REAL,        FID/IMAG
##SYMBOL=    X,             R,               I
##VAR_TYPE=  INDEPENDENT,   DEPENDENT,       DEPENDENT
##VAR_FORM=  AFFN,          ASDF,            ASDF
##VAR_DIM=   8192,          8192,            8192
##UNITS=     SECONDS,       ARBITRARY UNITS, ARBITRARY UNITS
##FACTOR=    0.0002004,     1,               1
##FIRST=     0,             0,               0
##LAST=      1.6414764,     0,               0
##MIN=       0,             -216997,         0
##MAX=       1.6414764,     374721,          0
$$ Real data points
##PAGE= N=1
##DATA TABLE= (X++(R..R)), XYDATA
0@%%%%%%%Qj6J6j6J8k6L2m0M8n6P2q7J03j20J40j64J89k18K50k86L28l71M20m76
31b52N37o03O73p52Q39r34J042j157J283j423J575j745J932k139K371k630K924
48A541l259L646m098M632n278O076p093Q441j0326J3169j8016K8484r1728J09840
62C6031J78664q7839m9933k7694p6631j25267n181N2664K3383K5537J25289J16681
74A85704N081q9456j10549j29393p0582O6685J46315Q3617K9911L6212q95q7541
86F5109p9611j8784m3634q0081M2807J95712J52910j6741p8866n8489q6183j04443
98a10294j4247P6818O8753N1439Q4293O1019m5771j04309p8195o1233n0626L3983
110h8370J27510J07754K4444o396j8372p3474j03195n3117J092J6026O2468J24434
$$ y = [0, 0, 0, 0, 0, 0, 0, 0, 8, -8, 8, -8, 10, -16, 16, -24, 24, -32, 40, -47, 56, -64, 76, -88, 101, -117, 133, -153, 175, -196, 224, -252, 285, -318, 355, -397, 442, -492, 550, -607, 676, -747, 828, -917, 1015, -1124, 1247, -1383, 1541, -1718, 1928, -2170, 2462, -2816, 3260, -3833, 4608, -5718, 7451, -10565, 17919, -73809, 36031, 214695, 126856, 76923, 49229, -27402, -152669, -157850, -105186, -81803, -56266, 69023, 185704, 190785, 101329, -9220, -138613, -209195, -142510, 3805, 87422, 117333, 153545, 152650, 65109, -14502, -33286, -76920, -157001, -114194, 81518, 234428, 217687, 138821, 80332, -5851, -110294, -124541, -47723, 21030, 72469, 156762, 217781, 172010, 67701, -10494, -71727, -122353, -88370, 39140, 146894, 171338, 164942, 146570, 73096, -30099, -83216, -82124, -66098, -3630, 120804]
122A20804Q7584l0019q4385o0332n7341o7975j3413N9812O6991N0790P2291N4050
134A98857n6255j42497j03929j8815J9411M7793R2171Q6317J3533m0565m1003
145E5018m2526o6640o4964j8542M2237R5357J12593N5582m6520j05416q5694m2169
157a11684j0400K5091N5074M9230L0938L6892L2846l0558j08426j12817l9260
168a83074M1461Q5432R4505O3380k52n7220o9196m5983k5458k0896r039L1494
180i4846Q2474R3238M3278l6877r4079j00220n6330J2078O4290P0426M4523K3008
192E0963J0496j1905m2980o4297o5219l4823K7486Q9591R7910M6962j3866n3144
204C7174p0242o1217k2074J4762K5096L7013O5208O7172J4846m7794p4439p2447
$$ y = [120804, 208388, 178369, 93984, 33652, -23689, -91664, -105077, -45265, 21726, 72516, 144807, 198857, 142602, 105, -103824, -122639, -103228, -55435, 36736, 123053, 136586, 96021, 55018, 12492, -54148, -119112, -137654, -95417, -60, 112533, 168115, 121595, 16179, -69515, -111684, -122084, -96993, -41919, 7311, 38249, 75141, 107987, 77429, -30997, -143814, -183074, -141613, -56181, 38324, 101704, 101452, 44232, -24964, -70947, -96405, -117301, -126340, -94846, -12372, 80866, 124144, 87267, -6812, -107032, -163362, -151284, -86994, -16568, 27955, 50963, 61459, 49554, 6574, -57723, -122942, -157765, -130279, -40688, 57222, 104184, 90318, 37174, -33068, -94285, -116359, -101597, -76501, -39488, 25720, 92892, 107738, 59944, -14495, -86942]
216h6942m9168R925P2337P7888L8504J4917O996k7188o8094o3497k8820P4L3655
229f9413Q0241Q6328K5785l7162n3094n2121n1546k3511K4174M2877M0376N4561
241F7495N5555j834p0747p9311m7307k0386J8233P1704P7731K5267j1036m431
253H0933j8415o4237o6678j7502K1162M0796P2114Q0023J4935o2670p0934l9685
265c0158k7257j2860K9780N3117L6204K9371L6955N63p0959q8937m1067M364L1533
278d9351O7086P5571K1757l4386l1458j8633m4530n5661j0416L6340M5150N3976
290E5445O1350J3528o7026q6046l9533n553L473L0657N7374M0235R987O999p539
303G3351n8526q2054l6656K1554M5864N8469O1013J9206m0750n1470k7581k7001
$$ y = [-86942, -136110, -126185, -53848, 24040, 62544, 77461, 84457, 57269, -10825, -74322, -103142, -103068, -69413, 10828, 97156, 122941, 85779, 32685, -19436, -70982, -94493, -70319, -27442, 12934, 67495, 123050, 121216, 50469, -28842, -76149, -96535, -78302, -6598, 71133, 96400, 85364, 80933, 62518, -1719, -68397, -85899, -64737, -23941, 48173, 128196, 143131, 80461, 9527, -30158, -57415, -70275, -40495, 12622, 48826, 78197, 115152, 115715, 44756, -44181, -85248, -80884, -49351, 17735, 93306, 115063, 80677, 49219, 30586, -13944, -69605, -80021, -43681, 1469, 55445, 116795, 130323, 63297, -22749, -62282, -67835, -64362, -33705, 23669, 63904, 73891, 80890, 73351, 14825, -67229, -103885, -82331, -36467, 22002, 83015, 102221, 61471, 10001, -17580, -44581]
315d4581l6290m442M2942N3950M2953L5022J926o2191q5425m0928J0783K4773
327f1508L3674M9184L6212J457j4022j7965m6028o6916l1668L0224N9800N7346
339B9790M3435P650m3412o0919l4160j1115j0717M408L9895N3269L6277J6069
351G0470j0553n5078p6611m0340J8422M3719M2951M0950K6503o836l0119l0488
363g010l3352m0889j9043L0142O1357N5098K9515m457m1563n9526m0237p871J0955
376f6881K3416M0319M4718K5887j612k6409m9535n5541k6226J8969M6281M6947
388B0333L5649J6594j2284l5397l9988l4250k2848K696L8136N8025M5350J1893
400H3909k0202m2447m7077l0841m954J6923L0431L9243L8872K1215j1548m2668
$$ y = [-44581, -80871, -85313, -42371, 11579, 54532, 89554, 91480, 29289, -56136, -97064, -86281, -61508, -27834, 21350, 57562, 59019, 44997, 27032, -18996, -85912, -117580, -87356, -27556, 29790, 73225, 80875, 37463, -23456, -57616, -68731, -79448, -75040, -35145, 18124, 54401, 70470, 59917, 4839, -71772, -112112, -93690, -49971, -7020, 33930, 60433, 53597, 23478, -7010, -40362, -81251, -100294, -70152, -8795, 46303, 75818, 71361, 29798, -29728, -69965, -77836, -66881, -43465, -3146, 41572, 67459, 65847, 39438, -10097, -65638, -91864, -72895, -26614, 20333, 55982, 72576, 60292, 24895, -15093, -49343, -72191, -69495, -31359, 26666, 72016, 83909, 63707, 21260, -25817, -56658, -61612, -44689, -14258, 24985, 63857, 85072, 73524, 30856]
412C0856n5613m1906n609L2191M8887M1938K1073j553j9133k9529l4210l1781
424d4389j7640J1503M2878N7074M1996J713l8632n5329m1791j2027J1294K4020
436a9330K8923K9875K2547J1116j0108l8872n6090m1909J082M1812N6400M3514
448F8960J2081k0185l7819l2971k0909j3620n148J4565L5795M3921L2591K452
460G9713l7210o0632m7790q697K5893L8658L6064K2986N314j0286k0050l0211
472f248l7232k7300L920L5392M9326M1362J4494k2740m7667m2996k0908n56J3044
485d8109K7959L6473K8441R094j0394l0411m5429l8176p076K5958L9684L7859
497B5873K4287L087k0986l5691l5899k5831m947K1730L8371L6947K1595J827j9522
$$ y = [30856, -24757, -66663, -72272, -40081, 8806, 50744, 71817, 70264, 51131, 21602, -12608, -44389, -62029, -50526, -7648, 49426, 91422, 93135, 54503, -826, -42617, -54644, -43350, -19330, 9593, 39468, 62015, 73131, 63023, 24151, -31939, -73848, -72766, -30954, 25446, 68960, 81041, 60856, 23037, -9934, -30843, -44463, -49611, -35046, 749, 44670, 77261, 79713, 42503, -18129, -65919, -74616, -48723, -10065, 25999, 48985, 54299, 44013, 23963, -6248, -43480, -70780, -66860, -31468, 17858, 59220, 73714, 50974, 3307, -39689, -60597, -61153, -48109, -20150, 16323, 44764, 53858, 43464, 13053, -32376, -70552, -77628, -51670, -11986, 25873, 50160, 53247, 32261, -3430, -39329, -65160, -70107, -48377, -10006, 26941, 48536, 50363, 30841]
510C0841l7370l7472k0840J214J8704L3139M0577K8632n45k9064m2409l7218j6945
523f8756J0157L0491L4776K6229J3080j292j6795l1104l6531k6824p31L1654N0156
536A4510L9542R802j8325l3560l3659k3224n317J1201K0797K4804K7531K2567
548E6669L525k5705m7114m3118j3807K2862M3707M0009J9453l468j7538k2767
560A2708k3149k0725j4492J666K4546M2066L8880J3097k1112m3427m1349k0995
572e2286M640K4534L2585K6473J1738J26p888j8645l2296l3560j2873J9378M1454
585C380M1725K1288o787k8724l3781k5900j3023J552J7021K8142K8445J9265L018
598E5621j7583l4937l6663k0337M719K5674L6631L1989J1771j2690k5329k6769
$$ y = [30841, -6529, -44001, -64841, -63627, -44923, -11784, 28793, 57425, 56880, 27816, -14593, -51811, -68756, -58599, -28108, 6668, 32897, 45977, 44685, 27890, -3214, -39745, -66569, -67300, -35646, 14510, 54052, 63854, 45529, 11969, -21690, -44914, -50231, -39030, -18233, 6571, 34102, 56669, 60194, 34489, -12625, -55743, -69550, -46688, -2981, 37028, 56481, 53013, 35475, 12708, -10441, -31166, -45658, -43992, -19446, 22620, 61500, 74597, 53485, 10058, -31291, -52286, -47646, -23112, 9473, 35946, 47684, 47810, 39922, 21277, -11019, -44579, -57452, -38074, 3380, 45105, 66393, 59606, 30882, -2899, -28799, -41822, -40270, -23249, 4893, 33338, 52603, 55621, 38038, 3101, -33562, -53899, -49180, -23506, 13125, 45114, 56885, 44195, 18866, -7903]
610g903k4426j6519K536K3938L3328K8337J2677q188k6180l2361k5123j1794M614
623d7064K3840L6398L0389P372j4646k7735l0590k3012p124J1930K3729K7789
635A1276K4450J0283j0546k7167l2035k5031j0028J2272L3273L7741K0907k855
647D2540k0657k7083k3521j4129l646P988K1102L1099K7294Q075j7031l4422l5092
660c7483j8990M323K3920L0316K3985J1520k696j4451k2535k3592j8677n554J3807
673c6107L1128L5726K2247m595k9566l5899k2972l685Q958J7403K2186K2523J3965
686D1312m45j5607k7709l0218j7354O157K7124L3769K5997P031j3135k4813k3957
699a1848j7750q000O081J9199K6146K3030J3565m395k5672l5701k4166j722J4855
$$ y = [-7903, -32329, -48848, -46312, -22374, 10954, 39291, 51968, 43780, 17600, -14761, -39884, -51678, -47064, -23224, 13174, 43563, 50935, 36289, 8554, -22036, -45048, -52172, -40242, -16513, 11276, 35726, 46009, 35463, 8296, -23739, -48770, -58798, -46526, -13253, 24488, 45395, 42540, 21883, -5200, -28721, -42850, -46496, -38508, -17406, 13693, 40987, 49062, 32031, -2391, -37483, -56473, -52150, -28230, 2086, 26071, 37591, 34895, 20444, -2091, -25683, -44360, -49914, -36107, -4979, 30747, 52994, 48399, 18833, -17066, -40038, -43723, -34765, -17362, 4824, 27347, 41312, 40867, 25260, -2449, -32667, -50021, -43864, -16740, 17029, 43026, 50057, 36922, 12109, -11848, -29598, -37598, -31517, -12318, 13828, 36858, 50423, 46028, 20356, -15345, -39511, -41233, -26378]
712b6378K3888K6215J9657L591j2206k1841k4299k0933o670J2375K3876K6238
724B3513K1715O271j6171k9237k5277j3970l033J0907K6485K8744J4196j520j1995
737C0628k2973k9150j8112L687J6920K1169K3917J8673r72k0239k4840k1526j7190
750d0008j578K1725L0143J9258O891L1j3734k9292k5723o851N918J1219K2835
763H34K8477J4025q889k1793k3692k3294j1370R649K2760K0847J6527J1521l759
776C1843k2882k5746j6634r279J128K1943L3582K0258j466j0956j6187k4802k1657
789d0855k549J3306J7261J9298K0953R408j1817k3693k3066j8746o390J5082K7704
802d104K0954R913L624p115k3366k5875j2055R56O530J9469L0359J9580m792j8152
$$ y = [-26378, -2490, 23725, 43382, 46973, 34767, 12926, -11373, -32306, -38976, -26601, -2725, 23513, 45228, 51499, 35328, 6091, -19186, -33156, -36189, -25282, 1203, 29947, 44143, 42623, 30628, 7655, -21495, -39607, -35920, -19000, 2169, 26086, 44759, 43787, 23548, -1292, -22818, -40008, -41586, -19861, 10282, 29540, 36431, 36462, 22728, -6564, -32287, -39138, -33220, -22001, 834, 29311, 43336, 34447, 12654, -11038, -34332, -45702, -36053, -13293, 7554, 24081, 35602, 31843, 8961, -16785, -33419, -42698, -41570, -19627, 13955, 34213, 32747, 21791, 5604, -19198, -40855, -43404, -30098, -12837, 6461, 27414, 36822, 25005, 1312, -21754, -40500, -46890, -31808, -4104, 16850, 26763, 30387, 23272, -94, -25969, -38024, -37068, -30538, -11069, 19290, 38870, 34078, 15926]
816A5926j9826k0229j6200K636J8932K0098J6165J3694M824j4975k5848k0002
828b4805j0805j625J5647K9175K3489N268p125j2502k0155k1931r026P574J4030
841a2791J7461K2307J5293n443k1278k2640j7744j0109O461K2995K4105J2261
853C0878M475l154j5792k3862j7232l906N711J4441K3475K2407N674j2476j9487
866A1152k0899j6717m253J1959J9650J8713J3821M386q549j9126k0356j4535n492
879c0246Q049K1954K4087J4093m23j1599k0662k2295j2533K247J2979J7327J7228
892B0206J2987R26j1522j9105j9994j4290n07J3266K2180K0774J0484l680j6192
905A5533k0972j6944p229K196J2381J8407J6781R964r10j3398k1701k0346j0198
$$ y = [15926, -3900, -24129, -40329, -37693, -18761, 1337, 17502, 31196, 36020, 21045, -4803, -24805, -35610, -37235, -21588, 7587, 31076, 36344, 29219, 16717, -3438, -25369, -34395, -26821, -12791, 4670, 26977, 42270, 36827, 15549, -7091, -24835, -34944, -28483, -5488, 18617, 30878, 35353, 32199, 16407, -7455, -24687, -28593, -22882, -8441, 15034, 37441, 43115, 30639, 11152, -9747, -26464, -30717, -18758, 892, 19605, 33426, 37812, 29263, 10137, -10219, -24754, -30246, -22197, -243, 23844, 37937, 37514, 25915, 5253, -17042, -29575, -27328, -14349, 2978, 20206, 33193, 34119, 22597, 3492, -16502, -30792, -31299, -18033, 4147, 24921, 35405, 31725, 15533, -5439, -22383, -29612, -27416, -15035, 3372, 20153, 30117, 29207, 15809, -5892, -26238, -36436]
918c6436M509J7335K2361J7240M695q061j5755j7534j4880n849M411J2466J7883
931B385J7788J0060n655j9085k1772j6177n683Q687K0568K0496J0072O01o435
944A5850j3177j8740j4528k680N520J3463K1024J9366L802j3349j9853j8332j3045
957c4679q16J4043J8994J3684Q073L655o939j7405j8203j0001l247O583K0279
970e979K4293J1471n068j2670j6655j8633r656O161J4822J1885J2290J2840K596
983B7697j2775j8544j5393j0406j528J4812K4369J7439L869n429j2525j8282j4958
996b1654k358O069Q250J3951J8102J0002n052j3436j6168j7823j0842Q754K0965
1009a240J8266R193M130m503j6407j6830q713j771O91J0359K0585J7245K627p232
$$ y = [-36436, -31927, -14592, 7769, 25009, 29704, 21643, 5888, -11646, -26526, -32375, -27964, -15498, 2385, 20173, 30233, 24578, 5493, -16279, -32456, -38139, -29452, -8884, 11612, 21684, 22285, 15850, 2673, -16067, -30595, -33275, -27755, -14292, 6732, 26098, 29900, 16551, -3302, -21634, -34679, -35495, -21452, -2458, 11226, 19299, 22954, 16015, -1390, -19593, -29594, -32841, -26258, -5979, 18314, 29785, 24717, 12047, -4608, -23241, -32897, -26736, -11914, -29, 12261, 25101, 27697, 14922, -3622, -19015, -29421, -30949, -16137, 8232, 25671, 29540, 24111, 11586, -6696, -21654, -24012, -17943, -9693, 4258, 22360, 32362, 27310, 13874, -2294, -20117, -30959, -22205, -1240, 17026, 26219, 30349, 25846, 9439, -7391, -16104, -17875, -17184, -6825, 13760, 31005, 33632, 26400]
1023B6400j3785k0124j7094m97J4327J6059J2427J0116L123j0256j4613j1599
1035e516r522p513M921J8561J9469R659J478p725j9080k1482p670O741R886J1363
1049C570J4104J0251j938j0590j1200j3927j3904l225J3054J9615J4553Q001j618
1062B6746j3880k0003j2904k201K860Q373J4332J3561N375j901q353j5028j8518
1075b1541r473N513J4729J6207J3723N735p662j6443j3382q283m665K093J1809
1088a1640J5421J1120M366k032j1632j9556j5452k234Q842J4325J6061J0964n4
1101A8499r378j2088j1166r578m289N547J2856J4601J1624M927p680j6976j6564
1114a9665r283R55R564J5151J4652O013j978p003j0169j2762j0520j383P968J4927
$$ y = [26400, 12615, -7509, -24603, -25100, -10773, 5286, 17713, 27829, 30952, 20696, 6083, -5516, -15038, -22551, -17630, 931, 20400, 30059, 31537, 23812, 4732, -16750, -24420, -17679, -7793, 3570, 17674, 27925, 25987, 15397, 4197, -9730, -23634, -26859, -13805, 5810, 20363, 28364, 26746, 12866, -7137, -20041, -22242, -19382, -11009, 3323, 16884, 22259, 20358, 12005, -3023, -21541, -31014, -25501, -10772, 5435, 19158, 24893, 17231, 788, -12594, -20877, -25542, -23449, -11640, 3781, 14901, 19267, 17235, 5603, -13953, -29405, -31639, -22797, -8472, 7589, 18553, 18499, 9121, -2967, -14133, -23711, -28000, -22453, -9597, 5004, 16628, 21555, 13875, -3101, -19665, -28948, -27993, -18429, -3278, 11374, 17387, 15409, 8406, -1763, -14525, -25045, -26428, -18460, -3533]
1128c533J5566J0295o11j1709j6327j3309n656L962J1152J2770J0774O199o14
1141A8959p534j3335j3192p808J060J0660J6895J4899N771n859j2934j3958r197
1154a5573k948L926R652J2607J1475N254k630j0226j4114j2916n829N872J3792
1167a658J5195J0800J653o853j2467j1982p579k615L748J0134J4184J0419L233
1180B6212m678j2313j6144j1192O50Q413J2785J1641Q602L01q577j1564j0716
1193f580p687j978N180J2693J3098R516R79q845j5377j3549n482K266P921J1455
1207C610J1795O175k245p557j0817j1688q838L94R409J3482J1962O568k710j0861
1221H679j4533j0193l852L301Q944J1505R280M643j132q868j3580j2711m308M699
$$ y = [-3533, 12033, 22328, 21717, 10008, -6319, -19628, -25284, -21322, -10170, 2600, 13374, 19573, 18959, 11425, -1910, -15102, -22910, -21850, -11190, 5705, 20604, 26375, 20516, 7582, -6376, -15573, -18521, -14595, -4943, 7664, 19139, 24393, 21763, 11537, -2577, -15493, -21322, -15450, -1658, 13537, 24337, 25990, 19137, 6670, -5312, -12891, -15506, -11758, -1624, 12560, 22979, 26212, 21534, 9221, -6923, -18115, -17465, -9052, 3733, 15374, 23976, 24277, 15700, 4136, -6580, -14267, -16245, -11065, 1628, 14726, 24242, 25221, 16376, 999, -12550, -18032, -15766, -7845, 3610, 15405, 21580, 19335, 11778, 961, -10727, -19565, -19171, -9762, 3720, 15682, 22250, 19540, 8679, -5854, -16047, -19899, -16598, -7654, 3851, 13131, 17774, 16642, 7774, -5806, -18517, -22825, -18126]
1235a8126R647J2261J1006M245n966j1784j1607p916l174L578J0204J1496R048
1248A2912L384l276j1364j3322r744j719N602J1098J3363P928K05p128q924j0923
1262a1908q500k045O602J0501J0970Q575K243o218j2785j2341p267J107P846J1579
1276a641J0534N473r46n686r837j1043o977P01O592J0994J2379P326j305r468
1290G096j2012r958m035K333Q156J0837R012M758q84o980j0861j0663n912K011
1304a7102R673J3233J0052L328m179r384j0563p773k774L144Q144R848Q977N013
1318A9637k026r485j2514j0127k388N776J0798J1128P187R40n136q382r560o855
1332a1007k649L248Q772J1951R182K087o156j1111j1743n889k14O462R996R165
$$ y = [-18126, -8479, 3782, 14788, 19033, 13067, 1283, -10324, -18240, -21414, -17836, -7632, 3864, 12912, 16296, 13020, 1656, -11666, -21410, -23129, -17527, -6429, 6934, 14862, 15067, 7939, -985, -11908, -20408, -22453, -15851, -5350, 5620, 14195, 16438, 10220, -2565, -14906, -22173, -21066, -13220, -1641, 8893, 14366, 13420, 7734, -2103, -13146, -20123, -19422, -12830, -1836, 10543, 17869, 16564, 7096, -4916, -14874, -18909, -16576, -8420, 2417, 11429, 16187, 15303, 8323, -2538, -13201, -19113, -17102, -7429, 5804, 15856, 19184, 15005, 5621, -4942, -12715, -15489, -12345, -4201, 5647, 14624, 19637, 17611, 8126, -4388, -14515, -16903, -11127, -329, 10799, 17986, 18926, 13790, 5408, -4152, -11007, -13656, -10408, -1636, 10315, 19497, 21584, 15428, 4317, -7426, -13315, -13529, -7067, 2929, 12094]
1346A2094N563J15m746q423j0524p766j224O497J1056J1248N859j096q041j0704
1360i2q995m627J249O701Q902Q534N195j96o419j0049j0509n434J037Q052J0803
1375D152R422L884l463q266r818p763l429J997P258R288Q209L654j874p958j0825
1390e532r315l239L675Q717J0699P850J224m577q594q685o677k086L229P232R363
1405C284P218L328l401r699j1066p410j129O253R324R551N621p86n270p791p544
1420i517n701j848L533Q773J0520P320P10o399j0615j0053m734K269P131Q170
1434d41P191M155l09m600p551q290o488r20O378J1408R822M665k713p802j0245
1449e740o590j535K690N341O723Q010M696m13o009r097r758m682K966R880J0093
$$ y = [12094, 17657, 17772, 13026, 4603, -5921, -13687, -14911, -8414, 2642, 13890, 19749, 18653, 10612, -92, -9087, -13714, -12465, -5764, 3138, 11672, 16867, 16671, 10252, 203, -10306, -15740, -14703, -6651, 4152, 13574, 17458, 13995, 5729, -4089, -11852, -15281, -13284, -6026, 3262, 11471, 15125, 13251, 5293, -5532, -14847, -18086, -14411, -5694, 5005, 12855, 14079, 9502, 908, -7777, -14454, -16540, -13311, -6079, 3284, 10502, 13830, 10429, 730, -10336, -17746, -18875, -12622, -3298, 6253, 11874, 11088, 5818, -1973, -9517, -15218, -17066, -13533, -4760, 5760, 13080, 13790, 7391, -3224, -13277, -18011, -15742, -8611, -441, 6750, 10905, 10596, 5996, -1555, -9845, -16333, -17253, -10875, 533, 10355, 15020, 12307, 4505, -5740, -12330, -13865, -11175, -5834, 889, 8899, 13595, 13182, 7173, -1924, -11682, -16364, -13398, -3518, 6575]
1464F575P275J155m089p657p250m808k494J694N797R100P669L895k792q371j0612
1479d913p515n03N570Q267Q007N648N00m417o819o606o402k276L498Q292Q952
1494I283N938J797m616j0225r600l889J365M922P327Q144M282j226m500o239p936
1509e173o168l36N565Q273P773N641m34p314r661p004k849J243N663Q620O308
1524A0147K033q59l991p778q555m616J460O467Q217Q763L858m078r036p705m966
1539a0639j813K193O322O591M925K820K24n963r821p882k409K982P868J0051N998
1554A1447p57n039o798n418m896j568L071N028O635O654L775l260r098r173n519
1569a4916j62N452R176O789K732j210l271n319o727m934n80K590O870Q780O579
$$ y = [6575, 13850, 15005, 10916, 3259, -3991, -8799, -11293, -9599, -3802, 5298, 12967, 16862, 14070, 5699, -4913, -12428, -12931, -7361, 906, 8913, 14561, 15061, 10644, 3825, -2781, -9183, -11459, -7961, 331, 9283, 15221, 17018, 12402, 2177, -7423, -11312, -9947, -5025, 2302, 10446, 14728, 13502, 9002, 2763, -5173, -11341, -11677, -6112, 2161, 9934, 15575, 15141, 7827, -1834, -8838, -11687, -10444, -4781, 3839, 10147, 12180, 11321, 7330, -448, -9003, -13619, -12159, -5692, 2525, 11288, 15146, 11068, 2032, -5673, -10639, -12452, -10259, -3937, 2654, 7579, 10399, 10623, 4660, -5161, -13043, -15452, -12470, -4602, 5449, 11447, 10690, 5651, -1147, -6565, -11461, -13029, -9958, -4930, 1705, 8359, 12134, 8874, -224, -9397, -14916, -15078, -9626, -450, 6339, 9071, 7861, 4590, -729, -7456, -12390, -12970, -10380, -3510, 5270, 11849]
1584A1849j87o609q248p048l474J922O082P161M388L059K95l530o766p549m122
1599a2777O08N097Q815P870L180k902o400p218n366j973K267N372O039N659L151
1614A1422n44n752p494o573k597K150O446Q477N854J327l404o103o772m853j143
1629i559K970N562O337N266K033k307o310p691n283j363L815P141P161M766j57
1644A2381m350n959n858m041n34K985N953O063N059J488l432p838p671m412R11
1659i255N068O619O848K250j739l877n111n608m000l64L712O267P439M776j324
1674A1701n860q321n645k029J897N227O095M288J287j92l354o620o105l476J063
1689a0044N141P424O838J816m061o425n390m183j640K585M756M845M380L208r62
$$ y = [11849, 11662, 5053, -3195, -10243, -13717, -11795, -5713, 1448, 5836, 8895, 9190, 5660, -1106, -8655, -12777, -12169, -7072, 1743, 9613, 12793, 9891, 3491, -3727, -9093, -11066, -8799, -3427, 2612, 8271, 11422, 10878, 5126, -2368, -8941, -11538, -9388, -2942, 5535, 11389, 12716, 9312, 3209, -3563, -8416, -9559, -6589, -1027, 5310, 10576, 12609, 10302, 3992, -3699, -8982, -10345, -6530, 611, 7772, 12538, 12381, 8031, 2072, -3786, -7827, -8361, -5376, 577, 6640, 11699, 13187, 9755, 1917, -5754, -10166, -9255, -4187, 2432, 9280, 11530, 9791, 5914, 803, -4805, -8805, -9169, -5457, 810, 8249, 13025, 11701, 5841, -2480, -8125, -10154, -8257, -3030, 3065, 7353, 8640, 8448, 5094, -1526, -7631, -11107, -10044, -4903, 2521, 9359, 11175, 7114, 689, -4701, -8884, -10524, -7939, -3183, 1662, 6042, 9250, 8288]
1704H288n947p972n178j290K630O517P508L819p08l272m329n851m349o73K897
1719g910M493N653N884J567m255o817o033l607m56L870P303N411K162k02k244
1734D819n981o395l037N20L204N340O550M318r66m870n278n954l159J064N282
1749d543O008L824K673N95m644o338m664k129K78L886O930O388J424j891m222
1764C575o203n188j789L343M379M436M654K281j305m921n093m247l099J339O223
1779a615P083M261J30k390m765o202l512K31K316L218N861M692J197k272n084
1794C149o066m702j092M380O243M931K458M19l108n616m135k462o95J477N078
1809B59O651L803j32l519o234o165k997J800M579M612L652K413j07l495m318m794
$$ y = [8288, 2341, -5631, -10809, -12099, -9469, -2952, 4556, 8375, 7667, 4395, 66, -5785, -10134, -10807, -7910, -3417, 2236, 8120, 9687, 5432, -1385, -7418, -11025, -11481, -7611, -308, 5103, 7265, 7063, 4819, -1162, -7557, -10594, -10074, -6870, -1530, 5020, 9338, 8372, 3502, -1776, -7730, -10889, -9825, -4543, 1465, 5289, 7962, 8557, 3913, -2425, -7089, -9218, -8940, -5054, 1876, 8264, 9688, 7797, 3575, -2628, -7816, -9605, -6262, -1883, 2553, 7207, 9488, 8183, 3262, -1831, -6078, -9177, -7838, -1615, 5468, 9729, 9859, 7469, 2704, -3498, -7010, -6779, -4463, -1245, 4616, 9308, 10505, 8233, 3149, -2917, -7619, -8711, -4331, 1912, 6843, 9301, 9720, 6612, 996, -3139, -5601, -6296, -4819, 259, 6910, 10713, 10581, 7062, 828, -5337, -8334, -6534, -1955, 2657, 6309, 8722, 8615, 5120, 802, -3992]
1825c992l773k44L900O413N558J857j213m738o224m128r83J600L171M741M450
1840F395J920j230l345n449n312k731J812N413N931L692Q30k724m211n199k921
1855g129j179J375L571N435L595J603j417m898n830m491o67L098M993M867L272
1870F198n3k631m299m425l144j086K137M570N228M015O3k515n437n269l141M01
1886i388L503N272M219K171k85k969m053m300k857j16K721N063N239L056q58l598
1902B820n361m860j539J574M036M294L570J566j61l022m318m232k513M88M344
1917c314N629M730J362k279m115n043l263m99K117L189L720L879K289j580l534
1932C288m901m423j637K143N764M823L286K4k217m430m052k387l83J358L570M658
$$ y = [-3992, -7765, -8009, -4109, 2304, 7862, 9719, 8506, 3768, -2456, -6584, -7567, -5967, -2796, 1945, 6395, 8315, 7085, 3740, -1709, -7021, -9752, -7940, -2527, 3404, 7096, 7926, 5202, 991, -4208, -7129, -8308, -6933, -3362, 2073, 5668, 7271, 5854, 956, -4874, -9365, -10032, -6934, -1941, 2926, 6198, 6145, 3514, -785, -5210, -8354, -9440, -7303, -2733, 2495, 6510, 6573, 4058, -1379, -6648, -9789, -9388, -5885, -613, 3606, 5777, 5492, 2523, -1530, -5830, -8687, -8803, -6082, -1019, 4220, 7276, 6418, 2820, -2541, -7401, -8940, -7366, -3330, 964, 4534, 6100, 5939, 2917, -1401, -5633, -8146, -7658, -3314, 2315, 7045, 8407, 6128, 2013, -3030, -6293, -6792, -4675, -1486, 2234, 6113, 8402, 6822, 3288, -1613, -6036, -7673, -5530, 234, 5057, 8343, 8367, 6150, 1720, -2332, -4719, -5102, -3744, -174, 4484]
1948D484L659J019k076m516n576l481M69L514M902L685J912k30k461l821l933
1963b450k086j138K229M520N126K674l12l312n313m581j997J741L491L572L605
1978E769J709o76k798l907l817k412l85L439N192M491J580j503m196m989l115
1993e618o97J600K552M051L161J378j060k915m477l940j947J559M161M584L342
2008E734Q31k397m563l535k435o39J423L074L954K612J511j293l698n232l575
2023h228k22K601M137M674K222q01k432l343l363j947o16J642L589L945K918Q99
2039E675k491m851m390k160O51L447L932L320J720q15k262l197l378k363O6K496
2055d600M155M296K307o89l554m544l598q54J948K830L460K891R60m16k257l475
$$ y = [4484, 8143, 9162, 7086, 2570, -3006, -6487, -6018, -2504, 2398, 6083, 7995, 7765, 5304, 1483, -2450, -4536, -5674, -3445, 1075, 6201, 8875, 8563, 5251, -62, -4643, -6640, -4899, -1408, 2164, 5769, 7478, 6802, 4004, 97, -3720, -6132, -6517, -3078, 2114, 6605, 8185, 6682, 2486, -2503, -5618, -6315, -4715, -2163, 1888, 5049, 6427, 5367, 2452, -2025, -5965, -7912, -6353, -2192, 2392, 5734, 6565, 4168, -395, -3930, -6365, -7004, -5581, -2507, 1447, 4059, 5570, 4277, 579, -4653, -8228, -8450, -5849, -1712, 2962, 5184, 4383, 1951, -1392, -4755, -6702, -7318, -5676, -2087, 1858, 4776, 5675, 3184, -1667, -6057, -8217, -7566, -4119, -187, 3133, 4853, 4038, 1776, -1421, -4799, -7162, -7096, -4600, -445, 3851, 6158, 5469, 1915, -2629, -6227, -7081, -5133, -2303, 1157, 4048, 5008, 4592, 2335, -1140]
2071a140l231k396Q26L339N278L154J193j736l705m142k367K9J400K593L390K733
2087E218J062p63l170l710l567j227K436M353M081J979J73k240l751l051j825
2102d002OJ032L302L487K765O93j784l796m446k246K72K444M481K887J509o22
2118E982k046l013l275j812q5J883L334L916K232k18l158m500k977j484J294K698
2134a229L493K486J058o58j979l257l413j673K66K501M202L453J424j466l629
2149A579l462k790p64J635K373L238K543N55m38k811l972l108j334J624L587L613
2165B068K838N26k452l419l083j785k63J508K345L330K102Q73j303l022m085k860
2181f682Q3K504L482L188J397J9k398k987k600j410n06J603K822L746K162o8k116
$$ y = [-1140, -4371, -6767, -5941, -2602, 2676, 5830, 7023, 5287, 1582, -2560, -4927, -4898, -3498, -905, 2485, 5218, 6280, 5517, 2347, -1363, -4930, -6157, -3721, 632, 4713, 6692, 6865, 4625, 874, -2177, -4002, -3996, -2964, 338, 3825, 6590, 7283, 5499, 1703, -2743, -4989, -4717, -2273, 2208, 5095, 6604, 5982, 3936, 923, -2352, -4164, -4249, -2366, 968, 4884, 7116, 6898, 3740, -760, -3737, -5221, -3927, -1229, 2264, 4750, 5808, 5150, 3171, -86, -3499, -5172, -4906, -2405, 1797, 5250, 6674, 5208, 1579, -1883, -4673, -5437, -3802, -1429, 1809, 4352, 4907, 4469, 1658, -2314, -5422, -6756, -5132, -1545, 2068, 4906, 5432, 2980, -439, -3522, -5307, -5570, -4062, -1717, 1613, 3715, 4588, 3285, 263, -3822, -6682, -6599, -4095, -613, 2575, 3972, 3991, 1593, -1394, -3994, -5404, -5910, -4307, -1485, 2261, 4423, 4355, 2239]
2198B239l751l751j710J593K625L182K331J198m76k037k872k289j767k29J881
2213c833M062L387J289n49k914l516l031n44J624K430K567K183J258o02k102l057
2229a348k776j405J190K848L707K804L86j502l078l259j827M9R93K620K661K664
2245D727O64j017k783l578k517m86K094L510K978K228l95k077k691k456j772j53
2261c724J376K856K997J784Q25j811l409l666j362M49K288L026K907R89n03k124
2277B898k573k010k308L94K223K899K261J798L69k967l584k687p84O62K429L234
2293B254K072N33p36j808k499k605j638Q64K019K976L223R56j353l337l033j709
2309c821m24J152K266K492J778P53m50k190l344k712q46J429K950L121K140k16
$$ y = [2239, -1512, -5263, -6973, -5380, -2755, 427, 2758, 3956, 3480, 1443, -1429, -3718, -5485, -5714, -3833, 229, 3616, 4905, 4356, 1442, -2074, -5105, -5649, -4025, -1595, 972, 3155, 4413, 3811, 1709, -1348, -4124, -5529, -4339, -1491, 2216, 5020, 5406, 3904, 826, -2433, -4260, -4211, -3218, -598, 2063, 4727, 5391, 4374, 1591, -1987, -4504, -4990, -2896, 614, 3592, 5820, 5425, 3348, 657, -1799, -3571, -3724, -2348, 508, 3505, 5289, 6114, 4303, 894, -2772, -4134, -3685, -1397, 1629, 4536, 5525, 5022, 2898, 325, -1685, -3993, -3599, -1376, 1523, 3784, 5582, 5951, 2984, -600, -3287, -4071, -3409, -980, 2254, 4326, 4859, 4123, 2315, -184, -2789, -4427, -3563, -1544, 1432, 4655, 5611, 4258, 921, -2112, -3821, -4245, -3093, -827, 1665, 3443, 4196, 3746, 1556, -1788, -4500, -5346, -3917, -967, 2154, 4294, 4078]
2325D078k014k504k050j593k00J055J535K983J827J241j686l011l009k302M75
2340e175K075L172K363O60j69j601k129k356j484l83J543K701L149J745n76k383
2356A152k955k274j001Q58K257K016K061J199j95j357l142k306j303P28K140L101
2372I79K491N69r65k361k635j884q66R21K558K300K198N67r40j783k963j933m40
2389d187J005K185K594K267K75r59k447k889j534q6J300K378K600J391j66p38
2405B989j764k700j950m50J287K586L331J460k83k317k661j658q13L77J197J702
2421C33K030J821Q18j455k823l300j556J038K198K759K167K38r13j714j290j680
2437a329j675j64J113K706K751J981n43k920l501j675J75J335J506K084J034P10
$$ y = [4078, 2064, -440, -2490, -4083, -4283, -3228, -1693, 1290, 3117, 4358, 2672, -339, -3348, -5650, -5175, -3100, 72, 2435, 3095, 2926, 1325, -804, -3160, -4644, -5027, -3484, -783, 2366, 4111, 3535, 1152, -1803, -4077, -5078, -4220, -1963, 53, 2114, 3313, 3118, 1761, -1381, -3687, -4990, -4262, -2122, 979, 3470, 4039, 3074, 713, -1922, -3806, -4672, -3751, -1193, 1107, 3305, 3872, 2932, 1149, -1814, -3747, -4187, -3182, -997, 1597, 3864, 4139, 3180, 733, -2156, -3690, -3776, -2476, -98, 2502, 3893, 3727, 2989, 1225, -1475, -3425, -3875, -2588, -2, 3329, 4789, 4506, 2189, -472, -2130, -2943, -2566, -1369, 333, 2363, 4184, 5002, 3547, 724, -2576, -4132, -3094, -896, 1863, 4030, 4268, 3355, 1641, 351, -1329, -3004, -3168, -2055, 651, 3402, 5383, 4840, 1920, -1581, -3256, -3081, -1746, -240, 1844, 2878, 3588]
2453C588l17p08k737k497j518P45K527L159J943J21j866k862j348o49m86M72J506
2470i27J877J966J066m33k792l163j850M40J648K346J984Q98m05j019j325j934
2486a623j622r86J311K441K728J360k10j880k910j608m92L5R66K020K415J171
2502C116k46j068k413k686j047P83J877K003J506R76k26j443j879j645j641j42
2518d175K015K835J923O36p72k061k231j468J35N37R27J663K101J458n34j883
2534A106k966k096m40J789K658J492J011j07n68j469q62j752j500Q3K404K838
2550A621K439L30j928l115j931m38Q30J363J089N04J404J190J5j979k999k240
2566c845j14J877L484K285K37j371j417j269p98o06o58J30J587K666K532j87j851
$$ y = [3588, 3271, 2563, -174, -2671, -4189, -3444, -917, 2242, 4185, 4306, 2440, -422, -1770, -2419, -2905, -2433, -927, 950, 2916, 3982, 3549, 757, -2406, -4256, -3816, -2168, 178, 2162, 3060, 2655, 1636, 311, -1623, -3245, -4231, -2920, -479, 2249, 3609, 3399, 1519, -1391, -2999, -3491, -3456, -2490, -470, 1945, 3116, 2870, 1802, -611, -3297, -4344, -3561, -1684, 319, 1825, 2801, 2575, 1132, -747, -2392, -4033, -4175, -2160, 675, 2598, 3234, 2462, 401, -1830, -3298, -3163, -2626, -1699, -36, 2065, 3523, 2989, 1106, -1860, -3956, -4396, -2607, 51, 1543, 2554, 2447, 1879, 410, -452, -2204, -3704, -3621, -1217, 1621, 4060, 4390, 2462, -653, -2584, -3022, -2192, -829, 260, 764, 2168, 3358, 3373, 1394, -1605, -3845, -3959, -2082, 1402, 3687, 3924, 2553, 1136, -133, -931, -1537, -2195, -2065, -478, 2188, 4720, 4533, 2682]
2583B682l505k178l64J408K171J702L88J09K70l36j481k276j978j53K150L165
2599A774K198K5j528k023j487j092K10K83O46J486J836J093nj976l009k065J04
2616c530J742K163J566L55O0m69j054j592j605j434P01K536K700J400k66j583
2632A690k254j545m11J29O52R05J635J684O98o84k636k584j501O37K222K398O08
2649A643K26j13m96j120j662j989n42J218K814K422J204j154k182k566n54L94
2665b457M49L24J141J209J720Q01j587k102l430m22J030L341J852O29o77q83q52
2682H6m75n98j864m45R05K969K837P83j733k736k426m04Q98J550P80L20L68J346
2700B161P04q93k525k445j356J500L511K501M92j256j909r78m22p3o86l51R34
$$ y = [2682, -823, -3001, -3365, -1957, 214, 1916, 2304, 2413, 2683, 2347, 866, -1410, -3388, -3541, -1391, 1774, 3972, 3997, 2469, 446, -1041, -2133, -1923, -1640, -994, 492, 2328, 3421, 3416, 1440, -1569, -3634, -3530, -1788, 375, 1941, 2296, 2356, 1887, 833, -759, -2364, -3798, -3097, -561, 2139, 3539, 3273, 1690, -564, -2109, -2520, -2391, -1739, -834, 801, 2485, 3183, 2499, -137, -2721, -4222, -3585, -1363, 1035, 1643, 1869, 1756, 1260, 140, -1522, -3511, -4053, -2835, -21, 2401, 3605, 2451, 269, -2297, -2851, -2457, -2008, -1684, -543, 666, 2386, 3187, 1600, -502, -3932, -4354, -3324, 17, 1869, 2498, 1821, 938, 86, -389, -987, -2851, -3296, -2391, 578, 3415, 4198, 2465, -271, -2697, -3101, -2203, -653, 127, 447, 815, 2161, 2865, 1972, -553, -2998, -4354, -2854, 657, 3158, 3650, 2394, 485, -493, -915, -988, -1674, -2025, -1091]
2717a091K174K386N10j254l183k183l96J176J976J505K60k61K80O8r15j787j953
2734b688m32J578K424K732K92j437j963j375l48k71L80J85P41J671J699K35j622
2751A801k830k123M22R14K126J517j5k6J07m82j158j819j559K46K090K442J739
2768C392j19j992j977p77l69K75J16L83J057K227R56k62k096k694k014R03K183
2785h08J660J254o49p07k19O8r96j843j191K40K421K856J843j111k545k260p71
2802b758P17R91K04J38M63J450J227K89k437l048j845J190K770K342R54q98j381
2819C68p19Jk32j130j272J01J961L485J065r09k872k621q70J194J958J051p0k19
2837B70O73J183m21j605k295j930J182K727K718N97j072j731j154k84L14Nq74
$$ y = [-1091, 1083, 3469, 3979, 2725, -458, -2641, -3037, -1861, 115, 1620, 1880, 1619, 1899, 1967, 1052, -735, -2688, -3120, -1542, 882, 3614, 3906, 2469, 506, -869, -1217, -1488, -1108, -923, -182, 1489, 3188, 3423, 1801, -1029, -3152, -2730, -1816, 310, 1827, 1812, 1786, 1893, 1411, 253, -1566, -3125, -2879, -789, 1653, 3392, 3273, 1281, -696, -1473, -1842, -1567, -1451, -1068, -11, 2216, 3172, 2910, 814, -1880, -3894, -2991, -808, 852, 2106, 1457, 750, 531, 599, -397, -2240, -3431, -3191, -770, 2086, 3929, 2818, 273, -1987, -2758, -2041, -1050, -846, -708, -245, 1205, 2432, 2721, 284, -2764, -4609, -3419, -649, 1693, 2647, 1749, 368, -351, -350, -582, -1712, -2984, -2883, -922, 2563, 3628, 2719, -153, -2774, -3644, -2450, -492, 559, 489, 270, 943, 2126, 1705, 100, -2195, -4125, -2943, -216, 2502, 3099, 2027, 296, -858, -1142, -828, -823, -1697]
2854a697nJ670K354J205n57l159k102p48J064J716J593o5K57m73Q53n82j650j501
2872a827r33J024K377K504L33j078k190r98Qlk58J01O19J256J856N03j146k370
2890b22k434k38J801J796R05O6m36J40K32l90j958j702m50J516K813K119j17j874
2908A567k053j093M20P69j02k11Q6J759J815L12j485l238k206N12K044K460R69
2925B325q36q69m45L45j33j299j544l66J327L003K153p32j982k842r91R22J445
2942e19N40l56j48J041J245M94j407k871j910K51K196K695J155r25j507r52L02
2959f76j10P1j234j035J459K790J744m55k027k521j349O19K016J035M0l58K02
2976B11J292L7j242k305j212q4K461K478J004p59j530j409K58K85o14j83k01J262
$$ y = [-1697, -1702, -32, 2322, 3527, 2970, -189, -2291, -3039, -1975, -259, 1334, 1269, 1526, 1053, 1906, 1324, -326, -1827, -2760, -1736, 641, 3145, 3478, 2400, 210, -788, -780, -783, -1041, -940, -321, 935, 2791, 3294, 2148, -222, -2656, -2894, -1093, 703, 1608, 1674, 1238, 1378, 1610, 1220, -738, -2440, -2890, -1374, 1439, 3558, 3441, 1567, -486, -1579, -1159, -390, -492, -703, -617, 1142, 2957, 3269, 1784, -1454, -3660, -3148, -1104, 1356, 2325, 1489, 620, 175, 520, 387, -912, -2456, -2822, -1495, 1508, 3661, 2929, 947, -1895, -2886, -1964, -519, 21, -335, -483, 558, 1803, 2297, 890, -1981, -3891, -3640, -1444, 1251, 2406, 1481, -26, -978, -676, -786, -715, -1949, -2984, -1525, 1265, 3009, 2554, 527, -1994, -3343, -2724, -708, 327, 367, 9, 211, 1503, 1540, 298, -2007, -3219, -3303, -842, 1636, 2640, 1881, 351, -1058, -800, -515, -1129, -1312, -1513, -251]
2994b51J676J406k10k467k038r77P43J694J431J81o04K27M78N2j483j334j308
3011b784J020J948K200P39r51j868j050J35N5j36R7o0R75J609J451j186j737k461
3029b004o35J392K027J083k99n89k17N88j41j177j603p90O27K727K090K71j837
3046A513j801j153K27J285J50m24l1M52J996R13q96k807k209k12J707K273J358
3063B341p22j122m31N56L1q22j779o07J038K232K201J9j350k835j248L96J514
3080e88O67k0j81J81J013P65o19k058k170k20J856K381J471n73j530j049j63K58
3098e79j64n68n38M70J878J820N90j907k637j184O31J059J416J67j33l52R06M45
3116A320r01k064j097k96J848K145J235j75j591j147l07L23o1m72l19Q39J663
$$ y = [-251, 1425, 2831, 2621, 154, -1884, -2861, -2118, -424, 1007, 1188, 584, 811, 1289, 1341, -142, -1476, -2784, -1764, 184, 2384, 3123, 2172, 304, -746, -611, -556, -692, -595, -655, 320, 1929, 3380, 2194, 457, -2004, -2639, -1247, 780, 1863, 1564, 975, 758, 1346, 1205, 28, -1575, -2365, -1738, 989, 3079, 3350, 1513, -288, -1441, -1214, 71, 221, -203, -234, 218, 2214, 3127, 2231, -576, -2785, -2997, -1290, 983, 2341, 1619, 497, 66, 622, 653, -169, -1948, -2555, -1517, 715, 2916, 2935, 1585, -1250, -2498, -2102, -588, 79, 59, -122, 59, 1072, 1837, 1218, -840, -3010, -3230, -1374, 1007, 2478, 1905, 375, -674, -837, -579, -743, -1311, -1849, -1379, 499, 2319, 2909, 1002, -1635, -2819, -2188, -1129, 287, 454, 321, -31, 875, 1320, 419, -1645, -2742, -3038, -1190, 955, 2190, 2015, 424, -723, -1030, -707, -768, -1240, -1559, -720, 943]
3133I43J288j76j490k175j353J171J461J057M4j85l84N40M24n78k108j121J84
3150b458K083K335O04q45j753j413N63O39P8m72j76O52J562R99J6k165k353n97
3168b701J337J761J181k09n01o66M70N60p95j675j185M30K229K302N95r74k619
3185d60j007n3J075Q99o37l55P28J236Q69j14j815k357o60J223K241J324k5j215
3203H97r92M30L46k87j062j203K42J890J871O71j133j877j563Q6J342Q90j02m11
3221C5K59O11J014m74j461k051n53J174K077J341j50p94j206o11K92J37j63q53
3239a376K36J183J645P60j323j770j545Q1J067J388N1Mm7L06L66n40j297j291
3257b102m94J531J947J419p32j138j126l05J43K02j79o25P91J211J413j09j395
$$ y = [943, 2231, 2055, 565, -1610, -2963, -1792, -331, 726, 770, 585, 201, 741, 1165, 587, -1521, -2642, -2458, -375, 1960, 2564, 1719, -34, -1447, -884, -245, -167, -639, -815, -163, 1399, 2398, 2414, 249, -2104, -2701, -1364, 397, 1578, 1369, 868, 202, 672, 1232, 437, -1238, -2423, -1993, 236, 2538, 3133, 2159, -460, -1467, -1520, -445, 454, -183, -538, 190, 1426, 2295, 2181, 366, -1991, -2651, -1428, 813, 2137, 2112, 897, -95, 335, 681, 394, -668, -1871, -1629, 261, 2132, 2803, 1670, -207, -1770, -1684, -342, 548, 446, 35, 294, 905, 1919, 1445, -16, -2067, -2620, -1446, 631, 1972, 1822, 1028, -178, -789, -497, -360, -523, -1376, -1140, 43, 1688, 2448, 1125, -645, -2190, -2109, -1042, 346, 397, 401, 354, 660, 1026, 486, -811, -2102, -2596, -1065, 882, 2301, 1569, 431, -695, -1000, -857, -655, -834, -1459, -668, 543, 1956, 1847, 452]
3274D52j738j176M48J340J038L27p79j8K92P37p19j270j247j7J505K136R62q29
3292A444j445r36j99O90k27l3r1K15J178J139R4j199k167p09N15J586J010L47
3310A212k51r04L65Q2j87j092r56L9J159K037Q17j28k251j515J58O74Q60N9n19
3329c41J57J002J294k59j282j630j204N76J951J214M98q25r63k47M29k29n50m68
3347h77j56R68J707N78m76j544j411n62J086J115j64K43O9J61Q05n67o84j483
3365a192p51L06J782J311N61j135p44l74m0o3j66m28n2J099J620J17n59j449j116
3384a273l23N59J076O01m32N6M94K37m22j350p30n82R99J850Q08j26r24m34o32
3403e48j72K71k22m66M69R73J273n6q51j671q23k61J336P35O53n1m20l2N84k39
$$ y = [452, -1286, -2462, -2014, -674, 364, 691, -88, -106, 186, 923, 204, -1066, -2313, -2330, -825, 1311, 2273, 1444, -1, -937, -1136, -446, -673, -706, -797, -582, 596, 1735, 1829, 630, -1537, -2246, -1731, -145, 865, 1212, 961, 57, 422, 504, 317, -775, -1731, -1692, -533, 1504, 2321, 2193, -58, -1573, -1415, -741, 119, 178, -341, -184, 818, 2112, 1853, 571, -1059, -2263, -1687, 264, 1478, 1976, 1151, 188, -59, 370, 141, -409, -877, -1033, -65, 1642, 2220, 1744, 200, -1211, -1773, -687, 428, 264, 507, 576, 737, 1542, 975, 291, -1192, -1943, -1637, 145, 1456, 2017, 882, 138, -236, -276, -339, -505, -933, -985, 114, 1734, 1851, 1292, -157, -1273, -1596, -1037, 39, 640, 208, 264, 758, 995, 573, -777, -1507, -2089, -1090, 760, 1568, 1442, 518, 84, -548, -720, -449, -671, -1137, -668, 305, 1578, 1522, 671, -1000, -1823, -2084, -748, -13, 640, 589, 169, 137, 721, 482]
3423D82j253r95l04J127J542J171k44j219j194j51L88L46Q4m52L50P15P45O18
3441A756j303j693r66N12J213J064M63l04o53j13M05k97l04j324%R03J417J160
3459A936p20p56j152p68N90O75L37k67L31L90M55L19o99j478p41R6Q15J513O02
3478A478j19o31r68J54Ln94l7J20M92J105O37o4j189q54q84N77M55M72O18p1K0
3499G20K65r4n47j418m56N04J051J107L70l89n13r80P0l8l76j1J33R01J222k13
3519A308L2j348j090o1L03J065K05k0N9K46J86n22m64q49n36O95J027N20N44l26
3539I74j053m24j23R5pj90K43Q95P41K90n59j487l46m60N63P77L41J57k96J55
3559B86r4l7q21m29l70M84J121J125o3q63n36n89k64L76r4M50J27K73P94J96l64
$$ y = [482, -771, -1766, -2070, -943, 599, 1770, 1526, 307, -887, -1038, -650, -304, -220, -672, -322, 393, 1138, 1756, 453, -1240, -2206, -1694, -481, 583, 1046, 742, 89, -24, 381, 84, -220, -1544, -1544, -641, 776, 1936, 1216, 460, -692, -1460, -870, -195, 142, -125, 206, 596, 1051, 1370, 671, -807, -1548, -1452, -637, 876, 1478, 1359, 728, -240, -86, -83, -677, -714, -594, -102, 1003, 1640, 1576, 387, -467, -1351, -774, -319, 153, 771, 700, 720, 985, 891, 344, -1074, -1530, -1026, 25, 1132, 1502, 1113, 600, -380, -310, -348, -724, -735, -602, 299, 1521, 1308, 1340, -8, -1098, -1159, -856, 209, 414, 394, 453, 699, 885, 363, -101, -950, -1486, -791, 236, 756, 1300, 974, -79, -503, -626, -531, -538, -728, -485, 410, 1151, 1441, 882, -605, -951, -1411, -848, -71, 270, 427, 131, 286, 192, 155, -666, -1095, -1465, -981, 140, 1265, 1202, 339, -197, -786, -1050, -674, -768, -318, -191, 82, 876, 1072, 708]
3580G08j412p22j25M60J051O26J87l81l96P7n7n10o06M7O28N70J098R9q70r97
3600e25m68MN19P4L74J20J40N38M22q31j056n57k15M78J203Q02R3o42l89k41l24
3621d81L21n11p6P62O92L35J56n57r51r47L31O60J23L76L33N31m27P8o82q52p9
3642h65k64J168P22M83l47k49l62l18m60l8LK36N17R68K08m48o61m93o95J20L89
3663c86P80R7J2L72ok38p02n32l56N45P65O37k0o6m02q51k1J94j36l56L46O46
3685C22L48N07l40q95p25k05K90O78N49R1J39o01K25m35k08m35m90L73Q41R52
3705I81J89l00q54l29m88j56L81L06J70K86K49J70j78o67l66o65L30P61M91M29
3725G40l00k93j23l84m47k04J41K88K75R81M44o95m68n75l15J01J67L37M05J97
$$ y = [708, -704, -1426, -1551, -1091, -40, 586, 773, 392, -4, 73, 16, -494, -1100, -1053, -425, 145, 1243, 1342, 472, -525, -993, -989, -470, -396, -22, 98, 238, 776, 1198, 367, -689, -1246, -1461, -983, 220, 1022, 1115, 473, 84, -157, -481, -160, -671, -747, 15, 707, 1042, 1198, 641, -310, -1257, -926, -266, -143, 233, 566, 1097, 670, 748, 66, -786, -865, -1129, 39, 761, 1244, 897, 648, 286, -32, -492, -530, -527, -291, 226, 1194, 1402, 954, 293, -200, -895, -775, -386, 394, 491, 503, 875, 869, 631, -71, -603, -959, -414, 351, 988, 968, 902, 500, -351, -372, -178, -314, -670, -324, 322, 670, 1177, 837, -58, -783, -988, -698, -20, 529, 620, 759, 158, 383, -52, -260, -695, -1185, -812, 29, 981, 1170, 870, 16, -313, -801, -957, -576, -270, -100, 186, 435, 605, 427, -240, -606, -1271, -941, -180, 311, 740, 440, 147, 24, -360, -807, -1011, -870, -582, -307, 674, 1118, 423, -45, -620, -935, -834, -667, -330, 75, 272]
3745B72K25n1m43m36p52K32K30M95R56L48l90m09n98k27j58m3J99O61M77J16J50
3766H54m48p31k31P0l49N65L64L41K43P4l77m19p17k5J52O87M22J23N8l9l15l27
3788b5o7k94l65L10P39N37m8J16l26r76j93J6M29N35O4N5M28k0o52j55n17m59
3810h68J84P00P83K40km59m51m45p8K01M00L2P4P66K02l90p04o39m19M63N15L38
3832D43M77j71l11m8n41q3k99k37N4R69M2M78Pn23n83k00l45N73P3K19L61K21
3854E76j65n0n45l18l50J34M37M63K74N6j46l11n44m60J96k7O92L6L86L7Ol61
3876A6m72k16l47J87M90K54N41m7r4k33l53n83k2L94M37P8M87O2k88l15k10q53
3898a087L60L28J54M23L89jm78l38l70r7M8L67J33L43J3K88k29m09m73N2J80K8
$$ y = [272, 497, 446, 3, -433, -1185, -953, -723, -228, 728, 1076, 686, 277, -321, -548, -706, -749, -550, 111, 588, 704, 854, 406, -325, -556, -486, -835, -270, 94, 435, 678, 752, 375, -44, -761, -786, -634, 53, 475, 598, 656, 617, 302, -25, -92, -386, -751, -441, 298, 835, 787, 903, 577, -399, -592, -576, -147, 388, 452, 507, 935, 915, 263, 108, -409, -868, -684, 16, 799, 1039, 1037, 578, 127, -318, -396, -195, 205, 237, 311, 1077, 1279, 889, 185, -454, -873, -410, 105, 443, 920, 749, 438, 390, -151, -234, -533, -770, -716, 253, 295, 773, 780, 257, -326, -526, -871, -298, -225, -6, 355, 576, 411, 361, -184, -502, -852, -718, -281, 182, 456, 512, 366, 55, -489, -949, -753, -780, -88, -52, 334, 371, 377, 16, -456, -672, -1019, -832, -342, -88, 453, 406, 312, 79, -274, -857, -879, -485, -48, 30, 517, 579, 291, -24, -234, -1087, -727, -399, -245, 178, 567, 566, 88, -250, -620, -717, -669, -302, -169, 174, 187, 475, 246, -163, -636, -584, -404, -376]
3920c76P74Q6M18k67o50j55Q8l87j94K53O49K39L04q4j86m27n47Qo8N28L40K09
3942E55Q9k05n2k2o49j53j39M71J17Q54J15k60m86m51j92j34K98K95L80K28J49
3963H08q4n37l02k23m59N23k9Q92K12j69l03j89k27k88j20M76J11M23r1K72L7
3984G33o02m47m50J38K13N74K90O3O8j69k56k99l59k8L66j20P57M8M8l45l00l88
4006d65j6l68N47N68o8J18M7l58j46j42n07J40O49r0L00N05o9n44k36k11l60K52
4028d54j3L96M78j40J08j96m51m32k55M86K11N17K84K4o63J46l37j83M0n0K55
4049b29M37l2L32l86l22Mn70L41k7M64K96Q3j13n4m59k87P2j45K54K28J52O03
4071F42j13j76p73j98K02m4J50P5R30k74L4l04j79n44l3J21N98p8N74R3j05l55
$$ y = [-376, 398, 484, 902, 635, -15, -170, -82, -469, -663, -410, 239, 478, 782, 698, 512, 85, -462, -454, -522, 6, 346, 555, 644, 439, 387, 365, -284, -437, -576, -105, 12, 866, 981, 721, 235, -216, -408, -542, -244, 51, 431, 659, 808, 724, 187, -115, -338, -797, -274, -303, 589, 801, 632, 329, 140, -87, -375, -495, -19, 92, 515, 424, 696, 733, 131, -316, -766, -628, -415, 159, 449, 512, 580, 411, 155, -144, -503, -531, -165, -285, 472, 520, 568, 223, -77, -465, -481, -849, -302, 266, 198, 316, 363, 5, -141, -283, -790, -650, -1, -91, 209, 714, 645, 101, -135, -346, -706, -454, -467, -71, 407, 267, 375, 179, -272, -704, -959, -473, -262, 255, 539, 563, -100, 46, -291, -474, -434, -484, -229, 208, 176, 508, 122, -200, -196, -766, -425, -452, 12, 308, 391, 278, 224, -235, -522, -450, -595, -341, -113, 39, 642, 529, 353, -420, -618, -416, -460, -310, -235, 695, 421, 455, 151, -28, -572, -605, -484, 114, 36, 610, 703, 598, 243]
4093B43p38N4K8J42M41L4K47j36J3J51n41k64R2k83N87J21L73j19j04l09n36Q6
4115d18q0%O19M93p9p6J13k56l99m82K15L69qN48Q5k08o9j68n53l56K11N03L64
4138C68O8J31K57l61m44l72j91J02K30L71L64Q7j61j69l53k72K39k53K21qN27
4159C81K05k76k14p5l56O8k27J29M94K55J66k81k04j60k57k52K22L07L09LM43
4180F80k31l96m9m49l42N46q4M24r4K13K49m33l37n56j62N33K73N44J70J03m04
4201A98m91j94qJ3k25O30J42M31j19k93O2m82j10jJ35K18J34K86j16j89l34k17
4223e30J55Q3k37N25M56R1j58k27k90k21l36K32K51K68M35k28l3k16J12k26l36
4244d30K34j72L45M43J26p4n4o92Q4m7J5J54K24K81J8j3o07J57k84j16J52N37
$$ y = [243, -495, -441, -413, -271, 170, 204, 451, 315, 328, 479, -62, -326, -234, -517, 70, 191, 564, 445, 341, 32, -504, -418, -498, -498, 121, 614, 535, 459, 572, 316, -83, -565, -350, 19, 11, 559, 644, 436, 367, 199, -354, -710, -499, 4, 368, 436, 567, 824, 463, 19, -353, -544, -442, -212, 159, 523, 610, 449, 280, -73, -345, -106, -359, -138, -146, 381, 586, 310, 96, 21, -335, -267, -494, -365, 129, 384, 550, 269, 65, -95, -352, -604, -382, -75, 234, 237, 680, 449, 53, 4, -445, -787, -241, -325, 99, 5, 218, 467, 34, -303, -859, -1021, -488, -215, 329, 499, 602, 198, -293, -487, -495, -482, -707, -77, 65, 496, 377, 84, 146, -336, -446, -447, -312, -94, 40, 326, 210, 21, -313, -530, -375, -292, -529, -4, 452, 543, 385, 158, -132, -353, -689, -457, -206, 62, 497, 269, 236, 20, 132, -94, -430, -196, -368, -23, 420, 546, 472, 418, -274, -190, -237, -222, -68, 156, 437, 455, 442, -165, -8, -292, -408, -256, 281]
4266B81M7L59Nl76q0p61J74k16K43K38L95Q5L12l61k26k71l84K6R9Q10j37N04
4288G66q8n64j19l13K9J25J65m1L54M9K45k82l68m38L12l1J29P0M90l32j68L81
4310C71j55n00n6K16P0n4K04L18J31m17j36l53j65L04L34L0L17J20k05k52k71
4331a49j99k47L12K4N03J82r0M6l03m03J59O0k75K72K98K73k88Q8j85n54J05j06
4353d77R6M21P3o0K62j80m15j54J4m7K74K3L02k9K61m41o3j50j32O9J54K22M0
4376F3K73j62l2l14J43k51m6K58J75J72N3q7k03k57k29K85l25M07P0N28k19j62
4398A40k0l45j80J93qj19N24l5M04m88M37q21j7O2r2K40J50M02l6l29oj07L5l21
4422c37j79N96R8K72J76o62j10J17n02K02L53j04K93M7qJ11l12k87J18p3L65K6
$$ y = [281, 328, 687, 692, 316, 236, -525, -351, -567, -324, -86, 309, 394, 706, 345, 119, -152, -536, -510, -411, 399, 262, 766, 678, 114, -5, -318, -289, -164, 1, -40, 314, 363, 608, 326, -42, -480, -168, -199, -70, 0, 490, 158, -10, 371, 216, -284, -340, -124, -54, -108, 96, 414, 545, 128, -8, -361, -526, -222, 112, 142, 459, 579, 374, 122, -149, -348, -595, -283, -259, 244, 426, 336, 382, 79, -324, -165, -105, -380, -108, 190, 463, 175, 263, 78, -476, -371, -477, -381, 40, 113, 53, 315, 135, -280, -434, -420, -467, -193, -170, 132, 103, 364, -77, -140, -290, -422, -353, -199, 23, 63, 336, 174, 142, -172, -29, -280, -326, -68, 107, 279, 332, 245, 42, -215, -444, -159, -484, -77, -7, 521, 302, 140, 120, -225, -405, -212, -220, -339, 185, 150, 554, 66, 503, -318, -335, -273, -365, -125, 25, 427, 391, 62, 56, -51, -16, -337, -516, 80, 178, 450, 626, -36, -146, -29, -531, -329, 24, -80, 213, 260, 252, 363, 51, -236, -118, -191, 174, 200]
4444B00JK11k53o4K25j63l52KL5m8L59L97k9m57l29r5L6j7L86j27L47J59l35J05
4468A94l21m8k16k84K41M96K36k45K49m17k12K18J1j16J58q2L26J03ml41P5l13
4490b92J40o4m7L98N0L95l53j85l43k20J06K73J20K6M43k41j67j95l48J24L38
4511d2j18R7n9N37N0n40q3k70Rn8M66K82j69J01K5m29K39j97k56R1L12J21J83
4534B92J92l07l66j85m8J52O2M64p6J94j29k11L54n35J30N6k77N6L11L39j17k0
4556C31k19k79%k22K15J00J70L99J53k76k81l92O5k2J67K62q5Q5r3R5j37J84m83
4579b63J9k23Q15k74K06J26m57q5k44M92k51J06j26L11K66j97j91J26m64k3J62
4600a69J75j75K58J68n1k70k51J41k01O7M6M61J08M08m17m23j85J94n77N09K11
$$ y = [200, 201, 412, 159, 95, 320, 157, -195, -193, -158, -206, 153, 550, 521, 64, -265, -360, -324, -341, 45, -82, 265, 424, 89, 194, -127, -175, -391, -675, -434, 62, 298, 53, 302, -115, -327, -109, -98, -214, -56, -138, 188, 291, 287, -54, 21, -292, -152, -216, -263, 135, 185, 580, 227, 42, -301, -521, -415, -142, -22, 4, 447, 206, 39, -156, -504, -380, -42, -160, -63, -122, 415, 465, -75, -158, -428, -419, -477, -11, 271, 102, 203, 228, -201, 38, -159, -415, -324, -12, 109, 292, 484, 177, -189, -374, -422, -270, -208, 256, 180, 374, 245, 34, 388, -147, -17, 39, -238, -182, 129, 468, 351, 331, 112, -167, -167, -389, -174, -74, 96, 495, 648, 372, 91, -301, -236, -258, -91, 171, 86, 171, 78, 173, 36, 220, -263, -244, -467, 348, 74, 280, 406, -51, -136, -380, 112, -139, -33, -159, 152, 418, 221, 30, 156, -308, -331, -169, 6, -169, 89, 257, 206, -64, -315, -174, -375, -308, -262, 199, 307, 715, 298, -125, -310, -116, -693, -184, 27]
4621B7K17P5j57k24L80l58m08K7J64O8K35J54k1m05J01J69l78K20j68K81o2N05
4643D42l19J52j26r9l95m5Q3K50P7L60kj48j49m94j34K28J34J10K43j2k5K0rk83
4667a41L30n46K50o4K55K24K6K7n31j64L41k81J72R0J52J06j4Q3j40j07o89L47
4689b74J13M45j37K22J31n83k03J05J4k59L08K48m7P7O2l9o03L02j71Q1J12K11
4711A15O5O8J29k79mk50Q7k82J64O93l54R7O8k06p0j16q5L26n0K25q2k0k27QJ24
4736A44m75j34K00M65K9J53j52j59m39J03O3M0K11J47J48j89K8j07Nk52K64l64
4758b71L04K21K5j00l4j03J72l23l41L44J94pM3J1J29q2l65Q4j48K20j09J84J62
4781B10K5j02j99k34K43k08J27P8J00J22J45J64m79J2j86j86L71k2J76J02J29
$$ y = [27, 244, 319, 162, -62, 318, -40, -448, -421, -257, -189, 46, 200, 179, -226, -125, 44, -334, -114, -282, -1, -63, 442, 123, 275, 149, 50, -345, -390, -307, -57, 20, 380, 378, 230, 81, -413, -547, -319, -185, -75, 168, 156, 131, 151, 142, -141, 189, -357, -107, -171, 84, 308, 334, 361, -170, -334, 7, -274, -102, -12, 140, 246, 232, 315, 175, 68, -621, -274, -161, 284, 147, 369, 500, -83, -286, -181, -167, -426, -118, 130, 83, 160, 222, 183, -420, -118, -289, -208, -96, 115, 180, 248, 377, 98, 94, -156, -69, -351, -187, 506, 152, 249, 317, 111, 41, -75, -160, 166, 116, 341, 259, 239, 12, 20, 144, -331, -465, -265, 200, 229, 382, 230, 71, -368, -265, -202, -162, 49, 196, 344, 155, 183, 76, 81, -171, 93, -271, 33, 254, 279, 179, 145, 42, 214, -109, -450, -106, 88, 81, 124, 135, 264, 182, -183, -99, -247, -27, -136, 48, 210, 235, 133, -66, -300, -57, -265, -138, -60, 40, 162, 307, 471, -8, 4, -182, -368, 3, -19, 157, 259, 388]
4802C88n38R5l5k63j17K86K72J11O0M0l02K0p8k37K08k04J32K15K81k03j28j64
4824a61M9Oj61J66M13K5m1r4j87p0o8l08L47J14K53m0j05L63k93l19Q4k72N9K17
4848b3J19J60K51n19R8o8p3J34j95L36J70J05J02n45k06%m45O55k32n4N48m08
4870i0L19P3k59m5j41k58K67R9K64j56o7J24l40L41k38o3J70J30k69M03J80k60
4892A84j33l1%m34J87K28K94j6q8l57j42L53n09M87o3q1N93m07J46k70J24k72
4914b07M05m05J46J83p7M68k43j52q0k23M7o5J40R7K70P4r0m36J14l56L8L73j22
4937a01N88k48l7m70K98l13J11k90L96L2L55J29l74O7k04j48j13p1K04K58O7j73
4959c7N7K86k32k22k52k8N15j73J77l6J79p2j52k98q9J27N4J52K30k4j18L86q94
$$ y = [388, -150, -55, -90, -353, -470, -184, 88, 199, 259, 299, -3, 17, -61, -298, -90, -294, -162, 53, 334, 131, 3, -161, -112, -106, -267, -101, 312, 337, 296, 202, 15, -55, -123, -431, -84, 30, 283, 243, 138, 501, 208, -111, -27, -299, -240, -23, 96, 256, 507, -12, 86, 18, -55, 79, -116, 220, 390, 495, 597, 52, -154, -154, -599, 56, -176, -230, 318, -90, 229, 302, 43, -2, -143, -401, -134, -35, 229, 73, 6, 130, -210, 131, -107, -170, 0, 130, -139, 264, 444, 184, 51, 20, 20, -414, -227, 1, 295, 279, 191, -166, -308, 45, -464, 23, -40, -121, 472, 65, 211, -59, 65, -207, 198, -207, -61, 122, 45, 513, 270, 118, 38, -185, -138, -203, -63, 34, 304, 378, 288, -148, -34, -390, -352, 21, -101, 487, 239, 202, -268, 30, -283, -172, -462, -66, -34, 321, 450, 76, 143, -61, -209, -322, -393, -189, 69, 136, -37, 20, 306, 74, -148, -400, -428, 87, -86, 91, 55, 234, 162, 10, -288, -377, -250, -196, -44, 186, 162, 44, 430, -464]
4982d64M03l5l9N4K49O0r8j08l2j57J03j38n6L28j86J63L86l88p8j19oJ14J38
5005I4k90M58j18r1lJ11l29L4J47Q8j17J73O8l9J40k00Q9l03O5M0J13n2J47j04
5029A21O5M1k21j53R2J1M7%M89j42r0m73K81l35J0O88l27n6M6n9K86m72M01m60
5053b10pR2K92m4m4J30j43J84k85j72R0P3J92J0j22r1j2Q4J22l5k69K37J22L0
5077B24O0K23o29K23j79qK24J80j99O4k6K2Lk94q9j64J06o3M45J70k40N6l03j50
5101c44K74k21J55M7J83O2j48j21J20n20M87m7K10r2l6j81qL4K26k17l88L98J92
5124F5k41K77K56l01j41J84k83J30m0J12J87K28n08M0knk02L7j07N47j63P2p9
5147F3j32Q6r8m9K3M9Q3J41j28j08J39j21L6l29L83p1J72M9O4K0j37k24k90O16
$$ y = [-464, -61, -96, -135, -81, 168, 228, 130, 22, -10, -167, -64, -202, -258, 70, -116, 47, 433, 45, -33, -152, -158, -44, 94, -196, 262, 144, 53, 50, 161, -168, -134, 13, 101, -16, 157, 225, 186, 326, 126, 215, -88, -23, 17, 130, 78, 225, 121, 186, 227, 6, -147, -55, -44, 3, 3, 492, 350, 260, -213, 68, -267, -257, 431, 104, 48, 94, 35, 321, -151, 250, -210, -217, -125, 167, 123, 79, 209, 66, 250, -35, -207, -117, -44, 148, 158, 36, -55, -67, 17, 139, 104, -165, 72, 194, 224, 284, 507, -122, 101, -78, -86, 138, 318, 119, 183, 157, 179, 182, -112, -201, -365, -259, -322, 123, 293, 53, 109, -194, -344, -70, -291, -136, -89, 94, 156, 8, -113, 7, -513, -26, -73, 137, 45, 9, -172, -180, -146, 80, -137, -525, -127, 65, -176, 101, 357, 56, -85, 99, -184, -54, -94, 18, 205, 433, -75, -35, -37, -42, -244, -207, -314, 233, 70, 142, 63, -69, 17, -81, -130, -107, -58, 25, 166, 38, -70, 69, -52, -16, -345, 38, -33, 139, 188, 252, 272, 135, -89, -379, 237]
5171B37k63j08m3O8M20k56N8r0m1k0k25M23J22j6k45L60m11L65M9m92J5J5K01
5194A23j7L9J67k12P4k65J45J27J9j51M19l78j96K17q8%k67r8J44L25L02l47K24
5217C06j6m55J63J0nj04K55o1q9K89m25R3k53K33K9j96J48K52J85m20%N8N6k20
5241a67L04M1k16O8K2q9J6k22M9J92n6K6K18m4l7j82P4k97K07j49L9N6L66j23
5265I6j4k4m14M43j41j76K85j40O4J58Ok17k5O1j79L6K18r2J78r3k16L97N6m48
5289a81J83j98r3K51K62n9j99O6l8J16l56K3L10N2k49J33o9K4p5j0k47L89kO3
5313I6m1o3L33l38O6j72k01l7N30M6k10q3J21j78n3K49l91L27J99r2J15L0L7l36
5337d6j52P5k57L84M6K11k14p9j5K33k40k95J03N61j85k55R0P3K0l92N33l37O80
$$ y = [237, -26, -134, -177, -109, 311, 55, 113, 23, -18, -38, -263, 160, 282, 266, 21, 381, -30, 335, 384, -108, -93, -78, 123, 106, 145, 312, 100, 174, -91, 54, 181, 200, 49, 468, 90, -106, 111, 23, 23, -244, -342, -198, 127, 429, 82, 306, 290, -165, -2, 8, 3, -101, 154, 93, 4, 293, -132, -39, -292, -59, -30, -226, -78, 174, 359, -61, -61, -3, 53, -167, 137, 178, -38, 30, 52, -37, -21, -243, -194, -2, -58, -32, 186, 142, 105, -77, -3, -300, -93, -242, -203, -147, 219, 96, 82, 58, -356, 87, -54, -230, 55, -85, -21, 137, 143, -74, -99, -38, -217, -181, 37, -55, 123, 30, -186, 211, 267, -181, 2, -196, -289, -38, 224, 165, -34, 32, -6, 110, -246, -223, 87, 139, -110, 23, -46, -22, -97, -107, -354, 35, 33, 96, 55, -8, 325, -13, 53, -119, -320, -357, 173, 219, 9, -74, 47, -131, -184, 65, -326, 1, 200, 108, 223, 253, 290, -46, -198, -123, -380, 4, 50, 261, 47, -32, -47, 186, -54, -349, -246, 315, 130, -125, -35, 38, 58, -334, 199, -138, 542]
5360E42n57L3J45PL17l16m15J53J09j73K3L84m46O14o88N17r2l65K37j88j9K97
5382A19l4l5rl74O23o52K36J03Jn7L01j67n6j01k15O3Q0J94l69M22k30K12qj75
5406a28n4R9j5N5q3J76R4q2J03l16O6k86M31J20j53J09j5K40k65l02J16R5m39
5429d34M56K9N8R1r4m3M7j68p3J22k91P0K39J04K06l57k83J13J7J44l2K6J77j21
5453Ck09L07l72m4K48r7K67q3r6P2K90L6l24J2k03K85j31M81l12J27l61j91J46
5476a49J6L25l21M5K13l3N2R9R4k72k90M7K36j14K65k34O5J02J34m10K1K57l87
5499b39J21L96o0jk57J32o4j54O6L70l95M60j05m2k33K02n15qJ51L93L23m01K2
5522A62J12j19k84K86j48k35K01K54O8l26j25N8m0q5K41j02J95kJ68r1N2j63J1
$$ y = [542, -15, 18, 163, 170, 487, 171, -244, -91, 18, -155, -132, 252, -194, 420, -268, 249, 157, -208, 29, -159, -178, 119, 85, 50, 41, -333, 290, -362, -126, -23, -22, -79, 222, 55, -1, -102, -317, -254, -174, 20, -349, 73, -157, 55, 47, -128, -182, -83, -98, -43, -126, 50, 144, 62, 165, -151, -85, -371, 60, 180, 27, 136, 121, 361, 96, -206, -90, 5, -434, 22, 51, 109, 200, 106, 63, 110, -58, -131, -9, -300, -230, 9, 113, 319, -38, -321, -208, -191, -47, -79, -53, 124, 3, -206, 101, -271, -315, -67, -164, 103, 20, -76, -4, 286, 322, -2, 10, -193, 92, -39, 442, 130, 257, -104, -295, -149, -133, 192, -129, -84, 129, 96, 148, 247, 341, 69, -221, -174, 62, -52, 213, -21, 44, 146, 280, -130, -109, 148, -239, -118, 278, 218, 217, -40, 92, 28, -126, -60, 310, -85, 375, 270, 228, -5, 197, -318, -326, -175, 218, 541, 140, 162, 274, 155, -129, 157, 9, -226, -25, 229, 297, -29, -154, -96, -136, -221, 20, -82, 113, 111, 279, 188, 240, 77, 88]
5545H8l12k81M42j4Q9K7R4j45j56M5L73j13l85J63Kp1L95l04Q6k15L5R8J52N3
5569A46p6k07P7j41J66J12j85J15k37K14L2R5K2J8k35j01J94J02k43J25j38K36
5591I1r0J39N4l31j63J69K9J82n2P5O3l4o70L99j26O62n01K82o0O1j04k29o3j27
5615c44M09k5j73K86m02J99J97J45m46Q9K3j84M43K13k28j93K86n54j70L85q2
5636a26K28L1k24K34J78m21K09n0k67J79J6L02j61m30M95m7j62j55M8j07L24k5
5658F9L78O2m43J16k41P6M01o11J24L3K91j88N6j65N2k01O4J71J69J61l84q2r2
5681a84J97O4m0k6l54L53J62J34j78k80p9K5J99j3k3J09k46K46R2j43k08J16l33
5704d10M76k28K18J97j84k00K35J5r2P4m65J00j11N80k18Q6O9j4k32R8k77K56
$$ y = [88, -224, -505, -63, -77, 12, 39, 133, -12, -168, -123, 250, 137, -248, -85, -83, -154, 241, -63, 23, -192, -157, -59, 93, 146, 70, -137, -60, -201, -35, 77, -108, 7, -230, -16, 16, 111, 133, 151, -84, -185, 9, 111, -132, -7, -145, 91, 1, 140, 194, -137, -300, -131, -102, 80, 28, 103, 166, 132, -538, -139, -265, 397, -104, 178, 118, 179, 75, -154, -217, -344, 65, 40, -133, 153, -249, -50, 147, 292, -154, -65, -42, -226, 217, 430, 202, 9, 295, -259, -429, -44, -126, 102, 133, -91, 143, 321, -100, 109, 59, -208, -29, -13, 289, 128, -302, 193, 146, -16, -171, -123, -230, 94, 69, 447, 509, 66, 182, -59, 17, 418, -193, -69, -36, 255, 67, 123, -42, 10, -191, -127, 44, 213, 374, -10, -92, -184, 13, 77, 37, 11, -343, 10, 172, 306, 128, -152, -231, -206, -7, -20, -43, 66, -180, 66, 158, 15, -193, -77, -410, 66, -162, 56, 253, 69, -131, 104, 119, 27, 101, -364, -264, -375, 205, -13, 73, 142, 128, -104, -6, -283, -27]
5726b7L09m11L9J98K08k57j80k51J85N48l44J86k51J93j39nj53J35r6j66M07j30
5748bK60j57m02K07o7L22J3j96j68K38K8n4K2k61J06j43L26J48m8k49m1L0K03
5771A15m9L32l00l14J08K98J30M7o93K21j77K67j5O8O5j78K10Q1j13o0N5k31J41
5794HJ65K5k8m2Q4l21j4O6J32K56l63m4J08J2O4K30l48l19J06q8N47j37k61K03
5818D1j41K54K7k20j24J8j50J84L52nql64J7J77pK2m0j66K32n4J15l2q6k69j07
5843c34K91M4J33j45Jk41J03J27k5N6l00M69j51J99j01m65K38p0M9q6O3J54k63
5866b54K72K4j35O5k53K74q6n1R4R4k35r8o7M22J6l15l19L75L5M5J6M29l65p6
5890i3j07K47j51K32O1m96J17K71l0m8kj84k8K53K15k45o8j40JO9L08l03K04m49
$$ y = [-27, 282, -129, -90, 108, 316, 59, -121, -372, -187, 361, 17, 203, -48, 145, 6, 1, -152, -17, -113, -279, 128, -2, 258, 101, -301, -94, -161, 161, 174, -22, -190, 48, 76, 22, 44, -217, -111, -254, 72, 220, 172, -77, -118, -88, 115, 66, 398, 98, -216, -108, 190, 320, 367, -326, -105, -282, -15, -30, 38, 103, -75, 135, 216, 103, 43, 98, -133, 8, 173, 198, 170, 128, 212, -109, -123, -57, 75, 331, -32, -76, 32, 44, 108, 338, -10, -329, -223, -311, 236, 99, -162, 41, -100, 154, 181, -39, -163, -145, -295, -111, 241, 236, 228, -136, -119, 58, 51, 73, 33, -133, 99, 45, 160, 128, 42, -227, -334, -43, 1, 134, -11, -10, -251, -148, -21, -46, 10, -290, 179, 28, 227, 126, -339, -101, -171, -122, -208, -145, 9, -254, 18, 42, -93, -28, -281, -7, -93, -144, -50, 44, -191, -289, -356, 66, 82, -233, -552, -177, -142, -97, -81, 348, -17, -93, -200, 47, -104, 128, 189, -307, -190, 81, 51, 3, 1, -183, -211, 42, 257, 12, -56, -196, -195, -126, 182, -121, 83, -366]
5914c66K92J97l6Q5Q2k72j68Q1J19j25K86j49L1J89k47k2L9j92L2p8O26m30J6
5937a0j08o2P7K19J03l65j18j30M35K56L3k90J17l09J9K98j01m1k3j32M22j58
5959A32P5l83Q9p6M41j53Nj37m74K99K30Q2N9n3k89q0N70k9n7Ln85K59L21l74
5983a25K79j52N2j50J17R0rm00L93l55J48J61P5ok12l08O23j36j55p6K20j16R1
6006D9K41n3j23l24o0L61J48j46L9k09j06J62J82p6l73L3J66K35O3l51J60j09
6028i1O2J05j48L19j89j55J86L36k19j05r0k63K15M2K54n8k61m1P2QJ86n5m58
6051c48O2J13K05N6j33R5l44K87p0L66k60j47p6j93L08J01L11m36p3J63j84M99
6073C02n62K40J93l98N02q3j14j9k30L31j24J65l6l24J33j43k03O30r8j94o0R6
$$ y = [-366, -74, 123, 87, 172, 254, -18, -186, -105, 14, -111, 175, 26, 57, 246, -1, -23, 16, -176, -144, -222, 404, -26, -10, -118, -180, -103, 116, 219, -146, -264, -394, 41, 297, 330, 40, 157, -152, -133, 165, 64, 23, 0, -132, 290, 132, 207, -176, -87, -163, 278, 125, 130, -7, -481, -182, 48, 130, 189, 136, -153, -233, 337, 308, 251, 254, -331, -72, 249, -125, 154, 2, 54, -96, 21, 111, 102, -298, 95, -260, -112, 49, 124, 118, -94, -402, 221, 85, -70, -146, 74, -42, 49, 290, 237, 114, -210, -270, 91, 239, 93, 132, -77, -183, -21, 161, 85, -288, -255, -89, 146, 209, -142, 18, -91, -29, 76, -72, 247, 58, -97, 89, 425, 206, 101, 11, -252, -37, 5, 259, 201, -60, -101, -29, -21, 165, 110, -348, -286, -173, 32, 88, -45, 50, -294, -7, -77, 289, 29, -118, -194, -387, -79, 22, 333, -103, -176, -13, -197, 302, -260, -20, 173, -225, 277, 194, 80, 61, -169, 162, 38, 203, 167, -157, -24, -167, -370, 260, 162, -32, -92, 4]
6095Do0J34j03N6j37K24l5J09K58k54n53J89J76J59j09J57l86J76k28L33J02n1
6117A61k08m52N78m6K78l90k04l9Q9M07j49j94k03J10K23K17R4l14r5j87M88R4
6139B58k10J45l09R8J97j46j16J58l13j0L39j34N68l69o8m00J44K10L7j8j86P4
6161e1J90o6qj67k75K72Q9lK65j51q6j22J76QR6k46q5q3M91j36o2LJ7J8n3j45
6187a14L54O1m78J78j20O15m70p6p9J69J30l33M50k68k1k06K45Q8n2j0k86R2r9
6210b30L49O3l12q7j3J94j06K39j66K21k30n9K20j3j63j41L10l16K97r8j20lQ3
6233h1J61j57K60j54j3k61N80k30l7j7j57o3J59N1J32l1j04P2pj62J52j41j45
6256a93j98M61O9L1l47J79K26l88R5J79Pk44J67J30J93k72J5n34M02jK10k15k6
$$ y = [4, -56, 78, -25, 31, -106, 118, 83, 192, 450, 196, -357, -168, 8, 167, 58, 215, -171, 5, -223, 110, 212, 161, -47, -499, 79, 33, 311, -79, -283, -322, -233, 174, 25, -169, -372, -262, -39, 178, 272, -42, -137, -324, 164, 258, 48, 193, -116, -18, 179, 33, -83, 75, -238, -248, 91, -43, 525, 156, 88, -312, -168, 42, 79, 61, -125, -51, 139, 73, 65, -102, -377, -105, -16, -19, 246, 95, 9, -113, 63, 71, 167, -79, -164, -247, 244, 108, 46, 49, 66, 84, 31, -114, 240, 301, -177, 1, -119, 496, 26, -50, -129, 40, 170, -163, 287, 19, -2, -208, 37, 125, 73, 63, -223, -131, -230, 119, 182, -130, -217, -230, -36, -142, 97, -69, 152, -78, -137, 83, 70, -93, -234, 76, -240, 57, -41, -161, -164, -81, 80, -77, 183, 29, 16, -245, 335, 105, 68, 51, -106, -169, -10, 41, 173, 142, 38, 110, 103, -59, 93, -48, -193, -391, 70, 139, 170, -177, 2, 228, -160, -65, 114, 121, -123, 44, 174, 367, 95, 110, -424, -22, -23, 187, -28, -54]
6279e4mj62K85K52p4o3l51K0N89o10J57K25l15J40k43M40j69J59l55j86M89J97
6301C67k08j18k12J30J72j86l0O4P4j48j2L70m62K1O0J72L1O8k8J7k76m8J57J43
6325A18j72J88k61K19k49J51j0j04j09O3r1K61p7J76k72J09n2L26j02j77m8m6
6347a59L6k3M01k73Q4j34p9R8K2p3R8Q7j46L20L4j64n83M93j28k1K36k2j51l9
6371h6J17j00K3p5M4k19K04J70J77m52P1J11P8N7l49J37n4j10K32K23j62j96j35
6394b94K96J07J48o3l39L99l31J06l51N04j68j8j99K53K14l49J36j90R5j28N38
6415C66p3j66j04j48J1M00R6j41j80j68k79P1N90m55J38M7K09k17j37K59m9j70
6437a00J02K00J0j77m1j34p0J46L14%m68J22K38j09O4j95L2k6M35k92K80j22r8
$$ y = [-54, -58, -220, 65, 317, 243, 180, -171, -151, 438, -172, -15, 210, -105, 35, -208, 232, 63, 222, -133, -319, 170, 367, 159, 41, -171, -41, 131, -55, -85, -21, 53, -95, -107, 263, -199, -178, -118, 54, 85, 153, 125, 142, -134, -182, -25, 118, -54, 134, -127, 92, -157, -6, -16, -120, -229, -166, -257, 4, -73, 103, -169, -60, -112, 214, 112, -65, -113, -159, -123, -146, 255, -18, 66, -68, -147, -49, -27, -100, -2, 85, -61, 259, 293, 129, -454, 39, -89, -110, 126, 104, -47, -86, 31, -69, -46, -121, -77, -296, -92, 78, 255, -197, -126, -15, 63, 120, -229, -92, -146, -256, -24, 199, 37, -159, -294, 2, 109, 257, 194, -145, 254, -77, 29, -322, 182, 14, -4, -203, 50, 264, -85, 51, -139, -44, -172, 366, 293, 127, 23, -125, -114, 286, 382, 241, 61, -107, -386, -315, 275, -180, -42, 5, 214, -3, -140, 119, 70, -100, 2, 202, 212, 35, -6, -140, -210, -64, 250, 250, -218, -96, 142, 33, 97, -98, -66, -92, 343, 51, 331, 209, 111]
6460A11m27J75K03j68L3k53N4J75K88J19J06o23l00L97J60l55K91Ml38P16l52
6481A6J51k01l36M18j72j27K23o8k55O61j32k78K01J93l32oO7k2k86L88M0l03
6503a60j10M49j9R8l97q3J29J22J88n44O20n23M73k85K77j51k31J81j40j7J04
6524a9J26o6j47L3Q6K9j9J46k52K24k39J21J97k77L12o7k27M2l99L02j83J82N7
6547c8o8M1L3j25K07K08j61L5k42J04n5M8K19k0l01k37J25K99J25j35J65m78K0
6570b31P1K84p0j91J11J27L3k04R9k84P1Q6j47L58K0o6P4r7KJ72j42N7l49R4K20
6595I8J12m5j44L63l34j37l9L6oK34M1o5K6l02J16k11Q1J8J97q6K38k99o0J63
6619ej89K93m27J48N0L5J71o6lk80Q9M3J96r5K65k67K20l89J78R0n7k00K27j12
$$ y = [111, -316, -141, 62, -106, -73, -326, -272, -97, 191, 310, 416, -207, -507, -110, 50, -305, -14, -10, -348, 368, 16, 167, -34, -370, 48, -124, -251, -28, -96, -351, 310, 178, -100, 101, 294, -38, -44, 23, 1, -285, 103, 143, -160, -270, 179, 160, 258, -139, -222, -93, 29, 217, -327, 293, -230, 243, -42, 235, 84, -147, 34, -106, -123, -19, 107, 41, -106, -73, 13, 42, 23, 169, -83, 141, -98, 23, 220, -57, 255, 188, -39, 3, -396, -94, -277, -95, -38, -106, -65, -32, -157, 50, 258, 97, 132, -110, -6, -61, -13, 206, 186, -115, -352, -227, 72, 197, 62, 227, -251, -231, -160, 124, 54, -137, -26, 101, 134, -70, 29, -255, -184, -98, -245, 113, 133, 67, 141, 44, 46, 218, 76, 133, -216, -122, 98, 210, 165, 21, 384, 50, -87, -126, -90, -96, 138, 179, 114, 140, -162, -46, -257, -176, -158, 39, -47, 191, -108, -168, -5, -194, 99, -328, -180, -130, -95, 76, 10, 7, -273, -184, -141, 55, -40, 225, -42, 178, -211, -33, 57, 0, -200, 27, -85]
6643h5n8K54j72J00j36L16l75M05l12j3NQ1qK27k70R8J02r5o1j14QK36j77J08
6667F4k1j60J33l74L84o5J60j79K29j77Q7J00k92n7J6O7J44Q0j10j41J46rJ57
6690A82l8j0j10j43R6J45R5o5j96lK88m49k6M44j81q6J01q9k63Q3n7K88J93m0
6714A59k04j56J7l8L8M11m80J28j40L52m52K79J46k44O1K17l52N70n43N54j30
6735A93k71K7m5J9j80j80M28o3lP4K01k7l7mj52ok46L71j25J24K5l11J37l2j37
6760b20J56P3l9j31k2K24j79K90j40j05J00k43K58p8P1M2L1j99J45J0j44mO9K05
6784A70k64K44l13j2M65m20L8J32J52O9j13j84Q3j30J96j17L8K60k95L42m45J39
6806C5J62l05j8K89L3j00l13M21l7j99J59o4l3%M6J03j35j19O0N9r7j8j43K28
$$ y = [-85, -143, 111, -61, 39, -97, 219, -156, 249, -63, -76, -71, 10, 2, 229, -41, 57, 159, 64, 3, -111, -103, 133, -44, 64, 43, -117, 16, -358, 26, -39, 121, -58, 171, -6, 81, 181, -111, -168, -152, -85, 59, 139, 29, -112, 34, 25, 182, 144, 134, 24, -119, -23, 122, 217, 152, -44, -47, 241, -208, -234, 210, 29, -57, 44, -45, -308, -225, -282, 6, 199, 159, -45, -201, -184, -222, -184, 227, -253, -125, -265, 87, -365, -86, 60, -184, -123, 94, -258, 312, -231, 323, 193, -78, -51, -96, -77, -257, -437, -9, -72, -75, -1, 200, 173, 136, 132, -20, -26, -272, 99, -26, 98, 123, -188, -51, -83, -220, -64, 9, -30, -161, -183, 41, -138, 152, 12, -93, 7, -236, 22, -56, 15, 57, 88, -111, 34, 44, -100, -104, -35, 170, -94, 150, -163, -175, 290, -130, -92, 40, 192, 261, 148, -36, 47, -83, 113, -4, 34, 294, -1, 341, -104, 35, 197, -108, -126, 163, 196, 96, -217, 204, 167, -32, 127, 63, 30, 30, 76, 179, 44, -75, -15, 44, -53, -71, -214, 14]
6830A4J3J5l4K14r5k92JJ23j06K70k09J48QP8k34J1M3j00K83O0l48K39J9k44Q0
6855d3J9nJ78k8k25Q1M3m2j25J7J34R3k56L17m6j82K2j08K36k73L98k19L70m06
6879e0J17o9j35k5L56j4Q4j62j74mJ27J58j65k31K96k09rP5K89k79J46p6j16j68
6903b38K50L5K2k54K12j22k1J31j74J98k29K36J40r6lk0p0L03m00J77k23J81j55
6926a20K45O3l91K38J93r4k1l5j79J47r9J02R8k35M61k77k4L10j66l24L19m83
6948b72L32R5J32m3j22M2k87k52K69K26q5j37J84n3l5j17K11k24n9J11K02k21
6970a03J50j15K17Q5k42J46n50L61q2P4o3J22q6J22j84J66Q1Oj76q0J88K5J85
6993B47j14k45K11j38q9r1M52k79m1P8r4K88rL4l22R9M8o3K9j27L14j81K2p0K6
$$ y = [14, 27, 42, 8, 222, 127, -165, -164, -41, -147, 123, -86, 62, 70, 148, -86, -75, -32, -132, 151, 211, -137, 102, 121, -123, -43, -24, -29, 149, 121, -104, -23, 20, -22, -147, -130, 4, 97, -159, 158, 112, -70, -48, -156, 80, -193, 205, -14, 356, -50, 67, -2, -137, -162, 194, 180, 264, 102, -72, -76, 51, 209, 44, -187, 109, -100, -109, -34, 255, -24, 122, 46, -70, -238, 12, 47, 69, -185, 27, -95, -116, 15, -159, 39, -190, 46, 186, 90, 87, 67, -3, 300, -100, 77, -146, 35, -120, 125, 188, -203, 35, 228, 134, 113, 78, -101, 46, -53, 49, 147, -88, 373, 96, 72, 382, 216, -108, 211, -272, 60, 155, 287, 244, 122, 164, -123, -375, -106, 120, 35, -102, 82, 29, -6, -123, 88, -136, -195, -84, 118, -103, 47, -68, 149, 234, -8, 138, -412, -51, -133, -59, -122, 0, -86, 36, -148, 18, 99, 105, -71, -151, 37, 62, 247, 133, -112, 99, -39, -128, -219, 233, -46, -87, -9, -103, 185, 176, 210, -112, -13, 35, -28, 1, -126, 188, 7, 29, -41, -15]
7018a5J75N2m70O46l71n9k8p6K04K12K9m29P7N5k18Q6Q4J19l33R5N17q0l05k00
7042b33L88N4o9k16r4L53m8j1j95J5J9o2j41L42j75K49k16p6J92J05k88J61L4
7065H8k06L6r7j3N7QK42l10J37L6j48K41m3j52j00L58k72l6p5K01P1J2J65k31
7089c1J35j85J87j1m0j59L96j95K12m71K41q7n6m0Q4q1j27J12r8K1J88l0l3J75
7113A07k35k45L26j54N35l36j16M55l88J62m01J46K50j89J24K06j70j03Pk4Q6
7134D3m6j73K7J84q8J08m2l16P5J48K76p1k8j11O2m8m6Qj3N10m45j68K74p1N0
7159I9j88j19L68j60R7l28K62k84N03k67J59o5j09N6j09N1M1N7m47O19k07n6j43
7182a70N7L45Qk46J81j12l0K9k1L1kj66L12j94k03O4K30Q0l81K80o8J41l23J76
$$ y = [-15, 160, 212, -258, 388, 17, -42, -70, -146, 58, 270, 299, -130, -53, 2, -216, -130, -46, 73, -260, -165, 352, 272, -33, -233, 155, 209, 140, -76, -170, 183, 135, 124, -71, -56, -37, -99, -240, 102, -73, 176, -40, -116, 76, 181, -107, 54, 88, -118, -82, -179, -192, -135, -127, 115, -195, -58, -22, -170, 71, 28, -124, -224, 134, -138, -174, -249, -48, 23, 35, 200, -31, 104, -81, 106, 95, 55, -104, 292, 97, 309, -162, 79, -8, -64, -104, -20, -101, -228, -116, -214, -193, -5, -35, -68, 107, -128, -373, -47, -201, 334, -2, -118, 337, -51, 111, -290, -144, 106, -83, 41, 247, 77, -26, -19, -43, 43, -3, -176, -149, 35, -53, 55, 13, -303, -228, -80, 196, 125, 97, -14, 48, 0, -46, -38, -51, 459, 14, -154, 120, 49, 99, -89, -208, 160, 0, 97, -231, 31, -253, 250, -17, 142, 77, -32, 24, -85, -34, 7, 64, -383, 236, 29, -27, -170, -113, 232, 240, -6, 175, 63, 33, 62, 41, 72, 70, -96, 216, 22, -181, -117, 113, 193, -188, 92, 24, 165, -158, 18]
7206A8p1O7J28Rj23j59N3K83k42K23%k1l93K00P0n6J89K7l7k9l13O9J78j70K07
7231A07k94J40J05J09l9j46l4j89O7M14m32J29j34K17O1J40p3j52j96J26j08J03
7253g9K08l23j33L78R2oj69r5L27j16Q8l6J8q6J93k56K42l52J0L00l12M50k12
7276A31k18K6O6J9j63L47k00J7j54K05M3j84J85k3k58L85n84K22N82o06O2P8Q1
7299E9j70j07L09M0k52J80N5J22j9l83N2J88l80M59J31l06J10j9P6j07k21J65
7321a8P0j66K93k35K49j76J18k2j69m6k21L8N78k99j4L46m85K11k15J21J90O6
7343B14l9j87j5J13k57J35O7j04o7K19j09M7j74R1j29L24o6M6p1l7J64p6J22k75
7367f4J41j15r3K43l96M44l88M44k82J26J87k65O5k25J51PJ16j50o4K35k25j9
$$ y = [18, -53, 14, 142, 151, 28, -131, -78, 205, -37, 186, 186, 165, -228, -28, 42, -14, 175, 202, 165, 136, -177, -108, 70, -100, 107, -187, -47, 58, 167, 128, -18, -52, -241, -174, 240, -192, -63, -197, 20, 81, 221, 148, -4, -200, -74, -182, -79, 129, -194, -327, 51, 143, 137, -32, -127, 200, 84, 172, 136, 154, 68, 261, 5, 247, -105, -95, 205, -107, 343, 131, -87, -61, 5, 24, -139, 208, 8, 25, -129, 76, 119, -65, 120, 97, -161, 224, -360, -138, 444, -162, -100, -22, 59, -111, -218, 91, 131, -121, 59, 114, 236, 217, -166, -114, 74, -306, 153, 284, -22, 88, 69, 145, 38, -183, -18, 52, -114, 179, -56, 193, 17, 135, 113, -56, -102, -323, -285, 293, -6, -20, 326, -159, 52, -163, -42, 148, 214, 175, -12, -27, 86, -171, -36, 31, -73, -140, 79, -30, 17, -157, -66, -195, 129, 63, 109, 38, 1, 165, 89, 211, -64, 77, -38, -131, 112, -284, 160, -228, 216, -66, 60, 247, -18, 47, -178, -27, -20, 96, -54, -118, 117, -108, -127]
7389a27K09k14N6K16j67q4J70o8O5J0J72l13m8J82PK3j20K75l51l7j58L45j27
7412h4K61j23j52k28J98L22k09L49m14J47k08J13P4j0k8J3M9O6k35j69J65k8J36
7435EJ00j77l3Q6m8k6K27j82Q6%l59K29J7L32j80k12K36l22M23P5k80n3r1L4P4
7460c9jJ67J40l13J22jj10Q3q5L13n27KJ52Q1j33K46p2J67MN4l88j49M85k56K23
7485A65j98J8j85K20j31J74m4r3L71k54m0j66K08N3k38K18J49O1K6k76J07r1%
7508E4Q1j11q1n9j8J63j56MOJ11J30j73j0K8Oj18J98K37j1N3n77J44J51N9j25
7533a4J59j46J16j37q6l4K83j84L12m15J27K04j40j83L49j71QJ13r4j29J79k11
7555i4K21j73p3R3q6K46k19j50j97M23J73n1n02M21j5j40Q2K02k45K26n1k72R0
$$ y = [-127, 82, -132, -76, 140, -27, -111, 59, -9, 56, 66, 238, -75, -123, 59, 66, 89, -31, 244, -107, -144, -302, 43, -84, 177, 54, -98, -326, -128, 194, -15, 334, -80, 67, -141, -28, 46, 36, 8, 21, 70, 136, -99, -268, -103, -131, 5, 105, -72, -105, -19, -67, -93, 134, -48, 38, 38, -321, -92, -75, 257, 77, -135, 101, -221, 202, 277, -3, -56, -147, -113, -39, -40, 127, 267, -46, 76, 75, -35, 48, -37, 276, -251, -249, -97, -16, -149, 97, 25, 192, 196, 250, -138, -287, 198, -58, 165, -33, -15, -200, 20, -111, 63, 19, -74, 297, 43, 3, -163, 45, 98, -140, 78, 227, 288, 314, 38, 145, 54, 54, 135, 24, -57, -116, -134, 29, -127, -123, -117, -6, 124, -49, -59, -31, -25, -143, 55, 292, 281, 334, -243, -99, 52, 111, -14, 145, -1, 115, -22, -108, -142, 141, -43, 269, -146, -19, 185, 45, -138, 211, 40, 48, 161, 67, -62, 117, -94, 127, -46, -119, -26, -112, 134, -85, -235, -432, -9, 164, 113, -389, 32, 17, -123, -41, 161, -84, 142, 91, -181, -91]
7578i1J18n5j44K32j98M2K67p5j48m27K50K65kl8k91M7K03j85L32l73M73j94J53
7601A61j64oK00qj29j10o9o8J49j33J70j15K4m6O7L07m43L69m1l11L26j62q1K23
7625A10J03l72K79l51J76j23O6J56k2L28n24K34r4m4K55k12j84O6O4l6J2p8L32
7648A41j37nM3R4p6p8p5l8j57J81M1P4mO4j37n3O1j04J97J23m33L45j04K91l42
7673h8mL30k86o6k36L37rJ00J45n65L79K02j77n2Q4L3j71M0L7l2L9J07k83l4K50
7698H0j71L51k15P9p1mK2M5j82K31l65l5J82O6j92L38m2j08L6j64Q2j04J68K9
7722E6K3k66K15j38J92J82k76J14j85RJ09k03J73p2m5K94k3R7l68q0R4l01N81
7745A82j50k77N14n64N12O0k25m5P3k7l5P4n6k28J27K2K2J94j2j22J78k29j47
$$ y = [-91, 27, -28, -172, 60, -138, -96, 171, 96, -52, -479, -229, 36, 34, -4, -295, -248, -45, -230, 102, -271, 202, 8, 161, -3, -9, 191, 183, 54, -56, -125, -193, -44, -177, -7, -122, -98, -144, -77, 230, -213, 156, 115, -196, 130, -32, -113, 110, 213, -159, 120, -231, -55, -178, -112, 44, 22, 350, -174, 60, -34, -78, 177, -35, -219, -153, -89, -125, -113, -191, 141, 4, -1, 42, 136, 60, -18, -93, -131, -288, -107, -66, 8, 4, 68, -69, -122, -61, -165, 32, 155, -278, 67, -37, 254, -88, -92, 238, -48, -114, -350, -13, -22, 78, 223, -342, 37, 239, 62, 10, 94, 127, -44, -4, 33, 1, 40, 147, -136, -170, 80, -91, 260, 45, 124, 53, 49, 71, 116, -66, 165, -200, -235, -53, 13, -179, 159, 117, 9, 45, -119, -37, -141, 27, 56, 79, -187, 28, -110, 82, 264, -12, 102, -83, -74, 35, -168, 5, -67, -112, 182, 159, 256, -112, -192, -98, -399, 182, 32, -245, 269, -295, 217, 277, 52, 7, 80, 53, 18, 92, 36, -192, -65, -43, -21, 173, 161, 39, 217, -12, -159]
7768a59J88j92M68k62k3l08L99K2k24q9K39k71K12J84k59M8P7j11J6L35j84Q0
7790A86r1j61K45l55N6K37o2J58l32J64N0k84R3K5J57n6r4J53J12j49m2J7r2j
7814f6J33J02j37K74k15k46K46r5J50j28K21m16J73q1k84N79l12M2j5kj95N13
7836B41m87J46J79O6l7j87K34j23l9m5Q2k00J34O0J40k1J90n82k8M16l0j5j28
7859c4O1l04M14r3l2k12J04O7K49k26K3J75j75j00m5K39j47O3k7l31KL11j25l01
7883d44K01K95n7O5J43l73K35l09L18j18P4k38M6M67k17O2j45l70N6L85k59J42
7905d1j19m7J68L21j50j39J02o9m9J35Jj51p9j08K50L27k93o4J92j97j39M3N9
7928d7K14k19NJ49Kj30K3K15P2j44l24K96k75K40j44J16j38n4M78j39k56q6J61
$$ y = [-159, 29, -163, 305, 43, 20, -288, 111, 133, -91, -180, 59, -212, 0, 184, -75, -27, 50, -61, -45, 290, 106, 186, 95, -66, 179, -176, -120, 117, 55, 213, -119, 45, 95, -189, -96, -71, 86, 30, -64, 89, 201, 52, 10, 27, -65, -66, 67, 169, 32, 306, 91, -155, 91, -4, 146, 18, 239, -177, -4, -85, -369, 210, -102, -60, -75, -77, -272, 241, -246, -100, 79, 145, 108, -79, 155, 32, -7, -52, 30, -170, -36, 24, 164, 143, 333, -249, -277, 139, 109, 94, -34, 27, -277, 137, 44, 12, -200, -96, -29, 220, -6, 17, 192, 17, -83, -128, 111, -36, 27, 0, -331, -329, -18, -143, -444, -243, 52, -5, 60, 203, -170, 65, -244, 74, -44, 30, -208, -162, 305, 88, 150, 5, -365, -309, 76, -183, -41, -160, -207, -39, 282, 132, -7, 95, 26, -23, 112, 113, -38, -117, -225, 25, 352, 59, -5, 187, -10, -149, -106, -47, 167, -52, -47, 102, 104, -26, -3, 212, 284, 140, -184, 112, -163, 77, -67, 49, -89, -143, 335, 196, -60, -146, 15]
7951A5M3m0m7k65L07O7k33J86j15J12J93m28L16o1p8j34M14q5j78K02j21Lj79
7974a06J24m9J23j09J05J03k15J51Q7k31j47Q2m0J15j27K24j01J5m4j16n5K43
7996C2l84M86k48k44J62L35k71M8o7J33K08m06J90L7O4j11P3j69M49l00k17J24
8018g6K4K19m22K49J66j55M2r9J5J17r9k37m7O8M02j18K8r7J19P9j14pj83j44
8042b70L90j20J17j78K99k73L2lQ8l4M0o7K3m8k0j68J28r8Q0K04l56K63J23k75
8066a23J4M7k85N64j22l07P5J59K77J63o78R5K25j72l9o2l8M98m95K26p6J35N1
8089A32J06n61J47n6K80J39j31k0r5m10L62K80m95L31L6j72%J91J27k09p1RK92
8112B12p5J8j75J30j97P0j0j90k4K69J75p4j19j13L01j74J02k0k14O0j31K92N7
$$ y = [15, 58, 18, -29, -294, 13, 80, -153, 33, -82, 30, 223, -205, 111, 50, -28, -162, 252, 167, -11, 191, 70, 73, -106, 18, -31, 92, -17, 88, 191, -24, 127, 214, -17, -164, -82, -122, -7, -134, 90, -11, 4, -40, -156, -211, 32, -352, 134, -114, -358, -196, 139, -132, -84, -151, -18, 190, -216, -26, 11, 75, -36, 37, -132, 317, 17, -200, -76, -52, 167, -255, -6, 160, 5, 47, -52, -37, 80, -19, -256, -303, -235, 167, 49, 77, -20, 99, 178, 64, 57, -126, -270, 120, 0, 117, -61, 238, -35, -3, -6, 82, 48, 88, 21, 44, -4, -24, -192, -64, -162, -82, 122, -234, 29, 152, -123, -109, -62, -347, 217, 95, -212, -137, 22, 299, 462, -216, -121, 104, -68, -107, -169, -207, 291, -204, 22, -54, 81, 132, 238, -323, -176, -232, 48, 187, 56, 36, -59, -469, -107, 173, -322, 9, 45, -127, -127, 64, 191, -18, -89, -80, 212, 137, 155, -20, 110, -87, -17, -27, -217, -241, 28, 203, 129, 10, -103, 198, 24, 126, 106, -108, -48, -179, 113, 170]
8135A70j24o9R2j32k6Nj87K91p7K2j71K77j04J92l01MJ38j32J07j2P6K80n41L28
8159A06M4j01rp4r4R3k5K09q2j08k5J29k0j72K87l19K28J07m22K3M98k31l62L22
8183Bo2k27K39J3N6k6M5p4
$$ y = [170, 46, -23, 69, -63, -89, -84, -271, 20, -57, -35, -206, 71, -33, 159, -142, -138, 0, -132, -25, -37, 39, 319, -222, 106, 150, 49, 40, -34, -128, -35, -60, 149, 67, -41, -66, 63, 43, -129, 158, -161, 67, 174, -248, -225, 273, 42, -320, 2, -60, -287, -48, -35, 21, -5, 40, -34]
8191c4
$$ Imaginary data points
##PAGE= N=2
##DATA TABLE= (X++(I..I)), XYDATA
0@%%%%%%Qj6J6j9K7l2M0n4O3p3R0j07J29j55J80k10K44k83L27l73M26m86N51o24
30c31P02p88Q84r90J108j234J373j527J693j877K081k304K549k821L127l468L852
47B029m286M782n361O039o849P836r072J0672j2831J5935k0802K9589n0491J89784
61A56974K17747k45862j21622m0397k2402o5489O7201J12320N8672R072O9876
72A96090K8137q9529j53265r0853l4562M5170J38785J55000L1479n7775n0799
83A17878n0197r8291o1946K6260L2354k29Q3641J67996O1625j32418j60882o6017
95h0226k8758k1322O1828J26927P5093N723M079k1254j03693j21327l9342K2777
107a19495L8540Q4997J22822N2874o0786q7226n9734o6489n9469J4839P5389O9001
$$ y = [0, 0, 0, 0, 0, 0, 0, 8, -8, 8, -11, 16, -16, 24, -30, 33, -40, 50, -57, 72, -83, 97, -113, 131, -152, 175, -198, 228, -258, 293, -331, 371, -417, 467, -523, 585, -649, 724, -803, 890, -987, 1094, -1210, 1339, -1482, 1645, -1823, 2029, -2257, 2525, -2836, 3203, -3646, 4190, -4882, 5790, -7041, 8894, -11908, 17681, -32810, 156974, 374721, 128859, 7237, -33160, -55562, -121051, -53850, 58470, 117142, 126214, 196090, 224227, 134698, -18567, -109420, -143982, -98812, 39973, 194973, 226452, 168677, 117878, 67681, -30610, -92556, -66296, -33942, -34171, 49470, 217466, 279091, 146673, -14209, -80226, -108984, -130306, -68478, 58449, 133542, 139265, 143344, 122090, 18397, -102930, -142272, -119495, -80955, 4042, 126864, 179738, 118952, 31726, -28008, -94497, -153966, -139127, -63738, 5263]
119E263O2001O8728L306j07790j24568m6489O70M454M7701R5809O8190Q499n042
132H0732k6521j02998j31882l6328P4877R4721P0398O2143K3761n5590r2567n8387
144i7641k3095k0388p72N0294Q8536Q5557M4669l5793j13728j17094m1274L2703
156a48026N8763O3804O0366K9996q560j7344k3021o3649r4989m6881N1731J12269
168b5541R9687M8160j3092o9606r1580o0560o516K6075L0475L4557N4419O5931
180I2409L4826l6308r6575j01171m7880K5604Q2575R4326N5469M94k9774l6130
192C7865m1317m9330l9516p607L4701P6871R1865N0527k7670q0769q0417n0865
204h5662j1537L4580O0467N0745L3026L0293R733m5995q5876o9457k2026K3389
$$ y = [5263, 67264, 135992, 139298, 31508, -93060, -139549, -138879, -134425, -86724, 9085, 77275, 85774, 80732, 54211, -48787, -180669, -216997, -142120, -47399, 22999, 85142, 108903, 53313, -39254, -97641, -120736, -141124, -141896, -91602, -3066, 82491, 127160, 91367, -22361, -139455, -180729, -148026, -89263, -25459, 34907, 64903, 56343, 38999, 15978, -47671, -142660, -189541, -137810, -25541, 74146, 122306, 109214, 39608, -51972, -112532, -119048, -92973, -62498, -27941, 26478, 92409, 127235, 90927, -5648, -106819, -154699, -129095, -46520, 47806, 103275, 103769, 73995, 37865, -3452, -52782, -92298, -99905, -65204, 11667, 103532, 154059, 126389, 45620, -34797, -85662, -97199, -62619, -2152, 48593, 81619, 111912, 121645, 75650, -10226, -79683, -101709, -78320]
216g8320O7369R0277N5933j2070m3345l9103m6411n6663k4645K9952N4903N8647
228E6524O1468L1737m0839q7846o6838k4634j416K7843O1039N6482K4790R268
240A07578m466n2915r0681n7761R783M5200N8899P1123M3322k6124o1320l7751
252D887k6462m4375k5607L6188O7487N4085M0362J7909m8105r8907o7753K85K6892
265f3114L0852N0457N2278J2879j5785j4674l8603p7825n8766J8213O6036O2708
277B4656N2716K9396l2260p5846m9738j0140j3508j3989L3170O8218M7781J7691
289G8147J674m1262r0755p0349Q061N1112M2442L9799M2267Q043l2471l4378l0634
302b8304n0434m4302J9502P3221O5865L5895J0038l2901p2728n7006o158J1945
$$ y = [-78320, -10951, 79326, 135259, 123189, 79844, 40741, -5670, -62333, -86978, -57026, -2123, 56524, 117992, 149729, 108890, 21044, -45794, -70428, -71844, -44001, 17038, 73520, 98310, 107578, 103112, 50197, -40484, -98245, -88462, -43262, 15637, 86760, 130082, 103958, 42638, 4887, -21575, -65950, -91557, -55369, 12118, 66203, 106565, 124474, 76369, -22538, -90291, -90006, -63114, -32262, 18195, 70473, 83352, 67567, 52893, 14290, -63535, -122301, -104088, -38052, 24656, 77372, 106768, 74508, -1338, -51076, -61216, -74724, -88713, -55543, 12675, 60456, 78147, 79821, 38559, -52196, -122545, -114484, -63372, -20930, 18869, 61136, 69179, 36708, 2330, -28304, -78738, -123040, -103538, -30317, 35548, 71443, 81481, 48580, -24148, -81154, -87312, -75367]
314g5367N966K9637O0690M5121L231k0129m2389p1915n8237J1553O3658N4985
326F804L2214K2980m42l5988m3090k8449k8259k4846K0270P0851O8491K6139j0548
339G6127m0979o5734n2938k220L0555K6481K7339M2796L4246l024l1640m4429
351c420n5249m2496J3238O6142O5232K9879M555j5144l9675m6501k6433p632n94
364e8098K2927N5947N8704K0527k3181m7685n6944m2935k261L5485M3134L4785
376D0405K8210J4418j4209l9068m5747l9129j8326K1119N6446N6489K7173m202
388H3579k5949m1867m4125k5873p85J8518L5361M9412M0489M226l4679n2104m5787
401c9584k4504O865L3200M0727L4475K1281L614k0692m3420n0736l3280J566L8573
$$ y = [-75367, -69401, -39764, 20926, 66047, 69278, 49149, 6760, -65155, -123392, -111839, -48181, 6804, 39018, 61998, 61556, 25568, -17522, -45971, -74230, -99076, -78806, -7955, 60536, 86675, 76127, 35148, -30586, -83524, -85744, -55189, -28708, -1369, 41427, 75673, 72649, 41009, -3420, -58669, -101165, -87927, -21785, 43447, 73326, 77881, 62737, 23062, -23439, -49872, -57504, -58098, -35171, 20776, 79480, 100007, 76826, 29141, -27803, -70738, -72999, -37514, 5620, 40405, 68615, 83033, 68824, 29756, -15991, -55120, -73446, -52327, 4119, 60608, 87781, 83579, 57630, 15763, -28362, -54235, -55020, -36502, -1141, 48271, 88760, 92986, 58307, 6203, -39584, -64088, -57223, -24023, 16704, 51179, 72460, 76074, 55382, 11962, -38774, -72054, -70488, -31915]
414c1915N6320M4194J2372j9026l5652l7084k9354j5229L69J9324L9291M6792
426E0402L1633m712m3166o0768m5335o751K8287M1195L4545K0946P023p850k1954
439B3495l3607m0363l0568K538M4197O1812M2356M025l1209m9280m2500j7439
451f6543O829J6950K0925K9171L2149J9748q055l6662n3357m5637p632L6287N4554
464a273M1257J4204q823k4935l0939k7299j9275j0161R053L5835M8268L4415L731
477F4058k7653m9608m7409j9236J6236L2874L2760K9025J9590j250k3332l4256
489h201l4876k5979j628L0975M8694L9312J3163j0947k9144l8607l2663j3318
501f3219R091K8048L9533L5395J3883j2864k9022l5914l1882j4223J2974L2239
$$ y = [-31915, 24405, 68599, 80971, 61945, 26293, -10791, -40145, -55374, -55005, -35681, 3610, 50402, 82035, 77323, 34157, -26611, -71946, -78697, -50410, -9215, 25330, 46276, 53299, 45449, 23495, -10112, -50475, -81043, -78505, -34308, 27504, 69860, 73885, 42676, -6604, -49104, -66543, -59714, -42764, -21839, 7332, 39481, 59229, 51174, 14512, -38845, -84482, -92114, -55827, -1273, 39984, 54188, 45365, 20430, -10509, -37808, -57083, -67244, -58191, -22356, 25912, 60327, 64058, 36405, -13203, -60612, -79848, -63612, -30738, 2022, 31047, 50637, 49387, 26055, -8201, -43077, -69056, -70684, -39709, 8985, 48297, 61460, 50513, 21369, -17238, -49901, -63219, -54128, -26080, 13453, 48848, 62731, 49867, 20845, -15069, -46951, -61174, -48200, -15961]
513a5961L5537K9125J6283o676l3675m5099l3389p365J9810L7697L9203K3260
525E8750L30j6969k5620k9331k5786j3371Q133L1584M5699L7203O345k8718m4646
538C603l6527j6248N509K2314L0373K5642J5256M796p672k4374l9663l6058j0171
551f3220K5495M8960M4026J6668j5067l2198l2917k1405q715J477J1690K3692
563a514L2565K8860O940k4761m5954m2931j7168J4261L5027L7101K4987N030j4407
576C8036k3248k2244k0792j8490o094J9100M1038M0342J6389j4694l6900m0441
588b7998k4281j764J5402K4664K7608K3003Q838q574k3604l1926l0277j3832J2508
601e0233L2909L7030K6552N051j9346l4616l1830j5581j531J1575K5295L2363
$$ y = [-15961, 19576, 48701, 64984, 58308, 24633, -20466, -53855, -61220, -41410, -3713, 35490, 58750, 59080, 42111, 16491, -12840, -38626, -51997, -43864, -12280, 33419, 70622, 76967, 48249, 3603, -32924, -49172, -43663, -21349, 9024, 34666, 49922, 54718, 47046, 22672, -16991, -53049, -63220, -37725, 11235, 55261, 71929, 56862, 24664, -8253, -29658, -38373, -36896, -25206, -1514, 31051, 59911, 66851, 42090, -3864, -46795, -63963, -49702, -14675, 22426, 47413, 52443, 38036, 14788, -7456, -28248, -46738, -52832, -33732, 7306, 47648, 64037, 49343, 12443, -27998, -52279, -54043, -38641, -13977, 13631, 36634, 45472, 36898, 13294, -18632, -48909, -62741, -50233, -17324, 19706, 46258, 51309, 31963, -2653, -34483, -50064, -51595, -40020, -14725, 17638]
613A7638K4695L825j6917l0300l2297k0684o29J7833K7144L0509K4432L328k2274
626B6303l4963k9875j4505K859J9943K9934K6925J4952K55j6445k9314l0410j7542
639e1883J606J9571L2194L4272J8991q397k9936l3351k1998n843R507J8478K2610
652E821K3145J7212J658k0370l4917l2500j3724J1636L0760L4590K2753L178j3867
665C5375k2775k4115j8887p255N089J8529K8251K8723J5400r031l1577l8899k4307
678d5479J511K2201K6966K1380J4054M332q973k0865k6341k1805r825J0126K9231
691c487L4730K2316m2k0885l1187k7047j1667L519J4130K1813K3951J6902K061
704D5107j2347k4868l1123k2831Q76K4519L0653K3182J1317l879j8789k7255k2583
$$ y = [17638, 42333, 46158, 29241, -1059, -33356, -54040, -54669, -36836, -9692, 20817, 45249, 48577, 26303, -8660, -38535, -53040, -50181, -30238, -304, 26621, 41573, 41828, 25383, -3931, -34341, -51883, -50277, -30706, 1488, 35760, 54751, 46354, 16418, -16933, -38931, -44774, -35267, -16789, 5821, 28966, 46178, 47836, 27466, -7451, -39951, -53675, -42039, -11279, 23311, 46064, 49242, 35375, 12600, -11515, -30402, -37657, -32568, -14039, 14212, 42935, 58335, 49304, 17727, -21172, -45479, -43968, -21767, 5199, 26579, 40633, 44965, 35992, 15127, -11214, -33019, -42844, -32718, -3487, 31243, 53559, 53517, 32632, 1445, -25602, -37269, -33750, -19620, 2193, 26144, 43046, 45107, 32760, 7892, -23231, -46062, -45186, -20667, 9986, 33168, 44485, 40606, 21817, -5438, -28021]
717b8021j1635J570J6173K6923K4977J2311l161j8189k9968k8184r321J0256J9182
730a7087K3064K3940J3038r598k3614k4044k0267j2204N893K4815K8099J7482
742B9517O431n007k1259l0483k0220l745P531J9351L0072K3813J098j6429j9268
755A402k0216k2278p623J6022K4602J9245J6381R879r201k8126k8370j4514j404
768d4201J2173K6711K6632J1723k366j0207j9664k7110j6462L059J4286J8656
780f770K5774K2526j350k3682k5147j6874j2081j204J7928K6995J8917Q012J692
793C4736j1408k6175k5268j0435M054J6006K6830K6320P228j0967j5984j8194
805c257k1249j2844Q317K0412J8906J7908J5648k403k5193k8823j5488l581N380
$$ y = [-28021, -39656, -38086, -21913, 5010, 29987, 42298, 39137, 20948, -9020, -37204, -46525, -36269, -17087, 5977, 29917, 42955, 33357, 9743, -14301, -34568, -46772, -40879, -16064, 12035, 29517, 35948, 30941, 9682, -20801, -41021, -44766, -37235, -17884, 12188, 36001, 37099, 20670, 1402, -18814, -41092, -48715, -32693, -8091, 11154, 27535, 37414, 28213, 87, -28283, -42797, -44201, -32028, -5317, 21315, 33038, 30672, 20465, 801, -26309, -42771, -39712, -25426, -6770, 19004, 41530, 40180, 16498, -8649, -25523, -37604, -38808, -20880, 6115, 25032, 33044, 34736, 23328, -2847, -28115, -38550, -34496, -18490, 8340, 34660, 41888, 30921, 14937, -3257, -24506, -37350, -29033, -8621, 10285, 28193, 43841, 41438, 16245, -12578, -28066, -31647, -26267]
818b6267J9450K6930J6466N30o437j3086k3299k2666m773J0710J7326K3078K2128
831D0090O472j6778k3771j8142j2890n484R590K2658K0326J1274N456n688k2512
844A0601k7166j5161R72J0936K0838K5622J3935n338j5751j6323j8624j5168q81
857c1508J4888J9723J7311J4480L045j4949k6293k1211r125K158J4572K2625J9592
870B5308P377m461j2989j9850j9745j0410L844J3229J9870K1385J1673n899j9319
883A0013k1593j8060q230O269J8851K0952J4221M778m608j5018k0828j7146o739
896c7138N442J6097K2187J8337O031q942j9957k2130j4670j878J0350J6695J7870
909H294J3560L858p170j6108j9762j6399n487J0089K0448K2240J4589O67j3675
$$ y = [-26267, -6817, 20113, 36579, 37109, 30672, 17586, -5713, -28379, -33152, -22442, -5116, 17962, 40090, 46562, 29784, 6013, -12129, -25019, -30503, -20913, 1745, 22071, 33345, 38801, 33113, 10601, -16565, -31726, -30754, -19818, 1020, 26642, 40577, 35239, 19488, 3165, -15459, -30627, -31508, -16620, 3103, 20414, 34894, 37939, 22990, -3303, -24514, -33639, -31481, -16909, 5716, 25308, 32685, 28224, 15235, -4615, -24360, -34770, -30926, -17697, 2173, 23558, 35231, 29332, 10013, -11580, -29640, -37870, -31601, -12750, 8202, 22423, 27201, 22593, 7575, -13253, -30399, -37138, -31696, -15599, 6588, 24925, 30956, 22014, 2057, -20073, -34743, -36621, -26271, -9576, 8294, 21854, 25712, 18542, 2434, -17328, -33727, -39214, -29125, -8677, 13563, 28152, 28819, 15144]
922A5144k0402j7698r543N38J0557J6829J6828J1503L351p960j9348k2458j2779
935c5438J477J3474K0882K0824J0089n944j4800j5955j3921r733P10J3042J7631
948B338J5680J1617K882j4410k4041j9237n812N589J5420K0962J6741K620p449
961B2900j0564j4434j6485q383N468J3009J6591J8559J1683o585k1239k0128j1645
974b1253m380O513J9076J9326Q275M77k178j0550k0022j6428l149O939J3805K0108
988A6559J9079K458j4602j8658j4928j1335j717J2017J6776J1701Q142N876n179
1001B6189j8308j8827j0946l050P128J9975K3491Q711o602j2166j3528j6594j0208
1014b4735M059J2364J0410J2217J3696L189j3392j9858j5377r987r32J4896K2635
$$ y = [15144, -5258, -22956, -32499, -31961, -21404, -4575, 12253, 23756, 27107, 19147, -201, -22659, -35438, -33961, -20487, 395, 21219, 31308, 25364, 10564, -5391, -19312, -29045, -28335, -15293, 2338, 18018, 29635, 32517, 18107, -5934, -25171, -30983, -25394, -9974, 10988, 27729, 30349, 22900, 12336, -2098, -18583, -26966, -21498, -8489, 8102, 26661, 38344, 31759, 10520, -9608, -21253, -25633, -19120, -44, 19282, 27557, 28034, 25856, 15306, -4716, -21144, -24293, -17354, -3549, 16559, 35638, 38096, 23494, 4836, -10092, -21427, -23144, -11127, 5649, 17350, 25492, 31368, 26189, 7881, -10946, -21892, -24942, -17814, 2161, 25652, 34363, 27761, 15595, 2067, -14527, -24735, -20676, -8312, 2098, 14315, 28011, 31200, 17808, -2050, -17427, -27414, -28346, -13450, 9185]
1027I185J4192K050n082j0035j6796j4538l519L223O789J3798J8817R971o065
1040B1990j4464j6508j6213r450Q247J9430J5838P321L289l002j3239j6656j0126
1053b3543l766M54J0561K0471J6834K793r086j3998j8080j4506J71J2030J3895
1066e770J1663R327L611p400j3048j2605j1289o362N599J8673J9238R779j051
1079B0365q429j7123j7166o188M625Q165J0905J3882J0747K29q932j2265j4660
1092a5845j2129j236J2845J8735J4762O818k752j2520j5964j0917l340K122P862
1105a1559J3711J3748P839r91r124j6191j6149o775N749J3951J5595J2755M294
1118B6853o499j3005j2185q478m407J918R621J5744J3399N776m187j3263j7034
$$ y = [9185, 23377, 25427, 20345, 10310, -6486, -21024, -24543, -21320, -14531, -733, 18084, 28055, 21990, 7526, -8982, -25195, -34645, -26398, -6968, 8870, 16191, 19480, 16478, 3239, -13417, -23543, -27309, -26855, -16294, 4177, 21011, 23804, 14718, 720, -17360, -31866, -31695, -19665, -5770, 5893, 15220, 18831, 11431, -1617, -14222, -25511, -31873, -26274, -7601, 11637, 21416, 20365, 11936, -5187, -22353, -28541, -23916, -15751, -4846, 9036, 19783, 20012, 11080, -1185, -15845, -27974, -29210, -16365, 2370, 17132, 23950, 21198, 8678, -7286, -18203, -21543, -19421, -11559, 2152, 15900, 23739, 22748, 13624, -2567, -18716, -25491, -19742, -5791, 9804, 22559, 26853, 20354, 7349, -4836, -13314, -17721, -15803, -6182, 9562, 22961, 28737, 24550, 11287, -5747]
1131e747j2526k455Q383J3933J3991R068Q69o317j0644j2309j0291l587N062J1865
1145g05J5477J1992K754q482j6093j4898q016J649Q427J2022J1380P642R94o733
1159A7410j2062j3294r756j575P590J4545J5096Q097j826j1174j4784j2215m835
1172a8783K653Q139J0866J1149P430o42q860j3473j3510q332J859J2202J5226
1185E924J0758L520l631j0110j3783j0464l448L136Q424J1754J1303O123l194
1198A6312j0546j5013j2728m110P290J2222J1821Q422L460m982j1447j2012q330
1211a9641l086K462J0464J4793J0363K163n995j1844j4065r555k28Q045J1541
1224d583J0921P917O57o171j0015j1525r086k795P861J3548J2215P022R05p486
$$ y = [-5747, -18273, -20728, -12345, 1588, 15579, 24647, 25516, 19199, 8555, -3754, -14045, -17632, -12570, -705, 14772, 26764, 29518, 21036, 4943, -9955, -17971, -16322, -7895, 4127, 15507, 23149, 24143, 17410, 5348, -7946, -17702, -19277, -11687, 2858, 17954, 26051, 24225, 13051, -1733, -13948, -18783, -16130, -7991, 2875, 14024, 21454, 20812, 11952, -1521, -15031, -23363, -21504, -9302, 5924, 16682, 20202, 16571, 6461, -7322, -17786, -21234, -18098, -9674, 2080, 13383, 19506, 16312, 5766, -9247, -21975, -26085, -18795, -6573, 5248, 13670, 17130, 12148, 701, -11311, -19641, -22727, -20265, -9801, 4992, 15355, 17518, 11523, -321, -14386, -23941, -24169, -16124, -4583, 6338, 14255, 14912, 8741, -1274, -12799, -21885, -24680, -16819, -3271, 8944, 15966, 16871, 9385]
1238I385j3248j2717n330K519P038J0978J1152O770p79o949j0971j1812p576J282
1252b0258R420J2652J1128O344k548r839j2038q986l777J339Q310J1896J0731
1265A4374M617k106p676j2273j1769m456M158J0606J2539R447L097m974r312r968
1279c696q738l377L058R914J1497Q983M110l479j0801j3467q903q31O629R620
1293E19J0927P385J275n137r410r875p999k999M985J0285J2679Q862K70p404j1956
1308B407j0626n663O00O602R780R318N861O82n599r537j1614p844l37P718J2963
1323D711J0376M781k748q128j0418q335m471J215O153R025R629O306l88q077j2330
1338b699j1045m229K915R289J1149Q505K440l674p926r252p932m493J544Q052
$$ y = [9385, -3863, -16580, -21910, -19391, -12353, -1375, 9777, 16547, 15768, 8819, -2152, -13964, -21540, -20258, -10838, 1814, 12942, 19286, 16738, 6899, -5139, -14125, -17902, -16563, -8253, 3643, 14374, 18991, 16885, 9209, -3064, -14833, -19289, -15131, -4525, 8014, 17461, 20558, 15584, 6272, -3696, -12434, -15811, -12753, -2839, 8658, 17641, 21751, 18272, 7471, -5996, -14899, -15730, -9101, 519, 11446, 18831, 20106, 14969, 5559, -4316, -12315, -15314, -10329, -44, 12635, 21497, 21767, 14363, 2407, -8219, -13882, -13282, -6680, 3100, 12418, 18279, 18961, 13362, 3825, -7789, -15633, -15970, -8252, 4711, 15087, 19868, 17120, 8992, -1426, -9761, -14232, -13017, -6864, 2161, 11790, 18096, 17708, 9631, -2699, -13744, -17973, -15058, -5769, 5380, 13885, 16325, 12651, 4725, -4527, -12459, -16952, -15408, -7356]
1352g356J0747R465M299m178j0136j1288q311j569M934Q653R406O801J890l855
1366I502q043r678q172l364M182R760J0936P783J370n757j0107j0628n904K76
1380a7844N058R219Q707O431N39m688q876r716p044p53O314J0601J0072O009j069
1395A2960p145j0223q668l548J279N719Q868Q489N107K7n792r429r722n928J676
1410a6330Q261J0899Q933L499l150p344r326o841k386K053N668Q149R257N058
1424A6400j792p927j0692q890l225M964R629R691N650R43l148o739p878o034k895
1439a1943J539P032J0240R515K634n062r861j0289o301M71O443Q217O418M379
1453A3432J941k616p421r062p050k461M305J0288J0899N852j149p249q994p823
$$ y = [-7356, 3391, 12856, 17155, 12977, 2841, -8447, -16758, -18327, -13393, -4740, 4666, 11467, 13357, 9502, 1459, -8219, -16391, -19755, -15573, -5813, 5123, 12906, 14276, 8519, -1588, -12216, -18120, -17844, -12786, -3567, 5140, 11571, 12110, 7422, -1454, -11170, -18214, -18967, -12653, -2052, 8020, 14029, 12960, 5815, -4408, -13076, -16624, -15345, -9626, -758, 7731, 12838, 12865, 7073, -2356, -12078, -18006, -16330, -8069, 2830, 11763, 15262, 12112, 4768, -4558, -11399, -13785, -11732, -6064, 2085, 11342, 16400, 14608, 6681, -4011, -12901, -16126, -11162, -1533, 8158, 13808, 14751, 11603, 4864, -3014, -9048, -11943, -10404, -3372, 6868, 16383, 19017, 13955, 4094, -6195, -12496, -12025, -5582, 2635, 9053, 13432, 15373, 12757, 5336, -3726, -10776, -13237, -8932, 1356, 12255, 18107, 16958, 9709, 715, -7108]
1467g108l833J710M715O372P064N328J368m573r181r359o244O93P464J0237P893
1482A2546K487k025o683q535o533k644O65M719P714Q460M165j914o007r200r311
1497a2096l491L966Q142P690N891K321k749p555p613n100l086J116O503R351O749
1512A0039K088k448p221j0017p635m42N095P134P414N685J127n243o103o138n382
1527a2047l294K784Q429Q547N811J569l851j0047r605l465J556M951O986P366
1541E690L470p96l367n244p088o937j281N741Q725Q663N076j070p777r046n146
1556a0387j729J535M624O417O021L441P34l259q625r159m459K379P740Q603P442
1571A1318J887m273o560n582m029k844Q21N255O761O743M309q90o851j0183o539
$$ y = [-7108, -10941, -9231, -4516, 1856, 8920, 14248, 15616, 11043, 1862, -7497, -13741, -13048, -5584, 4653, 12546, 15033, 13008, 6325, -2210, -8743, -11387, -10722, -6003, 1711, 10171, 14336, 12422, 6415, -2785, -12096, -15587, -11621, -3479, 4211, 10102, 12423, 9674, 2119, -5494, -10594, -13680, -12564, -6061, 3290, 10039, 12127, 9679, 2458, -7559, -15194, -15636, -10541, -3407, 4007, 9692, 10819, 5576, -527, -6665, -12047, -15341, -12557, -4128, 4419, 10230, 11799, 7948, -2099, -11704, -15169, -13613, -8662, -1676, 5690, 9160, 8364, 4997, -247, -7335, -14272, -15553, -9812, -1087, 7576, 12652, 11582, 3805, -5241, -10387, -12116, -10581, -5957, 460, 6481, 9922, 10656, 7397, -1228, -10387, -14846, -12467, -4727, 3876, 11318, 13205, 8932, 2372, -3210, -7239, -10083, -9262, -4007, 2754, 9497, 13806, 12916, 6065, -4118, -10657]
1586a0657j115L979P514P561M758r5l234m734n871n827k514K563O546P790O331
1601A2995K076m399q503p634l969J14M472O772O236L470L35k949n706p210n365
1616i265o17L882P134P640N097p11n790p404o531l105J032M813O133N922L286
1631A1516m21m370o572o721l683n7N321P444O920L136k324n841p276n517k230
1646a0675K387M114O313N314K633j111m554p487o931k909K792O324P606N386J074
$$ y = [-10657, -11772, -7793, -279, 7282, 12040, 11945, 8711, 3977, -1894, -7721, -10235, -7672, -1126, 6664, 12995, 15071, 10672, 2169, -5465, -9434, -9320, -4848, 1924, 8160, 11630, 11965, 9016, 3310, -3900, -9265, -9882, -6000, 1134, 8774, 13871, 13160, 7370, -34, -6565, -9670, -8638, -3825, 2308, 8230, 11516, 11095, 6725, 153, -6568, -10251, -10308, -4987, 2457, 9377, 12513, 10189, 4348, -2928, -8445, -10675, -8288, -4174, 2139, 7453, 10086, 8975, 4421, -3066, -9997, -12906, -10114, -3790, 3816, 9202, 10276]
$$ [...]
8191G3
##END NTUPLES=NMR FID
##END=
