##TITLE=1H_LR-710-C1-K
 CDCl3+DMSO-d6, 8 sc, 
 6.2.2020
##JCAMPDX= 6.0         $$ Bruker NMR JCAMP-DX V2.0
##DATA TYPE= NMR FID
##DATA CLASS= NTUPLES
##ORIGIN= UXNMR, Bruker Analytische Messtechnik GmbH
##OWNER= root
$$ XWIN-NMR		Version 3.5
$$ Thu Feb  6 14:39:32 2020 Russian Standard Time (UT+4h)  she@DPX200
##.OBSERVE FREQUENCY= 200.1315
##.OBSERVE NUCLEUS= ^1H
##.DELAY= (6, 6)
##.ACQUISITION MODE= SIMULTANEOUS
##.ACQUISITION SCHEME= undefined
##.AVERAGES= 8
##.DIGITISER RES= 18
##SPECTROMETER/DATA SYSTEM= spect
##.PULSE SEQUENCE= zg30
##.SOLVENT NAME= D2O
##.SHIFT REFERENCE= (INTERNAL, D2O, 0, 15.7039)
##AUDIT TRAIL= $$ (NUMBER, WHEN, WHO, WHERE, WHAT)
$$ ##TITLE= Audit trail, XWIN-NMR		Version 3.5
$$ ##JCAMPDX= 5.01
$$ ##ORIGIN= Bruker BioSpin GmbH
$$ ##OWNER= she
$$ F:/spectra/data/she/nmr/H-F/1/audita.txt
$$ ##AUDIT TRAIL=  $$ (NUMBER, WHEN, WHO, WHERE, WHAT)
(   1,<2020-02-06 14:38:24.81 +0400>,<she>,<DPX200>,
      <created by zg, POWCHK disabled, PULCHK disabled
       configuration hash MD5:
       00 E9 B6 7A A2 85 ED C7 34 08 36 98 17 FE 4E 26
       data hash MD5: 16K
       B1 B8 41 D8 0F 7B 9A 0F 63 DA 3D 0B 46 C5 09 D5>)
$$ ##END=
$$ 
$$ hash MD5
$$ 9A 8E F8 B3 DE 99 AC C2 0B 7F 6D E0 94 B1 22 F4
##$RELAX= 
##$RELAX= 
##$RELAX= 
##$RELAX= 
##$RELAX= 
##$RELAX= 
$$ Bruker specific parameters
$$ --------------------------
##$DU= <F:/spectra>
##$EXPNO= 1
##$NAME= <H-F>
##$PROCNO= 1
##$TYPE= <nmr>
##$USER= <she>
##$AMP= (0..31)
100 100 100 100 100 100 100 100 100 100 100 100 100 100 100 100 100 100 
100 100 100 100 100 100 100 100 100 100 100 100 100 100 
##$AQSEQ= 0
##$AQ_mod= 1
##$AUNM= <au_zg>
##$AUTOPOS= <>
##$BF1= 200.13
##$BF2= 200.13
##$BF3= 200.13
##$BF4= 200.13
##$BF5= 200.13
##$BF6= 200.13
##$BF7= 200.13
##$BF8= 200.13
##$BYTORDA= 1
##$CFDGTYP= 0
##$CFRGTYP= 5
##$CHEMSTR= <none>
##$CNST= (0..31)
1 1 145 1 1 1 1 1 1 1 1 1 1 1 1 1 1 1 1 1 1 1 1 1 1 1 1 1 1 1 1 1 
##$CPDPRG= <>
##$CPDPRG1= <>
##$CPDPRG2= <>
##$CPDPRG3= <>
##$CPDPRG4= <mlev>
##$CPDPRG5= <mlev>
##$CPDPRG6= <mlev>
##$CPDPRG7= <mlev>
##$CPDPRG8= <mlev>
##$CPDPRGB= <>
##$CPDPRGT= <>
##$D= (0..31)
0 1.2 0 0 0 0 0 0 0 0.06 0 0.03 0 0 0 0 0.0002 0 0 0 0 0 0 0 0 0 0 0 0 
0 0 0 
##$DATE= 1580985504
##$DBL= (0..7)
120 120 120 120 120 120 120 120 
##$DBP= (0..7)
150 150 150 150 150 150 150 150 
##$DBP07= 0
##$DBPNAM0= <>
##$DBPNAM1= <>
##$DBPNAM2= <>
##$DBPNAM3= <>
##$DBPNAM4= <>
##$DBPNAM5= <>
##$DBPNAM6= <>
##$DBPNAM7= <>
##$DBPOAL= (0..7)
0.5 0.5 0.5 0.5 0.5 0.5 0.5 0.5 
##$DBPOFFS= (0..7)
0 0 0 0 0 0 0 0 
##$DE= 6
##$DECBNUC= <off>
##$DECIM= 24
##$DECNUC= <off>
##$DECSTAT= 4
##$DIGMOD= 1
##$DIGTYP= 9
##$DL= (0..7)
0 120 120 120 120 120 120 120 
##$DP= (0..7)
150 150 150 150 150 150 150 150 
##$DP07= 0
##$DPNAME0= <>
##$DPNAME1= <>
##$DPNAME2= <>
##$DPNAME3= <>
##$DPNAME4= <>
##$DPNAME5= <>
##$DPNAME6= <>
##$DPNAME7= <>
##$DPOAL= (0..7)
0.5 0.5 0.5 0.5 0.5 0.5 0.5 0.5 
##$DPOFFS= (0..7)
0 0 0 0 0 0 0 0 
##$DQDMODE= 0
##$DR= 18
##$DS= 0
##$DSLIST= <SSSSSSSSSSSSSSS>
$$ [...]
##$SUBNAM2= <"">
##$SUBNAM3= <"">
##$SUBNAM4= <"">
##$SUBNAM5= <"">
##$SUBNAM6= <"">
##$SUBNAM7= <"">
##$SUBNAM8= <"">
##$SUBNAM9= <"">
##$SW= 24.9337058887773
##$SWIBOX= (0..15)
0 0 2 0 0 0 0 0 0 0 0 0 0 0 0 0 
##$SW_h= 4990.01996007984
##$TD= 16384
##$TD0= 1
##$TE= 0
##$TE2= 300
##$TE3= 300
##$TEG= 300
##$TL= (0..7)
0 120 120 120 120 120 120 120 
##$TP= (0..7)
150 150 150 150 150 150 150 150 
##$TP07= 0
##$TPNAME0= <>
##$TPNAME1= <>
##$TPNAME2= <>
##$TPNAME3= <>
##$TPNAME4= <>
##$TPNAME5= <>
##$TPNAME6= <>
##$TPNAME7= <>
##$TPOAL= (0..7)
0.5 0.5 0.5 0.5 0.5 0.5 0.5 0.5 
##$TPOFFS= (0..7)
0 0 0 0 0 0 0 0 
##$TUNHIN= 0
##$TUNHOUT= 0
##$TUNXOUT= 0
##$USERA1= <user>
##$USERA2= <user>
##$USERA3= <user>
##$USERA4= <user>
##$USERA5= <user>
##$V9= 5
##$VALIST= <valist>
##$VCLIST= <CCCCCCCCCCCCCCC>
##$VD= 0
##$VDLIST= <DDDDDDDDDDDDDDD>
##$VPLIST= <PPPPPPPPPPPPPPP>
##$VTLIST= <TTTTTTTTTTTTTTT>
##$WBST= 1024
##$WBSW= 4
##$XGAIN= (0..3)
0 0 0 0 
##$XL= 0
##$YL= 0
##$YMAX_a= 46403
##$YMIN_a= -45089
##$ZGOPTNS= <>
##$ZL1= 120
##$ZL2= 120
##$ZL3= 120
##$ZL4= 120
##$ABSF1= 10
##$ABSF2= 0
##$ABSG= 5
##$ABSL= 3
##$ALPHA= 0
##$AQORDER= 0
##$ASSFAC= 0
##$ASSFACI= 0
##$ASSFACX= 0
##$ASSWID= 0
##$AUNMP= <proc_1d>
##$AZFE= 0.1
##$AZFW= 0.1
##$BCFW= 1
##$BC_mod= 2
##$BYTORDP= 1
##$COROFFS= 0
##$CY= 11.3945322036743
##$DATMOD= 1
##$DC= 2
##$DFILT= <>
##$DTYPP= 0
##$F1P= 16.9975609425685
##$F2P= -3.02152046262296
##$FCOR= 0.5
##$FTSIZE= 0
##$FT_mod= 4
##$GAMMA= 1
##$GB= 0.15
##$INTBC= 1
##$INTSCL= 1
##$ISEN= 128
##$LB= 0.24
##$LEV0= 0
##$LPBIN= 0
##$MAXI= 10000
##$MC2= 0
##$MEAN= 0
##$ME_mod= 0
##$MI= 1.114404
##$NCOEF= 0
##$NC_proc= 0
##$NLEV= 6
##$NOISF1= 3.799351
##$NOISF2= 2.8
##$NSP= 1
##$NTH_PI= 0
##$NZP= 0
##$OFFSET= 15.70392
##$PC= 1
##$PHC0= -9943.833
##$PHC1= 9.200813
##$PH_mod= 1
##$PKNL= yes
##$PPARMOD= 0
##$PSCAL= 0
##$PSIGN= 0
##$REVERSE= no
##$SF= 200.130013532006
##$SI= 16384
##$SIGF1= 3
##$SIGF2= 2
##$SINO= 400
##$SIOLD= 16384
##$SREGLST= <1H.CDCl3>
##$SSB= 0
##$STSI= 0
##$STSR= 0
##$SW_p= 3612.71676300578
##$SYMM= 0
##$S_DEV= 0
##$TDeff= 0
##$TDoff= 0
##$TI= <>
##$TILT= no
##$TM1= 0
##$TM2= 0
##$TOPLEV= 0
##$USERP1= <user>
##$USERP2= <user>
##$USERP3= <user>
##$USERP4= <user>
##$USERP5= <user>
##$WDW= 1
##$XDIM= 8192
##$YMAX_p= 0
##$YMIN_p= 0
$$ End of Bruker specific parameters
$$ ---------------------------------
##NTUPLES= NMR FID
##VAR_NAME=  TIME,          FID/REAL,        FID/IMAG
##SYMBOL=    X,             R,               I
##VAR_TYPE=  INDEPENDENT,   DEPENDENT,       DEPENDENT
##VAR_FORM=  AFFN,          ASDF,            ASDF
##VAR_DIM=   8192,          8192,            8192
##UNITS=     SECONDS,       ARBITRARY UNITS, ARBITRARY UNITS
##FACTOR=    0.0002004,     1,               1
##FIRST=     0,             0,               0
##LAST=      1.6414764,     0,               0
##MIN=       0,             -45089,          0
##MAX=       1.6414764,     46403,           0
$$ Real data points
##PAGE= N=1
##DATA TABLE= (X++(R..R)), XYDATA
$$ [...]
631a667N95J51O83J349J219O57l74j996k407r99N67P82N67J075J064M54J46J96
$$ -1667 -1072 -921 -238 1111 2330 2987 2613 617 -1790 -2789 -2222 -1440 -873 202 1266 1720 1866 2062
649B062o09j787j822o56J48J064J884J531m6p04M6J75r07j602j231m67M70J774
$$ 2062 1453 -334 -2156 -2812 -2664 -1600 284 1815 1769 1065 1111 1286 379 -1223 -2454 -2921 -2451 -677
667f77K021P61l98m69n11r14r90l31k93n32M90J811J855O96n43j099j395q44j5
$$ -677 1344 2105 1707 1238 727 -187 -1177 -1508 -1801 -2333 -1843 -32 1823 2519 1976 877 -518 -1362 -1377
686a377M3k16J6Q81J417J162O55n32j614j659o48L02L17M65P32O33N17O76N92
$$ -1377 -1334 -1550 -1534 -653 764 1926 2581 2049 435 -1224 -1872 -1570 -1253 -788 -56 577 1094 1770 2362
705B362o59j673j749m50M58J022J046N25J61K66L82j22q45j294j053o56N76J434
$$ 2362 1703 30 -1719 -2169 -1711 -689 357 882 1043 1309 1691 1569 724 -570 -1623 -2279 -1703 -269
723b69J451M81l57l16o1l20o83r87p12j55O04J293J399O45l72j017p31l18l23
$$ -269 1182 1663 1306 990 929 609 -74 -1061 -1773 -1928 -1324 -31 1368 2013 1641 624 -107 -425 -748
742g48m46l97M5O89J340J171M30p62j109r83m57m8L86N9j43O40J398R23k97o93
$$ -748 -1194 -1591 -1546 -857 483 1654 2084 1322 213 -770 -1227 -1275 -889 -830 -973 -333 1065 1988 1691 998
762I98q73j045p52L19R32N08M8M03O98L89N6p12j238j229n4Q18O79N68N96J86
$$ 998 125 -920 -1672 -1353 -421 87 135 538 1236 1625 1681 969 -269 -1498 -1552 -734 -55 513 1109 1295
782A295k86P7K19n95j480p80M03N75N76J051O38m58o08k9j83p64o20k61j22M09
$$ 1295 1009 1086 1305 710 -770 -1550 -1147 -572 4 1055 1693 1235 627 598 415 -349 -969 -1230 -1352 -943
802i43J388J237l34q84k92k11p73n27L54q8l86O56J464O10n04l90n54j098m95
$$ -943 445 1682 1348 464 172 -39 -812 -1339 -985 -1073 -1459 -803 661 1271 767 377 -177 -1275 -1770
821a770N86L37m09J97R83P59j13M8j05j388j163L78Q56PM4O73O25j13J99K05p27
$$ -1770 -1184 -847 -1256 -1059 -76 683 570 618 513 -875 -2038 -1660 -804 -797 -753 -80 545 432 631 836 109
842A09j281k88L99K67M82J047L26n55M9N36k00j155m55J19j71L17J274J002n26
$$ 109 -1172 -1460 -1061 -794 -312 735 1061 506 555 1091 891 -264 -719 -600 -771 -454 820 1822 1296
861A296m96K97r1p24m06R6l45k33J060J185P2m28O5m09r07k33M99k66o19M09J114
$$ 1296 800 1097 1006 282 -124 -28 -373 -606 454 1639 1711 1283 1348 939 32 -201 298 32 -587 -178 936
882I36L41n7J70l50j153o52M56K44n11P2P62L79r2K95J65j023r84p6K80j71J96
$$ 936 1277 1220 1390 1040 -113 -765 -309 -65 -576 -504 258 637 545 840 1005 -18 -1002 -1078 -798 -969 -773
903g73P10K48k62K72L71n07r54l83Pk28M52Q23K53k22mM47k69o78k55n1m33N4
$$ -773 -63 185 -77 195 566 59 -895 -1278 -1271 -1499 -1047 -224 29 -193 -197 250 -19 -697 -952 -1003 -1436 -1382
925a382R54P17j68j4J64j31o12n6Ql69k09N95Q59J88M7J95k26n76k50J99j78k37
$$ -1382 -428 289 121 107 271 140 -472 -528 -520 -889 -1098 -503 356 544 591 786 560 -16 -266 -67 -245 -482
947d82K65N78L51K28K94j31o93m13K8O9k38J41M32K52K13J77J93n26n38k46j43
$$ -482 -217 361 712 940 1234 1103 410 -3 25 94 -144 -3 429 681 894 1071 1264 738 200 -46 -189
968a89l3K45K62J69J13J79J46k18m98l87l26m4J55L26J70J38J60l3o9l07l06m27
$$ -189 -222 23 285 454 567 746 892 674 176 -211 -537 -581 -426 -100 70 208 368 335 266 -41 -347 -774
990g74k85J06L73K80K01J96p1k06r4j80k67l60p7K83M46K80K41k6j91j09j18k29
$$ -774 -1059 -953 -580 -300 -99 97 26 -180 -274 -454 -721 -1081 -1158 -875 -429 -149 92 66 -125 -234 -352 -581
1012e81k24l4J03J80N33L37J52j92r3k37k55n2J40L7q3L51N98J74p1p1k25m57
$$ -581 -805 -839 -736 -556 -23 314 466 274 181 -56 -311 -363 -223 -186 -269 82 680 854 783 712 487 30
1034C0j13L09P5j20K18M42J09O2Q5j24n55l63J63J85l2J40K75O2j33J50J50l99
$$ 30 -83 226 301 181 399 841 950 1012 1097 973 418 55 218 403 371 511 786 848 715 865 1015 616
1056F16o85j28J59N8J28L43M7k96L1K10k78m59k36r1j40J26O07J78k97k07Q3j92
$$ 616 -69 -197 -38 20 148 491 538 242 273 483 205 -254 -490 -581 -721 -595 12 190 -107 -314 -231 -423
1078d23k99nj32l27m4N22M86j01j29k4j54m59J48J99k62k60L26M55J48O4J48j56
$$ -423 -722 -727 -859 -1186 -1230 -708 -222 -323 -452 -476 -630 -1089 -941 -742 -1004 -1264 -938 -483 -335 -271 -123 -279
1100b79n76j51M83K5j70J48L34P6J28L90R9n63l56J97K13J4K31L24o1j28L08M84
$$ -279 -855 -1006 -523 -498 -668 -520 -186 -110 18 408 507 -56 -412 -215 -2 12 243 567 506 378 686 1170
1122A170l05m52j06J7mK34M74J08l28M1J94N8k48j81k33k87J85N24L07k14m9j47
$$ 1170 865 413 307 324 320 554 1028 1136 808 849 1043 1101 853 672 439 152 337 861 1168 954 905 758
1144G58j68j77J63m5n08l14L56M31P9m1p0l89l32P1R6j86l33L8J99M9K01K25k81
$$ 758 590 413 576 531 23 -291 65 496 575 534 464 75 -257 -186 -90 -276 -609 -571 -372 -323 -122 103 -178
1167a78n98j76J31J31p4N7M5j44J45L75J76m00l88j92K1K14L15J52j99o5K43K20
$$ -178 -776 -952 -821 -690 -764 -707 -662 -806 -661 -286 -110 -510 -898 -1090 -1069 -855 -540 -388 -587 -652 -409 -189
1189a89N3j72j69j72j69K94M78J88j48r2R8K39O6K3k51l24j1L81L99J96j1j79
$$ -189 -136 -308 -477 -649 -818 -524 -46 142 -6 -98 0 239 305 328 77 -247 -258 123 522 718 707 528
1211E28j97J27J17Q1k97j41j0K90J38K66J04k69l50j11J92J24j62j62j83J20L62
$$ 528 331 458 575 656 359 218 208 498 636 902 1006 737 387 276 468 592 430 268 85 205 567
1232E67K51n7m19l32j47J18Q9N7k7l00%K82K56q0l03l67k32J3J95K33o6j13j33
$$ 567 818 761 342 10 -137 -19 70 127 100 -200 -200 82 338 258 -45 -412 -644 -631 -436 -203 -269 -382 -515
1255e15N2L20K3k48m28j61J34K76L11oj64r8MJ24J65o9k67k27P1L14L88J11j55
$$ -515 -463 -143 -120 -368 -796 -957 -823 -547 -236 -242 -406 -504 -500 -376 -211 -280 -547 -774 -703 -389 -1 110 -45
1278d5j41r9J25J29J19j25j91l4K61M39K43j86k71j89R0J53J80q6j22k4J16L94
$$ -45 -186 -285 -160 -31 88 -37 -228 -262 -1 438 681 495 224 35 125 278 458 372 250 226 342 736
1300G36K02j21k67k55k9J47J45Np7j06l6K58K08r6k61l44j14J56K29J82j55l19
$$ 736 938 817 550 295 266 413 558 563 486 380 344 602 810 714 453 109 -5 151 380 562 407 88
1322H8m6J75K01j30k59k53k03P8K77J83m8k47k25P1R2K7j18k56j87J07J82L24
$$ 88 42 217 418 288 29 -224 -427 -349 -72 111 63 -184 -409 -338 -246 -219 -337 -593 -780 -673 -491 -167
1344a67M2k98k19l9J42J23k6k23j88L8L18K34P4j56k16o0M2J67J45k5j93M9K11
$$ -167 -125 -423 -642 -681 -539 -416 -442 -665 -853 -815 -497 -263 -189 -345 -561 -621 -579 -412 -267 -292 -485 -436 -225
1367b25K79R5p5k35j94M2K98K20K0j20j03J63J77K39p8k71j99J28J56K24L5n8
$$ -225 54 149 74 -161 -355 -313 -15 205 225 105 2 165 342 581 503 232 33 161 317 541 576 518
1389E18j71K8J56J99p5k34j41p0J16K48J91p9k98o1J15Q4J2k10j65r9M6K66J77
$$ 518 347 375 531 730 655 421 280 210 326 574 765 686 388 327 442 526 538 328 163 64 110 376 553
1412E53j44k96m5n0K8R7n7j66k56J06K99L3l9j75j48k07J08J84Lk07p6KJ64J54
$$ 553 409 113 68 18 46 143 86 -80 -336 -230 69 102 63 -112 -260 -467 -359 -175 -172 -379 -455 -453 -289 -135
1436a35Ko9l12j06J66J16L3Jo7j29J44J64J52j39j38j87J16J26J57J54j47j79
$$ -135 -133 -202 -514 -620 -454 -338 -305 -304 -371 -500 -356 -192 -40 -179 -317 -504 -388 -262 -105 49 -98 -277
1458b77R3K21P9j36j18m7PJ80K73J2j85o8J36M3J5J5m2j44m2J85K02P4j08p5k12
$$ -277 -184 37 116 -20 -138 -185 -178 2 275 287 102 34 170 213 228 243 201 57 15 200 402 476 368 293 81
1483H1R3J25R1j21j88kJ12J72l1j5o0k32p6J68Q7j13j21J7m0J29O8qj82j69l5
$$ 81 174 299 390 269 81 79 191 363 332 317 257 25 -51 117 204 91 -30 -13 -53 76 144 136 -46 -215 -250
1508b50J59N0J6o8j46j2J78J07j09j73j18n2J13J43K0Kj35L1N4J18o5r9q0PP0
$$ -250 -91 -41 -25 -93 -239 -251 -73 34 -75 -248 -366 -418 -305 -162 -142 -140 -275 -244 -190 -72 -137 -236 -316 -309 -239
1533b39P1J43L3j21n5L0J37Mj0q2m5J9J90J01J7p0r3M9L8J9K2Kj23P9P8J27L8
$$ -239 -168 -25 8 -113 -168 -138 -1 3 -7 -89 -134 -115 75 176 193 123 30 79 117 136 158 160 37 116 194 321 359
1560C59j03p8l0k1J51P3q1j08N0O3N7L3o1j54j15N9R5Q2j15m9J0L8qM2o9j90m5
$$ 359 256 178 148 127 278 351 270 162 212 275 332 365 304 150 35 94 189 271 156 107 117 155 147 189 120 -70 -115
1587a15N2J10p9J1n2N8r2K9J47q5k01n8J4M8P7O9r0j74P6J14r6j9m5n5p6J56J90
$$ -115 -63 47 -32 -21 -73 -15 -107 -78 69 -16 -217 -275 -261 -213 -136 -67 -157 -331 -255 -141 -237 -256 -301 -356 -432 -276 -86
1614h6o5q2n5O7lj6O7j1j70J0J67J79om0Mj12n0J23J36j25q1L9J80KK7P9q1j82
$$ -86 -151 -233 -288 -221 -224 -240 -173 -184 -354 -344 -177 2 -4 -44 -40 -152 -202 -79 57 -68 -149 -110 70 72 99 178 97 -85
1642h5Q6J81Oq2J5P9j11J08J05P7l19m2J31K9l7J25N5j24q7J14J99k35q7Lj0J
$$ -85 1 182 188 106 121 200 89 197 302 379 60 18 149 178 141 266 321 197 110 224 423 188 101 104 94 95
1668I5Q6Q6q6j29l1J85nr8jq2j54J31J59L0j53o1Q3p8k6J23l5k30k6J69N7M6K6
$$ 95 181 267 181 52 21 206 201 103 102 20 -134 -3 156 186 33 -28 55 -23 -49 74 39 -191 -217 -48 9 55 81
1695H1j08j49l6J49N4p2j29M2K4M9N9Q0p5j95lJ59O9j75J09N8j67O5K10L1j70
$$ 81 -27 -176 -212 -63 -9 -81 -210 -168 -144 -95 -36 44 -31 -226 -229 -70 -1 -176 -67 -9 -176 -111 99 130 -40
1720d0p9J4P8pjJ49j63r3R6J38n2o8j5o8oR4J65n0j26l4O3MO5M7j18j60J02R3
$$ -40 -119 -105 -27 -34 -35 114 -49 -142 -46 92 40 -28 -43 -111 -117 -23 142 92 -34 -68 -5 -1 64 111 -7 -167 -65 28
1748B8N1Lo1q0p7J00J11k9k3j16k3O0Q5N0Kj39r6J25Q9Kp0l5m4K9J12P7l9j59
$$ 28 79 82 21 -59 -136 -36 75 46 23 -93 -116 -56 29 79 81 -58 -154 -29 60 62 -8 -43 -87 -58 54 131 92 -67
1776f7o0L4J31N8J1l5j79N8J68ql6k8k29J24J23J0Qo7l4o1O5K14m6q5j20n8N8
$$ -67 -127 -93 38 96 107 72 -107 -49 119 111 75 47 -182 -58 65 75 83 16 -18 -79 -14 200 154 69 -51 -109 -51
1803e1J75km4l3q3Q8J6O5j13m6o4Q0K4J29k9j02k4J2O0L3Mr6j49L7J78R7p2p5
$$ -51 124 122 78 45 -38 50 66 131 18 -28 -92 -12 12 141 112 10 -14 -2 58 91 95 -1 -150 -113 65 162 90 15
1831A5p0rQ6L0N8j67n1k1J43J13p6k6q4p1J27J7J26j90j5M8K7Q4P8l1j97l0J17
$$ 15 -55 -64 22 52 110 -57 -108 -129 14 127 51 25 -59 -130 -3 14 140 -50 -65 -17 10 94 172 141 -56 -86 31
1858C1J1M5K3q4r2O2N4O9m4j15m7N3j8J26O8r8j20N0J59q3m5M0j35p7J36J48P
$$ 31 42 87 110 26 -66 -4 50 119 75 -40 -87 -34 -52 74 142 44 -76 -26 133 50 5 45 -90 -167 -31 117 124
1885A24j22o0l3LO3J05q7k37NP1J09L1mp8p3m2J08J11j31ko5K9O2J16K7j56p9
$$ 124 2 -58 -91 -88 -25 80 -7 -244 -239 -168 -59 -28 -32 -110 -183 -225 -117 -6 -137 -139 -204 -175 -113 3 30 -126 -205
1912b05K2R3N3j3N8j31j42J88J35l7p3j18M0R3M9Q7j9j41m1J16J86n1q8k6Pp4
$$ -205 -183 -90 -37 -50 8 -123 -265 -77 58 21 -52 -170 -130 -37 12 99 80 -61 -102 14 200 149 61 35 42 -32
1938c2J36J21Qj61M9O1k1J11K8j71n5J8J32Q6j09Oj18j9J12Q5j1j37p1M8j3M0
$$ -32 104 225 233 72 121 182 161 272 300 129 74 92 224 310 201 207 89 70 182 267 256 119 48 96 83 123
1964A23J38r9j37j0P5J0j1K6j38n8oJ04L7q6p6n4J6j7J05J9j14q2P6Q7l6n5o7
$$ 123 261 162 25 15 90 100 89 115 -23 -81 -87 17 54 -32 -108 -162 -146 -163 -58 -39 -153 -235 -159 -72 -108 -163 -230
1991b30rq5P0J39J6j11p8L7J5O1O9n9r7K0M0R6P2j08j7j06Q1P3J18q9rJ2l7J46
$$ -230 -239 -324 -254 -115 -99 -210 -288 -251 -236 -175 -106 -165 -262 -242 -202 -106 -34 -142 -159 -265 -184 -111 7 -82 -91 -79 -116 30
2019C0k5N8r7j5m7Q2J33L6o2j07n0K24nQn7KJ3M2J08j06J6n1m7N5J00k6k9l8n5
$$ 30 5 63 -34 -49 -96 -14 119 155 93 -14 -64 160 155 163 106 108 121 163 271 165 181 130 83 138 238 212 183 145 90
2048I0L5J43o0n8p8n7Q9N3L6k2n8r0j5N4N8l4q5o9K3J07n8J3r3m2n7M3Q9J7n3
$$ 90 125 268 208 150 72 15 104 157 193 171 113 23 8 62 120 86 1 -68 -45 62 4 17 -76 -118 -175 -132 -43 -26 -79
2077g9q6qK6J18l0m7r7o0O8R4L5o3j09Q4j5J28K0r3l2k7J08L3MM8j10M9k4N4N8
$$ -79 -165 -173 -147 -29 -59 -106 -203 -263 -195 -101 -66 -129 -238 -154 -169 -41 -21 -114 -146 -173 -65 -32 -28 20 -90 -41 -65 -11 47
2106D7p3N9p2M6j3J45nn3Pl4P5R9n6l1m8K0k2J42m2nj05Q1pK9K3o6Jk4OL8k8O3
$$ 47 -26 33 -39 7 -6 139 134 81 88 54 129 228 172 141 93 113 91 233 191 186 81 162 155 184 207 141 142 118 124 162 134 197
2138A97j15o0L4O1k8m0q3j5rM8J01j01p9J3%P2j4r7k7M5o6j1L6j8j5J0l1l7J18
$$ 197 82 22 56 117 89 49 -34 -49 -58 -10 91 -10 -89 -76 -76 -4 -18 -115 -142 -97 -163 -174 -138 -156 -171 -161 -192 -229 -111
2167a11m0n0j7j11L3J99k6k9j54K0J21k1N3Kn2l9Q5N4%L5k8J7J7k2J06L8o8j2
$$ -111 -151 -201 -218 -329 -296 -97 -123 -152 -306 -286 -165 -186 -133 -131 -183 -222 -137 -83 -83 -48 -76 -59 -42 -64 42 80 12 0
2195@n5J76n4J31m2j01J8Q6Q9k2j1j60Q2J03lL1Pq9lO7k1NjQ2j30m4P6P4l5q0
$$ 0 -55 121 67 198 156 55 73 159 248 226 215 55 137 240 237 268 275 186 183 250 229 234 233 315 185 141 217 291 256 176
2225A76o0N4j3L1j8p5q0K4Q2pm8j18M0P4l6j3o5pl4J8n9K0M3k0p6n3M0O7m0p1
$$ 176 116 170 157 188 170 95 15 39 121 114 66 -52 -12 62 26 13 -52 -59 -93 -75 -134 -114 -71 -91 -167 -220 -180 -113 -153 -224
2255b24n9K3PJ32kj42l6L4J06j1n1L7k0k2R9mJ7l0L0p0M0N9j5P4mp2K3J03M5p7
$$ -224 -283 -260 -253 -121 -123 -265 -301 -267 -161 -172 -223 -186 -206 -228 -129 -133 -116 -146 -116 -186 -146 -87 -102 -28 -32 -104 -81 22 67 -10
2285a0m4K4N2N8nL2m2k5L0Q3J9k1o2K8J6K0M0N4j3r0n4N5J54l7r7l1n2J9N5L3
$$ -10 -54 -30 22 80 75 107 65 40 70 153 172 151 89 117 133 153 193 247 234 144 90 145 299 262 165 134 82 101 156 189
2315A89Kj41j5N6Q4n6l4o1l9L4mM0l5m4n1L3K0K3n4M4r9m7K1Q5Ml8q0pO5R8p9
$$ 189 191 50 35 91 175 119 85 24 -15 19 15 55 20 -24 -75 -42 -22 1 -53 -9 -108 -155 -134 -49 -45 -83 -163 -170 -105 -7 -86
2346h6p9n0kJ22j9k1N%l0L8K8K0J8J2q4M2N8J13o1q2k3N7R7K1Lj05LP7J5J1Lj8
$$ -86 -165 -215 -217 -95 -114 -135 -130 -130 -160 -122 -94 -74 -56 -44 -128 -86 -28 85 24 -58 -81 -24 73 94 97 -8 -5 72 87 98 101 83
2378H3M6j9K6j3O4l5n8NJ7N3J00j56k0m9O3J21m2m1j04J11k2j1l0l3LpjO3j22
$$ 83 129 110 136 123 187 152 94 99 116 169 269 113 93 44 107 228 186 145 41 152 130 119 89 56 59 52 51 114 -8
2407hQ9j10J2j5J4O1o5l3o4k2Q2K2m0l8k6j14J39J8Oj19J08n8L8n7K2j6o9J24
$$ -8 81 -29 -17 -32 -18 43 -22 -55 -119 -141 -59 -37 -77 -115 -141 -255 -116 -98 -92 -211 -103 -161 -123 -180 -158 -174 -243 -119
2435a19l3J1O9j8j8o8l2J41O6l1j30K6N3O8K1J5o6n7M7J29k5j7K5j1N6j4N0m7
$$ -119 -152 -141 -72 -90 -108 -176 -208 -67 -1 -32 -162 -136 -83 -15 6 21 -45 -102 -55 74 49 32 57 46 102 88 138 91
2463I1J2m3P4KQ8l0o2M5q2Q0N9lk4j65Q5O2J02j19n9o9Q7J12n7l6l1K3n2L6j4
$$ 91 103 60 134 136 224 194 132 177 95 175 234 231 207 42 127 189 291 172 113 44 131 243 186 150 119 142 90 126 112
2492A12L6j4o7r2RN9J01m1j78K8K3K1OL4j62k2O1j2K5o7M3lpm0O9j4Mm9l8R4p1
$$ 112 148 134 67 -25 -16 43 144 103 -75 -47 -24 -3 3 37 -125 -147 -86 -98 -73 -140 -97 -100 -107 -147 -78 -92 -88 -137 -175 -81 -152
2523a52Q2m3m4n6K8R4kk3mr0R6P6rl1l3J6Q3j7K2j7M4l4%J9l4O6l0MM9j4J1O3
$$ -152 -70 -113 -157 -213 -185 -91 -93 -116 -120 -210 -114 -38 -47 -78 -111 -95 -12 -29 -7 -24 20 -14 -14 5 -29 37 7 11 60 46 57 120
2555A20n5k2jL2N4L6o2p9QO4L5j5o0NJ3J1jK4J2r9PO9o0L8O3j24o2JO4J18j34
$$ 120 65 43 42 74 128 164 102 23 31 95 130 115 55 60 73 84 83 107 119 20 27 96 36 74 137 13 -49 -48 16 134 0
2586@r7qN8K8J35j58o7L9J1N2L7n3%ok9l6L2L3O6q3j16J00L4L6lo7j12O5J36l3
$$ 0 -97 -105 -47 -19 116 -42 -109 -70 -59 -7 30 -23 -23 -29 -58 -94 -62 -29 37 -46 -162 -62 -28 8 5 -62 -174 -109 27 -6
2616fm1k7J1M9k7Q4m1m7QJ03o4Q4k7k4o2L7M0K1J0k4o6N3J8K1L9j38rP8O3k5l8
$$ -6 -47 -74 -63 -14 -41 43 2 -45 -37 66 2 86 59 35 -27 10 50 71 81 57 -9 44 62 83 122 -16 -25 53 116 91 53
2647E3j0QN9r0K2mO0l3mj1J9Pj7J5j25R6l3J04l0j45K6K7mP4o6o0J1K5L8p3K2
$$ 53 43 51 110 20 42 38 98 65 61 50 69 76 59 74 -51 45 12 116 86 -59 -33 -6 -10 64 -2 -62 -51 -26 12 -61 -39
2678c9m7J2J0L4n6O5j17J07q4K9J6L1Mj14m4P0K9P3j21j4RN4J11r8j0m3N0P3K0
$$ -39 -86 -74 -64 -30 -86 -21 -138 -31 -115 -86 -70 -39 -35 -149 -193 -123 -94 -21 -142 -156 -147 -93 18 -80 -90 -133 -83 -10 10
2707A0o4j0L9lpkO6qn0OO3o3J50k9q6m4J50m8K4Pm3l0P1M3mq7j6JM3l4%L9L8l1
$$ 10 -54 -64 -25 -28 -35 -37 29 21 -29 -23 40 -23 127 98 12 -32 118 70 94 101 58 28 99 142 138 51 35 36 79 45 45 84 122 91
2741I1k5N5L0k0J6o2o3O4M6k0o7qn0P1Pj6j6j17Q3K8m4J5K6N5n8p8M8M3k5nq1
$$ 91 66 121 151 131 147 85 22 86 132 112 45 37 -13 58 65 49 33 -84 -1 27 -17 -2 24 79 21 -57 -9 34 9 4 -77
2772g7O1o5R5l3l3rn6J00J1l8N8r5l9J07m2N7j17k1K7K9N3l6M5%o8qOQ3J2p0N5
$$ -77 -16 -81 14 -19 -52 -61 -117 -17 -6 -44 14 -81 -120 -13 -55 2 -115 -136 -109 -80 -27 -63 -18 -18 -86 -94 -88 -5 7 -63 -8
2803hr1J59l9k1o5L3J8K6k2Qj1l2M2J2j4j2P1pm9r4J24L1L2j64P7nk3N6K2q3K2
$$ -8 -99 60 21 0 -65 -32 -14 12 -10 -2 -13 -45 -3 9 -5 -17 54 47 -2 -96 28 59 91 -73 4 -1 -24 32 54 -29 -7
2834gm3R6j2l9j7qO6m3pJ4M3n3ll1L8J3l8L7J5o3J6P3J3j34M8Q0j7k0l6l1N3K4
$$ -7 -50 46 34 -5 -22 -30 36 -7 -14 0 43 -10 -13 -44 -6 7 -31 6 21 -42 -26 47 60 -74 -26 54 37 17 -19 -50 3 27
2866B7k6l9M3j8L4j4K1J3Rl0l3j5%O8mj6o4K7O4J2k7l5j6M2l2N8r1O0m4J5P6M
$$ 27 1 -38 5 -13 21 7 28 41 50 20 -13 -28 -28 40 36 20 -44 -17 47 59 32 -3 -19 23 -9 49 -42 18 -26 -11 65 69
2898F9m4n3J4l1R7p0L4qNl7J9K4M8K0r2j0j3lJ16r4lp3J14l5O1j14L0N4N6p1L0
$$ 69 25 -28 -14 -45 52 -18 16 8 13 -24 -5 19 67 87 -5 -15 -28 -31 85 -9 -12 -85 29 -6 55 -59 -29 25 81 10 40
2929D0m1jl7j0M4JL0opo4R1p2K5l3J4lN3K5r0k2J0K9l0O8M0q8P6k4o0N5l1L6p7
$$ 40 -1 -2 -39 -49 -5 -4 26 20 13 -51 40 -32 -7 -40 -26 -29 24 49 -41 -63 -53 -24 -54 14 54 -34 42 18 -42 13 -18 18 -59
2962e9j1k6Q0P4r2j1j4M4NMmm8O3n3j4P1m5k8P0j8MJ8l9lp0P3k5N2J09j29NqK7
$$ -59 -70 -96 -16 58 -34 -45 -59 -15 -10 -6 -10 -58 5 -48 -62 9 -36 -64 6 -12 -8 10 -29 -32 -102 -29 -54 -2 107 -22 -17 -25 2
2995BL1o2L8l4k1O1O3n9q5L1j9R5m5O7l1j0MpO1j5J8K6k1l9K4k5M0l7k5j6P7M
$$ 2 33 -29 9 -25 -46 15 78 19 -66 -35 -54 41 -4 63 32 22 26 19 80 65 83 109 88 49 73 48 88 51 26 10 87 91
3027I1K5j23L3mk0J39Qn6Pn0n1M8JL0p1J0o1Q5j2j4K1l6J0L7K1l3j11j9N7PLM6
$$ 91 116 -7 26 22 2 141 149 93 100 50 -1 47 48 78 7 17 -44 41 29 15 36 0 10 47 68 35 -76 -95 -38 -31 -28 18
3059A8j13l3J22l4j0k5L4m7L1n1L1JL5m0K8J7L5Np5n4Q3%NN5n6j3k8M2n1P1L4
$$ 18 -95 -128 -6 -40 -50 -75 -41 -88 -57 -108 -77 -76 -41 -81 -53 -36 -1 4 -71 -125 -42 -42 -37 18 -38 -51 -79 -37 -88 -17 17
3090A7j12O5L9p9R8o4JK2L0N7n4Om0P0K0k9QM5q1k8LK8K7m5P5k3n9Q9ql3L7j8
$$ 17 -95 -30 9 -70 28 -36 -35 -13 17 74 20 26 -14 56 76 47 55 100 19 -9 -6 22 49 4 79 56 -3 86 78 45 82 64
3122F4m4L0j7M1l4m7K9Qj6L6J9k9J0r4O6K2o7O2j9o3P3l3M6r4Q2l2J3k5k8K0l9
$$ 64 20 50 33 74 40 -7 22 30 14 50 69 40 50 -44 22 44 -23 39 20 -43 30 -3 43 -51 31 -1 12 -13 -41 -21 -60
3153f0N4l4nKL5o3K4M3m9Q7p1N1K7r7P8nm9j9oJ8N6l3Lj1l3P1l0K0p5N9L4j8p9
$$ -60 -6 -40 -45 -43 -8 -71 -47 -4 -53 34 -37 14 41 -56 22 17 -32 -51 -57 -39 17 -16 -13 -24 -57 14 -16 4 -71 -12 22 4 -75
3186g5Q2L5n7K8J3l7J8o7R5j9%K9o5P6l2J5m6J17k2k8k9j3j6j6O5k5k4Pj7K9j7
$$ -75 7 42 -15 13 26 -11 7 -60 35 16 16 45 -20 56 24 39 -7 110 88 60 31 18 2 -14 51 26 2 9 -8 21 4
3217DpL6o0j7O7m0R7l3rj7m1KO2m8m6KM6mj3qRLm8k6K0L4o5PN0l5M6om4Ok8Q2
$$ 4 -3 33 -27 -44 23 -17 80 47 38 21 -20 -18 44 -4 -50 -48 -2 -6 -19 -27 -18 -15 -63 -89 -69 -35 -100 -93 -43 -78 -32 -38 -82 -76 -104 -22
3253b2l1N0n2j8M3n5R4L1o2j7K6K6m3N3L7j00K0M7J4J2J2nj11J13pk6K1M4o3J8
$$ -22 -53 -3 -55 -73 -30 -85 9 40 -22 -39 -13 13 -30 23 60 -40 -20 27 41 53 65 60 -51 62 55 29 50 94 31 49
3283D9N1j4n7M1o9O0j6K2L9o9J16j12M1N5o2J6l3p6Q1j7K4J3ro3K1J5K6r4P4r2
$$ 49 100 86 29 70 1 61 45 67 106 37 153 41 82 137 75 91 58 -18 63 46 70 83 74 11 32 47 73 -21 53 -39
3313c9R2K1k9j7n0l7Q6o4Q1k1j08P3q8O3J3j5j8Qq8J13Nr1R1q3K3L4LN0p8M5j4
$$ -39 53 74 45 28 -22 -59 27 -37 44 23 -85 -12 -100 -37 -24 -39 -57 -49 -137 -24 -19 -110 -19 -102 -79 -45 -42 8 -70 -25 -39
3344c9k9O0n4K2m7k6M9K9K0Pl6n0Q8L8j04K4j0L9%K4P5p7L5j0l7K7K3j5m2Q8l6
$$ -39 -68 -8 -62 -40 -87 -113 -64 -35 -15 -8 -44 -94 -6 32 -72 -48 -58 -19 -19 5 80 3 38 28 -9 18 41 26 -16 72 36
3375C6J8%L2Op4k4J31p1N2p5%j9M5J9k1J9p5J10q0K9J4l9O7j42O1K6K4r9k2J9
$$ 36 54 54 86 92 18 -6 125 54 106 31 31 12 57 76 55 74 -1 109 29 58 72 33 100 -42 19 45 69 -30 -52 -33
3405c3N8l6J26j18mOn6M1Rm8K5l2kJ5jJ5R6j04L3l2P3n0n8M8k1J9N8p1M0p1J3
$$ -33 25 -11 115 -3 -7 -1 -57 -16 -7 -55 -30 -62 -64 -49 -50 -35 61 -43 -10 -42 31 -19 -77 -29 -50 -31 27 -44 -4 -75 -62
3436f2Q8j6k6m5P2jp5R8J1n7Q4r8j4Q1l4l4O4o3P9m0kJ12j50K1M5K4p3N7q9M8
$$ -62 26 10 -16 -61 11 10 -65 33 44 -13 71 -27 -41 40 6 -28 36 -27 52 12 10 122 -28 -7 38 62 -11 46 -43 5
3466EJ06p3K3L5l6q1O1N8n8L4p1J1j3pL7L5k3l7L9j03N5PK0Pj11Q9j9J0m5j9M4
$$ 5 111 38 61 96 60 -21 40 98 40 74 3 14 1 -6 31 66 43 6 45 -58 -3 4 24 31 -80 9 -10 0 -45 -64 -20
3497b0pnJ2l4k0JRK2K6q0K9K4r8R3j5J8l8J03p0K4o3M1J8Nk6J0L6lK0n3K5jj5
$$ -20 -27 -32 -20 -54 -74 -73 -64 -42 -16 -96 -67 -43 -141 -48 -63 -45 -83 20 -50 -26 -89 -48 -30 -25 -51 -41 -5 -8 12 -41 -16 -17 -32
3530c2pN6lL2m0L8Nj3p4K8P4j1J2m8P2jn3M3l5M5q9N1QJ9J1Or7M0O5m2l5M1k0
$$ -32 -39 17 14 46 6 44 49 36 -38 -10 64 53 65 17 89 88 35 78 43 88 -1 50 58 77 88 94 -3 37 102 60 25 66 46
3563D6j6M4l9N1l7l0j5rL9JL2K6r0m1K7L8l2K2l4NK1n9P4j06oJ5j5P3m9j3L3L3
$$ 46 30 74 35 86 49 19 4 -5 34 35 67 93 3 -38 -11 27 -5 17 -17 -12 9 -50 24 -82 -88 -73 -88 -15 -64 -77 -44 -11
3595a1j4l8N5p3j4R1m3J5k7J2pl6O5m0L3Kk4n0R3j07M8N0k6K9m0RO1m6oM6Jj8
$$ -11 -25 -63 -8 -81 -95 -4 -47 -32 -59 -47 -54 -90 -25 -65 -32 -30 -54 -104 -11 -118 -70 -20 -46 -17 -57 -48 13 -33 -39 7 8 -10
3627a0J6O9r3O0Po4J02J9l3k4p2N9L8k7m3Q5j5m7L1M5p8Pm7J09q7mP9o9M8lj4
$$ -10 6 75 -18 42 49 -15 87 106 73 49 -23 36 74 47 4 89 74 27 58 103 25 32 -15 94 7 3 82 13 61 58 44
3658D4j6K8n2qJ2J5j7L5k4kK8k9L7k9j4L1J7m9k8l4O3n1J1O0m9Qm4M3j5j6O4n7
$$ 44 28 56 4 -4 8 23 6 41 17 15 43 14 51 22 8 39 56 7 -21 -55 8 -43 -32 28 -21 -13 -57 -14 -29 -45 19 -38
3690c8P0Olp4j4k0K2Q7p9N8LO3j15L9j5k5N8n8K7M9o0N4j00J17m0K9kk7KJ3j5
$$ -38 32 38 35 -39 -53 -73 -51 36 -43 15 18 81 -34 5 -10 -35 23 -35 -8 41 -19 35 -65 52 12 41 39 12 14 27 12
3721A2J2l3J2j5L2l0M1j3L5N0m6J4k5k8L0j8M7j8m4L1m3J0Mj6M5o2O6o4MNmN2
$$ 12 24 -9 3 -12 20 -10 31 18 53 103 57 71 46 18 48 30 77 59 15 46 3 13 17 1 46 -16 50 -14 -10 -5 -9 43
3753D3p7K9l0L7k5M2k6l3p4J06k4QJp9K0R1m9l1J1L1l1Mj8O3j6LJ9M6j03L5K7
$$ 43 -34 -5 -35 2 -23 19 -7 -40 -114 -8 -32 -24 -23 -102 -82 9 -40 -71 -60 -29 -60 -56 -74 -11 -27 -24 -5 41 -62 -27 0
3784@o4N6l6K0K6nLk5L8K7pJ1o7Q2m6J4J3O4m1p7K0OJ7nM3l9J9N1m9J8N8o1m8
$$ 0 -64 -8 -44 -24 2 -3 0 -25 13 40 33 44 -23 59 13 27 40 104 63 -14 6 12 29 24 67 28 47 98 49 67 125 64 16
3817A6K7P2o2Oo9j3N1%lJ8Rl5j2l8QM1Nj8LJ4K2ok6k3J6JJ1%J8m4N1q1M8nm0L8
$$ 16 43 115 53 59 -10 -23 28 28 25 43 52 17 5 -33 -25 16 21 3 6 20 42 36 10 -13 3 4 15 15 33 -11 40 -41 7 2 -38 0
3853@P2k1m2l7N2r1kJ11j23K5K4P3q0J9J2l7K7m9O7j8J3j22J35n5j5M3l2RK1K8
$$ 0 72 51 9 -28 24 -67 -69 42 -81 -56 -32 41 -39 -20 -8 -45 -18 -67 0 -18 -5 -127 8 -47 -62 -19 -51 -42 -21 7
3883Gm2J5LO8n5k3Jn6P1n5J6O1m1M3lk3%l1M7j1N3m5L0K1o5j6JR1Ml9o6j0R3l2
$$ 7 -35 -20 -17 51 -4 -27 -26 -82 -11 -66 -50 11 -30 13 10 -13 -13 -44 3 -8 45 0 30 51 -14 -30 -29 62 66 27 -39 -49 44 12
3917A2L3n5j0O0l5j5N6P3j33KN3k1L6j6o4R1p2M1n8j0O7k5LJ2l5J9qJ4om6L7j7
$$ 12 45 -10 -20 40 5 -10 46 119 -14 -12 41 20 56 40 -24 67 -5 36 -22 -32 35 10 13 25 -10 9 1 15 9 -37 0 -17
3949a7RmN5q8N4l9K0L7ql8P3n9J4o8N1K5m4L9M3ro9J6LJp9J12o0PK2j3J4P2r1
$$ -17 -8 -12 43 -45 9 -30 -10 27 19 -19 54 -5 9 -59 -8 17 -27 12 55 46 -23 -7 -4 -3 -82 30 -30 -23 -1 -14 0 72 -19
3982a9K8K9Ql8J4j8OOJoL3k9pJj3j1k9Q2l6k3J0M0L7q7l4QP5L2j48N0rP7n4L9
$$ -19 9 38 46 8 22 4 10 16 17 11 44 15 8 9 -4 -15 -44 38 2 -21 -11 29 66 -21 -55 -47 28 60 -88 -38 -47 30 -24 15
4016A5L1o1k5P7Pj01L4k4J4mO4o6N2j6m1qK1qL0K2j8K8kk7rL2o3LN0K7p2M4ol2
$$ 15 46 -15 -40 37 44 -57 -23 -47 -33 -37 27 -39 13 -3 -44 -52 -31 -39 -9 13 -5 23 21 -6 -15 17 -46 -43 7 34 -38 6 0 -32
4050c2L8m1P7r3N0J1k6P3n1rj6L2Pk5j0pP4o2O2n9K6l6J9L1j9L2k4O5o9K6q0O4
$$ -32 6 -35 42 -51 -1 10 -16 57 6 -3 -19 13 20 -5 -15 -22 52 -10 52 -7 19 -17 2 33 14 46 22 87 18 44 -36 28
4082B8J4q9Q1m9J8QK4N%j00K7KN5m3J01Jq3K7l4M7l0rP3l9p3J04m5kqj5J1K0j2
$$ 28 42 -47 34 -15 3 11 35 40 40 -60 -33 -31 24 -19 82 83 0 27 -7 40 10 1 74 35 -38 66 21 19 11 -4 7 27 15
4115A5k6oL7p2J6Q9j00K0j1J4PK1k6K0L9p8N5L7o3l2J5K0oK6m8m8L0j4N3j2O4
$$ 15 -11 -17 20 -52 -36 53 -47 -27 -38 -24 -17 4 -22 -2 37 -41 14 51 -12 -44 -29 -9 -15 11 -37 -85 -55 -69 -16 -28 36
4146C6jl0p5N0%k7l3M5O2n6j6L0L7K6j04L3N0J5k2n7L4L6pl4k8PN6p9N3M7j11
$$ 36 35 5 -70 -20 -20 -47 -80 -35 27 -29 -45 -15 22 48 -56 -23 27 42 20 -37 -3 33 26 -8 -36 -29 27 -52 1 48 -63
4177f3L7k1O8n8Q7rm0Kl1K5K9o3K4M3l5k4L4N2j4l0N8jm5j6Q%lj6N%j0lk3J6J6
$$ -63 -26 -47 21 -37 50 41 1 3 -28 -3 26 -37 -13 30 -5 -29 5 57 43 13 71 70 25 9 17 17 14 -2 3 3 -7 -10 -33 -17 -1
4212aLm8K0L9K4k3l5P6K3m6m4J5Rl3P0p5M8j8J5o4%L6L3Ml9K4%J3k4J5k1KO3j04
$$ -1 2 -46 -26 13 37 14 -21 55 78 32 -12 3 12 -21 49 -26 22 4 19 -45 -45 -9 24 28 -11 13 13 26 2 17 -4 -2 61 -43
4246d3J9k4O1o6M4K4Qm8L5k4L0l5m8Q4j9L1m7k2nM0MP9o1l1J1K2Jo9O8J5l5O5
$$ -43 -24 -48 13 -53 -9 15 23 -25 10 -14 16 -19 -67 17 -2 29 -18 -40 -45 -5 -1 78 17 -14 -3 19 20 -49 19 34 -1 64
4278F4l1q4L5l9M6Oj6N7j16N3j1J8qO6l6ln4L4M1lK7k8l7M2k9k2M9k3l9KK2N8
$$ 64 33 -51 -16 -55 -9 -3 -19 38 -78 -25 -36 -18 -26 40 4 1 -53 -19 22 19 46 18 -19 23 -6 -28 21 -2 -41 -39 -17 41
4310D1l7J4n1K8Pj3k9N2m3L8L6n2K6j1l0L5j03L8P7n3K5J0M6k4n6K9k4l4K4N0
$$ 41 4 18 -33 -5 2 -11 -40 12 -31 7 43 -9 17 6 -24 11 -92 -54 23 -30 -5 5 51 27 -29 0 -24 -58 -34 16
4340A6l1L9l1k6K8rK3K6Rq1Q0l8j7O5o9L1k6J0K4k7j3N0m4N1k7L5mo9P3q1O1j5
$$ 16 -15 24 -7 -33 -5 -14 9 35 44 -37 43 5 -12 53 -16 15 -11 -1 23 -4 -17 33 -11 40 13 48 44 -25 48 -33 28 13
4372A3J6k7J7rJ2kp%m4K7j5Q0n6Npk0L9n1p1J27qJ3q4P2K7n6j0K0j7j8L7j4K6
$$ 13 29 2 19 10 22 20 13 13 -31 -4 -19 61 5 10 3 -17 22 -29 -100 27 19 32 -52 20 47 -9 -19 1 -16 -34 3 -11 15
4405A5o1N9l7j8J1J0nMlJL3n1k0J9q2O3N6j0l3l5N5L9Mo0K7N1j22Q6j4QM8q7O1
$$ 15 -46 13 -24 -42 -31 -21 -26 -22 -25 -24 9 -42 -62 -43 -125 -62 -6 -16 -49 -84 -29 10 14 -46 -19 32 -90 -4 -18 -10 38 -49 12
4438A2ploM0m4J0N4q3l9N3k2P2l8m6M3Nk0M3k0J4l4M7J0m5JO0m4k5L9j5k1rK0
$$ 12 5 2 -4 36 -8 2 56 -27 -66 -13 -35 37 -1 -47 -4 1 -19 24 4 18 -16 31 41 -4 -3 57 13 -12 27 12 -9 -18 2
4471B%Jj2L4jj6j4L5k9l0k2Q0rPjk9l1J5N5n8K6l3M6J1o0Q1j24L4M5qO0r9MN8
$$ 2 2 3 -9 25 24 8 -6 29 0 -30 -52 28 19 26 25 -4 -35 -20 35 -23 3 -30 16 27 -33 48 -76 -42 3 -5 55 -44 -40 18
4505A8K1n5KJN8p9M0l2L1o7K5K6j4l9J44n2m6L0OL5n4K2K0j46R8j0rJ6QN4n5R
$$ 18 39 -16 -14 -13 45 -34 6 -26 5 -62 -37 -11 -25 -64 80 28 -18 12 18 53 -1 21 41 -105 -7 -17 -26 -10 -2 52 -3 6
4537Fp1R8k0o9Q9o5N6Lm1M0p5P0J3l2J6rk8k9N5K9l7k2L4lj8j3M4k8Kj0O5r8K8
$$ 6 -65 33 13 -56 33 -32 24 27 -14 26 -49 21 34 2 18 9 -19 -48 7 36 -1 -23 11 8 -10 -23 21 -7 -5 -15 50 -48 -20
4570b0L5o6O3J7m7L3m4Q8o4M0r2M5L8k5Nr5J02nJ2q4K0N0kJ5K6o1L6j9Q3k3%o1
$$ -20 15 -51 12 29 -18 15 -29 59 -5 35 -57 -12 26 1 6 -89 13 8 20 -64 -44 6 4 19 45 -16 20 1 84 61 61 0
4602@o7J26m2j01J16n4j0N3m5L2m3Q1n0MN5n1O7j3l7rj0k5R2kk9O3r7P1j6m2k4
$$ 0 -67 59 17 -84 32 -22 -32 21 -24 8 -35 46 -4 0 55 4 71 58 21 12 2 -23 69 67 38 101 4 75 59 17 -7
4633gkN9l6N1o8L1Jl4mK1M0p4M5K2q2j1J07m4J2m8L8m8k1K0K9oJ4Ok5j0j5O8o5
$$ -7 -9 50 14 65 -3 28 29 -5 -9 12 52 -22 23 45 -37 -48 59 15 27 -21 17 -31 -52 -32 -3 -9 5 11 -14 -24 -39 29 -36
4666c6K7j5Rp0M4m1J05qj4l8j7k2M2M9o6P2j15J22q6lK2J3M6l6j6OQPl1N3p9N3
$$ -36 -9 -24 -15 -85 -41 -82 23 15 1 -37 -54 -76 -34 15 -51 21 -94 28 -58 -61 -39 -26 20 -16 -32 -26 -18 -11 -42 11 -68 -15
4698a5N4lK3o7lQ1q3M5n2O7p2P6k4p7P4K1k2J4pl1j3OL9o8N7RL1o5L8n6Q8o3N4
$$ -15 39 36 59 -8 -11 70 -13 32 -20 47 -25 51 27 -50 24 45 23 37 30 -1 -14 -8 31 -37 20 29 60 -5 33 -23 65 2 56
4731E6j3j1%j10J16l7j8M9L1n3j8M6L3n8m8M3lj9JJ3k7MM9J0q4P6J1l4k3J0M9
$$ 56 43 32 32 -78 38 1 -17 32 63 10 -8 38 71 13 -35 8 5 -14 -13 0 -27 -23 26 36 -48 28 39 5 -18 -8 41
4762D1n6j4N6l7Lj0LpKj2L3R0r4oK4Jo2M5j4kl0L8K4l6l2L5M0j2k7j4J7l3R8m1
$$ 41 -15 -29 27 -10 -7 -17 -14 -21 -19 -31 2 92 -2 -8 16 17 -45 0 -14 -16 -46 -8 16 -20 -52 -17 23 11 -16 -30 -13 -46 52 11
4796A1KjM4j7o5O7m6L9j9oj1j3K2kJ2k8j9O2j1l1k9P1rm1j3M3k4KP5k9k7kl4J9
$$ 11 13 12 56 39 -26 41 -5 34 15 9 -2 -15 7 5 17 -11 -30 32 21 -10 -39 32 23 -18 -31 12 -12 -10 65 36 9 7 -27 -8
4830hl0J8kN3k2m9M4K1o0L0KlL6m1O9k0r5M8m1J03m9j3M6o8J8Qq1J58r7J4M2n9
$$ -8 -38 -20 -22 31 9 -40 4 25 -35 -5 -3 -6 30 -11 58 38 -57 -9 -50 53 4 -9 37 -31 -13 -5 -86 72 -25 -11 31 -28
4862b8L4J2k5m7L7K8M5n5l4O1k2j8lm0R2j8M1m0Rj5J7L1K3j01P1o9O3n1N5n7L3
$$ -28 6 18 -7 -54 -17 11 56 1 -33 28 6 -12 -15 -55 37 19 60 20 29 14 31 62 85 -16 55 -14 49 -2 53 -4 29
4893B9m0J8l3M5qOk0L4J8Ql3LK6ok4KJ6q5N5NM5n6n8M8k0N3k9j8M8j4Ok4KLk5
$$ 29 -11 7 -26 19 11 17 -3 31 49 57 24 27 53 47 23 25 41 -44 11 16 61 5 -53 -5 -25 28 -1 -19 29 15 21 -3 -1 2 -23
4928b3M5j5q8J03o7K0L7j8ql0MN6j6J2mm0L2K4l1K9l2KkK4r7M3M9n2M8l5J6N9
$$ -23 22 7 -81 22 -45 -25 12 -6 -14 -44 -40 16 0 12 8 -32 0 24 -7 22 -10 -8 -10 14 -83 -40 9 -43 5 -30 -14 45
4960D5k0j9l5M5lp2J07m8J8p6KO7k3M7k6q0Q2k3K2J6No3K7L6n3M7K2j9l3m5P2
$$ 45 25 6 -29 16 13 -59 48 0 18 -58 -56 11 -12 35 9 -71 11 -12 10 26 31 -32 -5 31 -22 25 47 28 -5 -50 22
4991B2%Kll7L1k0K5jOm2N0JL0q8K8l1L2K5l2Lj9M5oo4J9L6Nk2j2J4N5k4J1k3k1
$$ 22 22 24 21 -16 15 -5 20 19 25 -17 33 34 64 -24 4 -27 5 30 -2 1 -18 27 21 -43 -24 12 17 -5 -17 -3 52 28 39 16 -5
5026ej4L6j05P2O7Mr0K9M9j9Ro3L2Jo9P3M7j2ol9O6o8Rqnk0L9K0L9o0m1k1Q5p
$$ -5 -19 17 -88 -16 51 55 -35 -6 43 24 33 -30 2 3 -66 7 54 42 36 -3 63 -5 4 -4 -9 -29 10 30 69 9 -32 -53 32 25
5060B5k9J2loL1n3J03j08k%N7l2J3n3K8J9j1J9K7m4K4j6m5N1mk3M1mlJ0j7P1p3
$$ 25 -4 8 5 -1 30 -23 80 -28 -30 -30 27 -5 8 -45 -17 2 -9 10 37 -7 17 1 -44 7 3 -20 21 17 14 24 7 78 5
5093EO2n9l4K5JnJ7o1J9J2L6mJ3o1K4j2L6j2Q9q8kN3o3K3kpj4M2J5j06j2O8k5
$$ 5 67 8 -26 -1 0 -5 12 -49 -30 -18 18 14 27 -34 -10 -22 14 2 91 3 1 54 -9 14 12 5 -9 33 48 -58 -70 -2 -27
5126b7Ql0K7l2O6M5o9L1p1N9k7l4K3O7q5R4m0N9n6M9o3J2p7J01J4n6O4p4O6p8
$$ -27 -19 -49 -22 -54 12 57 -12 19 -52 7 -20 -54 -31 36 -49 45 5 64 8 57 -6 6 -71 30 44 -12 52 -22 44 -34
5156c4O0L0j5m2km1L5J8K5Km3L9Lk4nl1L9j7L7J1k7J0J8r2O0Jl1N4n2M7j39P9
$$ -34 26 56 41 -1 -3 -44 -9 9 34 36 -7 32 35 11 6 -25 14 -3 34 45 18 28 46 -46 14 15 -16 38 -14 33 -106 -27
5188b7M5L5n2J5L6k9J9r1J4J16o9l6rJ3L4l3j9k4J2K7Q1q5Kl0N9l7MM4k7m5K0
$$ -27 18 53 1 16 52 23 42 -49 -35 81 12 -24 -33 -20 14 -19 -38 -62 -50 -23 58 -27 -25 -55 4 -33 -29 15 -12 -57 -37
5219c7J6j6L9m0j2K3l3J2P5n4NRk5P7r5Q1j5l3K4K4p0L9Nk5L3J7l0j7m8P3L9l3
$$ -37 -21 -37 2 -38 -50 -27 -60 -48 27 -27 -22 -13 -38 39 -56 25 10 -23 1 25 -45 -6 -1 -26 7 24 -6 -23 -71 2 41 8
5251HP8j06k7Q5m0o1J20k5p2K8kN3Lm6Mj5K3N5p5NRqOK1J9o5J35n1n4M1l5k8j3
$$ 8 86 -20 -47 38 -2 -63 57 32 -40 -12 -14 39 42 -4 0 -15 8 63 -12 -7 2 -6 0 21 40 -25 110 59 5 46 11 -17 -30
5284c0M6J7p8J5j4k1M0M3M9l4nOnk1K0k1O9j16PN4Ql4Lk2N2Ooj4jr0O0K7L1o5
$$ -30 16 33 -45 -30 -44 -65 -25 18 67 33 28 34 29 8 28 7 76 -40 -33 21 29 -5 -2 -24 28 34 28 14 13 -77 -17 10 41 -24
5318b4O8n1k6NM5Qn0N1m3K6K8l3No9O3mn3O9m7mJ0M3j7J6PJ8n8K5K6p5K9P0j19
$$ -24 44 -7 -33 -28 17 25 -25 26 -17 9 37 4 9 -60 3 -1 -54 15 -32 -36 -26 17 0 16 23 41 -17 8 34 -41 -12 58 -61
5351f1P2k6k8O1R0q9l1K9k6J2k4J04r9L9j3k0l5rm2O3Q0J6o7Lj0K1n7M8L4m2j1
$$ -61 11 -15 -43 18 108 19 -12 17 -9 3 -21 83 -16 23 10 -10 -45 -54 -96 -33 47 63 -4 -1 -11 10 -47 1 35 -7 -18
5382a8j5N1M1m8k6J5O0n6j7J01n7m0L6on3K2l1NL7j9J0K6l0kL6L8m6l3mK9l7M4
$$ -18 -33 18 59 11 -15 0 60 4 -13 88 31 -9 27 21 -32 -10 -41 -36 1 -18 -8 18 -12 -14 22 60 14 -19 -23 6 -31 13
5414A3m5R0o6RK9m4M9r3R5l2N5n0rN7k7K4n1qM8j0k2O5p4M3J1p5M2kn5P5M6j01
$$ 13 -32 58 -8 1 30 -14 35 -58 37 5 60 10 1 58 31 55 4 -4 44 34 12 77 3 46 57 -18 24 22 -33 42 88 -13
5446a3M5Qn5j0j2J13m3nL6m6J1L7q0L9l7O0r7O8RPlk3LM3p7N8k6j8j6J6j6L4j1
$$ -13 32 40 -15 -25 -37 76 33 28 64 18 29 66 -14 25 -12 48 -49 19 28 35 32 9 12 55 -22 36 10 -8 -24 -8 -24 10 -1
5479aL1j3K1p0O5k6K6r5Q5o6K8l5J5M9n3J8P5n1l9J5M6q3J05j6j2l5J1j4L7%K5
$$ -1 30 17 38 -32 33 7 33 -62 23 -43 -15 -50 -35 14 -39 -21 54 3 -36 -21 25 -58 47 31 19 -16 -5 -19 18 18 43
5510D3q4N2m0K7M3j10P7k1N1l8j4K1K6n1J0pJ8nl1Q7o6Q8j34O8o7L0M7nJ4J8R
$$ 43 -41 11 -29 -2 41 -69 8 -13 38 0 -14 7 33 -18 -8 -15 3 -2 -33 54 -12 76 -58 10 -57 -27 20 15 29 47 56
5541E6j24J35o6M7J4o6L8k2KJ1j8Qk4P2j3j7l2K9L1p7K5L2n7N5oJ2m6k0N8ll5
$$ 56 -68 67 1 48 62 -4 34 12 14 25 7 15 -9 63 50 33 1 30 61 -16 9 41 -16 39 33 45 -1 -21 37 34 -1
5572aJ0l0O6m1j9L2p1L1M0L5m1K6l6M4Km5l8QO6rk6L0J7J7p3K1l0L2PPl5j3J6
$$ -1 9 -21 45 4 -15 17 -54 -23 17 52 11 37 1 45 47 2 -36 -28 38 29 3 33 50 67 -6 15 -15 17 24 31 -4 -17 -1
5605aK9j6K3J4J0o0m1N7KNj9m5N6j3L8o8R1k4Kj1k4J1P9m4l4K3k6j3rK9nk2nO
$$ -1 28 12 35 49 59 -1 -42 15 17 22 3 -42 14 1 39 -29 62 38 40 29 5 16 95 51 17 40 14 1 -8 21 16 -6 -11 -5
5639eqQRom1M3j7j1KK2K3o9J8P2p3O3l2J2QK1l4KK5%m2OK0j4O8j1p1O2m4n2M1
$$ -5 -13 -5 4 -2 -43 0 -17 -28 -26 -4 19 -50 -32 40 -33 30 -2 10 18 39 5 7 32 32 -10 -4 16 2 70 59 -12 50 6 -46 -5
5674eKOJ3k8MK3k7K9k7N0p3j2N5M6j00O0j0J1k6K3k6L0N2q2PL9Np0N3n7J9M4l3
$$ -5 -3 3 16 -12 -8 15 -12 17 -10 40 -33 -45 10 56 -44 16 6 17 -9 14 -12 18 70 -12 -5 34 39 -31 22 -35 -16 28 -5
5707eL7l9jO6Oq2L8j7j0M3o8J7LkP5j6n7K6n7M5j0Q1j01K0K1prl6K7kl3Q7j9L1
$$ -5 32 -7 -8 58 64 -18 20 3 -7 36 -32 -15 -12 -14 61 45 -12 14 -43 2 -8 73 -28 -8 13 6 -3 -39 -12 -14 -47 40 21 52
5741E2m5j0N6j05Q2k1k3K2k7M5kr9N0L4J6p3M9n8k2L3R7kl3jm1KQ4q0LJ8l4P1
$$ 52 7 -3 53 -52 30 9 -14 8 -19 26 24 -75 -25 9 25 -48 1 -57 -79 -46 51 49 16 15 -26 -24 60 -20 -17 1 -33 38
5773C8q8Q8k3N6r9N1Qj0k1J3l2l9Q0K3j9nm1oK3j1J0l6L7m6M1L9m0l8J04j1m0
$$ 38 -50 38 15 71 -28 23 31 21 0 13 -19 -58 22 45 26 21 -20 -26 -3 -14 -4 -40 -3 -49 -8 31 -9 -47 57 46 6
5804FM8m8j6k7N2RPJn6Q2l9o8kM1K3O3rn3L7q3J5KK4K0K2o1N8n4j4L1l7M1k3L6
$$ 6 54 6 -10 -37 15 24 31 32 -24 58 19 -49 -51 -10 13 76 67 14 51 -32 -17 -15 9 29 51 -10 48 -6 -20 11 -26 15 -8 28
5838B8k4oLl6M6J4j5N6p9m0O1M0q2K2Q3j06K5K1j3Ln9J3RN%O5km2J3o8M1k9L5
$$ 28 4 -2 1 -35 11 25 10 66 -13 -53 8 48 -34 -12 71 -35 -10 11 -2 1 -58 -45 -36 -31 -31 34 32 -10 3 -65 -24 -53 -18
5871a8km8O2K0K6m5j5L2K9p7M2j9L1m4K1J5K6jk8J5j7k3L5L4l8k5m3N2J4N2m5
$$ -18 -20 -68 -6 14 40 -5 -20 12 41 -36 6 -13 18 -26 -5 10 36 35 7 22 5 -18 17 51 13 -12 -55 -3 11 63 18
5902A8m4M6km6P2j4m1L8m3J4J7k4m1QM6m2KM1k1K2K6l6MKj9N4q8J4L3o3O4J5J
$$ 18 -26 20 18 -28 44 30 -11 27 -16 -2 15 -9 -50 -42 4 -38 -36 5 -16 6 32 -4 0 2 -17 37 -51 -37 -4 -67 -3 12 13
5935A3k1J0%m8P0k1m8L5M9l2N1n4n6O3m9J6l2P0J2k6MM9nn7L1%p9J10o3L0k2J9
$$ 13 -8 2 2 -46 24 3 -45 -10 39 7 58 4 -52 11 -38 -22 -54 16 28 2 6 55 50 -7 24 24 -55 55 -8 22 0 19
5967A9L6r6P0k3Ml1j2M1j6K6NJ8o4J0N7J1j0l1p1L4LkJ1K8n0P8j5QJ7q4J4L7j9
$$ 19 55 -41 29 6 10 -21 -33 8 -8 18 23 41 -23 -13 44 55 45 14 -57 -23 -20 -22 -11 17 -33 45 30 38 55 -29 -15 22 3
6000CK8m2k7Q2n4mQJ3J0%m1j9k0K7j9MMJ1k3K9Q0j8m4rj2L8L8k1q7O4j2m6M7L7
$$ 3 31 -11 -38 44 -10 -14 -6 7 17 17 -24 -43 -63 -36 -55 -51 -47 -36 -59 -30 50 32 -12 -21 -33 5 43 22 -65 -1 -13 -59 -12 25
6034B5p3K0JrM0j5l5N3l7KjoK2j1pP6m2K3o3K2O0p0m9M3M1o3O4l7L7j9rnO0q2
$$ 25 -48 -28 -27 -36 4 -11 -46 7 -30 -28 -29 -35 -13 -24 -31 45 3 26 -37 -15 45 -25 -74 -31 10 -53 11 -26 11 -8 -17 -22 38 -44
6068d4Q0Kql7m9O2pk9K8kL7l3K5j6Rj3OL2l4L9q5RN1K9q1Q0m1K7k8j5Q9p2m1K6
$$ -44 36 38 30 -7 -56 6 -1 -30 -2 -4 33 0 25 9 18 5 11 43 9 48 -37 -28 23 52 -29 51 10 37 9 -6 83 11 -30 -4
6102dmk5M3m6N9k9ON0k8M8p1M7j5k7m2pO3M6n3k2n2P7j5lJK8j7L7k0n4N7l5N5
$$ -4 -8 -33 10 -36 23 -6 0 50 22 70 -1 46 31 4 -38 -45 18 64 11 -11 -63 14 -1 -4 -3 25 8 45 25 -29 28 -7 48
6135D8l9K1j0K0n6K7l7M1%J5k0LLj7k6K3j2R8n5L3o3l9K2Q0j26J02n5K3p8K3l5
$$ 48 9 30 20 40 -16 11 -26 15 15 30 10 13 16 -1 -27 -4 -16 82 27 60 -3 -42 -20 60 -66 36 -19 4 -74 -51 -86
6166h6J48l8nm4J2rkM3o3P1J4rj7M4j01L0n1R1o3k6K5J2lO5m7PL1j1l5J12j10
$$ -86 62 24 19 -25 -13 -22 -24 19 -44 27 41 32 15 59 -42 -12 -63 28 -35 -61 -36 -24 -27 38 -9 -2 29 18 -17 95 -15
6197a5M8l2L5l6%NK2Lm2m9N7m3N8P6j38P3j35R3n5R5k7o5lM5kM9lj7k0j3M9n9
$$ -15 33 1 36 0 0 5 27 30 -12 -61 -4 -47 11 87 -51 22 -113 -20 -75 20 -7 -72 -75 -30 -32 17 14 -3 -23 -36 13 -46
6229d6M0jQP9q6%N5n5nMk2K3L0l6L0J6p4O7Mk1jM3n4j6O0l7qj0L3M4p4n0MJ04
$$ -46 -6 -7 1 80 -6 -6 49 -6 -11 -7 -29 -6 24 -12 18 34 -40 27 31 10 9 52 -2 -18 42 5 -3 -13 20 64 -10 -60 -56 48
6263D8K5n3r2N6M5j5K2j3q3Q2l4N7p0L8J8m9KK9j6KJ4l1J2J5k1k5L2J0l6QNQK3
$$ 48 73 20 -72 -16 29 14 36 23 -60 22 -12 45 -25 13 31 -18 -16 13 -3 -1 13 -18 -6 9 -12 -37 -5 5 -31 -23 -18 -10 13
6296A3m2M5L4k7o8O4J4l9L3oLj1K7q4N5k0o9P7kN9m2k3j9J6L2m2Q0p0M1o1rO6
$$ 13 -29 16 50 23 -45 19 33 -6 27 21 24 13 40 -44 11 -9 -78 -1 -3 56 14 -9 -28 -12 20 -22 58 -12 29 -32 -41 25
6328B5j03P5L0k0J0j2J6n2K2O2J1Rm0q0N7J4q6P4QJ1m3j3mP7n9J8m3L1J7RJ3j09
$$ 25 -78 -3 27 7 17 5 21 -31 -9 53 64 73 33 -47 10 24 -62 12 20 31 -12 -25 -29 48 -11 7 -36 -5 12 21 34 -75
6360g5Q7m8l1P8m0L5L0J6n3J2l1j7L3j2K6J7N3o3J3lrko4L1J9j5l6O4Rl1L6k4
$$ -75 12 -36 -67 11 -29 6 36 52 -1 11 -20 -37 -4 -16 10 27 80 17 30 27 18 16 -48 -17 2 -13 -49 15 24 -7 29 5
6392Epl7R3k1o2J9O5j11O6J2m5J1j1JJOp0J04K1o3L2nL5r3JO4N6p1k2K1L3m9j5
$$ 5 -2 -39 54 33 -29 -10 55 -56 10 22 -23 -12 -23 -22 -21 -15 -85 19 40 -23 9 4 39 -54 -53 11 67 -4 -26 -5 28 -21 -36
6425c6k7Q6m5mL6M3n3J2J3m1J1m6M1L6k6n7M7l2J1J08o4j1j2p5J14m0j6M6Kq8
$$ -36 -63 23 -22 -26 10 53 0 12 25 -16 -5 -51 -10 26 0 -57 -10 -42 -31 77 13 2 -10 -85 29 -11 -27 19 21 -67
6455f7Q5p5J18q9J7j9L7j2K3On5k6L0K7l1kl9R1l7m6J03r9O9M7j24N3L5K1r3J5
$$ -67 18 -57 61 -28 -11 -30 7 -5 18 24 -31 -57 -27 0 -31 -33 -72 19 -18 -64 39 -60 9 56 -68 -15 20 41 -52 -37
6485c7N2J2Ro4%L6n7P9m8QK0pPj1NLqj2nk2K1J7NN1l5J1j6m3M5l9N0m2j6j3O7
$$ -37 15 27 36 -28 -28 8 -49 30 -18 -10 10 3 10 -1 4 7 -1 -13 -18 -40 -19 -2 3 54 19 30 14 -29 16 -23 27 -15 -31 -44 23
6520B3L1m6NonKO5l3l9kM3j8j3m7Q0k8K2l8K3l3n3M4J0k4N5k5l6R5j0m7J4k5J6
$$ 23 54 8 13 7 2 4 69 36 -3 -5 38 20 7 -40 40 12 34 -4 19 -14 -67 -23 -13 -37 18 -7 -43 52 42 -5 9 -16 0
6553@l0P2l9j6l5L9L8k0K8nj3o6N2j0J8n8K4K6K7k6K9k0pjL5L6q3K2OrKj03K3
$$ 0 -30 42 3 -13 -48 -9 29 9 37 32 19 -47 5 -5 13 -45 -21 5 32 6 35 15 8 7 42 78 -5 17 23 14 16 -87 -64
6586f4M7n5J0J15l6nj0j8J1j3M0mK5j07O0L2p5L8kn9PJ01Ml3qn6%M7L9l0kMJ2
$$ -64 -17 -72 -62 53 17 12 2 -16 -5 -18 22 18 43 -64 -4 28 -47 -9 -11 -70 -63 38 42 9 1 -55 -55 -8 31 1 -1 3 15
6619A5M1l2m3N4k9K2k8jk4K6N5m9N8p7M2l3M9j5r7L0N3j2k9J1J9MNJ5k3k1J2n
$$ 15 56 24 -19 35 6 28 0 -1 -25 1 56 7 65 -12 30 -3 46 31 -66 -36 17 5 -24 -13 6 10 15 30 7 -14 -2 -7
6651gj5qK8K6N4o1m2M9J7n6nN7l4j7J1J9l0n5N7J9m6J2RJ2KrpK1l8P5mj2N3m7
$$ -7 -22 -30 -2 24 78 17 -25 24 41 -15 -20 37 3 -14 -3 16 -14 -69 -12 7 -39 -27 -18 -6 -4 -13 -20 1 -37 38 34 22 75 28
6685B8rjNpro6J0K6N0p9J34m2r1N4J3k8k9K4j5q3J41l0nn5J33j08M2Rm5k3Q0r
$$ 28 19 18 23 16 7 -59 -49 -23 27 -52 82 40 -51 3 16 -12 -41 -17 -32 -115 26 -4 -9 -64 69 -39 3 12 -33 -56 24 15
6717A5Km4M4q4R5qm7N9m4K5O6r0l3N7Mo1O3n7Q3l8K5k3Oj3j3j9N5k4j4MML6n2
$$ 15 17 -27 17 -67 28 20 -27 32 -12 13 79 -11 -44 13 17 -44 19 -38 45 7 32 9 15 2 -11 -30 25 1 -13 -9 -5 31 -21
6750b1K6M5k3p6Q9m0Kl5J3M0m2N4J8r0M8ln2N4p7K6N7mn7K0J1l1P4L3m9l4N1l9
$$ -21 5 50 27 -49 40 0 2 -33 -20 20 -22 32 50 -40 8 5 -47 7 -70 -44 13 9 -48 -28 -17 -48 26 59 10 -24 27 -12
6782a2KOLj6L2L8o0N3m9JN0p5Q3l3l8OK2o8P2K6j1m9J9qKj0J0m9L9j4Nk0m2O1
$$ -12 -10 -4 -1 -17 15 53 -7 46 -3 -2 48 -27 56 23 -15 -9 13 -55 17 43 32 -17 2 -6 -4 -14 -4 -53 -14 -28 -23 -43 -85 -24
6816b4K6M0l7MNl7k9N9j5J0j5J1pL1L3r4M9p9R2p2Nll8Q3K0m7m4M9K0K7l8oj4
$$ -24 2 42 5 9 14 -23 -52 7 -8 2 -13 -2 -9 22 55 -39 10 -69 23 -49 -44 -47 -85 -2 18 -29 -73 -24 -4 23 -15 -21 -35
6849c5J9J9m2K2M4l2LMJ9Mk2ql4M1o3M9Q1p1N9o5L6m9k7R7J8r3L4NK9k7l9kP6
$$ -35 -16 3 -39 -17 27 -5 -2 2 21 25 3 -5 -39 2 -61 -12 69 -2 57 -8 28 -21 -48 49 67 -26 8 13 42 15 -24 -26 50
6882E0j8p5M8J3kK3l4J5l6R5m3ol7Qj0j5O0o5K2O1k3L7l8m9K0Km2j8Q4k1m3O6
$$ 50 32 -43 5 18 16 39 5 20 -16 79 36 30 -7 1 -9 -24 36 -29 -7 54 31 68 30 -19 1 3 -39 -57 27 6 -37 29
6914B9J4n3kl0Q3p0k7L4j2N6M2r1M7ml7m4Q3pk2k5O1K1q0lPk6J13p0M9o4qM9J9
$$ 29 43 -10 -12 -42 41 -29 -56 -22 -34 22 64 -27 20 16 -21 -65 18 11 -11 -36 25 46 -34 -37 -30 -56 57 -13 36 -28 -36 13 32
6947C2m9M6k5r8O7jO0o9N1m7K9K0J3p0L4j5K9m4J6M6l4m4M5n1R1J8l8rM6l3%J6
$$ 32 -17 29 4 -94 -27 -28 32 -37 14 -33 -4 16 29 -41 -7 -22 7 -37 -21 25 -9 -53 -8 -59 32 50 12 3 49 16 16 32
6979C2l2l9RN5n2J0ok5N5OJ2n8O3k3n0K9J7j5Nrj7L8Oj2QJ9l6L1m0N2o5L4j3J5
$$ 32 0 -39 -30 25 -27 -17 -23 -48 7 13 25 -33 30 7 -43 -14 3 -12 -7 -16 -33 5 11 -1 7 26 -10 21 -19 33 -32 2 -11 4
7013Djr2J19n4J0JK4Qk2o1O3PRnl7J5J4J3K2k0j6jj3m0L3JK5n3L1K3j7QoL3J7
$$ 4 3 -89 30 -24 -14 -13 11 19 -3 -64 -1 6 15 10 -27 -12 2 15 37 17 1 0 -13 -53 -20 -19 6 -47 -16 7 -10 -2 -8 25 42
7048D2Km8n9J32n2l5MN3m6J9J2j2j7n6K8M2o0L1Q9r7P3p6N3Lr0N9R0j31O4N4o3
$$ 42 44 -4 -63 69 17 -18 -14 39 -7 12 24 12 -5 -61 -33 9 -51 -20 69 -28 45 -31 22 25 -65 -6 84 -47 17 71 8
7079Hj8rk6N0Mp7N8RL2K2K0j4p3oJ8R8r3J0K4m5m5N9m1m2N3J3M7l3rK3NlJl3k7
$$ 8 -10 -19 -45 5 9 -68 -10 -1 31 53 73 59 -14 -20 -2 96 3 13 37 -8 -53 6 -35 -77 -24 -11 36 3 -6 17 22 19 20 -13 -40
7114d0K7P0j10K8LO2m5J9k1K2K4j6n0j8M2%lk4K6O6p3Ol7k1Q6o3P0J2k0j5k2%
$$ -40 -13 57 -53 -25 -22 40 -5 14 -7 15 39 23 -27 -45 -3 -3 -6 -30 -4 62 -11 -5 -42 -63 23 -40 30 42 22 7 -15 -15
7146a5K7j1m7ON3K5l7m8M1P8n8kl1J1O4op0M2j3p8J6K1j1N7L3o5jN8k3j6O%jO
$$ -15 12 1 -46 -40 13 38 1 -47 -6 72 14 12 -19 -8 56 50 -20 22 9 -69 -53 -32 -43 14 47 -18 -19 39 16 0 6 6 5 11
7180A1l4J1m2L2L6n7L1M4J5k4m1N5m7Qk2L4j1LL4p0J7J6L7J1p5oj8KL4O8p0M8
$$ 11 -23 -12 -54 -22 14 -43 -12 32 47 23 -18 37 -10 -2 -24 10 -1 2 36 -34 -17 -1 36 47 -28 -34 -52 -50 -16 52 -18 30
7212C0K7o7K1K9o4M8no5L5KO0p9Q7j03Q4j3l8K9J8n6m0J8J2QJ4K0J7q4Q6p0nN1
$$ 30 57 -10 11 40 -24 24 19 -46 -11 -9 51 -28 59 -44 40 27 -11 18 36 -20 -60 -42 -30 -22 -8 12 29 -55 31 -39 -44 7
7244Gm5K1k0P2n5K0OL6n3L4jMKo6O8r3J34j32J09ojk4m3K4j3L6j8o7N1qJj6K4
$$ 7 -38 -17 -37 35 -20 0 6 42 -11 23 22 26 28 -38 30 -63 71 -61 48 42 41 17 -26 -2 -15 21 3 -64 -13 -21 -20 -36 -12
7277a2k9N0k7l9J15p2l8J2K2J3k1Rk7L5k5j4M5NM7l1J8m6kl7O1n8M8J6n3K6k1
$$ -12 -41 9 -18 -57 58 -14 -52 -40 -18 -5 -26 -17 -44 -9 -34 -48 -3 2 49 18 36 -10 -12 -49 12 -46 2 18 -35 -9 -30
7308c0L6k3n9R4n0K7L4l2lK1l6O0n9k0O3m7j0R3q5R4n1k3J8mOl0N4j2n4J6JL9
$$ -30 6 -17 -76 18 -32 -5 29 -3 -6 15 -21 39 -20 -40 23 -24 -34 59 -26 68 17 -6 12 8 14 -16 38 26 -28 -12 -11 28
7340B8k1Qqp2L3R7m5n3L0J3k9j8L0m7N8j2k1m0Q1L8j1n4l6J0P7n5J5Jm6j4L5L6
$$ 28 7 15 7 -65 -32 65 20 -33 -3 10 -19 -37 -7 -54 4 -8 -29 -69 12 50 39 -15 -51 -41 36 -19 -4 -3 -49 -63 -28 8
7372Hj8j3M7on2L8M0q6K5K1k5K9q5R0M2j08L7O3n5J2N9o7J7r5N2l1j8P3l9M1M3
$$ 8 -10 -23 24 18 -34 4 44 -42 -17 4 -21 8 -77 13 55 -53 -16 47 -8 4 63 -4 13 -82 -30 -61 -79 -6 -45 -4 39
7403C9o3k4P4p6M3k4J4k2J3M4l5Q2q1l1N2L2o8KL6rmO7o5j6JN5j5p7J10j00L4
$$ 39 -24 -48 26 -50 -7 -31 -17 -39 -26 18 -17 65 -16 -47 5 37 -31 -29 7 -2 -6 61 -4 -20 -19 36 21 -56 54 -46 -12
7434a2jK9Jl1L0O0o7j5N9L0q9j2PLJ5M3l9l1N7p8OK6O8ll7Kl0Q1o9ml0K0J8J8
$$ -12 -13 16 17 -14 16 76 9 -6 53 83 -6 -18 -11 -8 7 50 11 -20 37 -41 -35 -9 59 56 19 21 -9 72 3 -1 -31 -11 7 25
7468B5L6o6j3M6p2L0P5r6l6O4k5N1lm9J1Q7r8R9p9kj9qR6r3J4nP0mjn0J4l0K2
$$ 25 61 -5 -18 28 -44 -14 61 -35 -71 -7 -32 19 16 -33 -22 65 -33 66 -13 -15 -34 -42 54 -39 -25 -30 40 36 35 -15 -1 -31 -9
7501iJ6j5M1n5L6n7M5p3R0N5j04j7P2mkj1m7N5j2lK1K9k4l0m3N1L3q2K8pR1p1
$$ -9 7 -8 33 -22 14 -43 2 -71 19 74 -30 -47 25 21 19 8 -39 16 4 1 22 51 27 -3 -46 5 38 -44 -16 -23 68 -3
7533clrk2K2n1Q3k3Pn5J07p0l4N8m7Q8j9k0j4N6p6J9k8P1k4m1K1j4M5j9j4M7k
$$ -3 -6 -15 -37 -15 -66 17 -6 1 -54 53 -17 -51 7 -40 48 29 9 -5 51 -25 -6 -34 37 13 -28 -7 -21 24 5 -9 38 36
7565C6o7L7L3n9O3j3Jlo7LL3j8J3K7o9K4L9pkn9O7K1l2j1O7p1K3n7L9j2L1lPk0
$$ 36 -31 6 39 -20 43 30 31 28 -39 -36 -3 -21 -8 19 -50 -26 13 6 4 -55 12 33 1 -10 57 -14 9 -48 -9 -21 10 7 14 -6
7599fk1M2k2m1J03r5P7M5J1q8pk7J2n%K6M8m6j9L3m2kP8n4J1o1O1k9L4jm5K5n2
$$ -6 -27 15 -7 -48 55 -40 37 82 93 5 -2 -29 -17 -22 -22 4 52 6 -13 20 -22 -24 54 0 11 -50 11 -18 16 15 -30 -5 -57
7632e7N1M3moKk1j6QJ3k6O6q4O3o2J1n1P3L3r8R1k7K4n2JnQJ2K2n7O6p1M4K8L9
$$ -57 -6 37 33 27 29 8 -8 0 13 -13 53 -31 32 -30 -19 -70 3 36 -62 29 2 26 -26 -25 -30 -22 -10 12 -45 21 -50 -6 22 61
7666F1r1j6Q9o2j6lN7Jm0JQ6nq5J0J0q0J12mj0L0n4J8NL3n2n3P4L8j07M7M2p7
$$ 61 -30 -46 43 -19 -35 -38 19 20 -20 -19 67 62 -23 -13 -3 -83 29 25 15 45 -9 9 14 47 -5 -58 16 54 -53 -6 36 -41
7698d1Q3J0j01J15l7k4jo2R0kqJ9q8J24k6j10N1J5L2p0K6M7o2Lk8N0p2J21m6L9
$$ -41 42 52 -49 66 29 5 4 -58 32 30 22 41 -47 77 51 -59 -8 7 39 -31 -5 42 -20 -17 -45 5 -67 54 8 47
7728D7p3N9m8Rj0M1m3M5j6k4O8p1J9N0k8l7Nj7M2K2kk8L1l3k5kM6m6P0n7K3l0
$$ 47 -26 33 -15 -6 -16 25 -18 27 11 -13 55 -16 3 53 25 -12 -7 -24 18 40 38 10 41 8 -17 -19 27 -19 51 -6 17 -13
7760a3M5l2k0K5L2k0kl2k7l6L7k4oQ4pk7jJ4K8k2K6k2L0l6J6k2K7j3rNN2pk6p1
$$ -13 32 0 -20 5 37 17 15 -17 -44 -80 -43 -67 -73 11 4 -23 -24 -10 18 -4 22 0 30 -6 10 -12 15 2 -7 -2 50 43 17 -54
7794e4L6j0J2J5k2j0j4L7Kl9O7m6QK8K0Nq0P6L5K3n8j5o7J18q2J9J3J8jN5j05
$$ -54 -18 -28 -16 -1 -23 -33 -47 -10 -8 -47 20 -26 -18 10 30 35 -45 31 66 89 31 16 -51 67 -15 4 17 35 34 89 -16
7825a6J7K6J4l3k2Jk6J1M7l4j2l7N0J8J1RLRn5%J2N1Lk6n9P7j6m1M5n2JN4m8Q9
$$ -16 1 27 41 8 -14 -13 -39 -28 19 -15 -27 -64 -14 4 15 24 27 36 -19 -19 -7 44 47 21 -38 39 23 -18 27 -25 -24 30 -18 71
7859G1m0L7l2m6K1k4%k8Q4j2n2K7l1L7Lk3J3m5J01ln1M0p8L8j1o2J27l9n0J3r
$$ 71 31 68 36 -10 11 -13 -13 -41 43 31 -21 6 -25 12 15 -8 5 -40 61 58 7 47 -31 7 -4 -66 61 22 -28 -15 -24
7890b4PM8m6rn6J29j18P3mk9o6J16k4l7L0J9mKp9L7P3q5K6l8L0J9J9q0P7J1oP
$$ -24 -17 31 -15 -24 -80 49 -69 4 0 -29 -95 21 -3 -40 -10 9 5 7 -72 -35 38 -47 -21 -59 -29 -10 9 -71 6 17 11 18
7922A8k3L4l7nkj8N3L5p2N9n6j5J4M4k6k9lO5j4kK6j5q2K9L5M9o1j1k0PL8Qk3
$$ 18 -5 29 -8 -13 -15 -33 20 55 -17 42 -14 -29 -15 29 3 -26 -29 36 22 20 46 31 -51 -22 13 62 1 -10 -30 -23 15 23 0
7955@Mk0%L9m9K2N9nk5q6N9J0L8q7J7R6n4n7O7n9j2J7M2K1l0l8J6M4l1qJ5r6L4
$$ 0 4 -16 -16 23 -26 -4 55 50 25 -61 -2 8 46 -41 -24 72 18 -39 28 -31 -43 -26 16 37 7 -31 -15 29 -2 -10 5 -91 -57
7988e7N2N8l3j2l0J9L5k0N0j01R0r9M2J4j2k4JK0O7q0J9J6l1K4n5JL0O3q7j0J0
$$ -57 -5 53 20 8 -22 -3 32 12 62 -39 51 -48 -6 8 -4 -28 -27 -7 60 -20 -1 15 -16 8 -47 -46 -16 47 -40 -50 -40
8019d0ol3J30M0j11Q7o7l2L9k5O5p7K7M0o2K2%m2N5N1n2pj3L1j1L0o6L3K9r3N0
$$ -40 -46 -79 51 91 -20 67 0 -32 7 -18 47 -30 -3 37 -25 -3 -3 -45 10 61 9 2 -11 20 9 39 -27 6 35 -58 -8
8050hL2m6J2l3K3M0L2n8j2K7Q7p3q3O1mL3k5j7j16L5R2N4n8Rl8QO3k3j06P8N1
$$ -8 24 -22 -10 -43 -20 20 52 -6 -18 9 96 23 -60 1 -3 30 5 -12 -128 -93 -1 53 -5 4 -34 -26 37 14 -92 -14 37
8081C7j3l0N8j8p5M6m2O4n9M2l9n3Q0K8k7M0j09J39q5m1J02r1P8m2oLM9p0M5p1
$$ 37 24 -6 52 34 -41 5 -37 27 -32 10 -29 -82 -2 26 -1 39 -70 69 -16 -57 45 -46 32 -10 -16 -13 36 -34 11 -60
8111f0O2l1M5Lj6K9k3nLJ9q2Q0j3l5J5RkjQ0o0Qom5L1k4k5K9K4J1K9m1O9m6j03
$$ -60 2 -29 16 19 3 32 9 4 7 26 -56 24 11 -24 -9 0 -2 -3 77 17 25 19 -26 5 -19 -44 -15 9 20 49 8 77 31 -72
8145g2P9k3J0l0L6j6KL4j2k7plM9mJ5m9j4QQnL3L6o4LnO0l1l7M4j1mlO0j33P1
$$ -72 7 -16 -6 -36 0 -16 -14 20 8 -19 -26 -29 20 16 31 -18 -32 -24 -16 -21 12 48 -16 -13 -18 42 11 -26 18 7 3 0 60 -73 -2
8180bm0O2l5j0n1N7K1KqQj6
$$ -2 -42 20 -15 -25 -76 -19 2 4 -4 4 -12
8191a2
$$ Imaginary data points
##PAGE= N=2
##DATA TABLE= (X++(I..I)), XYDATA
0@%%%%%%%%%%%%%%qJ6j6J6j6J6j6K4l2L2l8M6m8N6o4P2q1Q9j04J18j30J42j58
$$ 0 0 0 0 0 0 0 0 0 0 0 0 0 0 0 -8 8 -8 8 -8 8 -8 16 -16 16 -22 24 -24 32 -32 40 -41 48 -56 62 -68 74 -84
37h4J78j98K17k40K69k98L30l65M03m48M99n58O24p01P95r09J050j232J480j833
$$ -84 94 -104 113 -127 142 -156 174 -191 212 -236 263 -295 329 -372 423 -486 564 -668 812 -1021
57a021K381l357N633j9969j1406M3084K0504l177j3967q129k1171k3929j0565
$$ -1021 1360 -1997 3636 -16333 -27739 15345 35849 32672 18705 10576 -10595 -34524 -45089
70d5089N892O903J4205K2068J8529M368j160p744j9946k4530j1380K9N820J4962
$$ -45089 -39197 -32294 -18089 3979 22508 26876 25716 17972 -1974 -26504 -37884 -37855 -32035 -17073
84a7073K2470J3635K917M595K656j7682k9622j5693K093M980Q944K0097J9955
$$ -17073 5397 19032 21949 26544 29200 11518 -18104 -33797 -31704 -26724 -17780 2317 22272
97B2272P104J27j624j1557k0059j3612l779k455L368J9133K4102J1240j120m365
$$ 22272 29376 29503 27879 16322 -3737 -17349 -21128 -23583 -20215 -1082 23020 34260 33140 28775
111B8775r110j5324j3602q083n329K147J6463K0719J1244K993j12r150j8436j4158
$$ 28775 19665 4341 -9261 -17344 -22673 -20526 -4063 16656 27900 30893 30781 21631 3195 -10963
125a0963m636l538k188J0117J8451J1697M099M371j848j7403k1797r340J357K089
$$ -10963 -15599 -19137 -21325 -11208 7243 18940 23039 27410 25562 8159 -13638 -22978 -21621 -19532
139a9532M464J1474J3559R015L417l501j2094j5503j1849o104PP985J2868J0350
$$ -19532 -15068 -3594 9965 18980 22397 18896 6802 -8701 -20550 -26654 -26647 -18662 -5794 4556
153D556O691N491P76q971j3738j0830p631m515M111J4227J5152P658K043m18m569
$$ 4556 11247 16738 17514 8543 -5195 -16025 -23656 -28171 -24060 -9833 5319 12977 15020 14602 10033
168A0033r533j0578q963n116J923J0149J3306J0574N851O68n189r188r608p932
$$ 10033 500 -10078 -19041 -24157 -22234 -12085 1221 11795 17646 18314 13125 3937 -5671 -13603
182a3603m829L91O537J0366J0999R056L571m409j0103j0583p392l604J38L919
$$ -13603 -18432 -18041 -11504 -1138 9861 18917 22488 18079 7976 -2607 -9999 -13603 -13465 -9546
196i546P214R465R536N526j329q205j1147r352m823m93K882O551R689Q541L639
$$ -9546 -2332 7133 16669 22195 20866 12661 1514 -7838 -12661 -13154 -10272 -3721 5968 14509 18148
211A8148p24l478p417j1216r207j878M001O384Q211Q130L995o29k371m644r411
$$ 18148 17424 13946 6529 -4687 -13894 -15772 -11771 -5387 2824 10954 14949 14320 11949 7305 -2106
226b106j0545m682K383N842P720Q395N338N71k485n052q353q322l810P6K019O027
$$ -2106 -12651 -17333 -14950 -9108 -1388 7007 12345 12916 10431 5379 -2974 -11296 -15106 -15030 -13011 -6984
242f984J0115Q072J440k870m722p228p622l627l48K81L920R663R408K798j938
$$ -6984 3131 11203 12643 9773 5051 -2177 -9799 -13426 -13774 -13493 -9573 90 9498 12296 10358
257A0358l379n920q354n242n51J370L587P669P746L323N96n26n162r585o894o79
$$ 10358 6979 1059 -7295 -12537 -13088 -11718 -8131 -462 7284 10607 11203 10677 5515 -4070 -10964 -11643
273a1643J720K996O594P203L366J167J020l417r460p859j196J109J235N148Q413
$$ -11643 -9923 -6927 -333 6870 10236 11403 12423 9006 -454 -8313 -9509 -8400 -7165 -2017 6396
288F396N019L22k81k168o969p234k852o26k16M372Q819O168N13r77j777n190o655
$$ 6396 11415 11737 11456 9288 2319 -4915 -7767 -8393 -8609 -4237 4582 10750 11263 10286 8509 3319 -3336
305c336l666j893r51L522P948O102J199K34n54n000p353m224j306p51J936O352
$$ -3336 -7002 -8895 -9846 -6324 1624 7726 8925 9159 8605 3605 -3748 -7972 -9278 -10029 -8093 -1741
321a741N860K280J463O62m403p850m961p33l93O22M690N962L482K118R66l386
$$ -1741 4119 6399 7862 8524 4121 -3729 -8690 -9423 -9816 -9194 -4504 1458 4940 7058 8024 4638
337D638o919m695j422j298k27M421O536L801J556J158j665n355m965k287j953
$$ 4638 -2281 -6976 -8398 -9696 -9923 -5502 1034 4835 6391 7549 5884 529 -4436 -6723 -8676
352h676p51L895O736L953J195J300K5m040n378l447j932n74K888N463M063K021
$$ -8676 -9427 -5532 1204 5157 6352 7652 7677 3637 -1741 -5188 -7120 -7694 -4806 657 4720 6741
368F741J924M20l579n378l697j887r04J729M174M092K928K366L96l421m901l170
$$ 6741 8665 9085 5506 128 -3569 -5456 -6360 -4631 -457 3635 6563 8929 9325 5904 1003 -2167
384b167k023j950L12L836M470L256K074M37k534m015l230k436k492n59L158M592
$$ -2167 -4190 -6140 -5828 -1992 2478 5734 7808 8245 5711 1696 -1534 -3970 -6462 -7021 -3863 729
400G29L218J967R50j360l429l733k938k228m61K354L562K939K454J924k65l345
$$ 729 3947 5914 6864 5504 2075 -1658 -4596 -6824 -7285 -4931 -1369 1570 4024 5948 5683 2338
416B338m019l146j923l15J593K689K777K825K475M14k589l944l267j981o90Q24
$$ 2338 -1681 -4827 -6750 -7065 -5472 -2783 -6 2819 5294 5708 3119 -825 -4092 -6073 -6763 -5939
432e939K498L271L067J840L50j375k465l104l019j679M93K646L410K998J773K94
$$ -5939 -3441 -170 2897 4737 5087 3712 1247 -1857 -4876 -6555 -6062 -3416 -6 2992 4765 5059
448E059q88j606k626l184k366j17K131L200L170K032P23p21j726k507k736j970
$$ 5059 4171 2565 -61 -3245 -5611 -5728 -3597 -397 2773 4805 5528 4807 3081 574 -2162 -4132
464d132m77Q28K084L051L029J838n35k234l010k339j341p00J39J296K693L080
$$ -4132 -4609 -3781 -1697 1354 4383 6221 5686 3452 442 -1897 -3238 -3938 -3799 -2503 190 3270
480C270K002L14j537k880k957j748n62L24J096K138K522J885Q48m93j804l026
$$ 3270 5272 5586 4049 1169 -1788 -3536 -4098 -3774 -2678 -540 1982 3867 4715 4222 2418 -608
496f08k904j538N02J800K514J922R72P83M99q49k596l213j864j53J140K279K553
$$ -608 -3512 -5050 -4548 -2748 -234 1688 2660 3443 3942 3093 497 -2716 -4580 -4733 -3593 -1314 1239
513A239J702N95j72p74j639k283k060j028L32J679K746K672J245l73j585j753
$$ 1239 2941 3536 3364 2590 951 -1332 -3392 -4420 -4088 -2409 337 3009 4254 3881 2296 543
529E43j384j194j042q24N94K432L073J945J59j341j743j771j639j004j4Q82J315
$$ 543 -841 -2035 -3077 -3901 -3307 -875 2198 4143 4302 2961 1218 -553 -2192 -3196 -3210 -2328 -1013
546a013J653J985J494L0j768k593k264r12L19J095J084J162J200J464R16n60k256
$$ -1013 640 2625 4119 4149 2381 -212 -2476 -3388 -3069 -1974 -890 272 1472 2936 3852 3292 1036
563A036k981j812Q1J200J307J406J535J009Jn70r19j514k006j514j13J440K429
$$ 1036 -1945 -3757 -3676 -2476 -1169 237 1772 2781 2782 2212 1293 -221 -2227 -3741 -3854 -2414 15
580A5K216O46o48o81l06q42j792j711o56P33J878K478J660M8j111r42j123j429
$$ 15 2231 2877 2229 1548 1242 400 -1392 -3103 -3759 -3026 -1148 1330 2990 3038 1927 985 -138 -1567
598a567q88l9J62L70J477K372J591j61j471k068j717m70N60K81k27P70K179J786
$$ -1567 -2455 -2494 -2332 -1962 -485 1887 3478 3317 1846 -222 -1939 -2409 -1849 -1568 -1795 -1025 1154 2940
616B940K74p35j586j953j473j43O94R09R73J157O41L72M28j74j790k524j242M58
$$ 2940 3214 2479 893 -1060 -2533 -2676 -1982 -1073 -100 1057 1698 2070 2498 2324 534 -1990 -3232 -2774
634b774J387J616J209K85j77L53K63j121k005j332k20L41J140K054J443k0o29
$$ -2774 -1387 229 1438 1723 1546 1899 2162 1041 -964 -2296 -2516 -2175 -1035 1019 2462 2442 1813
651A813n13o86j029n94n91o80J88J961K488P61p39r94r98r65l91j90m45k39J078
$$ 1813 1300 614 -415 -1009 -1600 -2280 -2092 -131 2357 3118 2379 1385 387 -578 -969 -1159 -1604 -1843 -765
670g65J823J181L80j68j190j956j213J57O72J68K26P61R97R07N75o21j824j779
$$ -765 1058 2239 2619 2451 1261 -695 -1908 -1751 -1079 -911 -685 76 1073 1980 2555 1934 110 -1669
688a669p05M50O90R08O89L10K79O93J78j003j624j293m54K13J168J570P93j78
$$ -1669 -2374 -1924 -1234 -326 363 673 952 1645 1823 820 -804 -2097 -2551 -2338 -1170 400 1193 1015
706A015k36k6j36p13j138j081l92P23J588J371N39k46n98o84n58k61m23p32k41
$$ 1015 779 753 617 -96 -1234 -2315 -2707 -1984 -396 975 1514 1268 670 -14 -572 -833 -1256 -1988 -2229
725b229P82J618J362L39m71r86r29n64k14J04L8N8N86J203J248L47q35j301j131
$$ -2229 -1447 171 1533 1872 1401 415 -514 -1078 -1292 -1188 -1150 -1092 -506 697 1945 2292 1457 156 -975
744i75m67K29N87L81K85M44Q12O42K2n54j354j382l27Q41R18K42M39N81K62r9
$$ -975 -1442 -1213 -626 -245 40 484 1296 1938 1960 1406 52 -1330 -1657 -816 102 344 783 1364 1626 1527
764A527j73l18j239j218k09Q30J024R66M44k38m02p8j8p20j055m75L8M41J113
$$ 1527 1354 1036 -203 -1421 -1630 -800 224 1190 1634 1396 994 916 898 178 -877 -1352 -1314 -873 240
783B40J302L72r23o83j18l22p60k48J2j36M09J355J054k08o98o04q80n51K35M10
$$ 240 1542 1914 991 308 190 -132 -892 -1140 -1128 -1264 -855 500 1554 1346 648 44 -836 -1387 -1152 -742
803g42m40j75J107J221J23k99k67r00j290k11Q68L06j19N00P80K59p8L63m65j566
$$ -742 -1182 -1357 -250 971 1094 795 528 -372 -1662 -1873 -1005 -699 -818 -318 462 721 643 1006 541 -1025
823a025q76N90N71J94O72Q05j82m48N63L02j148j193j6L15L41O99J041J04n16
$$ -1025 -1901 -1311 -740 -546 126 931 749 301 864 1166 18 -1175 -1191 -876 -535 164 1205 1309 793
842G93o2K58o42o97j45p4l86O19J510N86o21k54M8p17o13J47Q7n77j31J202J039
$$ 793 731 989 347 -350 -495 -569 -955 -336 1174 1760 1139 885 933 216 -397 -250 -163 -740 -871 331 1370
863A370j69k31l0p51j097Q9N07l06k89P03P18k2Q9N15p39j375m06N51P5k27N83
$$ 1370 1201 970 940 189 -908 -819 -312 -618 -907 -204 514 492 581 1096 357 -1018 -1424 -873 -798 -1025 -442
884d42O01q4p3O63q7j173q14K80M9p5O76P46k4l35M09K64o68p49n5j11j64O13
$$ -442 159 75 2 665 578 -595 -1409 -1129 -1080 -1155 -479 267 243 -92 317 581 -87 -836 -891 -1002 -1166 -553
906e53J072J90l08Q9J26m50l94m9k18l71L51J043N06j19J36M7n97n50J37J02m55
$$ -553 519 709 401 490 616 166 -228 -277 -495 -866 -515 528 1034 915 1051 1098 501 -49 88 190 -265
927b65pP31N53J15K51J19o61p03m6K02k87j67M68M42J07L01K67l61r38k99J8j24
$$ -265 -272 459 1012 1127 1378 1497 836 133 87 289 2 -165 303 745 852 1153 1420 1059 121 -178 -160 -284
949b84o6M73K34P9J20L24q1p21n31k04k07k6L43M96N4kJ73q2k80m40k42l77j57
$$ -284 -350 123 357 436 556 880 799 78 -453 -657 -864 -890 -547 -51 3 1 174 92 -188 -628 -870 -1247 -1404
972a404L47N54K42L3M7p9j58j59l50l60j30K08M09L79L08K0l5k20j15j65k44j78
$$ -1404 -1057 -503 -261 -228 -181 -260 -418 -577 -927 -1287 -1417 -1209 -800 -421 -113 -93 -128 -348 -463 -628 -872 -1050
994a050J03K58M03M85L46j11k05k48k43k4k2O7N6K21M99L84J0j06k62k77j86K7
$$ -1050 -947 -689 -286 199 545 434 229 -19 -262 -286 -308 -241 -185 36 535 919 929 823 561 284 98 125
1016A25J22P3J31L38L32L0R0r1l84n61l0J91J58J8K27K42m9P1N7k75o56k53J35
$$ 125 247 320 451 789 1121 1151 1241 1150 766 205 175 366 524 542 769 1011 962 1033 1090 815 159 -94 41
1039D1O1L6L00K71k03j90J47Ro17l68k1o9L0L27N47j55k98m3J9k98l32l6j52j22
$$ 41 102 138 438 709 506 316 463 472 -145 -513 -534 -603 -573 -246 301 146 -152 -195 -176 -474 -806 -842 -994 -1116
1063a116K86N98J58k62j13J6l80j67K03k9k88R8M89L38M7J12p7m62l43K10L74
$$ -1116 -830 -232 -74 -336 -449 -433 -813 -980 -777 -806 -1094 -996 -507 -169 -122 -10 -87 -549 -892 -682 -308
1084c08k20r5M20K73M4K93J27l48n69M2L52NQ3K82J84j70K33L99j31n77k12J46
$$ -308 -528 -623 -203 70 114 407 534 186 -383 -341 11 16 99 381 565 395 628 1027 896 319 107 253
1106B53q8J23M45K73l31l7K95J76n12j71r9l04p7N29M73j44l66N3L2k58q6l6k32
$$ 253 165 288 733 1006 675 638 933 1109 597 426 327 23 -54 475 948 804 438 491 523 265 179 143 -89
1129h9m08J13N52K69j87j07j74l39p4K28j99l68j0K37J85R8K75n0n42m97K36K05
$$ -89 -497 -384 168 437 250 143 -31 -370 -444 -216 -415 -783 -793 -556 -371 -273 2 -48 -590 -1087 -851 -646
1151f46j55m5J31J9O2M28K23k90n39r3R1J07R3L38j3j65J51M45R7k73k52n8j32
$$ -646 -801 -846 -715 -696 -634 -206 17 -273 -812 -905 -814 -707 -614 -276 -289 -454 -303 142 239 -34 -286 -344 -476
1174d76J80M32M11k62j65J78K98K1p4j82l10k8L35M94P7r8l9j17q9J02J69k52
$$ -476 -296 136 547 285 120 298 596 617 543 361 51 23 358 852 929 831 792 675 586 688 857 605
1196F05k84r2K98L40J51J5k26l10j36J41Q3j36j81j99R0K49L98k6m86l72p7O0
$$ 605 321 229 527 867 1018 1033 807 497 361 502 585 449 268 69 159 408 806 780 294 -78 -155 -95
1218i5l2M4K8k22n3J66K85N8m47m46j37O2K38J45j13j42m0J46J85N6k46l34l19
$$ -95 -127 -83 -55 -277 -330 -164 121 179 -268 -714 -851 -789 -551 -406 -519 -661 -701 -555 -370 -314 -560 -894 -1213
1241a213J30L29L55K2k12j33P9J97O3r3k19k13K3L38M20J74r7k85J6J78J86r5
$$ -1213 -1083 -754 -399 -377 -589 -722 -643 -446 -383 -476 -695 -908 -885 -547 -127 47 -50 -335 -319 -141 45 -50
1263e0j13j56k8K70M67K09l5l03j61L9K77J10q3j62j16L22L42Q8m9k45k58j73
$$ -50 -163 -319 -347 -77 390 599 564 261 100 139 416 526 443 281 165 487 829 917 868 623 365 192
1285A92K06L02L0k62j06J50J92K06j10k96l36ok1K46J75j57k12o8J24K46j05k51
$$ 192 398 700 730 468 362 512 704 910 800 504 168 162 141 387 562 405 193 125 249 495 390 139
1307A39l23j42J06K38J59j2k75j32l5P7K06k18k31k98Q9L10K82l8k50j74M9k5
$$ 139 -184 -326 -220 18 177 165 -110 -242 -277 -200 6 -212 -443 -741 -652 -342 -60 -98 -348 -522 -473 -498
1329d98J32M9k61j75N5L15K72O9j30k03j44L1J97J06n6j71OJ69M07R9j54k51j68
$$ -498 -366 -317 -578 -753 -698 -383 -111 -42 -172 -375 -519 -488 -291 -185 -241 -412 -406 -237 170 269 115 -136 -304
1352c04P1K40J74l1q4o9J58J78J92p8k29k48k0L37K30l3o8j74J16M6J50kj99k58
$$ -304 -233 7 181 150 66 -3 155 333 525 447 218 -30 -50 287 517 484 416 242 358 404 554 552 353 95
1376I5n5J74J52J80j00j94j10J51M9qj73k05j18P7K00K15n7l21j13P8O5N0q7k48
$$ 95 40 214 366 546 446 252 142 293 342 334 161 -44 -162 -85 115 330 273 -48 -161 -83 -18 32 -55 -303
1400c03j98J19K71J93j16j96j13j90J42J86n5j69j92J73K18Q6K0j32j29k91K22
$$ -303 -501 -382 -111 82 -34 -230 -343 -533 -391 -205 -260 -429 -621 -448 -230 -144 -124 -256 -385 -676 -454
1421d54J23J46o0j16Q2M6R0K10p8k60j72J99J91J25O6j12m7J6J68J75n7k46JJ3
$$ -454 -331 -185 -245 -361 -279 -233 -143 67 -11 -271 -443 -244 -53 72 138 26 -21 -5 163 338 281 35 36 49
1445D9J36K11J07j24r5k6J24Q6L0j24j07j16K26K61Rj80j15p4N6P8J0o7k62jK01
$$ 49 185 396 503 379 284 258 382 468 498 374 267 151 377 638 647 467 352 278 334 412 422 355 93 92 293
1470B93J30l3o1j06j75o5J48J04j17j43n5J4J0J50O9k82k35PJ08L7L0p0j84J09
$$ 293 423 390 329 223 48 -17 131 235 118 -25 -80 -66 -56 94 163 -119 -354 -347 -239 -202 -172 -242 -426 -317
1494c17PJ81q1j58j75K1O5O8P3N8j25m2K8J52M9j60p6q8R3J86J08Jj36J0P5N9
$$ -317 -310 -129 -210 -368 -543 -522 -457 -389 -316 -258 -383 -425 -397 -245 -196 -356 -432 -520 -427 -241 -133 -132 -268 -258 -183 -124
1520a24R1n4j12q0R2J47J60O2r7k5l5J08L3q7J7q7N7J26O5R6o7r8l1K6J58m1l4
$$ -124 -33 -87 -199 -279 -187 -40 120 182 85 60 25 133 166 79 96 9 66 192 257 353 286 188 157 183 341 300 266
1547B66n5o8J33J56qj19q8j22K0J59j6m7k9N5j1N6O2j06j24j60O7M1M7J00j66
$$ 266 211 143 276 432 424 305 217 95 115 274 258 211 182 237 226 282 344 238 114 -46 21 62 109 209 43
1572D3m7j1J01N6j04j77o1M4l8J11J8J03k10mQ6Pq0j9l0p9J3J70J21o9j51m8J00
$$ 43 -4 -15 86 142 38 -139 -200 -156 -194 -83 -65 38 -172 -176 -90 -83 -163 -182 -212 -291 -278 -108 13 -56 -207 -255 -155
1599a55M4K6rq4j25J30K36J0j24j9L6j10K9J42rj13L4O8O1mP1l4j86MJ07J70r9
$$ -155 -111 -85 -94 -178 -303 -173 63 73 -51 -70 -34 -144 -115 27 18 -95 -61 7 68 64 135 101 -85 -81 26 196 97
1626I7q6P9Q8r0J66J2j75j74J44J10r4J8O4n2j28lK95j40j40m8R6l1m1J29j1j32
$$ 97 11 90 178 88 254 266 91 -83 61 171 77 95 159 107 -21 -24 271 131 -9 -57 39 8 -33 96 85 -47
1652d7n9J71J8q9j13N8j04o3J53J38r7j77QQ8M7l9N1j18j62J51J64k3qm4l1l7
$$ -47 -106 65 83 -6 -119 -61 -165 -228 -75 63 -34 -211 -203 -115 -68 -107 -56 -174 -336 -185 -21 -44 -52 -96 -127 -164
1678a64k6K21k7j54j2N1O2L8M2J6j99oJ31J26o6o5K1r8M2J43J98k22j12J30jK1
$$ -164 -190 31 4 -150 -162 -111 -49 -11 31 47 -152 -158 -27 99 33 -32 -11 -109 -67 76 274 52 -60 70 69 90
1704I0k9J36K3j78L9Q3J30j95k8k6oM9J60l3j39m2J05RLl0jj45M0P7J19l6j91
$$ 90 61 197 220 42 81 164 294 99 71 45 39 88 248 215 76 34 139 148 151 121 120 -25 15 92 211 175 -16
1731a6Q2ojP8J0j23j09j7J29J31l1l6j07r3j5J98Oj67q6kJ50Q2L8q3j46j06J42
$$ -16 66 60 59 137 147 24 -85 -102 27 158 127 91 -16 -109 -124 74 80 -87 -173 -175 -25 57 95 12 -134 -240 -98
1758i8M4kl2l6J9l8J20P4l1j75o7Q2QJ41J03k10j16J9J27P6o9k7j08p9Q7J70L2
$$ -98 -54 -56 -88 -124 -105 -143 -23 51 20 -155 -222 -140 -132 9 112 -98 -214 -195 -68 8 -61 -88 -196 -275 -188 -18 14
1785A4p4o7J8OJ25qNj65m0N7J46K5j5p9q3N1N9J40k5k24L9OJ34Q4Kj20j22K3K5
$$ 14 -60 -127 -109 -103 22 14 19 -146 -186 -129 17 42 27 -52 -135 -84 -25 115 90 -134 -95 -89 45 129 131 11 -111 -88 -63
1814f3J65j9j25k2m6J50L7O0m0q3l6lJ05Q8q6j02k8J24J10M5j27n7j26J42J25
$$ -63 102 83 -42 -64 -110 40 77 137 97 14 -22 -25 80 168 82 -20 -48 76 186 231 104 47 -79 63 188
1839A88Nl6j12j7K9J26O0o3j41r4M4Q7P5N6r5j77M1J31N8j4m1j56J4L5J76P9k21
$$ 188 193 157 45 28 57 183 243 180 39 -55 -11 76 151 207 112 -65 -24 107 165 151 110 -46 -32 3 179 258 37
1866C7n1k6K6O8N5k2j65q7J06R1rK4j04j16j6R2J24j04j72J4P7J6J38k3r8j61
$$ 37 -14 -40 -14 54 109 87 -78 -165 -59 32 23 47 -57 -173 -189 -97 27 -77 -249 -235 -158 -142 -4 -27 -125 -286
1892b86L3O3Q0k3n2k9j4P4J45K4j13q9PJ02J0R0j6j17j16J70J78l4p8l5k3l1J09
$$ -286 -253 -190 -110 -133 -185 -214 -228 -154 -9 15 -98 -187 -180 -78 -68 22 6 -111 -227 -57 121 87 9 -26 -49 -80 29
1919B9K23j76n5l3J01M9N8J2m8k08N3J48R4p7m8n0n5Q3P4J03j53j36L2R3N7Pj9
$$ 29 252 76 21 -12 89 138 196 208 160 -48 5 153 247 170 122 72 17 100 174 277 124 -12 20 113 170 177 158
1946A58j56j23J89J7J34j86j01m7Q0M1P0j3j57l4O9L9l2O1o1p9K5L8O2m6j20K8
$$ 158 2 -121 68 85 219 33 -68 -115 -35 6 76 63 -94 -128 -59 -20 -52 9 -52 -131 -106 -68 -6 -52 -172 -144
1972a44l5R3PO0r6r8P0O7L0L6l0j00k5R9R5M5q8k3NrQ8P8n6r8JK9J27N9n1p2o2
$$ -144 -179 -86 -79 -19 -115 -213 -143 -76 -46 -10 -40 -140 -165 -66 29 74 -14 -37 -32 -41 47 125 69 -29 -28 1 128 187 136 64 2
2003BJ2J36P4p7k1n7L4K4J35po0j47L5J12Rm2j0p2l2P2R6l6j08J5j28J13N9K9
$$ 2 14 150 224 147 126 69 103 127 262 255 195 48 83 195 204 162 152 80 48 120 216 180 72 87 -41 72 131 160
2031A60m9j82mM8J00P%j39j00L4J9J23m6q6j6j6K8j3ml5p3j1Q9L7J8j25m0o2J40
$$ 160 111 -71 -75 -27 73 80 80 -59 -159 -125 -106 17 -29 -115 -131 -147 -119 -132 -136 -171 -244 -255 -166 -129 -111 -236 -276 -338 -198
2060a98K4N0l0q6kP6K3K3J8n0q9j3J59k1pj0o4R8J2Q9J6o5j2k7Q2N5J30j47l1
$$ -198 -174 -124 -154 -240 -242 -166 -143 -120 -102 -152 -241 -254 -95 -116 -123 -133 -197 -99 -87 2 18 -47 -59 -86 -4 51 181 34 3
2089CM2O5N9lPn0pL3J20m9k2Rj7Q1lR2q5n5k4K4L5Q3m6n4j1o1O0R1m3j30q5J00
$$ 3 45 110 169 166 173 123 116 149 269 220 198 207 190 271 268 360 275 220 196 220 255 338 292 238 227 166 226 317 274 144 59 159
2121A59J2pk6m5q9M3M0j1l3r6o9M8R2p3nNr7l2O1Rm9kq0LK7M6K0j45N6q2J16K
$$ 159 171 164 138 93 4 47 87 76 43 -53 -122 -74 18 -55 -60 -55 -152 -184 -123 -114 -163 -165 -245 -242 -215 -169 -149 -294 -238 -320 -204 -202
2153b02Oj04R2j4J5J08l8Nj63R2mO9J05j21N3j17O2J99j02J19j52J7L1R2J1J7
$$ -202 -196 -300 -208 -222 -207 -99 -137 -132 -295 -203 -207 -138 -33 -154 -101 -218 -156 43 -59 60 -92 -75 -44 48 59 76
2179G6Ln4M8O4L5r2J5o2O9JMM2M1m9p5J19L7O9o3o0j3L1kL2j0r7m8P6j3Qn9q2
$$ 76 79 25 73 137 172 80 95 33 102 103 107 149 190 141 66 185 222 291 228 168 155 186 184 216 206 109 61 137 124 132 73 -9
2211iQM0k0N3Mn5o2oM7Rj2q7k8j4R8m8mj2j19J1J39j1l4o0K4ok5J18r5J7j2mJ1
$$ -9 -1 39 19 72 76 21 -41 -47 0 9 -3 -90 -118 -132 -34 -82 -86 -98 -217 -206 -67 -78 -112 -172 -148 -154 -179 -61 -156 -139 -151 -155 -144
2244a44N7K4l5l9LMM4L2M9o6%K5J00k1J9j04K1M2Q4L4m8j6M8K2k3Q6kn9rL4j0
$$ -144 -87 -63 -98 -137 -134 -130 -86 -54 -5 -71 -71 -46 54 33 52 -52 -31 11 95 129 81 65 113 135 112 198 196 137 128 162 152
2275A52J8P2k5n1l5j8J29K9n9o2o3Q1Q0l2r8p7J4O4k3K2l0Oo7%Kl0R5q1q8%p1
$$ 152 170 242 217 166 131 113 242 271 212 150 87 168 248 216 118 41 55 119 96 118 88 94 27 27 29 -1 94 13 -75 -75 -146
2306a46R9k0j01m5L8O0M7p3m7j14J40M3l1k7q3J8n5P1O9J7k6q9J4L9J2L6Nk3n4
$$ -146 -47 -67 -168 -213 -175 -115 -68 -141 -188 -302 -162 -119 -150 -177 -260 -242 -297 -226 -157 -140 -166 -255 -241 -202 -190 -154 -149 -172 -226
2335b26L9P4J7P7j89Q3Q2P1N6m6o8l6J05O9n2Nm9P5K7K5J5rl7Q0m8KJ14K3o0l2
$$ -226 -187 -113 -96 -19 -208 -125 -43 28 84 38 -30 -66 39 108 56 61 12 87 114 139 154 145 108 188 140 142 256 279 219 187
2365A87r9J66J5K0j08o6M8NJ04m6q3qM5Oj1o7M7o4p9L5JQ4p8Lj21M2K9O6k1j32
$$ 187 88 254 269 289 181 115 163 168 272 226 143 135 180 186 175 108 155 91 12 47 48 132 54 57 -64 -22 7 73 52 -80
2395h0o4L0O0J5Lq4o3P5J7j7jn6m2K2K5k0P0n6n2OM6L7L8o1l1p8J48J1O5q2q2
$$ -80 -144 -114 -54 -39 -36 -120 -183 -108 -91 -108 -109 -165 -207 -185 -160 -180 -110 -166 -218 -212 -166 -129 -91 -152 -183 -261 -113 -102 -37 -119 -201
2426b01J9N2J57p2J1p5m0J22K0L8J6Lq0N7l4O7Q0r4l0NQ8O9Nr8r9O6N1O0l7p7
$$ -201 -182 -130 27 -45 -34 -109 -149 -27 -7 31 47 50 -30 27 -7 60 140 46 16 21 109 178 183 85 -14 52 103 163 126 49
2456D9PL1K7mN2m7l8lNP3Ko0j7j17M0N7P1l6j10J1j1M6O7r2p8l6R0O0p2o5M7o0
$$ 49 56 87 114 110 162 115 77 74 79 152 154 94 77 -40 0 57 128 92 -18 -7 -18 28 95 3 -75 -111 -21 39 -33 -98 -51 -111
2488a11LK5N0j04M5m0N5j5OL7J4j45LQ7K8M1j4o5l2M2Q0K9j30L3k8J38l9m9J07
$$ -111 -108 -83 -33 -137 -92 -132 -77 -92 -86 -49 -35 -180 -177 -90 -62 -21 -35 -100 -132 -90 -10 19 -111 -78 -106 32 -7 -56 51
2517E1j0k9M1j1K2jK3Rj18R6J17J2j09n1KP0J23j12J4o1JJ72j38K0NKl9J7no4
$$ 51 41 12 53 42 64 63 86 95 -23 73 190 202 93 42 44 114 237 125 139 78 79 251 113 133 138 140 101 118 113 49
2547D9O9m4l2j2NR8j4j07m5M0J0M9r1J2p0J8J10Nr4q1KM5l9oO0J7r0m1O4k7O2
$$ 49 118 74 42 30 35 133 119 12 -33 7 17 66 -25 -13 -83 -65 45 50 -44 -125 -123 -78 -117 -123 -63 -46 -136 -177 -113 -140 -78
2578g8m7o9J9M4N4O2j33O9j26N3J36n7l3j0kJ8N7p4Q8p9Q1k5l0L4J7n2J2M5j2
$$ -78 -125 -194 -175 -131 -77 -15 -148 -79 -205 -152 -16 -73 -106 -116 -118 -100 -43 -117 -29 -108 -27 -52 -82 -48 -31 -83 -71 -26 -38
2607c8Q4J1j12j4O0O9j5P7j72K9J23k1j9KN3m0l4J3N8lk8K1k7P3j2rL3m7p1PM4
$$ -38 46 57 -55 -69 -9 60 45 122 -50 -21 102 81 62 64 117 77 43 56 114 111 83 104 77 150 138 129 162 115 44 51 95
2638I5N2Kp3k0J3K5N8o5n7M6n2N2L7r3L9q2K3qJ8L8Ml7o0l8R4j5M2j22j4Q7OJ1
$$ 95 147 149 76 56 69 94 152 87 30 76 24 76 113 20 59 -23 0 -8 10 48 52 15 -45 -83 11 -4 38 -84 -98 -11 -5 6
2670Fq4j44J00M6N4n1N3o5L8m9JM6m8j3P1l7l6J05j2k6n9k1N9Q1l0k8p7J85k7
$$ 6 -78 -222 -122 -76 -22 -73 -20 -85 -47 -96 -95 -49 -97 -110 -39 -76 -112 -7 -19 -45 -104 -125 -66 15 -15 -43 -120 65 38
2699C8Jol2o3O7J8J1j9j0M8j8m9J8N9j2m8k0LJ8R9m6n0p3J32oL0p0J7l8R0J6K
$$ 38 39 33 1 -62 5 23 34 15 5 53 35 -14 4 63 51 3 -17 -14 4 103 57 7 -66 66 60 90 20 37 -1 89 105 107
2731A07o5q0Q4ok1l2k4N1k7p3J3R3l6M1q5o5R3l1N6m1j2o0M6J46j01n2O3j8M3
$$ 107 42 -38 46 40 19 -13 -37 14 -13 -86 -73 20 -16 25 -60 -125 -32 -63 -7 -48 -60 -120 -74 72 -29 -81 -18 -36 7
2760Gl3j8L1L0K7p5K1J5N7j0n8j9N8k2L8on7L5J33p7l6o6L4L0R4j19kM9Nk9jl
$$ 7 -26 -44 -13 17 44 -31 -10 5 62 52 -6 -25 33 11 49 43 -14 21 154 77 41 -25 9 39 133 14 12 61 66 37 36 33
2792C3K0K2mp0M4KnM4m3l6L2J01p2J2q5K1PM9K9q1o4Q2J5%l2j1Rk4pJ2k1Q3jq7
$$ 33 53 75 71 1 45 47 42 86 43 7 39 140 68 80 -5 16 23 72 101 20 -44 38 53 53 21 10 19 -5 -12 0 -21 62 61 -26
2826b6n0Q4kL2l3j01L3R8n3l3k6L1J1%M9o0k4j4nO2N3m9j7M9q6O0OK0o5n0J03
$$ -26 -76 8 6 38 5 -96 -63 35 -18 -51 -77 -46 -35 -35 14 -46 -70 -84 -89 -27 26 -23 -40 9 -77 -17 -11 9 -56 -106 -3
2857cj08J06M7m5j10l8K12n3k6jq8J47Kj08M9K1P4j18J5L9K3J9m3m6qM2O7lp4
$$ -3 -111 -5 42 -3 -113 -151 61 8 -18 -19 -107 40 42 -66 -17 4 78 -40 -25 14 37 56 13 -33 -41 1 68 65 -9
2886in0k3J17O3o3k8J7qJ25n2k7p0R3m6p6O5L7K3k7p4k1N2M6Jn0m5O0RK7Pl7n3
$$ -9 -59 -82 35 98 35 7 24 16 141 89 62 -8 85 39 -37 28 65 88 61 -13 -34 18 64 65 15 -30 30 39 66 73 36 -17
2918a7k4J26j6l4Q0j23L1K0k2N1J5p5nL2p7Q0Kl3J3rPL7k2j09RQ3k2OK9l6m1J0
$$ -17 -41 85 69 35 115 -8 23 43 21 72 87 12 7 39 -38 42 44 11 24 15 22 59 37 -72 -63 20 -2 4 33 -3 -44 -34
2950c4M8J3q6mK3N6m7kO4m2l6K8l4J3R7o6Pq2J3J17m4j04O1n8L1N1qMq9O4P7p7
$$ -34 14 27 -59 -63 -40 16 -31 -33 31 -11 -47 -19 -53 -40 57 -9 -2 -84 -71 46 2 -102 -41 -99 -68 -17 -25 -21 -110 -46 31 -46
2982d6N1J5o4m2j8J12lM2n6K2k5P9m4j7J8l9L1P7l3j7OOk8K2Pl8kM4p3K6L1K3
$$ -46 5 20 -44 -86 -104 8 5 47 -9 13 -12 67 23 6 24 -15 16 93 60 43 49 55 27 49 56 18 16 60 -13 13 44 67
3014F7J0o9L5Rk0lJ6l2j0K9K4j2r1J2J7N2Mo2M0p4M7j4L2l2J6j0O5n0rL2l8KK0
$$ 67 77 8 43 52 32 29 45 13 3 32 56 44 -47 -35 -18 34 38 -24 16 -58 -11 -25 7 -25 -9 -19 46 -4 -13 19 -19 -17 3
3047CJ6k7K6rq2M5J8M5m3K4lm7K8L4Mn5M6Rl1mkN2k6Pj3lK1nN2l6o2K4O9l4m3
$$ 3 19 -8 18 9 -73 -28 -10 35 -8 16 13 -34 -6 28 32 -23 23 32 1 -3 -5 47 21 28 15 12 33 28 80 44 -18 6 75 41 -2
3082bQm0J05k7K2k9m3LK7Ml5O4n4N0%j28J21l0k5j0L6koRk0k8M5k0RJ5l0n8J4
$$ -2 6 -34 71 44 66 37 -6 -3 24 28 -7 57 3 53 53 -75 46 16 -9 -19 17 15 9 18 -2 -30 15 -5 4 19 -11 -69 -55
3115e5nN6m4N8l8J6k2O2k2k4l6k3K2J4K3L2p7L6K0m6Q9j18K3N9p5M1lJj1l8P5
$$ -55 -60 -4 -48 10 -28 -12 -34 28 6 -18 -54 -77 -55 -41 -18 14 -63 -27 -7 -53 36 -82 -59 0 -75 -34 -37 -36 -47 -85 -10
3146a0j6k3L5j1k0L6n0Q5m1m3L1m3O0J4L8qK2j17R9lJ8K3q1K8L6K1o9J02m8j3
$$ -10 -26 -49 -14 -25 -45 -9 -59 26 -15 -58 -27 -70 -10 4 42 34 56 -61 38 35 53 76 -5 23 59 80 11 113 65 52
3176E2m4J33k1o4j3J2k4L9K6Pk9j5j9L2k2N2k0j8k2J5K4Ll4k5J7M9l5l9J0pl1
$$ 52 8 141 120 56 43 55 31 70 96 103 74 59 40 72 50 102 82 64 42 57 81 84 50 25 42 91 56 17 27 20 -11
3207a1lJ6J4L3q0Rj0J9m9M9m0OK6j04N1N9l3p2L5M7nk6L5j0j6L1J3m1m6O1J7n9
$$ -11 -14 2 16 49 -31 -22 -32 -13 -62 -13 -53 -47 -21 -125 -74 -15 -48 -120 -85 -38 -43 -69 -34 -44 -60 -29 -16 -57 -103 -42 -25 -84
3239h4L7N2k7P8j22mN8J1J2q8J14p7O4npj3l2O1k9j0J8p6J28j26P9O5L1p4l3N2
$$ -84 -47 5 -22 56 -66 -70 -12 -1 11 -77 37 -40 24 19 12 -1 -33 28 -1 -11 7 -69 59 -67 12 77 108 34 1 53
3269E3q0R8Jl7Mm8O3M3p0O3j09MJ27o7j8K2J0l3k6O8J9j00nN8n9Q7p7K2L3Mk0
$$ 53 -27 71 72 35 39 -9 54 97 27 90 -19 -15 112 45 27 49 59 26 0 68 87 -13 -18 40 -19 68 -9 13 46 50 30
3300C0j9JK9r9K1%R2n3K8m4on1N0l0OK8l1j7O2k0j2K3n2K5nl8K5P9j5o9N4K9l0
$$ 30 11 12 41 -58 -37 -37 55 2 30 -14 -20 -71 -21 -51 -45 -17 -48 -65 -3 -23 -35 -12 -64 -39 -44 -82 -57 22 7 -62 -8 21 -9
3333iO2q2RJ5K4n5R2j9m7K5J9M7p2K2n4O2M0j2k6K9m1O3p3M6L9k8k2j1j3N4j1
$$ -9 53 -29 -20 -5 19 -36 56 37 -10 15 34 81 9 31 -23 39 79 67 41 70 29 92 19 65 104 76 54 43 30 84 73
3364G3j6jjM7j24O1o0K7j8K8Lm7R5j34K2P8l2m3K7m9LL5n5J9J6l7qN0o6K2L0m8
$$ 73 57 56 55 102 -22 39 -21 6 -12 16 19 -28 67 -67 -45 33 1 -42 -15 -64 -61 -26 -81 -62 -46 -83 -91 -41 -107 -85 -55 -103
3396a03L9J1k3K9jP4j42nP3L8r2M1nk6L5M3n2ML6m2P5k3M2l4j4K6J3N0Lm0RmJ8
$$ -103 -64 -53 -76 -47 -48 26 -116 -121 -48 -10 -102 -61 -66 -92 -57 -14 -66 -62 -26 -68 7 -16 26 -8 -22 4 17 67 70 30 39 35 53
3429E3K4J5K6o7lK4QN0r5N0Pq9R8k0n6P0n7K1K7N2j8n1K2m5o0J31n8L8j3o7J38
$$ 53 77 92 118 51 48 72 80 130 35 85 92 3 101 81 25 95 38 59 86 138 120 69 91 46 -14 117 59 97 84 17 155
3460A55o9mo7N8q0K6N6j1n0Jk9m5RK6J3o6JN4P0p6j2N9r8J6M2J2j4Nj9K6j0m0
$$ 155 86 82 15 73 -7 19 75 64 14 15 -14 -59 -50 -24 -11 -77 -76 -22 48 -28 -40 19 -79 -63 -21 -9 -23 -18 -37 -11 -21 -61
3492f1N6k8l2mN4o6L0K4l0J3rj1L7k3j5j7QJ6K1j5K6m7J9N5Oml1QJ2N7o3J4J6
$$ -61 -5 -33 -65 -69 -15 -81 -51 -27 -57 -44 -53 -64 -27 -50 -65 -82 -74 -58 -37 -52 -26 -73 -54 1 7 3 -28 -20 -8 49 -14 0 16
3525A6J1j3M8j1M7l4k9J9j1j5j7M9k3KL9j6nl0m0O0p0N8l3O5k4J8m5N5m7jl5L6
$$ 16 27 14 62 51 98 64 35 54 43 28 11 60 37 39 78 62 57 27 -13 47 -23 35 2 67 43 61 16 71 24 23 -12 24
3557B4K3RJj5Mn6k4K3nL5o2M4r8J23r9N8l5L9K5l5K2m8k2J9M7j8j8J1K1K1p3N0
$$ 24 47 56 57 42 46 -10 -34 -11 -16 19 -43 1 -97 26 -73 -15 -50 -11 14 -21 1 -47 -69 -50 -3 -21 -39 -28 -7 14 -59 -9
3589ip0M2L4j8L3n3L3jM9l0J1k2O8o3j1N2jnk2j7K7M6Rk2j4M4l2j5JNo1KL9P2
$$ -9 -79 -37 -3 -21 12 -41 -8 -9 40 10 21 -1 67 4 -7 45 44 39 17 0 27 73 82 60 46 90 58 43 44 49 -12 -10 29 101
3623A01r3J8k8j6O0J6Nm3l4L7j1L1j3j3q2O0Mp5N0k1P7p5m3R1o2J8Nk6qK1M4m6
$$ 101 8 26 -2 -18 42 58 63 20 -14 23 12 43 30 17 -65 -5 -1 -76 -26 -47 30 -45 -88 3 -59 -41 -36 -62 -70 -49 -5 -51
3655e1m9P6l9R0k9p2O9p6M0m2P9J1l6j2KOoK8k2m2P8J3l6p8P3l5L8k7L8orN9L1
$$ -51 -100 -24 -63 27 -2 -74 -5 -81 -41 -83 -4 7 -29 -41 -39 -33 -39 -11 -33 -75 3 16 -20 -98 -25 -60 -22 -49 -11 -17 -26 33 64
3688F4l0m9N2q6L7O8J6n6lq0Q5K8J3K9o4jK0k2lM1j1m8P9K7n8R8j01rj5Pk9J28
$$ 64 34 -15 37 -49 -12 56 72 16 13 -67 18 46 59 88 24 23 43 21 18 59 48 0 79 106 48 146 45 36 21 28 -1 127
3720A27l5m8J6l3J3N8Lr3Q5r0pJ3L7J1p3M2n2L8j4O3n9p2K9L4K9o0l2J0O1%m3
$$ 127 92 44 60 27 40 98 101 8 93 3 -4 9 46 57 -16 26 -26 12 -2 61 2 -70 -41 -7 22 -38 -70 -60 1 1 -42
3751d2pl5J5J5J2qK5J6m5j6PP3l0qn4O6Mk0M8q1k7R8RK1km7J7n4M6J1MK2l5K9
$$ -42 -49 -84 -69 -54 -42 -50 -25 -9 -54 -70 -63 10 -20 -28 -82 -16 -12 -32 16 -65 -92 6 15 36 34 -13 4 -50 -4 7 11 33 -2 27
3785B7m8J4J11j02K1k1l2j2N7K5K4o1n7Q0m6K1n2N2k2QM1J9Ml0K8k0j5J7n2n2
$$ 27 -21 -7 104 2 23 2 -30 -42 15 40 64 3 -54 26 -20 1 -51 1 -21 -13 28 47 51 21 49 29 14 31 -21 -73
3815g3M9K8KLn6M2k2M5K1l9r0Q8K1L0n5R8r2N7l9O9m2p3J7OJ1lN6L7m2q1Q2r3
$$ -73 -24 4 6 9 -47 -5 -27 18 39 0 -90 -2 19 49 -6 92 0 57 18 87 45 -28 -11 -5 6 3 59 96 54 -27 55 -38
3847c8KN4l7pP9m7l4j4M0n2M1L2K4o5K1K1n6K9M8jl3l0M3lk6rK9m7L9j4Jj6Q7
$$ -38 -36 18 -19 -26 53 6 -28 -42 -2 -54 -13 19 43 -22 -1 20 -36 -7 41 40 7 -23 20 17 -9 -18 11 -36 3 -11 -10 -26 61
3880F1k3p1P3l0K5J1Llp7N0L1k0l6L2l9O7p1nL2K1q2N4K2q5R4p7L4K4L3m0LqJ9
$$ 61 38 -33 40 10 35 46 49 46 -31 19 50 30 -6 26 -13 54 -17 -22 10 31 -51 3 25 -60 34 -43 -9 15 48 8 11 3 22
3913B2K1q8rL0m6L8M4q3N0j0J6J6m7N2l2M1Jo2l9R5j5j4%k3M8o6O1OQk8l8j0J03
$$ 22 43 -45 -54 -24 -70 -32 12 -71 -21 -31 -15 1 -46 6 -26 15 16 -46 -85 10 -5 -19 -19 -42 6 -60 1 7 15 -13 -51 -61 42
3946D2r5M3Pj6%QL1k3k6LjJ7RmL2k5K2%J3Pm1PK8l0K4Pl3l3M8k3M9%o7m1R6k5
$$ 42 -53 -10 -3 -19 -19 -11 20 -3 -29 -26 -27 -10 -1 -5 27 2 24 24 37 44 3 10 38 8 32 39 6 -27 21 -2 47 47 -20 -61 35 10
3982A0Pj0N1q9P2j6j9L9pl1k4LnJ3PKM8ll3pj2O1j06J51p9k5J8lOk5K9p6J08l6
$$ 10 17 7 58 -31 41 25 6 45 38 7 -17 -14 -19 -6 1 3 51 48 15 8 -4 57 -49 102 23 -2 16 13 19 -6 23 -53 55 19
4016A9k9L2K9p8M4n6rJ1P1l1n8J08n0%j4J7k0J3j0Pl7O2p7J17r1P2r9%K0J0M7
$$ 19 -10 22 51 -27 17 -39 -48 -37 34 3 -55 53 3 3 -11 6 -14 -1 -11 -4 -41 21 -56 61 -30 42 -57 -57 -37 -27 20
4047B0m7km8O4j0O1p0M0K6l3l9L0Nl0k8N2J5L1o2L4J7k1J0oJ8j3nn2O2J4o2M7
$$ 20 -27 -29 -77 -13 -23 38 -32 8 34 1 -38 -8 -3 -33 -61 -9 6 37 -25 9 26 5 15 9 27 14 9 -43 19 33 -29 18
4079A8k3RM4Jl7J1j5k7L1k3OKK9r1N2N8n4PKnL3m0K3L3r5M3L5m8N8l0k3rJM3o
$$ 18 -5 4 48 49 12 23 8 -19 12 -11 -5 -3 26 -65 -13 45 -9 -2 0 -5 28 -12 11 44 -51 -8 27 -21 37 7 -16 -25 -24 19 13
4114A3N6q7K6j4J7L6p0K3%O1q0M9NJ3k0%j9J4Oj5k6J5Q6r9Km2O9NOJ0p3J7M8l7
$$ 13 69 -18 8 -6 11 47 -23 0 0 61 -19 30 35 48 28 28 9 23 29 14 -12 3 89 -10 -8 -50 19 24 30 40 -33 -16 32 -5
4148eO1q5R1n8J6k7jQJ3M9l2l8J7lJ7j8j3J9k0K9l5K6J0l4j6m8M7O5r5L3oj1R9
$$ -5 56 -29 62 4 20 -7 -8 0 13 62 30 -8 9 6 23 5 -8 11 -9 20 -15 11 21 -13 -29 -77 -30 35 -60 -27 -33 -44 55
4181E5nl1n0j8K7k2k7J03o1Q4l3J8o6Rjj8M6nm2J7N0o5R9j13M4L7n7K7Kp4K1O8
$$ 55 50 19 -31 -49 -22 -44 -71 32 -29 55 22 40 -26 -17 -18 -36 10 5 -37 -20 30 -35 64 -49 -5 32 -25 2 4 -70 -49 19
4213A9j2m0m5Q1%mk2L0l2L7j3k9K8m0J12r7N7q6Q6o1O0K1k8p4M3JoJ1lJ1K5j2
$$ 19 7 -33 -78 3 3 -1 -23 7 -25 12 -1 -30 -2 -42 70 -27 30 -56 30 -31 29 50 22 -52 -9 -8 -14 -3 -6 5 30 18
4245A8j4j8j2O4J2l1l3O3n5K4L0J4%K9k9n3L4Rj4j2J7o1kM0rk1J1O1o2k6L1nK5
$$ 18 4 -14 -26 38 50 19 -14 49 -6 18 48 62 62 91 62 9 43 52 38 26 43 -18 -20 20 11 -10 1 62 0 -26 5 0 25
4278B5o4RL4l1K7Jjl5O9k0j4L3lk9nm3O8p6j5M7j3J2J9N7m3l5NM4j08O6N6m5q5
$$ 25 -39 -30 4 -27 0 1 0 -35 34 14 0 33 30 1 -4 -47 21 -55 -70 -23 -36 -24 -5 52 9 -26 -21 23 -85 -19 37 -8 -93
4311i3Q4jJM4j6l3j8rj2M5k5M1J8p1J6O6m7%k3k4Q2o1K3N0m1n1P0Qm6l1R2m6m5
$$ -93 -9 -10 -9 35 19 -14 -32 -41 -53 -8 -33 8 26 -45 -29 37 -10 -10 -33 -57 25 -36 -13 37 -4 -55 15 23 -23 -54 38 -8 -53
4344e3J6J9J4j0JrL5J1j8K1n1j7OQ0k9m6R3l7K4n0K2j6M7r6K3M6K1l5L3L6l3o8
$$ -53 -37 -18 -4 -14 -13 -22 13 24 6 27 -24 -41 -35 45 16 -30 63 26 50 0 22 6 53 -43 -20 26 47 12 45 81 48 -20
4376b0lL7K3o1%K0j7Ml4K5L1L8r4M4K9m5M5J7m5K7o7N5o4K5%O1j7NjnK6m1jnj0
$$ -20 -23 14 37 -24 -24 -4 -21 -17 -51 -26 5 43 -51 -7 22 -23 22 39 -6 21 -46 9 -55 -30 -30 31 14 19 18 13 39 -2 -3 -8 -18
4411a8K3l8O1kJL4o1k6Q1p7J8n7J8L4P1n1j1l3J08l9L2m8j9k0LL9k0k9O1m1N2
$$ -18 5 -33 28 26 27 61 0 -26 55 -22 -4 -61 -43 -9 62 11 0 -33 75 36 68 20 1 -19 -16 23 3 -26 35 -6 46
4442D6p0K0N5o5KpO3j28J27m4L7o5%N9L2q8M8l4K1m3M6k4j0l2N5l1j1L5n3K9l0
$$ 46 -24 -4 51 -14 -12 -19 44 -84 43 -1 36 -29 -29 30 62 -26 22 -12 9 -34 12 -12 -22 -54 1 -30 -41 -6 -59 -30 -60
4473f0P1r6K4M1N0k9Ojj3k7L3q0Q4J2l9O2j1L4m9Pn4R2k2RK2m3K2m5N8m8K7n5
$$ -60 11 -85 -61 -20 30 1 7 6 -7 -34 -1 -81 3 15 -24 38 27 61 12 19 -35 57 35 44 66 23 45 0 58 10 37 -18
4505a8j7M5M2m6L5l5L4jj08O0M9m6JO1o4J6kl6O1j8l3L6lK1j02R3Pk5L8k4Nl3
$$ -18 -35 10 52 6 41 6 40 39 -69 -9 40 -6 -5 56 -8 8 6 -30 31 13 -20 16 13 34 -68 25 32 7 45 21 26 -7
4537gQ2p1J6L9r0L2J2J5j2M3l9j6oM2J4j0o5J1l5M7l1nn1N4NmL6k3L8m0K6q5P1
$$ -7 75 4 20 59 -31 1 13 28 16 59 20 4 -2 40 54 44 -21 -10 -45 2 -29 -34 -85 -31 -26 -30 6 -17 21 -19 7 -78 -7
4570gl3R6o9nl7KM2rj3j8k0Q9n3l1N7n5O4m0l9N6K8m5L0j3M6n9k7J01m9J2l9J2
$$ -7 -40 56 -13 -18 -55 -53 -11 -20 -33 -51 -71 18 -35 -66 -9 -64 0 -40 -79 -23 5 -40 -10 -23 23 -36 -63 38 -11 1 -38 -26
4602b6M8j1qm4P5k1J7OK5Km5rK7l2Q3j3j00m1P8m3M6J9MK8m9M5M1r1K3o4M7L1
$$ -26 22 11 3 -41 34 13 30 36 61 63 18 9 36 4 87 74 -26 -67 11 -32 14 33 37 65 16 61 102 11 34 -30 17 48
4634D8k3m4KK8L8k4K6lj19L1J21j16N8Kj9l3j5M8p2R0p0O3j1K3q5M9O0k2n2L6
$$ 48 25 -19 -17 11 49 25 51 48 -71 -40 81 -35 23 25 6 -27 -42 6 -66 24 -46 17 6 29 -56 -7 53 31 -21 15
4664A5l2j7Q3k2p7M6J9K8ql3qO5Qo1m1N8lL0pj10Q6K9k6l5j1K0J7JJ3l0J7j4J7
$$ 15 -17 -34 49 27 -50 -4 15 43 35 2 -6 59 67 6 -35 23 20 50 43 -67 19 48 22 -13 -24 -4 13 14 27 -3 14 0 17
4697A7l8j3O1n6j9O0n0M9j9m4K3MJ1K8j0j0r5J46q6N2n8N0lLL2m9P4o1m7J5M7
$$ 17 -21 -34 27 -29 -48 12 -38 11 -8 -52 -29 -25 -14 14 4 -6 -101 45 -41 11 -47 3 0 3 35 -14 60 -1 -48 -33 14
4728A4k1j2J8l1J7ok7P8j2k6l0K4J3k4LqK2k2L0l9N2l1J5L0k6jl7K3nO5n4l7L4
$$ 14 -7 -19 -1 -32 -15 -21 -48 30 18 -8 -38 -14 -1 -25 -22 -30 -8 -30 0 -39 13 -18 -3 27 1 0 -37 -14 -19 46 -8 -45 -11
4761a1K4L0q7J2k5J00k6oK5o3R1J1m6o9J4P0p4K4J3K7K6k5mj3l2Q2l6rojLkO1
$$ -11 13 43 -44 -32 -57 43 17 11 36 -27 64 75 29 -40 -26 44 -30 -6 7 34 60 35 31 18 -14 68 32 23 17 16 19 17 78
4794G8k3n8L6k0j6L7K9j00P7o2QM0l8M3Ll9l4N1K0m0jk3L8p2L7M3m1j3L9L4r2
$$ 78 55 -3 33 13 -3 34 63 -37 40 -22 -14 26 -12 31 34 -5 -39 12 32 -8 -9 -32 6 -66 -29 14 -27 -40 -1 33 -59
4825e9M4K1jm2L6p0NL8o%O3q2Q8p0M3k5m8Q4K7j13P7qL5n9K3Qm2K8P5l7n4N3p7
$$ -59 -15 6 5 -37 -1 -71 -66 -28 -34 -34 29 -53 35 -35 8 -17 -65 19 46 -67 10 2 37 -22 1 9 -33 -5 70 33 -21 32 -45
4858d5RM4P5p4m9k1J00j9K5m9m7P5j3K6l2j7OL1K4ok8q8P9k0J4K5ko8O7M9l8n
$$ -45 -36 8 83 9 -40 -61 39 20 45 -4 -51 24 11 37 5 -12 -6 25 49 43 15 -73 6 -14 0 25 23 -45 22 71 33 28
4890B8j3pk3k9K8P8o4L4m7Jk5R2l0J0k3ML2q6N8j2j3P4pq2N9o3O0p1N6o0Q0mo6
$$ 28 15 8 -15 -44 -16 62 -2 32 -15 -14 -39 53 23 33 10 14 46 -40 18 6 -7 67 60 -22 37 -26 34 -37 19 -41 39 35 -31
4923c1M0n0M3Nm0P7n9m7O3L8o1NN5k7jnK6Jn1klL1L7r1m4J06l5K0l5L6O1m3J8
$$ -31 9 -41 2 7 -33 44 -15 -62 1 39 -22 -17 38 11 10 5 31 32 -19 -21 -24 7 44 -47 -91 15 -20 0 -35 1 62 19 37
4956C7j9L9j25O6j4j3N3l9N2K3l5p2J12p7Q7o4O0l8n8N0kj6rnj8P9l4L8r8K8P3
$$ 37 18 57 -68 -2 -16 -29 24 -15 37 60 25 -47 65 -12 75 11 71 33 -25 25 23 7 -2 -7 -25 54 20 58 -40 -12 61
4987F1p8k2k1N2rLO2p9J4M3m6N6n8J5l2O0l0lK6lpp1N0k4J1O8k6j07J17m8M0j5
$$ 61 -17 -39 -60 -8 -17 -14 48 -31 -17 26 -20 36 -22 -7 -39 21 -9 -12 14 11 4 -67 -17 -41 -30 38 12 -95 22 -26 14 -1
5019aj6N6j05k2J07J7n5N5n9K1JL9k0Ol5J2j7K1N5p9KN7m8J1M1q2M7L0n1RM2q1
$$ -1 -17 39 -66 -88 19 36 -19 36 -23 -2 -1 38 18 24 -11 1 -16 5 60 -19 -17 40 -8 3 44 -38 9 39 -12 -3 39 -42
5051d2M5J4J5L7m8q3MR8n6%J8J8l9L9m3Q2n7k9j1R6j9j5k0o0P3l9J3J3K2k0RJ1
$$ -42 3 17 32 69 21 -62 -58 40 -16 -16 2 20 -19 20 -23 59 2 -27 -38 58 39 24 4 -56 17 -22 -9 4 26 6 15 26
5083B6%j4L8l3j3j7j6qJ7o1R9k3Nk4N7k6k1k6LK6k2jM2RL4j07O6M9l3j5m0L6j3
$$ 26 26 12 50 17 4 -13 -29 -37 -20 -81 18 -5 0 -24 33 7 -14 -40 -37 -11 -33 -34 8 17 51 -56 10 59 26 11 -29 7 -6
5116fO2m0k8lNk5K3J1oJJ2N4o4k3m4J02j4%p2%J08q7l0N2l2J1j1K1n1J07o3M7
$$ -6 56 16 -12 -15 -10 -35 -12 -1 -7 -6 6 60 -4 -27 -71 31 17 17 -55 -55 53 -34 -64 -12 -44 -33 -44 -23 -74 33 -30 17
5148A7j8jj1RM4n7K1J5M3o9J4Mk3n0J01nOl9j4k8L7k6N3k7K3k2O2m2k5P0qq3J8
$$ 17 -1 -2 -13 -4 40 -17 4 19 62 -7 7 11 -12 -62 39 34 40 1 -13 -41 -4 -30 23 -4 19 -3 59 17 -8 62 54 -29 -11
5181a1K3j3K4m5N4o6R2n1k3nj9M1lL2k2RL7r0PO8o0j8M1JK8mK7n6K0KJ5j3j0j9
$$ -11 12 -1 23 -22 32 -34 58 7 -16 -21 -40 1 -2 30 8 17 54 -36 -29 39 -21 -39 2 3 31 27 54 -2 18 20 35 22 12 -7
5215gm7jL4N5L6n5qN9j26Q3n3N6n1N3n8P1p6RJ1rj1L7L0n0K8o6%P2l7N6r1KL7
$$ -7 -54 -55 -21 34 70 15 7 66 -60 23 -30 26 -25 28 -30 41 -35 -26 -15 -24 -35 2 32 -18 10 -56 -56 16 -21 35 -56 -54 -17
5248a7K6N8n7m4P1l6L7m1rk4Q8n0K6k5J2l9O4n7kJ1M1oo%%j5%JM0j01N3m4M3K5
$$ -17 9 67 10 -34 37 1 38 -3 -12 -36 52 2 28 3 15 -24 40 -17 -19 -8 33 27 21 21 21 6 6 7 47 -54 -1 -45 -2 23
5282B3l6ol2jN1o6P8M1k6qp7O2m5jk4N3J8J6m0j0Q3o9L0m2RM4n0K8n6O6k9m7J31
$$ 23 -13 -19 -51 -52 -1 -67 11 52 26 18 -59 3 -42 -43 -67 -14 4 20 -20 -30 53 -16 14 -28 -19 25 -25 3 -53 13 -16 -63 68
5315F8o7J0k7j6k0N3J0m6L9K7l4k4N1J3J0k3m2O0j12N1M5j7j2mL4k9J9K%M0m9
$$ 68 1 11 -16 -32 -52 1 11 -35 4 31 -3 -27 24 37 47 24 -18 42 -70 -19 26 9 -3 -7 27 -2 17 19 19 59 10
5346A0mJ1pJ7M4p3jJ3k5Q3q2PJ9m3L9pJ1J5m7K3M9q2J5L0l7j4P1n0P7j11K3N7
$$ 10 6 17 10 27 71 -2 -3 10 -15 68 -14 -7 12 -31 8 1 12 27 -20 3 52 -30 -15 15 -22 -36 35 -15 62 -49 -26 31
5378C1m6k7l5J02l1Rj8JJK8M4o2rM8J1o5j7O3q7J50k6p1j4L4j2j8J7O%M9n4Jj7
$$ 31 -15 -42 -77 25 -6 3 -15 -14 -13 15 59 -3 -12 36 47 -18 -35 28 -59 91 65 -6 -20 14 2 -16 1 7 7 56 2 3 -14
5411a4M6k4jk4K4%Nl0k8P7j8m9M0m8O9jk4K7L1k6L6p2k2J2P9j3n3jPO1o5L5J0
$$ -14 32 8 7 -17 7 7 12 -18 -46 31 13 -36 4 -44 25 24 0 27 58 32 68 -4 -26 -14 65 52 -1 -2 5 66 1 36 46
5444D6J8n2k5L5m2M3M1j5k6L7j8k3mNk9L8p7O8J0k2J1o7JJ2K0n5J35m6p9N2M0
$$ 46 64 12 -13 22 -20 23 64 49 23 60 42 19 15 20 -9 29 -48 20 30 8 19 -48 -47 -35 -15 -70 65 19 -60 -8 32
5475C2k7l1m1J1J07p2kj9K8Q2k7J8o7k7OR7m7j7j0N1p1K4k1J7ol8J5L8L0Nn0j3
$$ 32 5 -26 -67 -56 51 -21 -23 -42 -14 68 41 59 -8 -35 -29 68 21 4 -6 45 -26 -2 -23 -6 -12 -50 -35 3 33 38 -12 -25
5507b5l9oQ4J3Rk2K4r5KM6M5J3o1J7n5jJ0j7R3k1j16J37l6j3JK1k8PO6j31L7N7
$$ -25 -64 -70 14 27 36 14 38 -57 -55 -9 36 49 -12 5 -50 -51 -41 -58 35 14 -102 35 -1 -14 -13 8 -20 -13 53 -78 -41 16
5539A6l9k0K3Q3o3N3m8p5J30j8m3j4Q9j17M9l8J0L2pJ2PMr8O1L1j5J6k2R6p1o1
$$ 16 -23 -43 -20 63 0 53 5 -70 60 42 -1 -15 74 -43 6 -32 -22 10 3 15 22 26 -72 -11 20 5 21 -1 95 24 -37
5570c7Q1k9J3J0RjLo3M3l3K8J5k3Oj1QNm8P7jj08P1j8o9Q4Lk0j0P8J3p2l4J4l5
$$ -37 44 15 28 38 47 46 49 -14 29 -4 24 39 16 22 11 19 24 -24 53 52 -56 15 -3 -72 12 15 -5 -15 63 76 4 -30 -16 -51
5604e1M4ppM8l2n7L0P0No5J1k3L8ON2l9l1j6O7r0K1K4J8j5PN%k6N2Pm8K0k5L1
$$ -51 -7 -14 -21 27 -5 -62 -32 38 43 -22 -11 -34 4 10 62 23 -8 -24 43 -47 -26 -2 16 1 8 13 13 -13 39 46 -2 18 -7 24
5638B4L3p4qN7j9Kn2N0m8J7M3l4k0K9p6L3L1pK7l0N7p2L8o3j2P7Jp1J1Qk4M5K2
$$ 24 57 -17 -25 32 13 15 -37 13 -35 -18 25 -9 -29 0 -76 -43 -12 -19 8 -22 35 -37 1 -62 -74 3 4 -67 -56 -48 -72 -27 -5
5671eOJ1k1l8M9n4R0J0o7L6j5J3N1p8K5Ln3M0Q1q1k1j1P6n7LM0j1J5k7l4k2K7
$$ -5 1 12 -9 -47 2 -52 38 48 -19 17 2 15 66 -12 13 16 -37 3 84 3 -18 -29 47 -10 -7 33 22 37 10 -24 -46 -19
5703a9OL2qk2mo4Q8k2O6l8k3R6p9r8O9k1M9pJ8n8OM0k7NrM7m0L9m4J7k4M6Kl2
$$ -19 -13 19 11 -11 -15 -79 9 -13 53 15 -8 88 9 -89 -20 -41 8 1 19 -39 -33 7 -20 -15 -24 23 -17 22 -22 -5 -29 17 19 -13
5737a3M6q4K9K1nPl3RQM6k2Mn0O3k3jK3qK9Mo5m8M8K0J6kj8N7p1k1J5K9Ml3j2
$$ -13 33 -51 -22 -1 -6 1 -32 -23 -15 31 9 13 -37 26 3 2 25 17 46 50 -15 -63 -15 5 21 19 1 58 -13 -34 -19 10 14 -19 -31
5772c1%L0k0Q2r4J21o2j01N4J6j0k6Q7r4O1m1n1N0M7RRp3N2p8Q9l3j7jLj2j0O7
$$ -31 -31 -1 -21 61 -33 88 26 -75 -21 -5 -15 -41 46 -48 13 -28 -79 -29 18 27 36 -37 15 -63 26 -7 -24 -25 -22 -34 -44 23
5804B3k9n1M0K4Ml3K2L5m8lJ4rK1j4nrPn4M6jN8%qL1r7RjN5l6l1k0O7o7K6j6J3
$$ 23 -6 -57 -17 7 11 -22 0 35 -13 -16 -2 -11 10 -4 -9 -18 -11 -65 -19 -20 38 38 30 61 -36 -27 -28 27 -9 -40 -60 7 -60 -34 -50 -37
5840c7P9l6K6p2K5K7ll3J9Nm2j4R2k3MJ6q3M5QK6m7O8K4p9K3j8k4N9k6L2M3p5
$$ -37 42 6 32 -40 -15 12 9 -24 -5 0 -42 -56 36 13 17 33 -50 -5 3 29 -18 50 74 -5 18 0 -24 35 9 41 84 9
5872Io6R4l1j8O5n4J9M9l9n2L2j5O6l2j3l5O0r4K1M9J1m1lm8K6mO5j1l7K7Rj3
$$ 9 -57 37 6 -12 53 -1 18 67 28 -24 8 -7 59 27 14 -21 39 -55 -34 15 26 -15 -18 -66 -40 -44 21 10 -27 0 9 -4
5904dj9k0P2o3M6o6jJ14o0j9l7Q9m1mN8r2J4Q5q4k5J02m1j2j4O5p9R1J3kp9ll4
$$ -4 -23 -43 29 -34 12 -54 -55 59 -1 -20 -57 32 -9 -13 45 -47 -33 52 -32 -57 45 4 -8 -22 43 -36 55 68 66 -13 -16 -50
5936e0Q3n4k7P4l7JMO0p5k0M2k8J3O5o8k0O2o9O8l7k3M1o1M6j7nJ5L6m4N4o1L4
$$ -50 33 -21 -48 26 -11 -10 -6 54 -21 -41 1 -27 -14 51 -17 -37 25 -44 24 -13 -36 5 -56 -10 -27 -32 -17 19 -25 29 -32 2
5968BJm3O2j9Mk3M6m4J2M2m9m6J78p0n9J8OK3p3N1L9p8j2J2J7M7o9K9l4kN4l9
$$ 2 3 -40 22 3 7 -16 30 -14 -2 40 -9 -55 123 53 -6 12 18 41 -32 19 58 -20 -32 -20 -3 44 -25 4 -30 -32 22 -17
6000a7J6L2n8J5K7l3O6j18Q1j3JLKj2oO5l4j6J2K9m7qK7o1oK4N8j8j1m1N3L6o2
$$ -17 -1 31 -27 -12 15 -18 48 -70 11 -2 -1 2 4 -8 -14 51 17 1 13 42 -5 -13 14 -47 -53 -29 29 11 0 -41 12 48 -14
6033a4L5o4M6J2j5M1l4m1J7N9k1Nm2K7l4%J8O3q4nK9m2J16n9m8N7m8N1K4j07K0
$$ -14 21 -43 3 15 0 41 7 -34 -17 42 21 26 -16 11 -23 -23 -5 58 -26 -31 -2 -44 72 13 -35 22 -26 25 49 -58 -38
6064c8M7kk6k8J00k9k2m2K9o3L4m2P4J5k6O4r6L3K0pL0j3j7J0J5K3m0l4l5O7p3
$$ -38 9 7 -19 -47 53 24 2 -40 -11 -74 -40 -82 -8 7 -19 45 -51 -18 2 -5 25 12 -5 5 20 43 3 -31 -66 1 -72
6095g2M5N3m1M0l3jk8%K7J8k7N9j8J1j9j8n5K9nK8K2J6L8m9m0nO3m2L5l5K8r3
$$ -72 -27 26 -15 25 -8 -9 -37 -37 -10 8 -19 40 22 33 14 -4 -59 -30 -35 -7 15 31 69 20 -20 -25 38 -4 31 -4 24 -69
6127f9M5J9J6k1M5l7m5O4n1J29o1n6K0J3K2j4l9Jrk0qK6N8jjm4O0n5J8n0M7M2
$$ -69 -24 -5 11 -10 35 -2 -47 17 -34 95 34 -22 -2 11 33 19 -20 -19 -28 -48 -56 -30 28 27 26 -18 42 -13 5 -45 2 44
6159D4J6m8L3k7jk7K7N1j01K7L8p3P1l8K3Om9R5j38K7O0k7L0n8m6Q9k3PmJ0k9
$$ 44 60 12 45 18 17 -10 17 68 -33 -6 32 -41 30 -8 15 21 -28 67 -71 -44 16 -11 19 -39 -85 4 -19 -12 -16 -6 -35
6190c5N0J4p0O8o4N0Kl5K0j2K4j5J3j04P3m9L8l1M4kPO0j05P2o3N5KQmpl1M5k
$$ -35 15 29 -41 27 -37 13 15 -20 0 -12 12 -3 10 -94 -21 -70 -32 -63 -19 -21 -14 46 -59 13 -50 5 7 15 11 4 -27 18 16
6223A6j2j9J2KOM0Jk4o3j0L4O1r0jJ3M5j2l7P7j05P7o8N2k8J9k9P0j5J5%LL0j38
$$ 16 4 -15 -3 -1 5 45 46 22 -41 -51 -17 44 -46 -47 -34 11 -1 -38 39 -66 11 -57 -5 -33 -14 -43 27 12 27 27 30 60 -78
6256g8Q4K9Jp6J2L8N3p0k1QK3nK1n6O9j3p7K8P8n6pN4p8Q8r1Q0n9N8o8L8J9mP
$$ -78 6 35 36 -40 -28 10 63 -7 -28 -20 3 -2 19 -37 32 19 -58 -30 48 -8 -15 39 -39 49 -42 38 -21 37 -31 7 26 22 29
6289B9m5K5J8n3k8L5J1J1K9m8Qk4P8r4M4L9J9m8m2N4p1L4LM0p4KL2L7Jl0kQl3
$$ 29 -16 9 27 -26 -54 -19 -8 3 32 -16 -8 -32 46 -48 -4 35 54 6 -36 18 -53 -19 -16 24 -50 -48 -16 21 22 -8 -10 -2 -35
6322c5M4n3J14p7l6KJ52m4m2klk5mL3r3Q4nMK3kl7l2N7m2L2J6qk0j7MoP4p9N0
$$ -35 9 -44 70 -7 -43 -41 111 67 25 23 20 -5 -9 24 -69 15 10 14 37 35 -2 -34 23 -19 13 29 21 1 -16 -12 -18 56 -23 27
6356B7o2N6j6o7Q2J9l7pK2j9qKk2P3m5k2J8l1M7k0K7Lm8%j7L8K9o6Rk6L9J1J2
$$ 27 -35 21 5 -62 20 39 2 -5 17 -2 -10 -8 -30 43 -2 -24 -6 -37 10 -10 17 20 -28 -28 -45 -7 22 -44 -35 -61 -22 -11 1
6389AM7qqNk1Ml7LN0m6N2o8N8Pn8K6%j9J1RKjJ8m6N8p8PJ5K8l6K3n%l8N7Lk4M3
$$ 1 48 40 32 37 16 20 -17 -14 36 -10 42 -26 32 39 -19 7 7 -12 -1 8 10 9 27 -19 39 -39 -32 -17 11 -25 -2 -7 -7 -45 12 15 -9 34
6427C4l1KrKnk0NQ1j19J9R8l9nm9O9q2J3l2N4O6r7N4K8k8K6l1k1L5n7J8M1n1j1
$$ 34 3 5 -4 -2 -7 -27 -22 59 -60 -41 57 18 13 -36 33 -49 -36 -68 -14 52 -45 9 37 9 35 4 -17 18 -39 -21 20 -31 -42
6460d2J44j82R8o3K4K6k8j3L2k0K8K0J4r0K8O5o8M4N3p2l1k3P2Km8L5%o9M7k6
$$ -42 102 -80 18 -45 -21 5 -23 -36 -4 -24 4 24 38 -52 -24 41 -27 17 70 -2 -33 -56 16 18 -30 5 5 -64 -17 -43
6490d3K6jj1O6j04O1l0L4J8l5O3m4j7k7P4j8l7N3p4J7P1l6j3L8m7M1p6J6L6N4
$$ -43 -17 -18 -29 37 -67 -6 -36 -2 16 -19 44 0 -17 -44 30 12 -25 28 -46 -29 42 6 -7 31 -16 25 -51 -35 1 55
6520E5m3K6j7M7p1K9j8Rpj2k6M2n1LJ4j8JN5J1J4o8K3k1R1q7rj4R6k1r6M7l5M0
$$ 55 12 38 21 68 -3 26 8 17 10 -2 -28 14 -37 -34 -20 -38 -37 18 29 43 -25 -2 -23 68 -19 -28 -42 54 33 -63 -16 -51 -11
6553a1k9L8k6%J21j22J1RPj7M7q7O1j2L7l5j0M4l7J0k8j3Q0n2K8j5k7NjK8p2J08
$$ -11 -40 -2 -28 -28 93 -29 -18 -9 -2 -19 28 -59 2 -10 27 -8 -18 26 -11 -1 -29 -42 38 -14 14 -1 -28 -23 -24 4 -68 40
6585D0k1j8rO7l4k4L9o1j6K3L3QJ6p2J8ppJ0Q1m4l4J8RK7j20J03k2m2R1j25J34
$$ 40 19 1 -8 59 25 1 40 -21 -37 -14 19 27 43 -29 -11 -18 -25 -15 66 22 -12 6 15 42 -78 25 3 -39 52 -73 61
6616F1q3Qk9O2j8k7J1l4L8K5n6L6M5m2j1l4N8L2l3Okm6J9lk4Q7k4n3pl3J52o9
$$ 61 -22 -14 -43 19 1 -26 -15 -49 -11 14 -42 -6 39 -3 -14 -48 10 42 9 15 13 -33 -14 -17 -41 46 22 -31 -38 -71 81 12
6648A2J8o7M7K6j1j9J1j8L6j3o7OM3j4QJ6k6M5k6n0L8P0q5Oj3J9ol8R4m4J9rl7
$$ 12 30 -37 10 36 25 6 17 -1 35 22 -45 -39 4 -10 -2 14 -12 33 7 -43 -5 65 -20 -14 -27 -8 -14 -52 42 -2 17 8 -29
6681b9K3K3o5M7L8j4K9j09P0P4j0m1l1Kk5L4l9J9Lkk1l2J08p1pO0p6J7k6P8J6
$$ -29 -6 17 -48 -1 37 23 52 -57 13 87 77 36 5 7 -18 16 -23 -4 -1 -3 -24 -56 52 -19 -26 34 -42 -25 -51 27 43
6712D3q7N1l0M2m7K9pj0oL9J3j09P7j1jj9kM0K7Mm1o4Q1k3N2k2k9n1Q1q2O1l8
$$ 43 -44 7 -23 19 -28 1 -6 -16 -22 17 30 -79 -2 -13 -14 -33 -35 5 32 36 -5 -69 12 -11 41 19 -10 -61 20 -62 -1 -39
6744c9L8o2M6pK2Mj5QPK2j7jL0oo1P7jj5j3nk2N1k0m1K1KqRJ5l5N1pq6P9Ljk2
$$ -39 -1 -63 -17 -24 -2 2 -13 -5 2 24 7 6 36 30 -31 46 45 30 17 12 -10 41 21 -20 1 3 -5 4 19 -16 35 28 -58 21 24 23 1
6781AL9m3jL4o2L8o0J4k7J1L8MK2l3l1J22p6M6k3n6N9k4L4l6N6n2kPL8k6K8m9
$$ 1 40 -3 -4 30 -32 6 -54 -40 -67 -56 -18 -14 8 -25 -56 66 -10 36 13 -43 16 -8 26 -10 46 -6 -8 -1 37 11 39 -10
6813a0K2k8L4Jm5L3nML1j2Mj3pj8j6K7m4RMK0KM9n2M6l0kn0M0l4L5o8J09j24Q8
$$ -10 12 -16 18 19 -26 7 2 6 37 25 29 16 9 -9 -25 2 -42 -33 -29 -9 -7 42 -10 36 6 4 -46 -6 -40 -5 -73 36 -88 0
6847@K9m8O2j04J00o9Qnkj7L9J3Jo9M0N8j2J9p7N2J0n4M1l1L9%j0n5PK3M7j0m0
$$ 0 29 -19 43 -61 39 -30 -22 -27 -29 -46 -7 6 7 -62 -22 36 24 43 -34 18 28 -26 15 -16 23 23 13 -42 -35 -12 35 25 -15
6880a5l1Q3o1J2O7%r3N6j0m3N4Pm8K2J0QRl6n9P1n3rJ4L7k4P1o1M5m2P9j03P1
$$ -15 -46 37 -24 -12 55 55 -38 18 8 -35 19 26 -22 0 10 18 27 -9 -68 3 -50 -59 -45 -8 -32 39 -22 23 -19 60 -43 28
6912B8q8KL8J9jj4K7k7LK5K4k4K5l2J7k9%K0K7l4L4K2q6J1R4j01RN6p0J0K1J9
$$ 28 -60 -58 -20 -1 -2 -16 11 -16 -13 12 36 12 37 5 22 -7 -7 13 40 6 40 62 -24 -13 81 -20 -11 45 -25 -15 6 25
6944B5rk5J6L6o9J5M6k4j4K1Mk1k0J1J0l7Nj2N7p2K3M4Q2j16M6l7j4l4M8Mn8Q5
$$ 25 16 -9 7 43 -26 -11 35 11 -3 18 22 1 -19 -8 2 -35 -30 -42 15 -57 -34 10 92 -24 22 -15 -29 -63 -15 -11 -69 16
6976A6o0N7m9O3o0k1M4k8lL4PN4k5m1N5lk4m0nJ5L0M5j0o1K5M5o2j6K0K4j3l5
$$ 16 -44 13 -36 27 -33 -54 -10 -38 -41 -7 0 54 29 -12 43 40 16 -24 -29 -14 16 61 51 -10 15 60 -2 -18 2 26 13 -22
7008b2J7j3O5p8L9p6O7KMJ9k6J3Nm3j7N9KJ2l3P5n2j4%l3j6L4j6P7o3j8O6k6J2
$$ -22 -5 -18 47 -31 8 -68 -1 1 5 24 -2 11 16 -27 -44 15 17 29 -4 71 19 5 5 -28 -44 -10 -26 51 -12 -30 36 10 22
7041B2n1N4j3mnJM9m9N0o3Ro0K9P0p0L1k0NM4J4m5j0PRJ3K9l4PNm8J1mjK1J7q
$$ 22 -29 25 12 8 3 4 53 4 54 -9 0 -60 -31 39 -31 0 -20 -15 29 43 -2 -12 -5 4 17 46 12 19 24 -24 -13 -17 -18 3 20 12
7077A2L4l2oPm4M6n1J9K7J8n8Ln4J06q2R3n7k0JM7j0pl8RP7l8nRJ5j3MJL1p7j7
$$ 12 46 14 8 15 -29 17 -34 -15 12 30 -28 -25 -79 27 -55 38 -19 -39 -38 9 -1 -8 -46 -37 40 2 -3 6 21 8 12 13 44 -33 -50
7112e0J02l6n5N9lL1q9L0L1%k7Mqk5N2m7J9qM4n4jK1K9n8R2o0JL9k9mj4KL2Jq3
$$ -50 52 16 -39 20 17 48 -41 -11 20 20 -7 -3 -11 -36 16 -31 -12 -20 24 -30 -31 -10 19 -39 53 -7 -6 33 4 0 -14 -12 20 21 -62
7147f2Q5q7J23p0Pj9K1Lk3R5o1L5p3L5j1jL5q5N3l2J5MnL7k1k2JN1MnKo6L8L4
$$ -62 23 -64 59 -11 -4 -23 -2 1 -22 73 12 47 -26 9 -2 -3 32 -53 0 -32 -17 -13 -18 19 -2 -24 -23 28 32 27 29 -37 1 35
7181C5j8k1j2l1M0J07r0k5J4J6l0k6K3j3P8m4lj5Jk8ljjJP9k4J6p6RJ0J5J0mL4
$$ 35 17 -4 -16 -47 -7 100 10 -15 -1 15 -15 -41 -18 -31 47 3 0 -15 -14 -42 -45 -46 -47 -46 33 9 25 -51 -42 -32 -17 -7 -11 23
7215B3n9L2j7j3N0j8kl1R7l5k0K6l5m2J3M0lK3j6MmK5kk3m0N0j2n6N2l3M7o9L7
$$ 23 -36 -4 -21 -34 16 -2 -4 -35 62 27 7 33 -2 -44 -31 9 6 29 13 17 13 38 36 13 -27 23 11 -45 7 -26 21 -48 -11
7248a1K6j2Kjn1O5n4K1n1J08m0Lk4j0rk1L3m3QN8K1m6Pkj8O3n2R2l4l3NJ7Km1
$$ -11 15 3 5 4 -47 18 -36 -15 -66 42 2 5 -19 -29 -38 -59 -26 -69 -61 -3 18 -28 -21 -23 -41 22 -30 62 28 -5 0 17 19 -22
7282b2RJ0MoNK0L9k6m2j1J0K1nO9r8L5m1Q1l9m9M4K6m4jM3KK1j06Q4n2j7j6O0
$$ -22 -13 -3 1 -5 0 20 59 33 -9 -20 -10 11 6 75 -23 12 -29 52 13 -36 8 34 -10 -11 32 34 55 -51 33 -19 -36 -52 8
7315Hl8K9mk9N0O2j18qR0j5J6j1j6J0L6r0MJ3j2nJ8m2L8J13j46Q7o1M2J6m8L6
$$ 8 -30 -1 -5 -34 16 78 -40 -48 42 27 43 32 16 26 62 -28 -24 -11 -23 -28 -10 -52 -14 99 -47 40 -21 21 37 -11 25
7346B5m9M8J4l0k7J3O8l4mj0M5j4o3K5L8m9oM3j6K0o4m2Q4nl0M9ojk1k1k6J5K8
$$ 25 -24 24 38 8 -19 -6 62 28 24 14 59 45 -18 7 45 -4 -10 33 17 37 -27 -69 15 10 -20 29 23 22 1 -20 -46 -31 -3
$$ [...]
8191A1
##END NTUPLES=NMR FID
##END=
