##TITLE=1H_LR-710-B1
 D2O, 8 sc, 
 6.2.2020
##JCAMPDX= 6.0         $$ Bruker NMR JCAMP-DX V2.0
##DATA TYPE= NMR FID
##DATA CLASS= NTUPLES
##ORIGIN= UXNMR, Bruker Analytische Messtechnik GmbH
##OWNER= root
$$ XWIN-NMR		Version 3.5
$$ Thu Feb  6 14:30:31 2020 Russian Standard Time (UT+4h)  she@DPX200
##.OBSERVE FREQUENCY= 200.1315
##.OBSERVE NUCLEUS= ^1H
##.DELAY= (6, 6)
##.ACQUISITION MODE= SIMULTANEOUS
##.ACQUISITION SCHEME= undefined
##.AVERAGES= 8
##.DIGITISER RES= 18
##SPECTROMETER/DATA SYSTEM= spect
##.PULSE SEQUENCE= zg30
##.SOLVENT NAME= D2O
##.SHIFT REFERENCE= (INTERNAL, D2O, 0, 15.7039)
##AUDIT TRAIL= $$ (NUMBER, WHEN, WHO, WHERE, WHAT)
$$ ##TITLE= Audit trail, XWIN-NMR		Version 3.5
$$ ##JCAMPDX= 5.01
$$ ##ORIGIN= Bruker BioSpin GmbH
$$ ##OWNER= she
$$ F:/spectra/data/she/nmr/H-F/1/audita.txt
$$ ##AUDIT TRAIL=  $$ (NUMBER, WHEN, WHO, WHERE, WHAT)
(   1,<2020-02-06 14:29:40.17 +0400>,<she>,<DPX200>,
      <created by zg, POWCHK disabled, PULCHK disabled
       configuration hash MD5:
       00 E9 B6 7A A2 85 ED C7 34 08 36 98 17 FE 4E 26
       data hash MD5: 16K
       EB 5B 43 56 45 80 8B 5F 66 ED 90 92 F0 9A 46 86>)
$$ ##END=
$$ 
$$ hash MD5
$$ B9 D7 D8 4F 22 BF B2 C3 A6 9C 2E 75 7B 21 A9 15
##$RELAX= 
##$RELAX= 
##$RELAX= 
##$RELAX= 
##$RELAX= 
##$RELAX= 
$$ Bruker specific parameters
$$ --------------------------
##$DU= <F:/spectra>
##$EXPNO= 1
##$NAME= <H-F>
##$PROCNO= 1
##$TYPE= <nmr>
##$USER= <she>
##$AMP= (0..31)
100 100 100 100 100 100 100 100 100 100 100 100 100 100 100 100 100 100 
100 100 100 100 100 100 100 100 100 100 100 100 100 100 
##$AQSEQ= 0
##$AQ_mod= 1
##$AUNM= <au_zg>
##$AUTOPOS= <>
##$BF1= 200.13
##$BF2= 200.13
##$BF3= 200.13
##$BF4= 200.13
##$BF5= 200.13
##$BF6= 200.13
##$BF7= 200.13
##$BF8= 200.13
##$BYTORDA= 1
##$CFDGTYP= 0
##$CFRGTYP= 5
##$CHEMSTR= <none>
##$CNST= (0..31)
1 1 145 1 1 1 1 1 1 1 1 1 1 1 1 1 1 1 1 1 1 1 1 1 1 1 1 1 1 1 1 1 
##$CPDPRG= <>
##$CPDPRG1= <>
##$CPDPRG2= <>
##$CPDPRG3= <>
##$CPDPRG4= <mlev>
##$CPDPRG5= <mlev>
##$CPDPRG6= <mlev>
##$CPDPRG7= <mlev>
##$CPDPRG8= <mlev>
##$CPDPRGB= <>
##$CPDPRGT= <>
##$D= (0..31)
0 1.2 0 0 0 0 0 0 0 0.06 0 0.03 0 0 0 0 0.0002 0 0 0 0 0 0 0 0 0 0 0 0 
0 0 0 
##$DATE= 1580984979
##$DBL= (0..7)
120 120 120 120 120 120 120 120 
##$DBP= (0..7)
150 150 150 150 150 150 150 150 
##$DBP07= 0
##$DBPNAM0= <>
##$DBPNAM1= <>
##$DBPNAM2= <>
##$DBPNAM3= <>
##$DBPNAM4= <>
##$DBPNAM5= <>
##$DBPNAM6= <>
##$DBPNAM7= <>
##$DBPOAL= (0..7)
0.5 0.5 0.5 0.5 0.5 0.5 0.5 0.5 
##$DBPOFFS= (0..7)
0 0 0 0 0 0 0 0 
##$DE= 6
##$DECBNUC= <off>
##$DECIM= 24
##$DECNUC= <off>
##$DECSTAT= 4
##$DIGMOD= 1
##$DIGTYP= 9
##$DL= (0..7)
0 120 120 120 120 120 120 120 
##$DP= (0..7)
150 150 150 150 150 150 150 150 
##$DP07= 0
##$DPNAME0= <>
##$DPNAME1= <>
##$DPNAME2= <>
##$DPNAME3= <>
##$DPNAME4= <>
##$DPNAME5= <>
##$DPNAME6= <>
##$DPNAME7= <>
##$DPOAL= (0..7)
0.5 0.5 0.5 0.5 0.5 0.5 0.5 0.5 
##$DPOFFS= (0..7)
0 0 0 0 0 0 0 0 
##$DQDMODE= 0
##$DR= 18
##$DS= 0
##$DSLIST= <SSSSSSSSSSSSSSS>
##$DSPFIRM= 0
$$ [...]
##$SUBNAM2= <"">
##$SUBNAM3= <"">
##$SUBNAM4= <"">
##$SUBNAM5= <"">
##$SUBNAM6= <"">
##$SUBNAM7= <"">
##$SUBNAM8= <"">
##$SUBNAM9= <"">
##$SW= 24.9337058887773
##$SWIBOX= (0..15)
0 0 2 0 0 0 0 0 0 0 0 0 0 0 0 0 
##$SW_h= 4990.01996007984
##$TD= 16384
##$TD0= 1
##$TE= 0
##$TE2= 300
##$TE3= 300
##$TEG= 300
##$TL= (0..7)
0 120 120 120 120 120 120 120 
##$TP= (0..7)
150 150 150 150 150 150 150 150 
##$TP07= 0
##$TPNAME0= <>
##$TPNAME1= <>
##$TPNAME2= <>
##$TPNAME3= <>
##$TPNAME4= <>
##$TPNAME5= <>
##$TPNAME6= <>
##$TPNAME7= <>
##$TPOAL= (0..7)
0.5 0.5 0.5 0.5 0.5 0.5 0.5 0.5 
##$TPOFFS= (0..7)
0 0 0 0 0 0 0 0 
##$TUNHIN= 0
##$TUNHOUT= 0
##$TUNXOUT= 0
##$USERA1= <user>
##$USERA2= <user>
##$USERA3= <user>
##$USERA4= <user>
##$USERA5= <user>
##$V9= 5
##$VALIST= <valist>
##$VCLIST= <CCCCCCCCCCCCCCC>
##$VD= 0
##$VDLIST= <DDDDDDDDDDDDDDD>
##$VPLIST= <PPPPPPPPPPPPPPP>
##$VTLIST= <TTTTTTTTTTTTTTT>
##$WBST= 1024
##$WBSW= 4
##$XGAIN= (0..3)
0 0 0 0 
##$XL= 0
##$YL= 0
##$YMAX_a= 34223
##$YMIN_a= -29646
##$ZGOPTNS= <>
##$ZL1= 120
##$ZL2= 120
##$ZL3= 120
##$ZL4= 120
##$ABSF1= 10
##$ABSF2= 0
##$ABSG= 5
##$ABSL= 3
##$ALPHA= 0
##$AQORDER= 0
##$ASSFAC= 0
##$ASSFACI= 0
##$ASSFACX= 0
##$ASSWID= 0
##$AUNMP= <proc_1d>
##$AZFE= 0.1
##$AZFW= 0.1
##$BCFW= 1
##$BC_mod= 2
##$BYTORDP= 1
##$COROFFS= 0
##$CY= 11.3945322036743
##$DATMOD= 1
##$DC= 2
##$DFILT= <>
##$DTYPP= 0
##$F1P= 16.9975609425685
##$F2P= -3.02152046262296
##$FCOR= 0.5
##$FTSIZE= 0
##$FT_mod= 4
##$GAMMA= 1
##$GB= 0.15
##$INTBC= 1
##$INTSCL= 1
##$ISEN= 128
##$LB= 0.24
##$LEV0= 0
##$LPBIN= 0
##$MAXI= 10000
##$MC2= 0
##$MEAN= 0
##$ME_mod= 0
##$MI= 1.114404
##$NCOEF= 0
##$NC_proc= 0
##$NLEV= 6
##$NOISF1= 3.799351
##$NOISF2= 2.8
##$NSP= 1
##$NTH_PI= 0
##$NZP= 0
##$OFFSET= 15.70392
##$PC= 1
##$PHC0= -9878.811
##$PHC1= 22.40081
##$PH_mod= 1
##$PKNL= yes
##$PPARMOD= 0
##$PSCAL= 0
##$PSIGN= 0
##$REVERSE= no
##$SF= 200.130013532006
##$SI= 16384
##$SIGF1= 3
##$SIGF2= 2
##$SINO= 400
##$SIOLD= 16384
##$SREGLST= <1H.CDCl3>
##$SSB= 0
##$STSI= 0
##$STSR= 0
##$SW_p= 3612.71676300578
##$SYMM= 0
##$S_DEV= 0
##$TDeff= 0
##$TDoff= 0
##$TI= <>
##$TILT= no
##$TM1= 0
##$TM2= 0
##$TOPLEV= 0
##$USERP1= <user>
##$USERP2= <user>
##$USERP3= <user>
##$USERP4= <user>
##$USERP5= <user>
##$WDW= 1
##$XDIM= 8192
##$YMAX_p= 0
##$YMIN_p= 0
$$ End of Bruker specific parameters
$$ ---------------------------------
##NTUPLES= NMR FID
##VAR_NAME=  TIME,          FID/REAL,        FID/IMAG
##SYMBOL=    X,             R,               I
##VAR_TYPE=  INDEPENDENT,   DEPENDENT,       DEPENDENT
##VAR_FORM=  AFFN,          ASDF,            ASDF
##VAR_DIM=   8192,          8192,            8192
##UNITS=     SECONDS,       ARBITRARY UNITS, ARBITRARY UNITS
##FACTOR=    0.0002004,     1,               1
##FIRST=     0,             0,               0
##LAST=      1.6414764,     0,               0
##MIN=       0,             -29646,          0
##MAX=       1.6414764,     34223,           0
$$ Real data points
##PAGE= N=1
##DATA TABLE= (X++(R..R)), XYDATA
$$ [...]
1575e6j721r02L34J425J852J380L17q80j710j752r23K77J384J804J416M12q57
1592A800j694j719r68K19J298J807J460M30p99j624j728j034J71J257J804J456
1608B136M78p14j608j739j071J19J202J766J489N36o66j554j743j086M7J147J733
1625D72J533N71o16j517j715j136j9J106J728J518O16n63j459j721j170o0J066
1642a366J685J540O67m94j442j716j181j00R62J673J557P18m44j408j687j213
1658b249j82R43J643J559P58l98j316j694j250k43Q93J608J564Q00l12j309j704
1675h89j255k74Q37J575J561Q47k61j278j653j289l28P73J546J584Q67k15j210
1692I38j651j314l79P17J522J564R21j56j159j649j336m15O92J452J590R55r9
$$ plain form
1575 -56 -1777 -2679 -2345 -920 932 2312 2629 1749 39 -1713 -2636 -2359 -975 829 2245 2657 1800
1592 1800 106 -1613 -2581 -2362 -1064 743 2203 2633 1834 210 -1518 -2552 -2381 -1124 680 2136
1608 2136 2614 1900 292 -1447 -2518 -2399 -1197 569 2058 2594 1928 374 -1369 -2455 -2408 -1261 472
1625 472 2005 2576 1960 443 -1272 -2408 -2427 -1321 407 1925 2541 1978 519 -1202 -2372 -2432 -1366
1642 -1366 319 1859 2526 2032 590 -1126 -2307 -2407 -1445 228 1785 2503 2059 651 -1036 -2249
1658 -2249 -2431 -1488 155 1714 2472 2074 758 -936 -2186 -2429 -1536 72 1636 2436 2124 815 -889
1675 -889 -2144 -2418 -1581 -6 1555 2402 2141 863 -790 -2079 -2407 -1634 -88 1496 2363 2148 938
1692 938 -713 -2027 -2406 -1689 -167 1397 2318 2162 1003 -646 -1982 -2397 -1705 -253 1337 2292 2193
1709B193j134j612j348m59O03J448J581R87o4j085j582j372n15N79J410J568R96
1726B194J2j031j579j391n40N23J359J579J038M9r96j538j400n86M70J324J569
1743A056J071Q0r30j525j405o38M18J296J540J106J42q85j498j444o58L76J247
1760f51J553J107J95q30j473j417p12L17J197J545J154K13p83j446j417p62K74
1777a936J176J521J163K60p27j413j442p79K29J118J512J189L10o74j393j438
1793a324q15J70J083J485J208L71o39j365j432q36J07J034J495J219M02n87j323
1810B53j449q88Q5R93J471J227M51n41j306j421r10L5R54J434J254M94m96j269
1828C71j442r18j4R05J438J252N27m57j232j415r69n9Q73J393J284N72m17j183
$$ plain form
1709 2193 1059 -553 -1901 -2360 -1757 -309 1272 2259 2195 1110 -472 -1844 -2359 -1780 -370 1198 2194
1726 2194 2206 1175 -404 -1795 -2335 -1812 -453 1126 2164 2213 1217 -321 -1721 -2307 -1837 -513 1056
1743 1056 2127 2207 1277 -248 -1653 -2291 -1873 -577 963 2069 2211 1326 -172 -1616 -2274 -1898 -651
1760 -651 902 2009 2204 1374 -99 -1516 -2228 -1911 -714 831 1985 2198 1415 -31 -1448 -2210 -1936
1777 -1936 -760 761 1924 2184 1457 44 -1398 -2177 -1948 -830 682 1871 2181 1507 114 -1324
1793 -1324 -2139 -1969 -886 599 1807 2178 1539 174 -1258 -2094 -1987 -953 542 1761 2163 1576 253
1810 253 -1196 -2084 -1999 -1006 465 1692 2143 1602 296 -1125 -2035 -2000 -1046 388 1642 2136 1640 371
1828 371 -1071 -1989 -2003 -1098 340 1592 2119 1662 430 -985 -1954 -2013 -1140 253 1537 2109 1692 509
1846E09j428r81r8Q19J374J294N87l71j148j423j004j40P80J357J293O19l15j118
1864F06j417j011j90P37J329J306O65k80j079j391j051k28O87J312J299O87k23
1881A758j043j385j067k71O61J291J308P10j83j009j369j090k99O05J260J318
1897A195P50j43r76j377j096l29N73J231J308P72j09r10j355j128l71N23J201
1914b41J312Q07n6r04j328j118m38M90J171J305Q43j6q69j291j146m71M40J126
1932c84J321Q64K2q07j305j145m97L92J117J294Q94O6p73j274j153n37L53J074
1950d78J302Q96J12p18j247j193n54L10J039J286R34J65p14j216j194n90K66J013
1968e81J289R38J96o54j207j203o06K25R46J276R78K23o01j191j198o52J91R32
$$ plain form
1846 509 -919 -1900 -1998 -1179 195 1489 2076 1705 557 -866 -1870 -2010 -1230 127 1420 2039 1724 606
1864 606 -811 -1822 -2012 -1275 54 1360 2025 1745 666 -725 -1776 -2004 -1317 -5 1294 1981 1758
1881 1758 715 -670 -1737 -2008 -1347 -56 1252 1962 1779 770 -599 -1689 -1988 -1383 -123 1195
1897 1195 1945 1802 826 -551 -1647 -1976 -1403 -172 1136 1908 1799 889 -466 -1594 -1965 -1442 -241
1914 -241 1071 1878 1822 918 -410 -1528 -1966 -1476 -305 1000 1843 1827 958 -333 -1479 -1950 -1510 -384
1932 -384 937 1801 1823 1016 -289 -1434 -1931 -1539 -422 872 1766 1832 1059 -215 -1368 -1905 -1552 -478
1950 -478 824 1720 1832 1114 -133 -1326 -1880 -1570 -531 755 1689 1854 1140 -76 -1270 -1860 -1594 -581
1968 -581 708 1646 1842 1188 -19 -1222 -1828 -1603 -657 619 1597 1820 1219 28 -1170 -1822 -1631 -699
1986f99J257R87K59n58j160j195o86J40R02J266R87L12n25j134j204p04J03Q64
2004g88J239J025L31m90j096j201p34O6Q13J218J029L80m48j075j195p59PQ12
2022h66J194J049M08m08j040j203p80j5P37J189J047M50l71j021j193q05m4P31
2040i41J147J073M62l32r82j191q21j08O88J158J072M93k96r45j185q41j22O39
2058a032J114J091N40k70r28j174q54j63O14J117J066N70k27q88j168q78j98N80
2076a088J075J096N73j68q64j157q97k35N45J065J087O10j44q34j142r26k49M87
2094a166J043J097O19r1p98j145r12l04M65J016J096O52o9p53j137r23l24M25
2112a209R87J087O86l8p42j098r52l50L85R72J098O93J4p12j079r63l90L63R40
$$ plain form
1986 -699 558 1545 1804 1246 86 -1109 -1795 -1655 -753 513 1500 1812 1287 153 -1051 -1755 -1652 -788
2004 -788 451 1476 1807 1317 221 -980 -1714 -1648 -835 383 1412 1792 1344 269 -926 -1685 -1678 -866
2022 -866 328 1377 1785 1377 337 -866 -1646 -1661 -924 265 1312 1762 1391 370 -823 -1628 -1672 -941
2040 -941 206 1279 1741 1409 427 -764 -1585 -1693 -1005 153 1225 1718 1422 477 -708 -1549 -1671 -1032
2058 -1032 82 1173 1713 1443 515 -659 -1513 -1676 -1062 55 1121 1691 1464 576 -592 -1470 -1668 -1088
2076 -1088 -13 1083 1656 1488 624 -533 -1430 -1665 -1120 -55 1032 1642 1498 664 -478 -1404 -1653 -1166
2094 -1166 -123 974 1593 1502 704 -441 -1353 -1657 -1192 -176 920 1572 1503 750 -387 -1310 -1634 -1209
2112 -1209 -222 865 1551 1513 771 -327 -1279 -1629 -1244 -272 826 1519 1533 821 -258 -1221 -1611 -1248 -308
2131c08J082P34K8o74j070r69m08L17R03J081P65O3o43j061r62m52K79Q88J081
2150F74P56R3n96j040r86m65K38Q76J054P90J34n80j012j000m88K16Q28J066Q05
2169A363J63n53j003r83n21J80Q12J062Q06J93n04r80j003n47J51P79J050Q27
2187A292K32m80r65j001n68J23P39J046Q32K58m38r33j011n91R3P22J031Q41K84
2206A506m11r22r90o17N3O84J014Q59L08l69q95j007o35K4O60J002Q71L50l38
2225A147q95r93o50j8O27J002Q81L75l22q52r88o82m1O18R61Q87L87k65q18j005
2245f44o88p0N76R57R03M14k50q00r81p19q2N33R29R06M35k09p72r83p28j21N10
2266h84R27R13M55j88p49r68p40j50M54R06R24M86j63p04r72p64j85M51Q92R11
$$ plain form
2131 -308 774 1508 1536 862 -208 -1177 -1585 -1268 -365 716 1481 1544 901 -160 -1122 -1574 -1295 -407 674
2150 674 1430 1523 927 -113 -1099 -1564 -1326 -450 604 1394 1528 948 -64 -1064 -1552 -1336 -508 558 1363
2169 1363 1526 973 -30 -1013 -1534 -1354 -542 520 1326 1519 1015 35 -968 -1515 -1364 -585 465 1292
2187 1292 1524 1044 79 -922 -1490 -1367 -628 418 1250 1508 1070 137 -874 -1465 -1372 -650 381 1222 1506
2206 1506 1095 173 -817 -1434 -1381 -697 317 1176 1484 1115 220 -787 -1422 -1398 -738 264 1135 1485 1147
2225 1147 252 -741 -1391 -1409 -782 220 1101 1476 1154 302 -686 -1368 -1409 -791 170 1057 1444 1179 361 -644
2245 -644 -1332 -1402 -826 131 1034 1448 1198 398 -583 -1302 -1384 -851 78 984 1419 1210 438 -545 -1273 -1394 -884
2266 -884 43 956 1411 1223 474 -494 -1234 -1384 -930 -24 900 1386 1223 519 -453 -1217 -1402 -951 -59 852
2286H52N19j35o92r56p57k18M09Q78R18N21q3o75r30p83k36L81Q39R10N68o6o27
2307F37r37p95k65L65Q15R22N73l1o09r47p89k91L31Q13R18N80j1n93r04q03l29
2328a350L00P98R05N98K7n67r07q03l46K80P74R01O12M7n27q92q21l46K26P60
2348c31Q94O37P4n22q70q11l91K17P28R03O59Q9m75q59q29m07J84P15Q79O70J30
2369A284m62q50q23m22J54O88Q94O68J53m31q33q39m34J29O59Q75P02J69m20q01
2389F0q41m67J17O38Q63P07K00m04p82q42m87Q7O24Q46P03K32l44p82q30n17O4
2410a155N91Q64P12K43l22p55q47n34L9N73Q36P26K86l09p37q39n43J2N52Q23
2430B16P34K81k71p04q37n70j0N15Q20P48L07k47p03q27n67n3M93Q10P52L33k32
$$ plain form
2286 852 1371 1236 544 -412 -1169 -1387 -978 -100 818 1339 1256 581 -349 -1132 -1368 -987 -148 762 1330 1264 637
2307 637 -300 -1095 -1360 -995 -180 742 1315 1284 675 -272 -1061 -1352 -1021 -208 710 1290 1279 686 -218 -1021 -1350
2328 -1350 -1050 -252 653 1251 1278 711 -196 -999 -1345 -1065 -291 610 1222 1269 742 -150 -971 -1317 -1091 -331
2348 -331 563 1200 1274 752 -118 -929 -1320 -1103 -375 528 1187 1276 801 -58 -887 -1294 -1110 -395 484 1154 1284
2369 1284 822 -28 -851 -1273 -1119 -431 463 1131 1284 853 20 -819 -1253 -1124 -465 410 1112 1281 861 60
2389 60 -781 -1248 -1131 -493 370 1077 1277 873 91 -751 -1238 -1151 -527 319 1022 1254 910 128 -702 -1219 -1155
2410 -1155 -564 300 1012 1255 933 178 -669 -1203 -1164 -591 245 971 1257 948 211 -628 -1171 -1159 -607 216
2430 216 950 1231 960 256 -581 -1151 -1161 -646 174 922 1229 982 279 -548 -1115 -1168 -675 135 887 1220 988
2451I88o77q22n78q5M71Q11P32L51k09o41q28n94r8M37P82P63L82j71o53q09o06
2472a054j29M22P73P64L96j44o25p96o32j43M05P41P71M17j22o06p98o29j64L69
2492g84P26P66M44r7n88p96o37j92L54P22P46M47m7n62p96o41k09L15P19P53M58
2513A101m4n46p68o58k25K96O81P53M90k0n17p76o59k43K73O73P61M89lm85p61
2534a88o58k76K38O60P59N13K3m57p49o79l04K44O23P55N23M4m36p43o77l16K03
2555h98O10P50N35Q4m19p32o89l43J98N90P47N62Q3m04p11o90l59J51N94P28N63
2576I50J19l88o96o98l59J23N74P19N79J41l51o87o98l86J10N36P26N83J71l40
2596G28o63p09l96P4N20P38N81J88k97o69o98m25P5M97P02O01K08k82o49o96m46
$$ plain form
2451 988 311 -511 -1089 -1174 -703 108 840 1191 982 341 -487 -1081 -1179 -742 40 803 1185 1014 361 -448 -1054
2472 -1054 -1183 -761 12 776 1172 1028 403 -393 -1025 -1168 -763 -22 749 1166 1044 438 -360 -989 -1153 -784
2492 -784 -58 708 1152 1055 467 -329 -966 -1158 -804 -82 664 1111 1064 502 -294 -935 -1144 -829 -110 643 1101
2513 1101 1057 511 -257 -915 -1140 -844 -163 590 1080 1060 543 -233 -892 -1135 -862 -189 572 1061 1058 573 -188
2534 -188 -846 -1122 -884 -224 535 1048 1071 614 -135 -814 -1118 -874 -251 504 1027 1071 635 -108 -785 -1101 -898
2555 -898 -288 462 997 1081 662 -70 -759 -1102 -904 -314 433 995 1078 674 -37 -727 -1086 -935 -341 387 950
2576 950 1069 681 -15 -713 -1072 -949 -375 344 923 1064 713 26 -672 -1058 -948 -412 314 897 1068 728
2596 728 65 -644 -1040 -966 -446 292 873 1061 764 95 -603 -1028 -953 -456 246 847 1055 773 124 -572 -1018
2617a018M7M85P05O02K33k71o25o87m47oM67O95O09K51k35o21o94m53j5M39O83
2638A44O23K61k18o08o72m68n3M23O78O31K89k06n75o94m84n3L92O71O21L07j78
2659H31n51o95m92q1L83O41O37L35j56n45o73n07j19L68O39O36L22j17n19o83
2679c46n16j25L41O21O36L57j11m95o76n36j37L12O29O35L60q0m87o69n32j62
2699i81K94O11O42L75o8m56o65n46j83K75N88O38M07m5m54o40n58k03K53N76O40
2720E00M07j2m30o41n70k06K37N61O28M29mm05o33n63k42K02N52O37M28K4l90
2741E09o36n61k40J75N36O31M32O0l83o14n71k69J51N45O15M40O7l55o01n71k84
2762i24J42N03O32M60Q3l37o11n67k88J10N00O15M69Q1k90n84n90l13J14M75O21
$$ plain form
2617 -1018 -971 -486 219 821 1054 783 158 -529 -976 -982 -515 180 789 1040 805 184 -510 -963 -978 -539 144
2638 144 767 1028 810 202 -470 -938 -991 -568 110 741 1030 824 249 -445 -929 -982 -590 81 702 1009 831
2659 831 280 -415 -907 -988 -605 36 673 1008 852 307 -366 -873 -992 -624 15 651 973 856 337 -346
2679 -346 -862 -987 -646 -25 611 968 857 362 -314 -850 -987 -675 -46 589 949 869 382 -287 -819 -981
2699 -981 -687 -76 566 941 873 417 -248 -794 -977 -702 -114 524 931 886 432 -208 -766 -969 -716 -140 500
2720 500 907 895 465 -176 -746 -952 -715 -154 474 903 899 494 -139 -702 -944 -742 -190 447 875 899 509
2741 509 -127 -688 -928 -753 -217 414 846 906 523 -91 -662 -931 -780 -235 380 820 887 532 -69 -640 -924
2762 -924 -782 -279 353 813 896 559 -52 -619 -907 -797 -297 318 787 868 578 -6 -596 -909 -795 -320 301
2783C01M76J20k98n81n74l30R3M52O08M83J53k83n65n86l41P0M27O16M94J61k65
2804F31n56n74l52M9M23N89M85J79k39n33n81l55PM09N86N20J77k21n26n82l54
2825h18PL77N86N07K02j96n16n72l81k9L90N72N17K17j96m94n63m04k5L53N64
2846I8N23K36j74m75n74m00o4L43N65N27K37j33m86n67m01q5L20N58N26K65j44
2867F95m35n76m24q5K90N46N17K80j04m34n63m37j04K95N33N20K80p6m28n56m34
2888g00j28K72N26N32K95o5m15n43m70j18K46N10N32L13l3m18n38m60j40K23M98
2909h1N47L09k7l79n56m40j76K18M70N35L46k6l54n40m60j74J96M64N29L50pl48
2931C96n40m64j92J86M56N27L58Ol17n27m76j99J60M52N17L70L1l16n10m88k02
$$ plain form
2783 301 777 897 599 18 -556 -886 -793 -341 267 750 903 620 55 -531 -872 -802 -375 241 735 896 631
2804 631 75 -499 -851 -802 -379 210 695 874 635 102 -479 -834 -827 -418 168 688 865 644 118 -464 -818
2825 -818 -811 -434 152 659 861 665 149 -423 -804 -833 -443 129 646 863 667 173 -390 -794 -819 -466 98
2846 98 621 857 683 208 -366 -766 -830 -487 78 605 842 709 223 -344 -745 -830 -510 48 574 839 695
2867 695 260 -316 -740 -825 -535 11 528 808 704 270 -293 -730 -834 -539 -6 514 794 718 290 -266 -700
2888 -700 -828 -556 -30 502 797 732 317 -226 -696 -814 -568 -58 474 787 754 336 -202 -662 -802 -579 -81
2909 -81 466 775 748 369 -187 -627 -803 -585 -115 420 766 740 386 -154 -614 -788 -592 -128 401 751 744 396
2931 396 -144 -608 -800 -614 -158 369 727 733 416 -111 -587 -786 -626 -174 343 713 744 428 -82 -570 -772
2952g72J23M49N39L70L1l01n05m75k25J28M26N23L78O6k82n09m70k44J08M11N07
2973B76M05O4k67m96m73k58R4M07N01L90R9k48m72m99k78Q1L90N16L89J06k37
2994D90m66m77k84O0L77M96M17J29k23m65m86k91N9L42M97M13J34j97m63m70k99
3015g07L5L37M90M28J42j84m46m76l07J1L38M99L96J63j74m17m90l11oL16M67
3036A04M34J78j60m10m91l24jK92M57M29J88j25m09n01l12l1K84M67M24J99j16
3057E76l96m95l44l9K84M66M29K17j14l89m74l56n7K67M47M37K22j02l71m56l46
3078e94q6K56M34M37K40r0l64m65l51q2K18M39M43K31n9l65m49l70r2K17M19M36
3100D03K43m2l32m57l69j15K00M16M37K61l8l25m64l76j25J80M14M41K74k5l01
$$ plain form
2952 -772 -649 -200 339 709 740 439 -66 -541 -766 -638 -212 311 689 755 473 -36 -506 -750 -642 -231 276
2973 276 681 745 478 -18 -491 -749 -655 -248 253 643 742 494 22 -477 -755 -674 -284 232 621 727 490
2994 490 24 -453 -737 -677 -300 196 613 742 519 54 -432 -723 -664 -322 175 588 722 525 62 -408 -707
3015 -707 -672 -335 155 583 725 541 95 -381 -688 -677 -339 160 556 719 545 128 -362 -673 -679 -363 104
3036 104 538 716 556 146 -345 -669 -670 -378 79 508 696 571 162 -339 -651 -682 -398 69 493 692 576
3057 576 180 -315 -659 -698 -414 52 481 698 584 195 -279 -635 -692 -425 22 459 681 579 208 -248 -594
3078 -594 -680 -424 10 447 687 597 233 -232 -583 -665 -447 -8 435 666 607 242 -207 -577 -669 -452 -33 403
3100 403 646 604 272 -185 -554 -669 -469 -53 384 645 607 282 -182 -558 -683 -503 -89 352 626 601 300
3121C00m42l76j56J76M10M31K73Pl14m33l72j63J56L84M44K81Rk80m33l90j56
3142f44J41L75M48K77K5k72m31l82j73J14L75M31K96L4k51m27m04j67J03L61M35
3163B64L00N7k46m19l94j94R5L56M22L05N8k27l97l99k07P7L45M15L26P2k22l95
3185hl89k22P0L31M24L29P2k12l86l97k25P0L08M21L34R7j80l95m04k38N7K95
3207b48M27L24J07j80l71m11k34L7K91M13L32J03j50l73m02k25JK77M02L43J38
3228F01j57l61m06k53K0K61M03L40J41j38l53l91k67jK58L91L51J37j14l45l76
3249b59k78l8K62L97L45J55j09l37l79k88j7K29L77L46J78j12k98m08k80m4K26
3270c32L77L54J71r8l02l88k82o0K00L83L54J82o9l10l87k86n6J85L62L53J93
$$ plain form
3121 300 -142 -518 -674 -498 -88 343 616 623 309 -124 -496 -659 -503 -119 325 606 615 335 -98 -488 -644
3142 -644 -503 -128 320 597 622 350 -81 -463 -636 -522 -147 284 580 614 363 -64 -468 -635 -532 -171 264
3163 264 564 621 375 -44 -438 -632 -537 -181 241 546 604 377 -20 -419 -626 -549 -204 211 537 609 387 -8
3185 -8 -397 -619 -549 -218 206 535 607 395 9 -388 -613 -543 -235 186 520 617 437 42 -362 -600 -543 -248
3207 -248 179 503 610 430 59 -352 -586 -549 -258 155 487 590 440 67 -335 -560 -559 -282 120 463 601
3228 601 444 83 -323 -576 -556 -295 108 448 589 451 98 -293 -560 -561 -303 88 439 576 462 117 -259
3249 -259 -537 -575 -313 84 429 584 475 138 -241 -529 -546 -317 60 406 584 472 174 -234 -514 -558 -332
3270 -332 45 399 570 472 170 -218 -500 -560 -360 23 377 559 490 180 -207 -493 -549 -364 -2 351 544
3291E44o3k96l87k90o6J80L58L58J94m7k76l82k87r4J68L47L73J97l9k70l87k83
3313d48j02J62L31L63K27l2k56l74k97j18J49L36L59K24qk62l76l15r7J28L25
3334h1L55K36rk37l64l14j14J17L32L35K28K5k50l53l23j21J05L15L54K41J7k18
3356B76l43l27j52J13L04L52K44M6k10l53l22j52R9K72L73K49M1k07l41l12j69
3377e19P6K96L46K59L9j70l43l30j55O4K64L51K74N0j74l34l23j85N6K75L49K56
3399D22R1j89l08l30j86N0K56L40K67Q4j50l26l22j98N7K28L31K64J07j31l21
3420C6l23j97K2K49L26K92Q6j21l16l23k00J8K35L26K78R9j03l05l13k31J4K11
3442b40L44K75J23j20k91l23k14kJ95L29K96J00q8k90l18k29nJ88L30K85J29r7
$$ plain form
3291 544 481 185 -202 -492 -558 -378 -20 338 532 485 209 -173 -460 -554 -386 -39 334 531 492 222 -165 -448
3313 -448 -550 -388 -57 306 533 501 245 -129 -426 -544 -395 -59 300 524 516 254 -122 -437 -534 -406 -81
3334 -81 274 510 501 264 -100 -414 -528 -411 -79 256 484 509 259 -94 -417 -538 -433 -118 236 477 494 276
3356 276 -67 -394 -546 -433 -129 223 467 513 303 -50 -372 -524 -425 -153 220 469 510 303 -38 -350 -519
3377 -519 -443 -147 199 458 497 327 -16 -346 -501 -437 -173 178 452 502 328 -6 -329 -514 -458 -183 166 422
3399 422 513 324 16 -314 -500 -450 -194 146 413 497 347 21 -301 -499 -442 -214 117 381 488 357 36
3420 36 -287 -484 -462 -213 113 405 491 370 54 -269 -469 -451 -216 110 388 487 384 79 -234 -465 -451 -240
3442 -240 104 379 502 382 91 -232 -446 -448 -253 76 372 472 384 94 -224 -453 -458 -270 60 345 474 377
3464C77k68l10k30l3J84L07L03J32q4k73l12k23k9J59L09L17J45p2k61l29k28
3485d19m6J74L12K73J61o6k32l18k32o2J67K93K87J68n6k33l14k49n0J39K88L18
3507C03J57o0k20l16k35q2J54K82K89J71l6k21l05k67o7J25K88L00J68j4k14k99
3529i9k67r2J26K80K79J86j4j92k98k59j02J25K60K96J93j2j89l09k40j05R3K64
3551g6K90K00Jj91k85k64j10R7K60K76K12J2j75l01k62j16Q6K46K94K02Kj63k80
3574d5k62j22O2K52K79K21K6j60k77k68j34O1K32L02K14K8j58k82k57j37N3K32
3596a40K80K27M3j33k91k61j51O3K16K94K18O4j48k68k65j53L4K17K89K09M9j10
3618B83k60k54j59K7K10K74K24O4j16k53k64j60K7J87K79K21Q1j19k38k63j76
$$ plain form
3464 377 109 -201 -431 -464 -280 27 330 462 378 105 -207 -430 -459 -300 9 326 471 399 138 -191 -419
3485 -419 -465 -291 21 294 455 389 157 -161 -393 -455 -288 5 292 460 404 171 -143 -392 -442 -303 -15 303
3507 303 460 400 180 -136 -371 -453 -299 -17 272 443 407 186 -119 -386 -453 -328 -40 260 428 414 200 -99
3529 -99 -366 -458 -332 -52 227 413 399 207 -91 -350 -452 -327 -67 229 422 410 221 -88 -328 -433 -340 -76
3551 -76 214 414 415 224 -61 -325 -435 -338 -78 198 410 422 247 -54 -316 -432 -346 -100 194 396 398 235 -45
3574 -45 -307 -429 -367 -115 164 385 411 251 -26 -294 -428 -367 -135 167 381 409 251 -31 -288 -425 -372 -140
3596 -140 140 367 410 277 -14 -275 -426 -363 -147 147 365 429 281 13 -252 -405 -371 -154 135 344 393 283
3618 283 23 -231 -390 -363 -153 121 345 409 293 40 -224 -384 -357 -170 109 330 411 292 54 -209 -385
3639c85J4J92K51K46Q6j04k57k69j70PJ85K62K41R1r9k31k63j71j1J76K52K66
3661C09Q5q4k24k77j79%J56K74K41R0o9k45k49j91j5J66K57K42J13q1k10k67k03
3684c61j0J48K64K24J25o8k13k64j91k0J26K51K42J32n0k16k62j83m5J27K58K41
3706B55J10l9j99k66j95m6J23K39K46J19k6j88k49k06n6J17K43K39J45k7j90k58
3728a09k05n0J13K19K45J48k2j72k59k06o7J00K25K50J52pj76k62j98q1R9K17
3750d6K34J69k1j69k44k09q7Q7K26K34J64lj53k37k20q6P2K14K44J49J4j52k46
3773f6k14q2O0K14K30J79K1j43k41k21r9O8K05K52J45M5j54k21k19j10O2K02K31
3796A44J67L8j32k24k19j08M9J78K45J59M6j14k33k14j23M8J87K22J87L8j19k11
$$ plain form
3639 -385 -371 -179 72 318 404 300 43 -226 -396 -389 -204 58 299 390 291 60 -203 -374 -385 -209 43 309
3661 309 394 310 86 -191 -370 -370 -214 60 301 391 322 77 -172 -363 -378 -212 45 287 400 319 109 -158 -361
3684 -361 -371 -223 41 265 390 322 109 -155 -346 -366 -240 11 253 385 335 119 -143 -326 -371 -244 14 255
3706 255 365 326 127 -139 -334 -380 -257 -18 228 347 321 133 -116 -322 -378 -261 -18 221 366 339 149 -109
3728 -109 -314 -364 -251 -32 213 361 339 167 -92 -298 -365 -265 -40 210 362 355 179 -83 -281 -362 -263 -46
3750 -46 188 357 336 167 -77 -286 -373 -286 -60 174 338 335 182 -55 -275 -361 -289 -75 169 318 332 180 -66
3773 -66 -280 -362 -302 -88 142 321 342 199 -42 -263 -362 -294 -89 163 308 353 199 -22 -241 -351 -289 -87 144
3796 144 311 349 217 -7 -226 -334 -285 -107 138 297 343 229 -4 -218 -341 -293 -106 116 303 341 222 11
3818A1k32j15M6J62K25J78O1j04k16k24j40L5J75K30J85N4j01k15k20j31K9J49
3840a58K31J89O6q5k10k24j39J8J73K16J81O9p9j98k26j38JJ60K17J92Q3p9k01
3863E9k18j47MJ45K17J83Q2q2j70k34j44j6J47K23J84Q8o0j92k20j51pJ12K27
3886C0J91R6o5j62k23j63k2J38J97J91J06n7j68k18j60j1J16K01J97R7m1j67k21
3909a18j51k2R7J85K28Q7k7j71k10j60l9R6K02K03J22l7j66k10j66m3R7J90K08
3932A95J20m1j42k15j72n0R2J84K02J26j1j68j94j76n8Q4J88J89J26j2j33k06
3954g2j90l4P1J83K06J15jj39j98j82o2Q9J68J98J40oj33k01j76o8O4J74J99J41
3978B86Kj20k14j78o3N2J71K08J24K5j21k08j95o3N4J70J91J53J2j26j92j74r1
$$ plain form
3818 11 -221 -336 -290 -128 97 275 336 232 16 -208 -348 -313 -138 92 277 331 230 15 -205 -336 -307 -158
3840 -158 73 262 328 243 33 -191 -330 -312 -139 77 258 327 248 50 -176 -314 -313 -153 64 256 339 260 59
3863 59 -159 -306 -302 -157 60 243 325 243 73 -161 -305 -321 -174 49 233 321 261 69 -151 -302 -309 -197 30
3886 30 221 317 252 90 -133 -296 -318 -180 17 208 314 257 89 -129 -289 -300 -184 17 214 311 270 103 -118
3909 -118 -269 -291 -194 -9 219 306 279 108 -102 -262 -301 -205 -3 200 322 285 119 -91 -257 -300 -203 -13 195
3932 195 315 274 132 -83 -255 -305 -213 -29 173 299 288 120 -74 -250 -308 -224 -36 153 279 267 134 -72
3954 -72 -262 -296 -225 -42 164 279 278 139 -59 -241 -303 -214 -46 152 292 286 153 -48 -224 -292 -228 -54 145 286
3978 286 288 168 -46 -224 -287 -235 -64 144 268 293 172 -36 -231 -294 -240 -70 121 274 286 160 -32 -206 -297
4001b97N1J62J94J55Pj00j83j80j04M7J65J82J50L0j09j85j84q0L6J41J93J65
4023B56L2j01j80j82r5K1J46J94J50N4r3j82j79j18K6J36J98J55N6q6j79j93r8
4046b62J6J36J89J56N2r4j62k01j09J9J44J73J63N7o8j72j93j19KJ38J88J60N3
4069B66o7j67j89j14kJ35J78J66P3o0j77j73j23qJ19J90J46P5m2j62k01j17j4
4092b68J27J78J69P5o3j44j89j21j6J02J78J69P7m5j60j78j29k9J08J79J58Q8
4114B66l6j51j85j36k3R9J65J65J06m5j40j75j37l0Q5J58J78R1j7j40j87j44j7
4137b50Q6J59J64J01k4j24j80j52k1O5J52J79J11l7j17j69j56o4Q9J69J68J12
4159B61j6j40j72j27o3O8J64J68R4qj18j68j48n7O0J48J86J13j2j09j80j52n7
$$ plain form
4001 -297 -246 -84 110 265 272 172 -11 -191 -295 -248 -83 99 249 279 170 -15 -199 -279 -243 -102 91 256
4023 256 288 187 7 -175 -270 -249 -103 91 241 295 202 20 -159 -277 -251 -115 83 238 294 208 29 -164 -262
4046 -262 -246 -110 79 235 287 193 31 -170 -279 -260 -116 57 220 277 209 37 -156 -275 -273 -135 53 213 266
4069 266 199 32 -157 -271 -273 -138 40 206 279 219 42 -131 -254 -262 -143 47 193 268 226 64 -137 -254 -268
4092 -268 -141 37 206 281 218 74 -115 -236 -252 -150 28 197 274 229 69 -109 -238 -267 -159 20 178 266
4114 266 230 79 -106 -242 -265 -166 -1 164 270 225 85 -90 -227 -257 -172 -14 164 255 238 98 -89 -233 -250
4137 -250 -164 -5 159 260 236 112 -68 -220 -241 -176 -24 155 266 229 112 -57 -213 -277 -188 -19 149 261
4159 261 245 105 -67 -194 -257 -189 -25 143 237 229 111 -57 -205 -262 -202 -54 132 245 233 124 -56 -208 -265
4182b65N6J51J92R2jj02j56j64o4N5J47J73J21J0j07j64j57p0O1J39J67J33Qj03
4206A52j77j47p8L8J46J65J31J5r2j69j65p1N5J22J74J21K1q4j63j57p9L2J24
4229h6J75J32K5p3j92j50q8M2J28J78J33J5q0j49j67q7L6J23J59J28K9p7j42j60
4253a48r3K1J15J65J49L5p9j35j71q5RJ11J77J35M9o3j54j59j05J6J01J74J47
4276B12M2o5j50j59j05RJ00J79J26N5n9j48j53j16J5R6J52J52N4n5j30j70j07
4299b25lJ07J56J28Q1o1j29j64j14rR6J61J38P8l9j41j70r4k6R6J51J52P1m0j23
4324G7j47j22j7Q5J36J56P6l6j28j47j31k9Q2J49J56Q0l7j23j54j19k1O9J49J48
4348A52Q0k4j25j57j39k4Q1J40J49R2k3j20j53j21l2P4J21J62P2kj20j47j31l5
$$ plain form
4182 -265 -209 -58 134 226 225 123 -33 -197 -261 -206 -59 114 235 245 138 -26 -183 -253 -192 -53 114 247 255 152
4206 152 -25 -172 -250 -212 -66 99 230 245 153 -16 -181 -252 -197 -75 99 220 241 157 -6 -163 -242 -210 -86
4229 -86 89 221 246 173 -19 -169 -257 -215 -87 91 224 239 159 10 -157 -244 -208 -85 74 202 231 154 12 -148
4253 -148 -241 -220 -105 60 209 244 165 30 -141 -226 -217 -106 71 206 255 192 38 -121 -226 -210 -109 65 212
4276 212 254 189 39 -120 -225 -216 -116 63 189 244 185 37 -116 -232 -217 -121 31 183 237 182 52 -118 -225
4299 -225 -228 -121 35 163 244 183 54 -110 -224 -233 -137 24 162 240 201 60 -110 -204 -230 -134 17 169 240 200 77
4324 77 -70 -192 -209 -124 12 168 244 208 80 -67 -198 -227 -145 4 160 240 203 80 -74 -193 -214 -145 4 152
4348 152 232 208 83 -74 -213 -237 -156 -16 133 225 202 82 -71 -192 -224 -150 -29 133 205 203 83 -64 -195 -230
4372b30N8J38J57J00j7j16j53j08n3P4J35J41R2kj04j48j36m2N0J28J60R4kj09
4396A07j36j37n7N4J37J56R6mr2j54j38n8N7J20J41J24j2p9j58j37m9M2J27J49
4420I9J03J2q4j57j34o1L9J25J43J07J6r0j33j35p2M3J10J55J10K4q9j36j31p1
4444b07K8J19J39J29Mq0j33j32p6K3J14J46J20K6p4j36j45o2OJ13J43J20K1m9
4468A57j37j53p7J4J10J47J15K4o1j40j25q0kJ14J37J28L1o0j29j33r3L0R0J33
4492D0J12N9m8j42j34p3LQ8J37J21M5l9j35j34r5OQ9J39J21N3l7j28j43r6oQ3
4518a14J55J19M7l4j22j49r7j2J01J27J27M7l2j01j56j05j2Q1J38J39M7m0r2j45
4542h3j06j9Q6J20J43M7j3j20j43r5k5Q0J24J27P0k3j02j41r1l5O4J42J31Q4m1
$$ plain form
4372 -230 -172 -34 123 223 206 90 -63 -171 -224 -150 -15 126 218 216 112 -36 -172 -214 -164 -36 124 218 216 107
4396 107 -29 -166 -223 -169 -32 124 220 216 124 -30 -168 -226 -169 -49 92 216 204 125 -33 -170 -219 -177 -50 99
4420 99 202 214 130 -27 -161 -222 -183 -58 85 192 208 118 -15 -150 -222 -179 -69 86 196 220 131 -5 -136 -207
4444 -207 -179 -60 79 208 212 132 -1 -133 -209 -186 -72 74 194 220 146 10 -135 -197 -191 -78 65 185 206 157
4468 157 20 -133 -210 -196 -86 61 176 200 139 -1 -126 -206 -208 -94 43 171 202 142 13 -120 -213 -183 -93 40
4492 40 152 211 163 21 -113 -186 -183 -95 42 163 208 169 34 -100 -195 -189 -100 39 160 213 176 48 -95 -191 -197 -114
4518 -114 41 160 207 173 51 -98 -195 -207 -106 21 148 195 163 62 -94 -199 -211 -130 8 147 194 154 62 -83
4542 -83 -189 -208 -122 -2 141 188 175 55 -88 -183 -208 -128 -4 123 193 170 68 -73 -164 -199 -135 7 138 222 181
4567A81j09j32r9m4Q0J17J35P7k9r5j39j05l5P6J24J30O5k2j02j23j15l9O1J21
4591b1J34P7or5j45r8n0O6J14J27Q1Pj03j27j16m1M6J11J35Q4j4p3j26j32j6K4
4617a57J29J18R7mp4j28j20m3L8J19J28R7nq7j18j21o8N3R9J41R1J9r1j24j28
4642a39n1M3R9J18J08J0p2j35j34k9K6R5J31R6K3p4j29j22n5L3R4J25J09J9q0
4667A09j00j32o2J8R9J21J07L0p5j11j27p0K9J08J12J15K0n9j22j19o5RJ02J24
4691F1J01K5n9j09j23q0J0R3J29R9M6n6j03j38q1K1P3J33J01L5m4j32j14o2lR6
4717h1J17J03L6m9j05j20q1J9O7J34R3M5l5j14j11r3jR3J11R9O5l9j17j10r4p
4743a75Q0J21J16M8l7j05j11r6j8R2J03J05O6m0j06j20q5j3O7J18J16O4m6r0j25
$$ plain form
4567 181 72 -60 -159 -203 -123 -6 129 206 177 82 -57 -162 -197 -121 3 133 198 176 74 -49 -164 -203 -142 -21
4591 -21 113 190 184 89 -56 -154 -204 -138 -24 103 184 191 88 -39 -155 -196 -150 -39 96 180 166 93 -33 -165 -181 -157
4617 -157 -28 90 187 183 109 -19 -139 -182 -144 -25 103 200 195 108 -10 -131 -199 -146 -47 94 185 204 113 -11 -139
4642 -139 -190 -147 -48 70 178 188 116 -19 -153 -182 -156 -61 70 166 189 115 -14 -136 -191 -158 -64 61 170 189 109
4667 109 9 -123 -185 -167 -68 53 160 190 115 4 -123 -193 -164 -56 56 171 191 132 10 -109 -174 -165 -63 61
4691 61 162 187 128 19 -104 -184 -174 -81 48 147 193 137 34 -104 -185 -164 -91 42 143 178 134 2 -112 -174 -177 -81
4717 -81 36 139 175 126 21 -99 -180 -161 -94 40 133 178 143 29 -82 -175 -176 -83 28 127 192 153 36 -74 -168 -175
4743 -175 -95 26 142 190 153 48 -63 -159 -177 -85 18 123 189 149 43 -77 -162 -175 -108 10 126 190 144 54 -71
4768g1r0j0M8J15J14N7k2j01j06j06j2N9J28J20N2k8r7j11r5j9O4J00J16P4l4
4793A45q0j21q2l6O8J00J15P3m1o9j19r2k2M0J01J10R2k5o2j39j03k8N3J07J20
4818A05N6po9j32q7m4N1J01J09Q3k3n9j21j06k7J4J28J07P9kq6j08j02l0L8J06
4844b6J06P9kp4j01j23m2M9R9J14P7Mp5j10j01l9L0R3J31P5J0q2r4j11n6K3J04
4871d2J19Q1J0q1j03r4n2K0Q4J23Q1Ko5q7j12m8J5R2J08R7K1p1j02j22m1K1Q1
4898f5J08Q1L0n4r4j08n0J5P4R8R6K6m8r9r6q7L1Q5J17Q8J7n2r9j02n6JQ2J08
4926D7Q2M2n7j02q6p8J3Q0J00Q9M4m7j08j03o5MP4J11Q5L9m2r2j13o9nP7R8R3
4954A11M2m0q3j12o3j0O9J11R2L4l0r4j07p5%O3J04J07L9l6q5j14o1oO6J00R4
$$ plain form
4768 -71 -161 -171 -123 -8 106 163 141 40 -66 -172 -184 -125 3 123 175 147 50 -61 -156 -175 -111 -11 105 179 145
4793 145 65 -56 -138 -174 -106 -6 109 182 141 72 -47 -139 -161 -121 -20 90 182 157 95 -44 -147 -175 -122 -15 105
4818 105 161 154 85 -47 -134 -178 -127 -26 83 166 143 84 -37 -143 -170 -156 -28 79 158 156 70 -38 -140 -170 -132 -26
4844 -26 80 159 157 83 -18 -141 -183 -134 -35 79 156 160 85 -25 -126 -165 -135 -42 89 164 174 92 -2 -113 -169 -146 -42
4871 -42 77 158 168 87 -16 -110 -162 -142 -58 65 146 148 83 -4 -116 -164 -149 -57 51 148 169 98 -4 -126 -167 -146 -65
4898 -65 43 124 154 100 6 -102 -152 -137 -63 35 131 157 109 10 -86 -173 -142 -57 60 148 165 113 14 -88 -144 -143 -61 47
4926 47 129 171 114 12 -74 -152 -139 -59 41 130 174 127 19 -84 -149 -145 -71 40 125 164 122 30 -83 -152 -157 -80 18 111
4954 111 153 113 30 -82 -145 -155 -86 25 117 151 121 27 -80 -155 -155 -92 12 119 158 122 37 -77 -138 -144 -78 22 116
4981A16L3mr7j08q4nP0R1R1M9k5p8j06q0jN0R3J07L9k5p7r6q0k0N8R4P5O1j1j01
5011B9q5q4j8N9R5R8M9%q4j03r1j0L9R5J10K7J5q1j11q2l0N7R2J15O3k0q4r3q0
5040a13k1L1J05R1O7qq6r3r4j2K8R4J08N6j0p6q0r2m2L4Q8J03O4mn0j09r1l3J9
5069a26R8R9O8lp2r0q7m2L4R1R0P6J3p0r9r6l5L8O7R9P9J5n8j07r9k1K7P3J11
5098G3P0nn2q9r7l4L2O3J05P3K0n7j09q3n4K4P3J05P8Nn5r8q1m3J3O9R1Q1Qm8
5128G8q3q7n4J2Q0Q9P3K8m9q1r1o3RP3J07P5K5n4o9j04o3K1P2J00P9J6l9q9q6
5157g5o1%P4J05P1L2m1r1q8o2RO2R1Q3K7l0p9j01o1J0N6R3P6M0l9q2q9n5pO0Q6
5188A4R1K9l7p2j01n7nM3J04Q4M0k6q0r3o1%N3Q0Q7M3k1p8r8p5kO0P7R3M5j0q2
$$ plain form
4981 116 149 145 48 -60 -144 -149 -79 12 103 152 127 49 -57 -137 -138 -88 5 112 151 126 49 -47 -127 -147 -89 5 80 141 130 29
5011 29 -56 -140 -158 -99 -4 94 143 143 59 -44 -135 -145 -106 -11 99 126 141 60 -51 -133 -163 -106 -14 101 164 144 60 -33 -113
5040 -113 -134 -103 2 93 160 152 66 -27 -121 -133 -105 -11 97 153 143 67 -13 -105 -147 -113 -25 78 142 138 88 -21 -112 -145 -126
5069 -126 -28 71 139 136 64 -26 -113 -155 -121 -30 60 136 149 79 -20 -116 -151 -113 -46 53 132 147 89 -18 -117 -138 -111 -38 73
5098 73 143 138 86 -3 -100 -134 -102 -39 66 139 159 102 -7 -90 -144 -120 -47 58 136 141 86 -12 -93 -136 -123 -54 37 118 126 78
5128 78 -5 -92 -146 -134 -54 35 108 136 87 6 -85 -148 -139 -66 41 116 141 87 18 -86 -149 -128 -56 44 123 139 100 11 -75
5157 -75 -136 -136 -62 43 114 146 105 14 -74 -136 -127 -65 26 109 136 106 27 -74 -135 -125 -69 24 100 140 101 19 -70 -125 -132 -72 14
5188 14 105 134 97 25 -76 -133 -138 -95 9 93 133 107 27 -66 -127 -127 -74 6 93 136 115 37 -61 -136 -138 -78 -1 92 137 127 45
5219D5j05o0kL9R5P7M3j1p4q1q5kM2P8R2N5k2o9r2q7j3L8R9Q4N4j9p4r5p4k2L0
5250a16R4Q9N4pp3r4o7k4L7R5Q9M4qn7q2q2l4L1Q7R2N1ln6p6r0k0L0P3R3N4On5
5282G5q5q4k8L4O5Q9O7po1q1r2l2K8Q1Q6O6Pn8r3p0l6L0O3Q8O7j5l8q7q5l7K0
5313a23Q8P9N4L3p2p0q3m2K3P2R0O5J6m7q7q6l8K2O8Q8O7J9m8q3q8l8J9O2Q3P5
5343A18J9m6r1q2l6PO8Q2P6J0n1o9p9n6QP1Q2Q4J2m1p0j04m3J4N3Q7P6Nj2q6q6
5374h0m1mO1Q5P5K3k0q1p9o6kP3O9Q7K8m1p0q0o0KP1P3Q1K1k8p3p7n8j1N7Q2Q2
5406I9K7j9p6q7o5RN3P4Q5K0k0n7q8o5j1N4Q0O7L9j8p7r2n1rM4Q9O9N0l0o3q5
5437e4o2j0M3P5J01K3j5o6q5n5j8M6Q3P4N0j7p4q0n5l3N2P5Q7M7k0n7r4o7pK0
$$ plain form
5219 45 -60 -120 -122 -83 12 89 132 121 47 -34 -119 -121 -79 -1 91 146 124 55 -37 -124 -137 -99 0 84 138 119 45 -50 -124 -146 -116
5250 -116 -22 67 121 114 41 -53 -120 -144 -107 -12 77 121 113 56 -26 -108 -142 -111 -24 68 119 116 60 -16 -106 -126 -96 -23 70 124 130 75
5282 75 -10 -94 -122 -88 -23 66 133 126 65 -16 -108 -140 -112 -31 55 121 128 70 -23 -93 -129 -99 -36 52 119 104 66 -21 -106 -143 -123
5313 -123 -35 44 98 131 59 -11 -94 -136 -113 -41 49 114 130 83 -4 -90 -128 -106 -38 50 117 136 88 5 -83 -121 -102 -40 43 118
5343 118 137 91 0 -82 -118 -111 -43 39 115 125 74 5 -74 -130 -122 -51 31 115 127 86 16 -88 -131 -117 -64 23 99 104 92 6 -80
5374 -80 -121 -125 -64 21 96 119 99 18 -61 -127 -129 -56 13 100 128 87 17 -63 -123 -121 -50 23 104 125 97 24 -53 -111 -122 -65 17 99
5406 99 126 107 31 -56 -121 -112 -59 15 100 120 100 43 -45 -110 -121 -67 13 80 119 101 24 -68 -119 -128 -84 5 74 124 94 31 -54
5437 -54 -116 -126 -83 -8 93 116 101 35 -50 -105 -123 -77 6 80 130 113 39 -41 -96 -129 -77 -2 85 132 112 55 -39 -106 -113 -93
5467i3Q5Q6L9kp4p8p7oL4P3Q2M8l2m0q5n6m7M0P5R6M7j0o6p0q2k7M0P4Q2O1pn3
5499E7p7p2k8K1Q9Q3M8%o5q7o2k6K6Q8O2M9Qm4p6q1l0L4O3P9O4ln2o0q5m0K7P2
5531a8Q2M4Kn0p7o2l7K7O2O8O6ll8p4p8l4J6O6P0P5ll6p4q1k6J2O9P4M5L0l9q3
5563eo9m7K0N6P4P5Qm0o8p1l7J1N6Q0O5Kj5p9p9m4ON5R3N6K0m9o1r4k0NM1R0O4
5596I9J0l1o3p9m0%N5P7N7K2l6p6o1m9PN4O7O9K0k1o9p1n0J5M5O6O8L1k9o9p2
5627e4n5OL2R5N8L7k5p7o5m2LL8O2O7L5k5p0n6n0k4M7P4P2L3k8p0o8n0k0N6O1
5658cN9N2j3o4q1m8j0L4P0P6J8po0o9n3j7L9P7O9L4j5n7p9m4j2M3O1P6M4k0n6
5689D4r0m3j7L5O0Q1N0j5n3o7o7j9L8N8Q7L0pn9p7m8j1J9N8P6M1j3l8q7n8k1L7
$$ plain form
5467 -93 -8 78 117 115 41 -37 -114 -120 -86 -13 69 117 85 45 -40 -96 -143 -103 -28 68 115 105 39 -31 -113 -140 -100 -26 56 117 110 57
5499 57 -20 -92 -120 -99 -10 73 121 121 56 -31 -93 -119 -93 -5 57 106 114 70 -6 -87 -117 -83 -20 59 123 120 68 8 -77 -117 -90 -18
5531 -18 64 108 110 60 -17 -79 -116 -89 -27 41 107 104 66 -8 -86 -120 -104 -38 32 107 104 68 -6 -87 -113 -101 -32 42 87 117 78 -5
5563 -5 -74 -121 -101 -45 29 104 112 72 4 -67 -104 -93 -37 43 108 110 95 16 -63 -107 -101 -46 47 103 123 74 13 -81 -101 -96 -55 35 99
5596 99 109 78 15 -64 -104 -104 -49 28 85 107 71 -5 -66 -115 -108 -54 13 82 102 81 12 -59 -109 -94 -49 17 85 116 87 18 -54
5627 -54 -109 -103 -71 24 82 119 94 17 -48 -90 -87 -49 13 80 115 90 20 -36 -86 -110 -63 11 83 116 88 18 -50 -100 -120 -64 -3
5658 -3 56 108 95 31 -50 -98 -108 -74 -4 72 90 83 23 -46 -99 -116 -77 0 69 103 88 31 -48 -92 -104 -61 0 76 120 100 44
5689 44 -46 -89 -106 -71 -11 70 120 105 52 -15 -82 -101 -63 -5 82 112 105 46 -31 -79 -90 -71 -13 63 104 91 53 -34 -92 -113 -76
5720g6O9N7N4j3m7o5p8j8M8L6Q2N0j0m6o7n5j4QO1O8M1Ql6o7o5l0L4M5P2N3om0
5752E3o3o4k4K2N1Q0L8J1m4o3n2l7RN7O7N9nl4p2p4j4NN3O9M9K7n0n2o4m7K2N0
5784c7P2M2Pk1p4n0o0K9N0P1M2J9k8o3o5l0LN7P6N0J8k8q3n7k1j1O2O7N5Rk6p4
5816An3l4KM9P5N6J7l7n4p2m6NN3O6N0K3k3o7o1m6J6K7P1O0Rk9m3o6m0nM9O9M4
5849F6L1k9n6n9l9rM6O1N6K2j2o3n7m7j1M9O0N5M4k6n5o6m7OL0O1O5K7qn1p6m0
5881g2k1K9P9M6M6k6o5m8n4j2L8P0M8K6j0m6o3o0MK7N3O2L9j5m4o2o8nL7N3O5
5912E1L2Jm2p6m4pJ8O6P5J5qm0o0m6k1K6N9N2M3Pn7n7n9j3K6N3O0M3qm5n4o0k6
5945i6L9N3N4L2%l4o6o0k2K3N8O9L7Lm4p0n5j7J8M2P9L9j4k3p7m5k0K1N1N7M4
$$ plain form
5720 -76 -7 50 104 91 44 -21 -99 -117 -69 -33 49 99 89 43 -24 -79 -93 -85 -24 44 85 93 57 -10 -75 -105 -71 -26 46 99 93 53
5752 53 -10 -74 -98 -76 -25 55 93 104 60 -3 -55 -92 -83 -26 41 100 95 61 -11 -85 -99 -94 -41 28 77 104 54 2 -62 -109 -87 -37
5784 -37 35 77 84 63 -11 -61 -121 -92 -42 29 71 90 62 -1 -66 -96 -93 -36 40 90 108 80 -3 -60 -81 -92 -30 37 92 101 75 1
5816 1 -52 -86 -84 -35 40 96 113 76 22 -50 -96 -91 -38 28 78 101 78 11 -50 -96 -80 -53 18 78 87 58 15 -51 -91 -96 -47 22 66
5849 66 97 68 12 -47 -86 -95 -49 12 68 90 78 15 -42 -89 -100 -51 9 64 108 82 27 -39 -86 -80 -50 11 76 103 95 44 -32 -72
5881 -72 -93 -64 15 61 107 81 16 -32 -86 -98 -60 10 58 84 74 28 -35 -95 -91 -64 -11 51 90 75 31 -31 -99 -104 -67 -14 51
5912 51 83 84 42 -34 -78 -85 -67 -1 74 89 81 41 -19 -65 -86 -60 -1 51 94 101 44 -13 -72 -85 -59 -6 54 97 89 44 -10 -70 -96
5945 -96 -57 -4 50 82 82 48 -18 -78 -100 -77 -19 50 87 90 46 -24 -79 -96 -78 -36 43 82 68 45 -32 -77 -97 -76 -25 32 76
5976G6kl3n1o1k3K3L6P5M4Pm0o1m3l5OO2N5N2%k1p2l6m8L1M6N7L4J9l4m7p0k2
6008g6ML8O7M5K1n3n3m5m4L2L3P0K8J1k8n1n6l9K5K3P4L5J9k8n4o0l2PN3O6N3
6039H5jj4m9o3l5MM7N7L9K2j8n3o3l9nN1N5M5K8l2l0p0l5JN0M6N1Rj8n6n1m6%
6072h8L8N3N9K8k6m9o4m3j2N5O0M2J0jn3n9k3j7L7O6M8J6Kn9m5m7j2L9N8N0K0
6103H3Nn7o5k9j0K9N7M8K4Jo6m0m2oK1O4K8M4j2m7l9o7RL2L2N5L0mm4o3l8j9K6
6136f0M5N9K9pm7m8m0k1K1O0L7M5ql5n0o1j1K2M9O7J7Ol5n3n3nJ6M9N9L3ql0n2
6169a0o2mJ8N5M3L5%l0n6m9pK0L5M6L2J1m6m5o3rK1M4M8M7nl2n4m8j8J5L7N5M0
6202F4Kk3m3o3j9J2L8N4M4Rk4n0n4k2OM4N8M3jk5n1n0j4KL3M3N4J0k5m8m7l7K0
$$ plain form
5976 76 74 41 -10 -71 -94 -71 -35 40 84 91 51 -10 -53 -88 -82 -20 35 87 87 66 -6 -42 -90 -59 -13 44 78 97 63 16 -54 -76
6008 -76 -72 -34 33 78 99 46 -7 -52 -96 -64 -31 39 67 78 50 -1 -57 -96 -71 -48 26 61 80 52 -2 -62 -94 -87 -34 32 85
6039 85 84 70 21 -42 -77 -73 -26 31 70 92 74 21 -42 -81 -86 -35 20 65 93 61 31 -39 -74 -73 -23 23 74 83 65 9 -42 -88 -88
6072 -88 -50 3 62 90 64 15 -49 -92 -104 -49 11 53 63 62 9 -50 -73 -90 -53 13 61 77 79 20 -25 -72 -84 -45 13 63 83
6103 83 88 31 -34 -63 -73 -44 13 61 85 86 20 -20 -62 -68 -47 17 45 89 77 30 -9 -76 -67 -35 -3 52 82 78 34 -29 -67 -86 -60
6136 -60 -15 44 73 66 19 -29 -69 -90 -69 -9 28 73 65 30 -20 -81 -92 -70 -21 46 63 69 34 -19 -72 -77 -61 -12 47 80 72 42 -10
6169 -10 -72 -76 -58 -3 40 75 75 45 -11 -60 -67 -47 -12 34 66 77 31 -14 -77 -86 -65 -21 27 74 69 37 -17 -65 -83 -68 -31 24 64
6202 64 66 43 0 -63 -82 -70 -32 22 66 75 51 1 -53 -75 -69 -25 33 76 75 50 -1 -51 -65 -63 -30 13 67 77 52 4 -43 -80 -60
6235f0L4N8L1Lpn4m7k5lM2N6L8Lj9m5n7l2kM2M6N1J3j7n3m7k4%K9N4L5J3j2m6
6268bl7n1J1M1N4M0J9k2m2n8j9%L0M7M3J7j9l8n5k1qK6N4M6J3k8k7m1l9qN2M1
6300A9L4L0j6n0m8k8j5K1N7N1J6k8k7m8l9pJ6O3M8K0pm6m8l5k6N1L4N4J9Kn4m8
6332c5k8k3M4M4N1J3Ll8m8m1j9L4M7M8J3J0m8m7m3j6J9N6N3J9j1l3m9k3k3K0M5
6363fM1K9ll8n1l8j7K0M7M8J4J5m0m6m5j8K9M7M2K8kk8n2m0qK6L1N3J5Mj8p2j2
6396d5k7J0M7N2K8Ql6m8k8l2K7L3M1M2j2j2m8n4jjL4N6L0%k0m7n2j5J7K8M8K9
6428E2Mk7l8n7j0J6K7N1K5K3l5l8m5l4J6L9M4L6Rk6k9n0l2J1M2M0L0J9k1l5n1
6459d4l1J5L5N5L4Nk2l4o0j3jL2N6K3J8k9m0l5k8nL5M6L6J5k9m3l2m7J7K3N2L4
$$ plain form
6235 -60 -26 32 63 66 59 5 -42 -67 -70 -28 28 66 69 50 5 -52 -84 -86 -44 2 53 66 49 -4 -51 -75 -75 -46 8 43 56 44 -2
6268 -2 -39 -90 -79 -38 16 56 75 53 11 -47 -66 -66 -36 11 54 71 52 14 -41 -62 -70 -44 10 56 69 41 14 -27 -66 -74 -22 19
6300 19 53 83 67 17 -31 -59 -74 -53 4 55 71 43 16 -32 -71 -78 -62 1 49 69 62 16 -32 -67 -93 -42 -8 46 65 67 13 -35
6332 -35 -63 -86 -42 2 53 66 69 31 -17 -58 -77 -43 4 52 65 75 27 -20 -63 -79 -60 -4 49 68 57 24 -25 -48 -71 -51 -6
6363 -6 35 64 61 23 -28 -66 -83 -63 -16 32 46 61 21 -25 -70 -88 -59 -12 30 58 56 28 -24 -64 -72 -46 -15 38 53 57 39 -33 -45
6396 -45 -72 -62 -15 37 65 73 37 -11 -39 -71 -44 -11 30 72 60 48 0 -54 -55 -56 -22 34 64 64 44 -3 -55 -70 -53 -25 23 52
6428 52 56 29 -9 -66 -76 -60 -33 18 43 66 31 -7 -52 -86 -70 -31 13 49 58 32 3 -47 -79 -68 -26 14 44 63 42 7 -44
6459 -44 -75 -60 -25 30 64 69 47 13 -47 -60 -61 -29 27 50 68 39 -1 -36 -64 -69 -34 12 48 63 34 -9 -41 -88 -71 -48 4 38
6491C8J0j3l6n3l2K3J3N8L3K6k6l8m4k6kK0N7M2J0j7l6m4l5J6J4N5L5J5j9k9l0
6522a5m3nL1N5J9K9j4l2m8k0j3K5M5M4J6j9m7k5k4j3J9L0M5J6j5k7m6k8j8M2K5
6553a1M0L2j8l0n8j3qK5L2L7K8Km8l7l8rL5L1L8J9%l7m1k0oJ1K6O0K6ql3l7m3
6586e3NJ5L7L3L1j0k9m4l1k0J7M5N4J7jl2n2m0LJ8K3L6K9lk7k7m2j8lN5K9L6J3
6619F4l2m0n6kJ4L4M4L6ml2l6l8j3J0L7L6L3Kk2l7m3j1K2K2M3K3Lk3l0l5k5KM2
6652a2M4K2J2k9m2l5k3J4K7M8K7Jj7n3m1j2%M3L5L8okm4m0l0J2M0L7K4J3k1l3
6684cl6k3oL6N5KK9j6l6n3mQJ9N2K2J8j6l2n0j1kL0L1M2J6k5l9l4k9jL4M3L9J
6718F1j5m3k7j8j5K6M6K3J8l9Jn6k4nL2L9K7J6j1k1m7j8j2K2L6L9K3j7l2m8k0
$$ plain form
6491 38 48 35 -1 -54 -86 -63 -50 8 41 67 41 3 -41 -67 -69 -49 8 50 60 43 7 -37 -72 -56 -42 13 48 63 44 15 -15
6522 -15 -58 -63 -32 23 42 71 57 25 -23 -43 -56 -31 14 58 74 55 8 -17 -41 -54 -35 -5 40 56 41 14 -32 -60 -78 -36 -11
6553 -11 29 61 43 13 -45 -58 -66 -41 -9 28 56 58 10 -27 -65 -74 -39 -8 30 49 49 12 -29 -49 -55 -44 -18 42 68 60 27 -10 -53
6586 -53 -48 -33 4 37 68 58 29 -15 -46 -66 -49 -4 50 67 66 34 -18 -58 -55 -37 -14 22 51 48 21 -6 -48 -66 -69 -14 15 51 64
6619 64 32 -8 -64 -66 -52 -18 26 62 58 26 -10 -48 -61 -51 -14 22 55 57 35 -2 -45 -56 -34 -12 31 54 57 34 4 -31 -56 -54 -12
6652 -12 32 54 66 37 -5 -40 -63 -49 -22 26 53 54 37 -16 -57 -69 -69 -26 9 47 41 39 -5 -45 -75 -63 -23 14 38 51 30 -3
6684 -3 -39 -62 -68 -32 23 25 54 38 2 -51 -55 -47 -28 24 46 64 48 16 -34 -45 -47 -17 14 56 72 47 8 -26 -55 -56 -22 21 60 61
6718 61 46 3 -24 -42 -57 -31 15 38 56 17 18 -38 -62 -67 -35 4 31 47 36 15 -32 -50 -62 -40 -4 35 58 41 9 -39 -59
6749e9OJ5M1L3J2j2k5m4k3NK4L3L8Rol3l3l2nL1M4J2J4Nk7n3k0NJ3L3M2J2Jm3
6783A3l9k2j2J4L8L6J8j0k9l0l4rJ0N3L0L0qk2m6m0oL4L2K7J2mk4l4j8j3J0L6
6815gN0K5qk6l6k0k5J3L4M2KRj7m3l3j2J5L1K4L7rj9k5m1j1J5K8L8J7j0k4k7l4
6848d7j3J3K7L8K2Lk5l0l1rJ2K4L6RJ8l1k8l5r%L8K9L1J1k7l2m0j1J7K5M5K5Q
6881F3l2l2k6j7pM4L2K9kj4m2l6qJ4L1L0K9j1rm2k8k0PK7L2L5Mk2k9l5k1LL1K4
6915BM4Lj5l7l6j2kL9L0L1Nrl5m1k2QK1M2L0Lj3l4k7k6NL0K9L5J1j4m2l4j8JJ9
6950b9M5L2Qj1m2l7k1kL1L2L4Oj8j5m0l2nK6K9K2J8j1j8l3k6jK7L2L1J5jk8n2
6983c4k5pM2K1L5J6rl1m0j5qK6K6M3J0Km3k3j5k1K0L5L6J3j6j3m9j3j4J3K6M0
$$ plain form
6749 -59 -53 -38 3 36 48 36 11 -33 -56 -51 -27 6 44 53 47 14 -19 -51 -56 -25 19 31 45 50 23 -30 -50 -45 -32 1 43 55 56 13
6783 13 -26 -48 -60 -46 -8 28 46 36 7 -23 -57 -66 -56 -3 27 57 49 27 -19 -59 -65 -31 1 28 40 36 12 -22 -40 -53 -43 -7
6815 -7 43 68 60 34 -2 -22 -47 -34 0 42 44 53 36 -7 -40 -52 -37 -6 18 55 46 27 2 -39 -50 -35 -7 31 48 38 14 -13 -47
6848 -47 -60 -47 -20 18 40 43 18 -12 -43 -52 -40 -16 20 29 47 16 -12 -47 -56 -56 -18 11 42 53 26 -6 -46 -57 -40 -15 30 55 63
6881 63 31 -1 -27 -44 -51 -7 25 54 52 38 -4 -40 -48 -34 -3 27 56 45 36 -6 -34 -54 -47 -20 12 47 51 29 0 -35 -56 -53 -22 2
6915 2 46 49 34 -3 -39 -51 -53 -14 16 47 52 43 8 -33 -55 -47 -26 16 46 49 36 2 -25 -51 -46 -16 13 48 59 45 3 -31 -49 -48 -29
6950 -29 16 48 56 45 3 -34 -55 -57 -26 6 40 46 28 13 -27 -59 -64 -38 -9 13 31 20 2 -31 -57 -58 -31 1 32 47 46 18 -34
6983 -34 -59 -66 -24 -3 32 48 39 8 -32 -47 -55 -29 -3 40 50 52 9 -14 -29 -50 -30 5 41 54 38 25 -24 -37 -51 -38 -12 28
7015B8J5J0k2m1l3j4ON6J7J7ok9k0m4JK3L5K9J7j0k8k5k5oK1J6L9J8j3j9j9l5
7047d1j1J5K6L6J1J2l4l0qj9J1K2M3J6%j9l9l2j6K8K7K4K4jj6m4k4j5RL5L1J9
7079D0Jj7l5l1j4J3J8L7K9pk0k8k9j0jK3L3K6J7l0k3l8oNK7M4K1jj4m8k5kML6
7113eK9K9Jj8l1l9j2RL1K9L0j2j2k5m4j3J4J9L0K6Rj2k9l2j8pL0M0K5Ll0j3l8
7146c6j9J1K1J8K0QJk8k5k2MK5K6K1K2ql7l9k1qL4L8L1Rj2l4k2k3%L0K2K7K0q
7180D6l3k6l8kK9L8K5Jqk1m2noJ3K9L3J4j3k9k6l2pL3J9L0PQk2m2l3lK9L7K7K0
7215E0j4k8l3j9pJ9L4K7Qlk2l3l8MK1M2K6J1j0j6m4j4lQL5K3K5j1j8l5j5j7J8
7248b9K9J5J8nj5k5l0%J4K5J4K6lk4k9k4j7K3L4MK8kk4l0k5rJ9L4K1J6%j1l3k8
$$ plain form
7015 28 43 53 31 -10 -43 -57 -51 5 22 39 33 4 -16 -60 -59 -36 -1 28 45 35 7 -18 -43 -49 -28 -12 27 45 32 13 -6 -41
7047 -41 -52 -37 -11 25 36 48 14 -16 -24 -43 -32 -10 33 49 49 30 -9 -41 -57 -29 -2 22 46 45 29 -15 -39 -54 -45 -10 21 40
7079 40 41 24 -11 -42 -56 -43 -25 12 41 34 14 -14 -43 -53 -54 -31 2 28 45 15 -8 -46 -52 -47 -20 24 45 44 30 -18 -43 -45 -41 -5
7113 -5 24 53 54 36 5 -34 -46 -37 -6 23 53 41 29 4 -40 -53 -39 -20 10 36 45 33 4 -28 -46 -53 -23 17 42 45 15 2 -36
7146 -36 -55 -44 -23 -5 15 23 24 -4 -29 -51 -47 -22 4 25 47 39 2 -37 -58 -66 -32 6 37 46 34 0 -22 -45 -45 -15 7 34 54 46
7180 46 13 -13 -51 -53 -24 14 39 40 32 11 -31 -36 -42 -29 0 33 47 34 5 -21 -53 -60 -27 -8 22 29 37 15 -27 -60 -63 -34 3 30 50
7215 50 36 8 -25 -44 -51 -32 2 29 37 34 12 -21 -59 -55 -34 8 34 45 35 19 -25 -39 -42 -34 1 24 49 38 20 -15 -30 -47 -29
7248 -29 0 15 33 28 13 -12 -42 -42 -28 -3 11 37 34 10 -19 -43 -60 -37 -3 1 29 27 3 -27 -52 -61 -42 -8 13 29 29 18 -15 -43
7282d3nJ8K2K2L4j0k7l6pj8MM4L7JJ5k0l9j3j3J0K6L9%Oj7l6j6k1J4QL6J0J4j3
7316B6l4k6k1K3J0L7K1Nk5k7k6j5LL6K4L4pk9k2k7j3LK9L2K0Lpl2l2j5J7K1K0
7349FL1J2k6j6l3j7OL1K7J7J4j1l3m3j1J0J2L2L9oml2l1k3PL0J9K8Rj9k3m2pJ1
7383c6J1J9K0J6Jl7l1olK5K6J4Rj1j3k4k7oK1M7K0Rql5l2j7QJ3L1L3Qjl5l0j8
7418c9KJ2L6L8%pl7k2j7nPM0J7J2Kl1k5k0rJ3L0L1Ojk6l4j8mJ9J3M7Rj5j8l0k2
7454d6JRK0M2J1jk5k7k7MJ9K1J6L2j4j3m0j5oNM3L2PMk4l7k7nRK7K5K5Kl5k5l3
7490d6NKM1J5J0Pk3k1l8nK1K2QM5j1l0k6j4j4J9J6L2J0J4k0l1l2mK0K6K0L3Mm2
7524A3j3l8LJJ7M9kJ8j3m5k7pK0K1K4L6k5ok5l0k1K4J4L6J4mj2l7j1k4J6K0K3
$$ plain form
7282 -43 -48 -30 -8 14 48 38 11 -25 -32 -50 -46 -2 35 36 51 31 -8 -21 -34 -24 2 41 41 47 30 -6 -22 -43 -29 -21 15 25 39 26
7316 26 -8 -34 -55 -32 -22 15 36 41 16 -11 -37 -52 -49 -13 11 45 38 9 -13 -40 -53 -50 -21 11 31 34 27 -5 -37 -52 -35 -14 6
7349 6 37 49 23 7 -26 -43 -37 -6 21 38 52 41 8 -35 -46 -36 -24 8 47 41 37 5 -26 -49 -42 -12 7 35 44 25 2 -40 -47 -36
7383 -36 -25 -6 14 30 31 -6 -37 -43 -46 -21 5 19 28 17 4 -20 -47 -53 -32 15 35 44 36 1 -31 -48 -40 -27 4 37 45 44 9 -21 -39
7418 -39 -37 -25 11 49 49 42 5 -17 -34 -39 -32 8 25 37 39 8 -17 -37 -46 -33 -3 28 34 33 7 -27 -45 -49 -30 -17 30 39 24 6 -24 -46
7454 -46 -45 -36 -16 26 37 36 11 -16 -43 -39 -20 1 17 49 35 22 -18 -33 -39 -34 9 41 48 52 28 -9 -36 -41 -32 -5 20 45 47 12 -13 -46
7490 -46 -41 -39 2 17 27 34 11 -10 -48 -53 -32 -10 -2 43 32 2 -24 -38 -52 -33 -17 15 25 39 19 -12 -44 -48 -28 -2 18 51 55 13
7524 13 0 -38 -35 -34 -17 32 30 48 35 -10 -37 -44 -24 -3 21 57 32 26 1 -29 -50 -26 -12 24 38 34 22 -15 -26 -50 -34 -14 9
7557IL3ok3k1j9j7OK0K8J7Mj5m2j1j2lK7K5K6J3j8k9l1j0J1K2L3J4J9k2k8j9l8
7590e7J7K6L3J7Nj4k1l2j1MJ5K9L0Rj9k5k9k7MJ2M6K2kk1j2k6k2J2J6L4K0J2j9
7623B6k8k5j6j4L3K3M3%j6k9k5mj6K2J9M1J2k1j6l0j8nJ7L9J0J7ll7k6j3mK5L4
7656A5K5J2rk1l9j6rL0J2L7Kjl1pk8j7J3L8K4J9j4k3k5k9kJ6K5K3J3j5j2k8k9
7689e1lJ6L4L6kpj7j5l3J5nL0L1K4j2k8k1m1KRL5L3J2qj2l0k5lPL5L4K3k3j6l5
7724a1k3%%L8K3K3jl3k4k9qK1OL7J8Nk5k4k9j7J0L4K8K3rj1l9l6LK1J6K9J0J0
7758C6j2k8l8mJ7J1L2K2Nk7j9l6lQK1L5L0j6pl0k0j3oL4L0J3Pk2k0k4k0mJ8L7
7792GK6Lom1k7j4J1J8L8J6Mj1l5l1%KK0K9J9J6j4l3k7j9QL5K5J7J1j6k7k8k0J0
$$ plain form
7557 9 42 36 13 -8 -27 -44 -38 -18 10 27 31 16 -26 -37 -49 -52 -25 0 26 39 21 -8 -39 -49 -38 -16 17 31 50 28 0 -19 -57
7590 -57 -40 -14 19 36 41 27 6 -26 -37 -33 -18 11 41 50 31 6 -23 -50 -46 -34 12 34 32 11 -1 -27 -49 -37 -21 13 33 45 26
7623 26 -2 -27 -43 -57 -24 -1 42 42 26 -3 -28 -32 -48 -26 -7 34 46 25 9 -21 -39 -44 -27 12 22 39 36 -1 -27 -40 -44 -19 15
7656 15 40 52 43 22 -17 -33 -42 -12 0 37 39 38 7 0 -28 -45 -32 6 30 49 35 12 -13 -42 -44 -28 -3 20 33 18 6 -22 -51
7689 -51 -54 -38 -4 32 30 23 6 -9 -42 -27 -32 -2 29 53 41 13 -8 -49 -47 -38 -3 30 42 34 22 -8 -33 -36 -29 6 40 63 40 24 -11
7724 -11 -34 -34 -34 4 27 50 49 16 -8 -37 -45 -24 -18 19 37 42 17 -7 -36 -53 -43 -9 19 42 33 22 -17 -53 -50 -29 -13 16 26 36
7758 36 24 -4 -42 -46 -29 -18 14 36 41 14 -5 -41 -44 -36 -15 20 50 34 27 -3 -23 -36 -42 -8 22 35 42 20 0 -24 -44 -48 -30 7
7792 7 33 36 30 -11 -38 -52 -41 -23 15 31 35 24 -11 -42 -42 -40 -20 9 28 44 30 -3 -30 -49 -41 -6 19 36 47 31 4 -24 -44 -34
7826c4K3K1L4mj7j3k5j3JK0J6L5J0pl2l1j3j6K8L0K9Nnm5j4j9kPK6N1j3kl1l1
7860c1mj2K3J9L0J0k8Nl0l0J8MJ7M1J4j5l1k5j4oK7J8J8K7j8j4l3k1rL3J7K8J5
7893D3lj7l4j4j0K5J1L1J6j5l1j2k7qJ7K8J6K1rl2j1l5%J5K1K4J2Rk9l0j7jJ6
7926c0K1K4J7Ll5k0j6kOK9K7K3j5j1k4k5qJ0K9J3L6nl1k7j9j0J2J7L5K4lk2j5
7959Hk9k0J2K9K0J8Kk8k2k0j2PJ4L0K7Kl4j7k2j8J4K5L1K6k0j2j7l4pOL1K1J8
7992B9jj3k8j2j5LK5L4J1Jjl1k6k0J0J6K7L7rlk8k8j1NK1K4K9Jk1k1k5j8MJ4K0
8027@J9J4j7l3k1rJ5QM6NoKj3k3m1K0J4L5J0Qj4k8k4KpJ0L9J3J5kk9l0o%OM3J8
8064C9kj4k1j1k6J6QK6L0%nj9k5j5mPL1J7Rok7k3k6j0K5M0LJ8ml0k7k3PJ8J8K5
$$ plain form
7826 -34 -11 10 44 40 23 10 -15 -28 -27 -7 9 44 54 47 15 -16 -29 -45 -17 13 42 47 42 -3 -17 -36 -38 -31 -5 46 33 31 0 -31
7860 -31 -35 -47 -24 -5 25 35 7 12 -18 -48 -30 -26 -9 32 46 31 0 -25 -39 -45 -18 0 18 45 27 13 -20 -41 -50 -17 0 28 43
7893 43 40 23 -11 -25 -35 -10 1 32 48 33 2 -10 -37 -45 -28 0 16 37 28 -4 -15 -50 -50 -35 -14 10 22 31 2 -28 -45 -46 -30
7926 -30 -9 15 32 35 0 -20 -36 -38 -32 -3 24 47 32 21 -3 -28 -36 -26 3 16 52 47 16 -11 -30 -40 -28 -11 24 48 45 23 8
7959 8 -21 -41 -29 0 20 38 40 12 -10 -30 -42 -35 -21 9 36 38 4 -13 -35 -53 -39 -14 17 43 23 11 -6 -40 -47 -41 -10 11 29
7992 29 28 15 -13 -25 -40 -37 -12 22 33 34 33 2 -24 -44 -34 -18 9 46 37 34 6 -22 -33 -28 -7 17 46 47 26 5 -20 -38 -34 -20 0
8027 0 19 33 16 -17 -38 -47 -32 -24 22 27 21 23 10 -13 -54 -34 -20 15 25 33 19 -9 -33 -31 -38 -28 11 24 39 37 8 -22 -28 -28 -22 21 39
8064 39 37 23 2 -9 -35 -19 -11 15 45 45 40 21 -4 -19 -23 -16 15 32 41 35 8 -15 -41 -51 -26 14 17 35 31 1 -26 -49 -42 -24 -6 19
8100A9J1Ql2k8k2KJ9K1K0J2nj3l1j7oJ6M0J6J3qj7j3m0KKL1L1POj5l4k9KQM0K1
8136C7Rj3km4mk1J9J9K4MK0l7k7k4j2J9L2J6NKj6k1j4j9J2K7J9K5nk6k0k2j6K1
8170c3K1K6J7Oj3k5l8OlK3L5J6Nj6k4k6oJJ9L3K8
$$ plain form
8100 19 30 38 6 -22 -44 -42 -23 -2 18 30 25 12 -19 -36 -42 -26 14 30 43 35 18 5 -35 -33 -31 0 31 38 44 29 -5 -34 -32 -24 16 37
8136 37 46 33 31 -13 -17 -38 -19 0 24 28 48 11 -16 -40 -52 -33 -1 15 20 22 6 -15 -29 -48 -36 -9 10 35 30 4 -16 -38 -54 -33
8170 -33 -12 14 31 37 24 -1 -39 -33 -36 -13 22 38 43 27 3 -23 -29 -28 -9 24 52
8191E2
$$ Imaginary data points
##PAGE= N=2
##DATA TABLE= (X++(I..I)), XYDATA
0@%%%%%%%%%%%%%%%%%%%qJ6j6J6j6J6j6K4l2L2l2M0m8M8n6O4p2Q0q8R7j05J20
41F4j33J44j59J78j98K19k44K72l04L41l84M39n08N94p08Q70j117J546k499Q234
61F647n402k3124p741K709J6277J9883J7398L677r943j9707j8902j1314K794J5070
75a1678K0806J5630M402q935j7920j9587j1213K337J4465J9039J5901N478q054
88B0671j8233j8818j0565J842J2735J8604J6093N455q020j6676j7451j1053J99
101b5217J2248J8643J5641N149o919j5438j7305j1465J54J1654J7309J5138O263
114B5855n875j5472j7273j0734J52J0323J6196J5243O707n551j4576j6213j0936
127b2154j119R645J6321J4939O282m820j3155j5844j1577j498R499J5508J4181
$$ plain form
0 0 0 0 0 0 0 0 0 0 0 0 0 0 0 0 0 0 0 0 0 -8 8 -8 8 -8 8 -8 16 -16 16 -16 24 -24 24 -32 32 -40 40 -48 49 -56 64
41 64 -69 75 -84 94 -104 115 -129 143 -161 180 -204 235 -273 321 -387 483 -634 912 -1587 6647
61 6647 1245 -21879 -29620 -26911 -10634 9249 26647 30324 20381 674 -18228 -29542 -26748 -11678
75 -11678 9128 24758 29160 20225 2305 -17282 -28495 -26158 -11693 7346 23247 28725 20671
88 20671 2438 -16380 -26945 -25103 -12368 6236 22329 27784 19764 3088 -14363 -25416 -25217
101 -25217 -12969 5674 21315 26464 19545 4107 -13198 -24663 -24509 -12855 4454 19592 25855
114 25855 19980 4508 -12765 -23499 -23347 -13024 3172 18415 25122 19571 4995 -11218 -22154
127 -22154 -23273 -13628 2693 17632 23914 19094 5939 -9905 -21482 -22980 -13481 2027 16208
140A6208O770l647j2736j5915j1263j441Q495J4409J4148P371l286j2229j5022
153h138j1090k478P505J4401J4288P101l021j1145j4333j1468l094P259J3900
166c13J3642P315k042j0556j4367j1385k935O589J2782J3356P974j458j0282j3918
180e598j1048l452N670J2444J3462P942j293r496j3196j1212m058N341J2145J2952
194A0603P862n46q703j3045j1326m121M971J1340J2514Q274P5q387j2763j1054
208a4306m356M194J0819J2576Q390J86p861j2092j0956m889L703J0581J2282Q263
222A6534O43p160j1778j1057n039L422R982J1841Q478J205o793j1569j0856n118
236a7265K828R427J1722Q654J415o414j1062j0674n451K347R096J1507Q576J728
$$ plain form
140 16208 22978 19331 6595 -9320 -20583 -22024 -13529 880 15028 22399 19113 6884 -8138
153 -8138 -19228 -21706 -14201 200 14488 21589 18568 7423 -6910 -18378 -21472 -14213 -313
166 -313 13329 20644 18602 8046 -6321 -17706 -20641 -14052 -1270 12086 20060 18602 8320 -5598
180 -5598 -16646 -20098 -14428 -1984 11478 19420 18127 8631 -4565 -15777 -19835 -14494 -2349 10603
194 10603 18465 17919 9216 -3829 -15155 -19276 -14305 -2965 9549 17823 17898 9511 -3252 -14306
208 -14306 -18662 -14468 -3649 8927 17317 17503 9642 -2450 -13406 -18295 -14592 -4011 8271 16534
222 16534 17177 10017 -1761 -12818 -17857 -14435 -4453 7388 15866 17071 10278 -1291 -12147 -17265
236 -17265 -14437 -5010 6712 15366 16781 10367 -695 -11369 -16820 -14473 -5377 6130 14706 16434
250A6434n807j0670j0694n693K043Q670J1142Q632K173n364j0428j0552n785J597
264a4302Q151J0930Q771K446n014j0054j0354n991J122P761J0759Q748K701m557
278A1117r625j0291o227Q03P418J0462Q725L024m126r344j0175o329M52O957J0204
293C045Q798L291l763r012j0022o453P7O589R979Q771L533l376q668r880o598
308a3689k50O251R709Q766L755l004q326r745o711n60N845R485Q760L962k660
323A1588p994r591o826q51N513R246Q687M197k303p698r484o892j102N137Q973
338F00Q674M413k004p400r294o964j409M806Q770Q636M537j695p062r135p048
353a1575j681M536Q511Q538M703j341o775r012p095j869M196Q222Q519M887j082
$$ plain form
250 16434 10627 -43 -10737 -16430 -14387 -5717 5425 14057 16230 10866 438 -10114 -15899 -14302
264 -14302 -6151 4779 13550 15996 10982 928 -9426 -15417 -14295 -6534 4225 12973 15674 11117
278 11117 1492 -8799 -15026 -14223 -6805 3657 12382 15406 11280 1936 -8239 -14568 -14116 -7159 3045
293 3045 11843 15134 11371 2359 -7663 -14116 -14039 -7450 2529 11300 14833 11457 2789 -7091 -13689
308 -13689 -13939 -7688 2021 10787 14542 11538 3212 -6533 -13244 -13804 -7959 1526 10286 14248 11588
323 11588 3594 -5997 -12823 -13674 -8161 1085 9772 13969 11666 3968 -5516 -12408 -13510 -8373 600
338 600 9274 13687 11683 4283 -5011 -11975 -13384 -8578 192 8828 13365 11670 4608 -4527 -11575
353 -11575 -13256 -8720 -209 8329 13032 11691 4916 -4096 -11191 -13060 -8864 -642 7877 12764 11682
368A1682o509q824p111k128L853Q025Q477M994q29o178q634p174k386L583P823
383a336Q356N104n03n893q524p201k534L306P512Q281N286k58n670q321p178k746
399a2319K952P298Q243N376m3n344q121p217k991K678P097Q131N448K76n029p983
415a548p268l162K435O810Q011N583N46m774p803p223l338K103O543P953N700
430A0568P60m502p591p216l549J825O360P832N727J009m167p429p239l710J588
445i734O086P705N827J279l916p250p217l851J284N820P619N928J489l694p018
460C57p173m020J011N589P525N955J673l391o839p129m180P92N370P350O009J898
476A0797l118o668p112m272N43N105P246O073K079k903o456p052m371L10M839
$$ plain form
368 11682 5173 -3651 -10762 -12890 -9037 -1012 7465 12459 11630 5452 -3182 -10356 -12742 -9159 -1336
383 -1336 7020 12124 11621 5728 -2796 -9997 -12531 -9225 -1713 6568 11854 11596 5926 -2395 -9573 -12319
399 -12319 -9367 -2069 6174 11550 11507 6163 -1958 -9175 -12166 -9488 -2391 5740 11188 11464 6435 -1548
415 -1548 -8816 -11978 -9543 -2733 5278 10861 11407 6633 -1170 -8393 -11731 -9628 -3085 4868 10568
430 10568 11328 6826 -765 -7981 -11530 -9705 -3345 4487 10214 11223 7056 -373 -7612 -11322 -9734
445 -9734 -3648 4057 9884 11163 7247 -3 -7220 -11071 -9787 -3967 3652 9580 11069 7375 357
460 357 -6816 -10836 -9825 -4236 3289 9244 10917 7526 687 -6442 -10622 -9830 -4460 2890 8899 10797
476 10797 7679 1011 -6101 -10373 -9830 -4725 2521 8594 10673 7770 1314 -5738 -10109 -9799 -4960
491d960P118O095K274k639o271o991m493R9M631O971O097K441k377o061o956m605
507i627j18M394O843O113K611k134n868o876m700l51M169O686O140K780j893n688
523B481o787m779n67L923O524O147K949j662n465o701m896p94L701O414O130L080
539I698j429n248o634m953r76L473O216O150L249j222n083o541m981j166L217
554f230O075O132L382r89m884o437n059j369K999N944O121L465p78m647o339n140
570g754j531K811N767O055L602n41m463o270n163j654K539N576O051L742l57m280
586D130o132n168j892K317N454O032L800j84m014n994n261k056K133N295N945
601D405L901O5l837n925n263k160J914N074N915M040K28l679n796n226k319J676
$$ plain form
491 -4960 2158 8253 10527 7888 1617 -5374 -9867 -9768 -5137 1834 7931 10372 7995 1934 -5022 -9627
507 -9627 -9745 -5351 1492 7605 10216 8082 2214 -4662 -9362 -9713 -5544 1142 7282 10062 8169 2481
523 2481 -4306 -9085 -9652 -5729 795 6942 9891 8229 2764 -3937 -8833 -9627 -5926 488 6618 9698
539 9698 8269 3021 -3613 -8566 -9542 -6069 147 6297 9546 8324 3241 -3300 -8281 -9447 -6230
554 -6230 -155 5977 9359 8370 3486 -2951 -8010 -9379 -6380 -436 5685 9150 8372 3725 -2614 -7754
570 -7754 -9285 -6474 -707 5348 8950 8409 3946 -2324 -7487 -9141 -6602 -1026 5025 8767 8410 4130
586 4130 -2002 -7170 -9062 -6745 -1291 4741 8541 8357 4343 -1651 -6912 -8968 -6835 -1540 4405
601 4405 8306 8371 4534 -1391 -6654 -8814 -6900 -1826 4089 8129 8357 4678 -1118 -6344 -8663 -6987
617f987M930N894M076L72l444n637n289k485J534M798N782M125N78l220n563n310
633e846k555J346M573N695M242P57l059n448n254k674J089M419N687M286Q74k875
649E257n257n264k863R52M280N580M284J092k635n159n290k940P94M084N447M375
665F737J284k491n045n231l009N52L879N441M435J369k309m867n189l143L51L762
681c474N344M425J521k068m726n234l242K61L561N198M474J702j884m631n169
696c942l288M4L346N142M554J790j764m447n087l396j51L194N060M546J908j535
712E974m290n087l496k83L062M911M525K066j329m175n043l521m35K824M814M590
728E107K205j236m018m946l585o16K657M724M600K282j020l861m934l675p34K534
$$ plain form
617 -6987 -2057 3837 7913 8285 4841 -796 -6085 -8570 -7036 -2238 3544 7669 8247 5027 -536 -5846
633 -5846 -8401 -7055 -2482 3213 7455 8212 5153 -295 -5549 -8223 -7134 -2715 2972 7258 8132 5257
649 5257 0 -5264 -8127 -7175 -2895 2685 6969 8061 5426 267 -5023 -7963 -7169 -3085 2362 6737
665 6737 8021 5530 485 -4746 -7755 -7203 -3324 2117 6552 7921 5612 745 -4444 -7587 -7236 -3474
681 -3474 1870 6295 7816 5748 1022 -4212 -7454 -7193 -3632 1566 6040 7742 5858 1227 -3942
696 -3942 -7230 -7186 -3840 1302 5856 7646 5882 1435 -3652 -7048 -7199 -4005 1055 5601 7509 5974
712 5974 1684 -3403 -6899 -7182 -4120 791 5316 7382 6053 1878 -3165 -6686 -7121 -4297 517 5107
728 5107 7312 6076 2058 -2888 -6473 -7089 -4432 292 4892 7174 6154 2293 -2641 -6316 -7050 -4516
744d516M609M521K394q16l699m883l737q60K349M495M556K512p25l568m778l741
760e887j037K158M393M583K575n73l403m731l802j153K036M271M519K671l81l272
776B967m655l850j264J867M153M501K773k48l149m570l836j399J665M042M506
791C503K850j19k973m503l893j507J549L917M435K919O7k831m419l925j632J409
807e153L796M402K979K01k687m307l956j747J253L668M394L049L12k550m223l958
823d527j841J094L549M346L102M60k391m158l961j963R51L434M303L150N78k241
839C885m042l968k053P98L297M263L210P21k103l973l974k131O86L150M191L269
855E226Q64j974l876l969k201N15L021M166L315R42j812l768l959k316L84K905
$$ plain form
744 -4516 93 4614 7008 6192 2493 -2390 -6127 -6987 -4638 -143 4413 6925 6200 2632 -2146 -5887
760 -5887 -6924 -4766 -373 4210 6785 6212 2809 -1922 -5724 -6877 -4841 -570 3949 6620 6239 2967
776 2967 -1688 -5538 -6802 -4935 -782 3719 6492 6244 3095 -1475 -5311 -6710 -5045 -1003 3503
791 3503 6353 6234 3261 -1242 -5135 -6642 -5093 -1176 3259 6178 6245 3414 -1005 -4930 -6562 -5153
807 -5153 -1357 3045 6024 6225 3538 -769 -4725 -6472 -5219 -1551 2843 5892 6204 3654 -569 -4527
823 -4527 -6368 -5274 -1725 2621 5723 6183 3792 -366 -4327 -6290 -5339 -1905 2398 5548 6126 3885
839 3885 -157 -4125 -6178 -5380 -2083 2180 5390 6111 4008 35 -3939 -6070 -5384 -2234 1957 5226
855 5226 6090 4116 240 -3729 -5930 -5415 -2394 1772 5087 6029 4217 449 -3510 -5826 -5442 -2537
871b537M099L335J068j649l670l983k383K69K768M023L390J183j527l583l955
886c152k438J32K644L972L411J271j418l456l904k549nK557L916L417J364j273
902D489l347l920k595r3K422L814L454J488j141l296l869k616k26K255L775L493
918D087J555j049l155l823k710l39K163L714L468J620q73l039l835k765m26K063
934c344L593L478J761p77k970l771k791n41J894L516L528J823o78k854l699k844
950d676o80J785L460L521J852n21k700l675k924p69J683L354L484J995l93k601
966B195l665k927q55J513L244L522K083l02k495l583k954j002J388L197L516K120
982D995j80k348l524l040j093J308L095L462K186ok258l498l057j159J167K964
$$ plain form
871 -2537 1562 4897 5965 4316 646 -3337 -5720 -5451 -2683 1340 4730 5913 4386 803 -3152
886 -3152 -5590 -5458 -2814 1158 4569 5840 4422 966 -2938 -5487 -5492 -2935 981 4398 5762 4489
902 4489 1142 -2778 -5373 -5466 -3044 770 4224 5712 4571 1275 -2594 -5210 -5436 -3181 594 4087
918 4087 5642 4593 1438 -2385 -5095 -5434 -3271 443 3911 5531 4658 1619 -2216 -4981 -5407 -3344
934 -3344 249 3727 5488 4711 1741 -2030 -4821 -5362 -3468 48 3576 5399 4721 1867 -1832 -4676
950 -4676 -5356 -3571 -111 3410 5262 4741 2041 -1634 -4558 -5327 -3644 -290 3194 5189 4796 2195
966 2195 -1470 -4397 -5252 -3739 -495 3027 5110 4808 2313 -1270 -4224 -5226 -3838 -641 2875 4995
982 4995 4815 2467 -1057 -4097 -5190 -3882 -787 2675 4861 4855 2597 -901 -3958 -5117 -3950 -986
998i86L477K295N3k166l417l036j276J004K923L460K328J44k022l331l101j387
1014e038R52K832L393K370L07j902l311l118j423Q28K693L374K455M07j835l242
1030b58l072j517O93K589L394K498M53j712l111l127j630N97K550L343K486N80
1046D756j564l086l163j662N29K396L278K568P02j501l033l105j723L73K292L271
1062A328K618P43j383k900l129j814K51K262L200K620Q46j251k842l138j872K02
1078d259K112L130K682R61j167k801l085j914P9J982L114K724J015j072k675l073
1094b247k007l5J920L080K711J073r29k579l095k048j15J823K971K740J214q45
1110C632k533l067k074k18J692K916K799J280p75k426l007k154l35J609K893K778
$$ plain form
998 -986 2491 4786 4839 2673 -744 -3780 -5056 -4052 -1129 2331 4659 4803 2781 -550 -3651 -5038
1014 -5038 -4086 -1254 2139 4509 4816 2914 -397 -3515 -4938 -4110 -1417 1957 4412 4819 2984 -258
1030 -258 -3330 -4847 -4154 -1565 1829 4327 4780 3068 -43 -3170 -4800 -4203 -1653 1690 4176 4756
1046 4756 3192 106 -3057 -4719 -4190 -1794 1484 4052 4754 3253 220 -2885 -4608 -4235 -1943 1328
1062 1328 3946 4689 3306 406 -2723 -4537 -4286 -2024 1176 3796 4642 3391 549 -2589 -4461 -4259
1078 -4259 -2147 983 3665 4626 3459 658 -2427 -4341 -4262 -2280 834 3558 4573 3501 826 -2247
1094 -2247 -4254 -4289 -2369 711 3422 4495 3566 987 -2108 -4156 -4271 -2448 523 3263 4477 3632
1110 3632 1099 -1968 -4042 -4260 -2568 348 3147 4427 3652 1226 -1781 -3935 -4270 -2661 232 3010
1126C010J317o40k310l016k228l80J525K782K793J421n55k249k961k251m78J407
1142b813K726K816J495m71k165k926k298n66J305K689K806J531l72k054k887k331
1158c515o61J246K595K795J587k63j979k857k370p19J142K526K796J666k01j897
1174A891k813k383p97J056K449K777J711r7j798k770k416q87R68K411K750J774
1190C826j1j740k723k440r46Q94K316K744J825N8j659k670k436j035Q00K262K727
1207A792J862J52j568k622k476j079P16K201K696J892K57j511k577k470j164O31
1223c268K134K671J960L28j429k545k455j228N40K043K647J998M06j328k482k484
1239b492j297M55J982K624K011M98j247k431k469j370L67J909K589K058N73j160
$$ plain form
1126 3010 4327 3687 1377 -1639 -3867 -4247 -2722 60 2853 4274 3719 1470 -1491 -3742 -4220 -2813
1142 -2813 -87 2729 4224 3753 1588 -1338 -3636 -4202 -2897 -208 2598 4129 3757 1703 -1184 -3515
1158 -3515 -4176 -2930 -335 2460 4047 3784 1805 -1052 -3422 -4141 -2999 -473 2323 3989 3788 1891
1174 1891 -922 -3305 -4102 -3046 -597 2180 3891 3794 1996 -774 -3190 -4077 -3109 -698 2052 3826
1190 3826 3815 2075 -648 -3088 -4034 -3140 -824 1920 3745 3803 2144 -526 -2962 -3997 -3197 -935 1792
1207 1792 3654 3806 2238 -384 -2860 -3939 -3223 -1022 1674 3566 3823 2312 -265 -2735 -3899 -3268
1223 -3268 -1134 1537 3497 3825 2396 -149 -2604 -3832 -3292 -1249 1398 3396 3802 2474 -8 -2492
1239 -2492 -3789 -3334 -1352 1272 3283 3781 2534 103 -2366 -3736 -3369 -1460 1129 3187 3760 2600
1255B600k370k467j421K69J824K579K067O57j070k319k473j468J92J762K520K104
1271B986P16r92k243k468j528J12J687K500K134P83r36k191k451j550J5J614K457
1288F45K148Q63q45k140k452j597n4J546K429K146R09p51k071k432j651j31J471
1305a967K374K181R62o67k012k416j701j79J373K340K187J031n92j941k396j742
1321c165k47J303K274K202J099n08j882k377j768l45J235K249K214J138m36j813
1337A173k353j806m13J164K191K220J197l64j734k332j828m92J086K139K216J246
1353C310k69j682k314j852n63J004K095K217J289j95j596k275j891o11R08K041
1369c84K206J351j09j542k250j906o77Q39J988K206J405o7j459k203j926p57P69
$$ plain form
1255 2600 230 -2237 -3658 -3389 -1565 1014 3081 3738 2668 349 -2124 -3592 -3400 -1638 882 2986
1271 2986 3702 2710 467 -2001 -3529 -3417 -1730 770 2904 3687 2751 560 -1891 -3441 -3426 -1812 645
1288 645 2793 3656 2811 671 -1781 -3378 -3432 -1886 543 2689 3598 2847 776 -1656 -3307 -3438 -1967
1305 -1967 407 2588 3550 2883 871 -1545 -3246 -3425 -2052 288 2475 3506 2914 973 -1423 -3165
1321 -3165 -3412 -2109 165 2367 3466 2958 1076 -1301 -3069 -3414 -2179 70 2284 3422 2986 1173
1337 1173 -1180 -2986 -3399 -2235 -44 2176 3373 3009 1275 -1057 -2885 -3377 -2291 -152 2064 3310
1353 3310 3041 1359 -955 -2807 -3370 -2366 -271 1946 3235 3040 1444 -831 -2722 -3333 -2425 -384
1369 -384 1822 3173 3064 1522 -728 -2634 -3311 -2472 -484 1722 3127 3060 1601 -602 -2528 -3285 -2516
1386b516J921K216J430J9j378k178j951q13O96J870K194J482J04j321k151j962
1402b338q68O03J822K179J525J67j257k098j976r37N45J762K167J556K35j191
1418A896k061j998r70M65J712K140J580L17j124k034j990j014L80J654K123J629
1434B705L57j055j987j991j069L29J590K107J641M29r87j925k012j127K76J533
1450a186K069J667M83r07j908j991j157J95J466K061J691N49q69j838j989j209
1466b873J09J418K041J717N91p83j791j997j260P6J325K003J733O61p00j772k003
1483a505j283QJ283J970J765P18o69j699j969j342p2J206J978J771P61n85j652
1500F84j982j380j25J179J903J774Q19m83j623j967j386j96J083J884J803Q77
$$ plain form
1386 -2516 -595 1621 3051 3070 1692 -486 -2437 -3250 -2554 -684 1510 2992 3096 1775 -376 -2338
1402 -2338 -3206 -2603 -781 1398 2923 3090 1833 -265 -2241 -3178 -2633 -871 1296 2852 3087 1896
1418 1896 -165 -2163 -3133 -2668 -956 1184 2764 3081 1957 -77 -2067 -3081 -2701 -1047 1076 2705
1434 2705 3062 2007 20 -1971 -3040 -2711 -1121 986 2627 3056 2069 144 -1868 -2995 -2719 -1186
1450 -1186 883 2550 3033 2126 218 -1773 -2930 -2735 -1269 792 2483 3032 2163 325 -1664 -2873
1466 -2873 -2764 -1346 695 2412 3003 2220 429 -1568 -2828 -2752 -1427 576 2309 2970 2270 498 -1505
1483 -1505 -2788 -2780 -1497 473 2238 2956 2287 588 -1381 -2723 -2795 -1589 389 2160 2921 2336 684
1500 684 -1298 -2678 -2803 -1624 279 2053 2872 2389 766 -1201 -2587 -2783 -1700 184 1987 2864
1516B864m61j543j949j435k56J022J854J816R09l89j491j933j463l39R91J813
1532A0J809R36k88j447j946j477l59R12J755J808J029k58j419j895j492m39Q21
1549a940J751J821J054j98j345j866j529n03P93J708J796J096j24j279j869j567
1565b201n18P28J640J812J128n7j246j839j569n68O45J604J823J176l9j158j807
1582d46j594o34N93J584J797J189L7j092j793j611o95N57J512J775J253J15j072
1599A475j765j613p34M84J456J804J273J48j017j701j631p90M14J447J776J289
1615B315K04r29j697j637q38L82J392J742J338K74r01j672j642q48K93J332J750
1632H58J356L25q51j622j632r10K45J258J773J359L62p79j580j659r66K01J243
$$ plain form
1516 2864 2403 860 -1089 -2524 -2780 -1758 96 1912 2821 2432 941 -992 -2455 -2794 -1803 10
1532 10 1819 2755 2467 1020 -926 -2403 -2762 -1850 -95 1713 2742 2484 1065 -830 -2322 -2761 -1940
1549 -1940 -189 1632 2686 2488 1143 -723 -2252 -2755 -1962 -254 1542 2638 2514 1235 -634 -2201
1565 -2201 -2719 -1991 -351 1461 2589 2532 1286 -553 -2122 -2690 -2045 -441 1382 2558 2519 1361 -446
1582 -446 -2040 -2674 -2081 -497 1300 2489 2526 1434 -359 -1970 -2665 -2108 -596 1179 2432 2547 1475
1599 1475 -290 -1903 -2637 -2153 -697 1107 2380 2528 1511 -190 -1821 -2611 -2197 -750 1026 2315
1615 2315 2519 1590 -107 -1744 -2582 -2200 -808 934 2272 2546 1645 -27 -1669 -2517 -2224 -892 858
1632 858 2214 2539 1688 66 -1566 -2476 -2231 -973 800 2159 2521 1742 162 -1497 -2463 -2262 -1019
1649a019J701J391M43p27j572j668r57J44J174J682J439M67o87j506j656j022
1665b373P2J139J678J433N06o18j452j661j069K8J103J646J442N70n41j452j645
1682a194j094j4J038J619J472O11n12j411j614j123p9R68J619J471O48m46j351
1699F08j639j156j34R46J591J472O93m00j308j645j168j65Q91J535J500P34l49
1716B006j282j616j192k21Q25J508J526P57l00j231j583j237k72P83J510J504
1732A485Q00k40j198j598j232l10P36J468J503Q41j91j158j577j246l63O91J421
1749a68J516Q78j54j105j540j278m17O48J393J515R13j16j044j545j289m66N97
1766a662J357J493R50l6j018j525j297n03N48J310J502R75Qr59j502j314n43M69
$$ plain form
1649 -1019 682 2073 2516 1789 217 -1451 -2408 -2264 -1090 592 2031 2498 1811 305 -1351 -2373
1665 -2373 -2301 -1162 516 1949 2455 1837 385 -1276 -2345 -2317 -1214 432 1874 2444 1903 451 -1194
1682 -1194 -2288 -2302 -1264 355 1827 2438 1926 515 -1099 -2222 -2301 -1333 286 1757 2405 1959 608
1699 608 -1031 -2187 -2321 -1375 216 1688 2381 1981 673 -972 -2140 -2305 -1414 121 1621 2355 2006
1716 2006 724 -892 -2084 -2305 -1480 28 1554 2311 2011 780 -803 -2040 -2312 -1529 -19 1485
1732 1485 2285 2045 847 -751 -1983 -2293 -1557 -89 1414 2255 2064 906 -671 -1917 -2280 -1589 -168
1749 -168 1348 2226 2072 967 -573 -1851 -2268 -1620 -227 1288 2201 2085 1041 -504 -1793 -2259 -1662
1766 -1662 -305 1188 2138 2102 1084 -441 -1738 -2241 -1693 -383 1119 2094 2102 1143 -359 -1673 -2216 -1747
1784a747J305J493J005M7r31j463j335n79M24J256J498J028J04q72j459j339o09
1801b174L90J203J488J055J53q46j424j341o52L40J177J486J073J80p73j407j364
1818a436o95L11J134J461J094K45p41j376j369p21K41J108J451J106K73o86j354
1835D6j371p50K04J072J428J144L04o28j337j372p78J56J016J429J148L63n99
1852A475j294j375q15J19R83J411J166L89n54j261j375q38P1R47J386J184M30
1869B049n00j229j381q56OR14J369J197M70m74j196j367q85l0Q70J351J218M91
1887B017m22j167j371r21n0Q23J325J222N45l94j121j365r35j13P80J322J231
1904A406N70l48j099j348r51j65P49J304J234O04k98j059j340r87j85P03J270
$$ plain form
1784 -1747 -442 1051 2056 2103 1172 -291 -1626 -2205 -1781 -525 973 2001 2105 1233 -226 -1565 -2174
1801 -2174 -1784 -581 907 1962 2115 1269 -155 -1496 -2148 -1808 -631 855 1928 2108 1335 -72 -1436
1818 -1436 -2131 -1820 -686 775 1869 2114 1373 -3 -1372 -2093 -1852 -744 707 1813 2086 1400 46
1835 46 -1325 -2075 -1871 -799 629 1773 2077 1449 112 -1260 -2038 -1882 -866 563 1711 2074 1475
1852 1475 181 -1194 -2009 -1890 -907 504 1670 2059 1505 244 -1131 -1969 -1898 -951 435 1619 2049
1869 2049 1549 320 -1061 -1917 -1911 -997 372 1569 2039 1565 369 -998 -1883 -1913 -1043 308 1526 2017
1887 2017 1595 428 -943 -1864 -1914 -1091 234 1456 2001 1607 486 -879 -1814 -1927 -1147 175 1406
1904 1406 1976 1628 529 -819 -1770 -1935 -1186 118 1352 1956 1658 599 -741 -1728 -1913 -1210 60
1921F0J238O27k50j015j340j004k32O70J240J247O73k10r98j322j021k65O16J216
1939g0J253O99j57r65j307j044l17N86J181J260P32j30r10j294j067l38N30J181
1957a77J238P65r3q85j279j066l87M83J148J251P91m3q41j263j103m08M58J105
1975c06J238Q18lq03j256j086m54M09J068J250Q38N2p84j220j111m79L55J056
1993d18J249Q51R2p37j212j125n17L25J015J242Q83J18o86j185j138n49K83R77
2011e32J243Q77J64o35j178j132n75K28R53J221R24K06o21j146j157n92K02R14
2029f36J215R41K19n60j122j145o31J60Q81J197R51K71n37j081j161o38J08Q39
2047g29J190R77L05n04j062j152o91Q9Q21J167R75L37m51j049j140p17N1P92J146
$$ plain form
1921 60 1298 1925 1675 660 -680 -1684 -1916 -1246 -6 1241 1914 1704 706 -616 -1637 -1902 -1286 -70
1939 -70 1183 1882 1725 760 -547 -1591 -1908 -1322 -141 1119 1851 1721 811 -483 -1550 -1888 -1358 -177
1957 -177 1061 1826 1733 848 -431 -1497 -1884 -1401 -253 998 1789 1746 905 -358 -1461 -1869 -1411 -306
1975 -306 932 1750 1747 944 -312 -1398 -1852 -1443 -375 875 1713 1765 981 -239 -1350 -1829 -1474 -418
1993 -418 831 1682 1774 1037 -175 -1300 -1817 -1492 -477 765 1648 1766 1080 -105 -1243 -1792 -1509 -532
2011 -532 711 1588 1752 1117 -61 -1193 -1768 -1540 -587 634 1558 1764 1143 -3 -1160 -1752 -1550 -636
2029 -636 579 1520 1739 1179 57 -1088 -1719 -1559 -678 519 1470 1741 1204 123 -1038 -1676 -1568 -729
2047 -729 461 1438 1743 1239 177 -975 -1666 -1577 -756 411 1386 1723 1272 223 -917 -1634 -1583 -791 355
2066C55R94L67m18j011j164p37K0P47J138J004M02l90r91j133p61j8P05J141R92
2085A242M35l35r73j138p77n1O75J102J022M59l06r45j121p92j03O49J094J023
2103A160M86k73q97j149q05j23O04J079J050M92k29q76j130q13j68N73J062J037
2121A080N34j88q61j116q56j84N41J009J066N54j59q34j089q65k21M90J032J045
2139I78N84j39p81j092q74k65M67J001J034O25j06p55j082q92k85M44R59J052
2157H73O32n7p23j064r00l28M06R47J042O59k4o94j047r18l54L67R21J047O84
2176A469Ko63j049r05l91L45Q74J047P00N3o54j020r31l96K85Q71J038P07Q8o09
2196H61j011r40m27K69Q45J021P42J09n75r98r33m63K41Q02J027P67J23n43r68
$$ plain form
2066 355 1349 1716 1298 287 -877 -1614 -1594 -847 291 1295 1697 1307 316 -817 -1578 -1596 -891 250 1242
2085 1242 1677 1342 369 -769 -1546 -1597 -922 180 1202 1661 1355 410 -711 -1503 -1606 -957 137 1160
2103 1160 1646 1373 476 -673 -1478 -1601 -997 82 1132 1624 1395 519 -611 -1424 -1592 -1019 43 1080
2121 1080 1614 1426 565 -551 -1407 -1591 -1050 -41 1025 1579 1420 586 -503 -1368 -1589 -1099 -67 978
2139 978 1562 1423 642 -450 -1324 -1589 -1122 -121 913 1538 1432 677 -405 -1297 -1582 -1138 -179 873
2157 873 1505 1448 725 -339 -1239 -1567 -1161 -214 828 1487 1463 769 -278 -1196 -1550 -1183 -262 785 1469
2176 1469 1471 808 -241 -1146 -1537 -1192 -318 729 1429 1482 828 -192 -1123 -1519 -1234 -363 675 1382 1470 861
2196 861 -150 -1090 -1517 -1248 -403 618 1360 1469 894 -104 -1037 -1500 -1259 -457 570 1337 1460 917 -51
2215e1r37m92J92P89J039P68J67n14r75r28n10J68P63J027P59K06m83r35r51n22
2235a420J23P38R99P93K23m37r20r47n69J09P10R87Q00K54m08r10r51n67P5O73
2255f45R89Q05K79l74q81r50o04N3O42R70Q40K97l35q57r65o16J2O32R46Q46L28
2276A412l17q32r52o26k6O09R41Q40L54k88p83r59o46n2N60R22Q67L83k61p92
2296C54r57o66p2N40R18Q59M06k32p70r34o83j11N18Q97Q74M14j95p41r35o86
2316a202j45M95Q70Q81M50j86o96r38p23j49M77Q55Q55M84j58o81r09p30j79M26
2336i03Q42Q83M87j18o58r09p23k33M14Q29Q78N04q9o34r13p35k39L81Q07Q88
2356G59N19o5o23q88p56k48L46P86Q90N26k9o01q71p51l07L41P57Q86N56Ln94
$$ plain form
2215 -51 -988 -1480 -1288 -499 540 1308 1475 961 -14 -942 -1452 -1284 -521 506 1265 1471 988 53 -898 -1420
2235 -1420 -1297 -559 440 1233 1456 1019 99 -848 -1417 -1308 -598 389 1189 1443 1035 125 -826 -1393 -1318 -645
2255 -645 344 1149 1428 1054 173 -777 -1381 -1328 -686 284 1124 1421 1086 229 -736 -1352 -1340 -708 238 1084 1412
2276 1412 1095 263 -689 -1315 -1341 -732 209 1049 1403 1115 332 -627 -1273 -1325 -765 157 1024 1407 1146 354
2296 354 -603 -1269 -1341 -801 117 976 1382 1150 380 -554 -1237 -1348 -830 67 941 1355 1160 419 -516 -1202
2316 -1202 -1347 -852 18 899 1349 1163 467 -471 -1194 -1343 -866 -11 844 1328 1170 489 -420 -1150 -1329 -903
2336 -903 -61 822 1309 1191 533 -376 -1099 -1332 -918 -89 789 1293 1204 570 -343 -1078 -1317 -936 -129 759
2356 759 1278 1213 590 -298 -1054 -1302 -956 -170 720 1246 1217 616 -255 -1006 -1313 -972 -215 671 1227 1230 636
2377F36q65p64l04K98P48Q74N77K5n63q52p71l22K54P46Q65N90M5n09q48p81l46
2398a267K36P19Q64O05O0m79q27p89l71K08P02Q54O14J01m74q24p81l97J89O76
2418c81Q56O28J30m45q13p95m02J49O53Q50O54J42m21p88q15m15J20O29Q60O56
2438A052J62l97p61p89m71J13O17Q24O76J80l57p70p93m62Q0N83Q18O93K11l36
2458H73p43p90m88L9N65Q26O83K30k96p24q06m96K4N35Q21O73K73k90o97q10n07
2479a105oN09Q02P04K81k67o84p89n33l2M95P74P22K91k32o70q08n38l8M74P63
2500A13P13L22k04o44q03n49p3M46P67P10L51j90o27p92n64j00M42P37P16L78
2520A149j73o15p72n82j19M09P22P18L83j21n96p70o04j30L77P06P34M02j25n76
$$ plain form
2377 636 -229 -993 -1297 -999 -251 623 1200 1225 662 -190 -961 -1283 -1029 -283 582 1172 1217 708 -140 -921 -1267
2398 -1267 -1031 -312 552 1157 1217 738 -89 -878 -1249 -1041 -339 515 1129 1230 756 -68 -849 -1246 -1057 -381
2418 -381 475 1103 1233 788 -25 -820 -1222 -1073 -420 430 1084 1226 805 17 -798 -1213 -1093 -464 396 1052
2438 1052 1214 817 56 -733 -1204 -1091 -474 350 1026 1206 849 79 -714 -1176 -1096 -513 305 998 1209 873
2458 873 130 -660 -1148 -1109 -544 282 965 1195 899 175 -631 -1127 -1103 -568 253 926 1199 909 212 -598 -1105
2479 -1105 -1111 -602 200 904 1185 918 234 -555 -1088 -1120 -625 149 871 1162 930 260 -548 -1086 -1124 -650 113
2500 113 826 1148 944 300 -503 -1052 -1125 -679 88 798 1149 959 332 -460 -1024 -1124 -682 55 771 1149
2520 1149 976 361 -411 -993 -1112 -703 19 737 1120 999 403 -367 -971 -1101 -724 -18 716 1118 993 417
2540D17p58o01j68L51P03P34M17j01n34p72o12j88L28O93P28M33o3n35p44o28
2560i00k10L02O94P25M41l2n22p37o24k27K78O50P33M53%m87p29o42k58K69O32
2581a91P36M70J6m64p20o53k71K28O32P34M81L3m48p08o49k91K05O16P17N02M8
2602A023m11p07o56l08J77N98P21N13Q0m02o87o63l32J55N71P24N29R3l76o78
2622c6o65l27J28N51P09N48J15l50o59o64l62J10N40P07N45J39l27o56o78l55
2642i87Q0N21O99N64J56l26o43o51l92N2N09O88N66J94l00o24o80l87L7M74O87
2663B37N80J92k73o09o60m20K0M57O80N76K15k41n97o53m43KM30O70N92K47k38
2684G64n80o68m35j3M06O66O03K44j92n63o80m45m3M08O34O01K68j82n33o75m43
$$ plain form
2540 417 -341 -942 -1110 -759 -56 678 1095 994 460 -312 -924 -1112 -784 -91 637 1070 1007 472 -272 -900
2560 -900 -1110 -808 -114 611 1052 1020 498 -239 -863 -1090 -812 -162 571 1024 1024 537 -192 -834 -1092 -823 -191
2581 -191 545 1015 1031 567 -153 -806 -1077 -849 -217 517 998 1031 583 -125 -774 -1065 -860 -244 473 975 1023
2602 1023 612 -95 -751 -1059 -882 -284 437 950 1030 628 -59 -722 -1054 -899 -328 396 925 1018 642 -36
2622 -36 -701 -1028 -900 -349 360 908 1023 673 14 -650 -1012 -902 -362 345 890 1029 702 46 -632 -987
2642 -987 -907 -386 313 877 1033 707 64 -587 -979 -927 -418 270 836 1030 730 106 -574 -961 -924 -450 237
2663 237 817 1009 736 127 -533 -953 -933 -476 204 780 995 754 157 -496 -939 -937 -507 163 755 1002 764
2684 764 184 -484 -919 -932 -526 140 743 987 795 232 -448 -893 -936 -528 106 707 975 793 260 -415 -858
2705h58p2L73O35O04K95j72n11o59m93p8L50O34O06K94j19n19o53m87r6L23O23
2726B0N94L21j05m91o53n01j25L20N92O04L47r0m82o29n20j28K81N92O13L53p0
2747H43m71o29n15j57K78N72O15L65n2m45o24n31j65K54N59O14L64j3m27o21n31
2768g17j93K34N48O13L83Om22o20n25k08K04N36O18M04Kl90o07n49k27J99N25
2789a86O17L99K4l72n99n41k38J65N17O06M20N3l68n82n50k64J72M84O07M32O8
2810H64l43n74n49k74J36M87N86M54Q4l15n78n48k87J08M69N92M47J20l05n74
2830@n34l18R6M60N87M53J21k82n52n55l16Q2M36N90M48J37k49n36n69l19M0M21
2852c59N95M61J56k48n21n58l37L1M14N68M71J74k20n29n51l40K3L74N59N05J67
$$ plain form
2705 -858 -930 -557 78 682 977 805 294 -365 -858 -936 -586 48 654 948 829 310 -343 -830 -926 -603 20
2726 20 614 935 830 339 -314 -815 -940 -620 -28 576 923 833 351 -278 -798 -926 -645 -53 560 913 843
2747 843 372 -257 -772 -929 -651 -79 536 901 849 404 -220 -751 -916 -662 -103 511 875 862 435 -186 -717
2768 -717 -910 -676 -128 485 868 874 452 -168 -693 -901 -697 -161 457 861 863 473 -134 -683 -910 -711 -186
2789 -186 431 830 854 482 -117 -658 -896 -731 -214 392 812 865 497 -85 -635 -899 -727 -243 364 796 864
2810 864 521 -53 -602 -876 -740 -253 333 787 871 556 -22 -570 -857 -749 -280 312 759 879 574 0
2830 0 -534 -852 -756 -296 291 744 865 583 31 -524 -840 -758 -322 268 716 853 604 68 -501 -820 -780 -359
2852 -359 236 697 853 605 84 -474 -811 -780 -366 202 673 847 627 98 -453 -793 -770 -396 163 668 835
2873H35k02m93n64l47kL56N70M86J97j91m78n58l65k3L48N39N11K18j72m74n70
2894c79l59l8L37N31N10K11j61m55n39m08l2L10N27N08K30j21m44n45m19n3L05
2915d84N17M96K49j11m35n33m13o7K73N13N06K72r8m19n39m11r6K63N10N01K80
2936G74q6l96n28m21j18K56M95N06K80o0l89n20m43j15K27M82N15K98m3l77n42
2957b05m14j53K12M84M98L25m7l53n29m18j71K05M66N00L24k1l40n19m43j64J79
2978e84M62N05L22J1l41n03m56j71J67M44N00L33K6l11n07m48j83J41M18N10L54
2999F89K3k97m96m40k06J27M22M91L50N3k79m84m52k24J06M08M98L57O8k63m94
3020d3m49k31J01L88N09L59Q0k67m58m67k30P3L82M90L76Q9k40m57m60k58P7L59
$$ plain form
2873 835 633 140 -424 -771 -773 -417 153 639 836 645 167 -391 -756 -779 -431 108 619 837 665 191 -379
2894 -379 -738 -776 -439 92 602 813 652 197 -342 -750 -782 -472 55 563 793 672 228 -317 -736 -789 -484
2915 -484 33 529 778 667 232 -301 -714 -781 -508 5 511 783 685 266 -273 -684 -780 -517 -7 494 774
2936 774 688 292 -236 -657 -775 -519 -24 482 762 702 313 -207 -650 -765 -538 -56 459 757 714 337 -205
2957 -205 -619 -772 -560 -76 422 747 700 347 -182 -600 -771 -566 -100 400 724 703 363 -156 -599 -763 -584
2978 -584 -122 383 705 716 375 -128 -584 -755 -588 -144 356 689 715 404 -103 -551 -734 -593 -175 335 689
2999 689 712 415 -81 -521 -727 -600 -178 313 663 716 437 -47 -499 -723 -617 -209 289 646 714 451 -43
3020 -43 -492 -723 -622 -234 275 634 714 447 -11 -478 -708 -635 -253 237 613 702 462 5 -455 -713 -636 -277
3042b77M92L91R0k13m61m55k65M6L74M81L77J31k16m42m40k76K1L44M72M05J18
3063F97j94m21m66k86K8L28M77L96J44j82m19m66k87J6K99M68M02J50j61m03m75
3084c55k93JK94M50M04J79j57m00m61l06j7K81M65L90J93j39l82m52l10m3K82
3105c76M40L97K01j16l77m49l03p0K67M37M13J99j03l65m36l38n9K28M34M24K18
3126F66r6l53m53l42o6K29M20M18K32p8l44m56l36r5K27M20M08K22n3l49m20l50
3148e49r6J97M15M06K43n9l03m35l44r7J74L87M06K70l4l15m16l65j22J77L82
3169g8M25K69k9k99m25l61j28J59L78M23K58j4k70m22l68j45J57L76M12K57Pk74
3191C08m03l66j61J36L63M09K82L4k81m02l62j64J10L49M14K75M3k51m05l55j92
$$ plain form
3042 -277 215 606 696 483 22 -433 -698 -652 -278 203 580 711 495 53 -387 -663 -642 -298 174 579 697
3063 697 503 82 -384 -670 -642 -314 163 559 703 521 102 -364 -651 -635 -336 132 534 684 523 120 -355
3084 -355 -648 -647 -353 97 501 680 523 123 -338 -644 -661 -380 85 475 668 529 147 -305 -615 -658 -376
3105 -376 64 461 662 546 169 -280 -583 -653 -386 51 464 663 560 195 -241 -579 -638 -410 24 448 666
3126 666 570 217 -236 -578 -644 -415 5 423 655 577 233 -223 -559 -654 -427 -7 401 623 570 221 -199 -549
3148 -549 -645 -448 -33 373 616 557 254 -181 -525 -622 -448 -61 345 615 581 266 -150 -515 -637 -460 -78
3169 -78 347 616 587 288 -137 -498 -626 -467 -89 334 592 578 308 -114 -482 -627 -470 -94 318 575 582 308
3191 308 -95 -461 -622 -486 -123 286 568 602 321 -81 -443 -607 -497 -148 266 541 584 333 -72 -427 -619
3212f19J16L21M28K94L1k12m07l70j90R8L33M00L04N2k15l91l72k03Q8L14M00
3233B00L24O9k10l73l82j88M3L21L99K98Q7j95l74l80j96M0L04L91L07J07j85
3254D07l80l75k16N6K77L93L09J18j79l62l68k43L2K79L90L31J06j55l53l88k37
3275e58K6K64L88L30J20j45l43l78k48J0K56L91L30J34j34l49l76k30rK39L67
3296H5L37J55j39l17l66k65j4K33L60L44J41r8l23l62k69l7K25L62L32J63q8l11
3318A48l83k51n4K12L60L50J68r8l05l59k75o2K10L52L42J71o6k94l61k76n7J79
3340c49L45L39J89o1k80l65k78n5J60L35L57J88n0k67l60k68r9J60L42L29K14
3361E26k3k74l67k85r4J53L30L26K13l1k44l58k84j09J57L05L42K22k5k39l48
$$ plain form
3212 -619 -503 -182 246 540 571 359 -48 -418 -608 -510 -177 223 527 579 364 -27 -399 -602 -514 -200 200
3233 200 524 593 383 10 -372 -560 -517 -196 203 501 588 393 19 -361 -557 -517 -213 178 485 592 407
3254 407 27 -348 -564 -508 -231 162 471 589 410 48 -320 -563 -531 -252 138 469 575 420 67 -321 -558
3275 -558 -532 -268 120 450 570 425 82 -296 -544 -534 -278 113 443 577 443 94 -282 -512 -521 -282 85
3296 85 422 577 438 121 -245 -510 -524 -291 69 413 554 456 133 -229 -498 -535 -310 52 384 547 459 148
3318 148 -235 -486 -540 -328 32 382 550 452 147 -212 -487 -549 -339 13 355 526 460 166 -195 -471 -528 -349
3340 -349 -4 335 524 463 183 -182 -460 -515 -355 -20 337 525 475 208 -152 -420 -519 -359 -17 312 526
3361 526 503 229 -138 -423 -517 -364 -34 292 505 474 230 -128 -412 -521 -364 -59 283 505 480 241 -107
3382a07k91j26J32L13L35K14Ok32l41l02j23J29K93L46K05L3k32l35k97j26R7
3403d09L00L41K30K0k06l31l02j31R1K83L31K36L2j96l27l08j42P8K91L24K42
3424D47M3j84l23l19j45P7K51L50K33N5j82l17l06j61O6K56L32K45O1j73l23k90
3446c07j72N1K54L26K43P7j50l14k99j84M4K46L23K55Q5j54k97l02j75L3K17L26
3468A26K70Q5j15l25l03j80J2K30L16K57J07j29k83l19j94J4K25L17K59J05j17
3489C58k77l16j92JK09K98K70J10j01k82l02k02lJ80L15K66J20q3k83l11j94j4
3511d33J87L00K74J26q6k57l05k16k4J90K82K61J45p8k50l01k12l1J67K95K75
3532C09J31n1k56k98k30l0J64K92K65J36m2k42k91k20n7J49K92K80J35l9k38k96
$$ plain form
3382 -107 -398 -524 -392 -79 256 470 476 244 -97 -399 -522 -393 -100 246 451 484 252 -83 -380 -506 -409
3403 -409 -109 232 462 482 276 -55 -357 -488 -397 -114 217 453 485 289 -38 -346 -488 -410 -119 205 447
3424 447 490 306 -17 -336 -481 -404 -153 197 430 485 303 -14 -320 -481 -415 -159 173 418 479 306 -17 -307
3446 -307 -479 -428 -174 152 395 472 322 8 -291 -475 -431 -185 138 393 478 324 27 -275 -450 -417 -200 126
3468 126 396 481 366 41 -262 -442 -430 -200 116 373 480 351 68 -251 -445 -431 -206 111 370 475 358
3489 358 81 -235 -427 -426 -217 81 351 461 360 78 -224 -426 -429 -249 66 332 452 369 86 -225 -419 -433
3511 -433 -246 54 328 454 368 111 -194 -410 -434 -244 38 299 444 366 116 -185 -397 -428 -261 34 309
3532 309 440 389 133 -165 -395 -425 -261 31 296 432 390 148 -143 -363 -420 -271 21 301 436 397 159 -137
3554a37k47l6J30K66K96J51m6k14k96k40m9J23K76K81J55l0k13k86k37p1J18K61
3576d5K84J70k1k08k90k35q5J10K71K94J66j0k06k83k40q8J03K56K93J67jj95
3598B07k87k34r2R5K46K83J85Qj96k71k42j24J05K39K72J90Qj71k76k38j13P5
3620c31K39K68J94J9j72k62k51j16P9K21K70K09L0j55k63k59j21N6K26K91J86
3641C58M1j37k72k61j18N7K13K51K29L4j46k51k47j43N0K05K74K04O0j29k56k64
3663b48j31K6K20K58K05O9j29k48k60j61N2K03K54K10O4j20k40k53j48K2J92K48
3685H5K17P8j10k39k43j58J3J73K62K19P4q9k24k63j54QJ75K40K33R4r5k32k58
3708a94j50j3J64K58K34Q8r0k13k50j79j4J77K43K13J05p6k14k52j83kJ58K24
$$ plain form
3554 -137 -384 -420 -290 -24 272 423 377 163 -133 -373 -422 -299 -23 258 413 383 170 -116 -353 -424 -306 -45
3576 -45 239 409 388 180 -110 -345 -430 -320 -49 245 411 401 195 -88 -328 -416 -313 -57 236 403 402 207
3598 207 -80 -314 -406 -311 -65 218 403 411 215 -56 -298 -422 -317 -78 194 384 392 221 -55 -293 -406 -331
3620 -331 -92 176 370 389 217 -45 -296 -412 -333 -112 158 367 397 242 -21 -280 -401 -345 -119 172 358
3641 358 399 262 -10 -271 -389 -332 -119 132 361 395 249 -2 -249 -392 -342 -137 137 341 401 272 16 -248
3663 -248 -379 -353 -133 125 330 399 270 22 -238 -399 -347 -144 110 320 384 264 24 -229 -377 -355 -163 85
3685 85 302 380 270 31 -212 -370 -357 -184 78 297 371 282 58 -205 -359 -351 -176 64 297 391 296 64 -194
3708 -194 -344 -357 -193 65 299 387 297 84 -166 -345 -359 -182 61 274 379 303 89 -163 -346 -348 -190 34
3730C4K30J05n2k24k53j74l1J46K50K31J01n4k03k46j82l6J37K40K14J29n3j91
3752A18k53j82m3J33K35K32J22n4j86k51j82l0J11K35K22J24l9j74k45j90m2J09
3774b30K12K43J23k1j74k39j87o5J01K28K16J43k6j87k20k01o5J07K04K32J46
3795C40k4j64k37j83q1P2K35K14J51j4j38k39k06p6Q8K13K18J58jj56k27k01q9
3818c47P4J93K34J57J6j39k27k04r5P2K01K18J71Jj34k11k11q8N4J88K31J51K9
3841C34j27k30k07r8N5J89K19J65L4j27k33j87j21N0J82K18J65L7j09k06k24j07
3863c28M4J64K27J70M6j07k09k24j12L8J72K19J71N5j11k00k02j37K8J75K10J78
3885B67O5j08k03k09j41L2J65K11J91N6q7j96k12j34J7J39K22J74O9q4j91k13
$$ plain form
3730 34 264 369 317 93 -160 -334 -365 -219 31 262 363 309 106 -140 -322 -358 -221 19 233 362 309 118
3752 118 -135 -317 -360 -227 8 240 362 308 122 -129 -311 -341 -230 5 227 351 312 138 -107 -297 -339 -230
3774 -230 -18 225 348 327 153 -86 -273 -338 -237 -9 207 350 324 137 -83 -284 -349 -242 -38 194 340
3795 340 316 152 -85 -268 -349 -277 -42 172 323 309 171 -68 -274 -350 -262 -49 169 327 326 170 -57 -258 -347
3818 -347 -273 -80 154 311 327 188 -39 -243 -338 -266 -65 153 324 325 191 -20 -231 -319 -265 -77 154 305 334
3841 334 207 -23 -230 -328 -273 -84 135 300 334 207 -26 -213 -334 -284 -102 116 281 318 209 3 -221 -328
3863 -328 -284 -120 107 277 323 216 7 -217 -329 -291 -119 100 271 326 215 15 -187 -324 -296 -121 89 267
3885 267 332 224 21 -188 -329 -297 -132 79 270 326 239 43 -169 -303 -286 -147 75 249 318 234 43 -170
3907a70j28J1J29K19J80P7q0j77k24j43KJ39K18J69P1n9j86k07j37%J22K13J85
3930B24P3p3j59k02j57j0J27K10J89Q7n1j85k00j53j4J20K05J87Q7n1j73j95j48
3953b62k4J09J94J93Q4l3j65k10j49j8R5J87K02J02l5j68k03j60k9R7J86J85J19
3976B97l2j61j97j68m8J12J84J84J10l1j41j88j65n7Q7J90J93J05lj47j99j71
3998b46m3Q4J74K02J17l0j33k00j57n4P9J85J81J25%j44j92j73o1P9J72J95J13
4021B73mj19j84j85o9O0J73J90J19J6j27j78j70q7O2J66J89J41J4j28j78j80o3
4044b69M3J41K09J27K4j11j82j76q7M0J59J92J28L8j01j83j78r2N7J42J85J39
4066B45K6r1j91j49j10L8J41J98J48K5q9j84j78r7K6J37J97J46L5r7j68j81j02
$$ plain form
3907 -170 -298 -287 -158 61 241 318 238 61 -163 -306 -304 -165 53 222 293 234 48 -159 -296 -296 -174 39 224
3930 224 297 224 65 -137 -294 -304 -177 33 222 309 258 73 -127 -280 -294 -174 31 218 305 254 81 -114 -262
3953 -262 -286 -177 17 210 294 261 96 -114 -263 -281 -186 1 203 305 270 102 -101 -261 -290 -193 -7 178 297
3976 297 265 104 -93 -261 -309 -197 -13 171 281 250 109 -79 -244 -301 -214 -24 169 274 271 124 -75 -246
3998 -246 -289 -205 -31 171 288 258 125 -75 -232 -286 -207 -22 159 284 284 140 -52 -225 -286 -207 -35 160 273
4021 273 269 150 -34 -219 -288 -228 -55 135 254 270 143 -35 -205 -292 -230 -64 125 266 280 152 -26 -206 -269
4044 -269 -226 -85 124 251 275 164 -18 -194 -281 -241 -82 110 238 276 175 -8 -186 -278 -221 -79 106 245
4066 245 271 180 -11 -160 -270 -232 -91 107 255 280 191 7 -171 -268 -242 -105 92 238 273 176 8 -173 -275
4089b75M3J32J74J52L5q2j55j91r7J7J27J79J59M4p8j71j73j04K3J14J95J43M0
4112B51n6j58j96r7MJ18J89J61M3n2j66j75j23J0J31J65J57O0n7j55j87j14QJ18
4136a21J66J58O3n6j56j78j15k4J28J72J45Q1n6j47j77j23pR3J77J59P8o0j32
4159F8j75j31k2R9J67J65Q9m3j46j78j29l6R9J88J55P8k4j41j78j30l5R2J73J70
4183A75P5k0j30j82j38l8R6J64J70P6j8j26j79j34l9Q3J62J56R6k7j10j79j44
4206b11l8P3J48J76R3k2j18j55j45o6Q3J51J68R6mj27j56j48n1N3J67J58J08L
4230B36j23j60j52n2N6J39J80J09Nj09j61j51p0O8J45J64J04Oq6j73j53o1M8J49
4254d2J58J22Or5j59j56p6N8J26J71J11J8j05j40j75o0L6J38J55J12K9r6j44j61
$$ plain form
4089 -275 -232 -100 74 226 261 179 24 -167 -264 -247 -120 59 218 262 184 13 -160 -264 -241 -127 68 211 251
4112 251 195 37 -159 -256 -252 -134 55 216 259 207 41 -134 -257 -247 -116 49 206 266 209 54 -133 -247 -239 -121
4136 -121 45 203 266 210 54 -124 -239 -263 -135 37 182 263 207 60 -117 -240 -247 -154 23 182 260 200 68
4159 68 -107 -238 -260 -161 6 171 260 217 71 -107 -236 -272 -173 15 170 248 224 83 -95 -225 -260 -168 5 175
4183 175 250 230 100 -82 -220 -258 -162 2 172 248 230 104 -75 -209 -248 -165 -3 153 249 222 112 -67 -211
4206 -211 -249 -176 -28 148 241 219 101 -54 -199 -265 -182 -31 137 233 229 102 -54 -202 -253 -200 -33 125 233 236
4230 236 113 -47 -199 -251 -195 -56 124 233 238 129 -32 -183 -253 -185 -40 124 228 234 148 -25 -178 -239 -191 -42
4254 -42 116 238 244 149 -10 -166 -242 -184 -58 113 224 242 137 -3 -178 -238 -202 -64 91 203 232 136 -8 -169
4278a69q3N3J13J70J19K8q7j51j47q8K8J36J64J21L3q9j47j57r3M4J15J64J26
4301B03K8o8j49j56r5L2J18J66J37K7q1j48j44p6J0J07J48J45M1p3j37j57q2J0
4325a94J12J46J31M4o1j43j67q2nJ10J56J46L9n4j46j54r8mJ07J47J48M7n5j30
4349D0j66r9KR8J51J59M6o3j23j52j07j2J04J52J47O5n1j20j60j13qQ2J61J38
4373A71O0l8j16j62j11k4R2J44J38O7m1j22j42j15l0R3J34J53N8k5j19j40j22
4396a97l8Q4J35J64O7k6j30j44j17k9O6J53J56N5lj21j40j24m5Q0J42J55Q4k2
4420B05j08j52j28k5N2J43J45R3k8r2j54j19n0P4J23J43J00jj18j53j14m4N8J12
4444c8J48J05mj20j34j34m9O8J21J39J06oj02j36j43n1O0J16J55R3Oq8j54j22
$$ plain form
4278 -169 -252 -199 -86 84 203 231 144 -7 -154 -242 -214 -78 86 207 240 151 4 -153 -246 -202 -87 77 203
4301 203 231 163 14 -142 -237 -205 -87 79 216 243 162 14 -130 -206 -196 -89 59 204 245 172 35 -122 -204 -194
4325 -194 -82 64 195 239 178 35 -132 -214 -219 -109 47 193 232 178 32 -122 -220 -224 -117 30 178 225 170 40
4349 40 -126 -225 -223 -125 26 185 231 168 45 -107 -214 -226 -122 30 177 242 191 71 -89 -202 -210 -128 33 171
4373 171 231 193 77 -85 -196 -220 -128 16 154 221 180 58 -84 -199 -229 -136 -2 151 209 184 65 -75 -197
4396 -197 -235 -151 -16 148 215 189 59 -85 -202 -231 -165 -12 144 199 196 75 -65 -189 -234 -154 -12 143 227 205
4420 205 97 -55 -183 -208 -156 -13 132 225 197 105 -49 -168 -218 -144 -21 122 222 221 103 -50 -164 -208 -150 -38
4444 -38 110 215 211 91 -43 -177 -226 -158 -37 102 208 202 100 -36 -179 -230 -170 -54 101 194 200 112 -42 -164
4468a64n1N1J21J35J09qo7j47j34n5M4J25J35J00K7j02j23j39o6M3J09J47J08
4491A98Pp3j41j28p1M0J13J32J18J1q3j29j37p7M1J07J34J12L0p6j31j39p0J7
4515a95J07J46J16K4o3j40j31o4jJ06J43J27K0p0j18j35p3JJ17J43J08L6o4j24
4539A6j24r7J6J02J36J17M4n8j24j29q5J2Q6J32J14M8l5j42j25r1jQ4J42J28M2
4564B08l9j42j17j02JQ3J41J22M3m6j18j30j00PP1J34J27M8l6j20j26r9%P9J22
4589A1J32M4k5j12j39r7j0Q5J24J18O3l0j09j33j00qP8J19J39N4l4j03j26r3k9
4614a81P2J08J19P9l0r6j45r9j8P5J09J18Q1l7r1j29r9l3N6J18J37P3k9r7j18
4639e7r6l2N6R5J34P2jq8j38j06l2O2J04J33Q0nr8j20j29k7O6J21J16P9j4p6j32
$$ plain form
4468 -164 -215 -164 -43 92 201 193 126 -21 -155 -210 -166 -41 94 194 221 119 -4 -143 -209 -166 -57 90 198
4491 198 205 132 -9 -137 -208 -168 -55 77 195 206 123 -6 -143 -220 -179 -72 62 174 204 128 -3 -142 -212 -195
4515 -195 -88 58 174 198 135 -5 -136 -200 -201 -95 48 175 195 125 7 -128 -201 -200 -83 60 168 204 140 16
4539 16 -108 -205 -189 -87 49 166 210 152 28 -101 -186 -174 -88 44 158 206 171 29 -96 -187 -188 -104 38 166 208
4564 208 169 27 -90 -192 -191 -108 33 155 198 152 34 -96 -196 -189 -118 16 143 191 155 35 -91 -190 -190 -111 11
4589 11 143 187 162 50 -89 -186 -196 -111 13 131 194 164 55 -78 -178 -186 -108 11 150 204 170 67 -59 -152 -181
4614 -181 -109 -1 118 197 167 71 -74 -173 -191 -116 -7 111 192 155 64 -65 -164 -197 -141 -23 114 187 158 61 -57
4639 -57 -153 -185 -129 -34 100 172 171 83 -55 -161 -193 -131 -27 106 186 181 83 -37 -166 -193 -127 -6 110 189 175 99 -33
4666c3j17k9M8J18J12R0qq6j23j16m4M8J13J24Q9j4p1j25j32k8K6J11J32Q6j4
4691A57o3j34j07l7K2J09J27R9Nq2j15j15n9L4R6J33R0K3q1j17j09o9L4J08J22
4716G1R3L0p9j16j18m4J1J03J19R6L1q2j03j31o2L2J03J00R8M0o4j07j27o4J3
4741a57R1J28R3J5l6j22j21o7J3P9J30J08K1m9j14j15q0J7Q0J33Q7L8m5j01j18
4766i2q7J4P9J18J19J8k7j13j17p6J0Q1J03J16L5l6j09j21q3J5Q8J04R8M0k9j04
4792D4j23q0j3P7J01J22N0l4r8j21q8lO3J14J13L8l3r4j08r9nP2J05J18N1l1j03
4819C5j18q5j3P4J16J05N1k4q5j30p0l1O3J09J15N9j9q0j24r3l1P6J07J08O2k1
4845A56q4j14j06oO5Q2J15O8j0j03j09r1l4N2J09J10O3pq0j23r8k4M8J03J16M3
$$ plain form
4666 -33 -150 -179 -131 -13 99 189 181 95 -28 -144 -188 -140 -27 97 186 172 101 -24 -156 -184 -158 -47 85 171 157
4691 157 94 -40 -147 -184 -162 -53 74 173 178 96 -19 -134 -193 -159 -63 70 160 183 102 -15 -124 -193 -159 -51 71
4716 71 164 194 115 -1 -119 -163 -152 -49 70 166 197 115 12 -119 -181 -149 -46 54 152 192 128 21 -106 -170 -157
4741 -157 -66 62 155 170 134 12 -109 -176 -163 -84 46 154 175 126 12 -103 -183 -166 -86 47 134 172 127 26 -92
4766 -92 -179 -165 -86 32 151 169 142 29 -88 -164 -154 -73 30 146 181 145 36 -85 -168 -153 -65 39 137 177 148 44
4792 44 -79 -159 -172 -95 6 128 178 144 46 -75 -163 -166 -103 11 124 162 129 35 -73 -172 -177 -105 0 118 169 138 35
4819 35 -83 -168 -181 -107 9 114 165 141 56 -74 -144 -175 -112 -3 112 171 152 72 -52 -145 -176 -100 7 115 177 156
4845 156 72 -42 -148 -154 -89 -7 108 176 166 63 -46 -137 -171 -119 -10 100 163 156 76 -47 -145 -169 -121 -18 98 141
4871A41J8j02j11q4m6M6J13J12P8nj00j03r1l8M3J08J10O4J0q6j11j01l9N8J02
4896a4R1Q5Nq3j08j00k0K0R1J22O2J2p3j07j03l4K7Q6J21P9j2n0j12r5m8K0J09
4923b9R9P4K0o6j25r4m8L5Q1J07Q6J2o1j06r5o6M1P7J14Q5J1m4j06j11n3K4Q3
4950e5J05R8J8o6r3j00n4K7P8R7R4J4m3r7j14n8J5P9J09R1K0n5r5j03n9KR2R9
4978D6P9K4m3q7j14o5J5O3J03J01L5m7j01r2q0J9P2J00R7K4k9j01r7p9J5O5J00
5005B3J01L8l5r3j12o0KO7R4R7L8l8q4r4q1JO8R8R3L2k5q9j02p6OO1P8J12M2l2
5035A30p7j08o8k5P1R6R3L0k1q7r4r3kP1J00P3O0l2p4r5p7k4N0J04Q4N4j6p6j06
5064e9p4j4N9Q7J04M9j9q1q5j01mM5Q8R9N8j2p4j09o6m4O4Q7R8N9j7o5j17p6k5
$$ plain form
4871 141 159 57 -54 -138 -184 -138 -25 87 165 160 60 -43 -134 -172 -129 -21 89 153 163 77 -34 -135 -174 -116 -14
4896 -14 77 162 167 84 -24 -124 -144 -124 -33 89 151 163 90 -17 -120 -154 -127 -41 80 159 147 97 -15 -110 -158 -138 -29
4923 -29 70 144 164 98 -27 -121 -169 -134 -53 54 140 152 91 -15 -110 -176 -135 -58 56 141 152 108 2 -109 -162 -138 -55
4950 -55 50 148 166 100 7 -93 -147 -120 -42 55 149 163 120 23 -91 -149 -134 -55 54 145 165 110 15 -88 -147 -145 -53 46
4978 46 125 149 106 19 -95 -160 -145 -82 21 122 157 110 9 -83 -163 -144 -72 28 125 149 120 19 -78 -157 -142 -77 23
5005 23 124 162 127 34 -78 -138 -136 -69 25 122 160 122 38 -56 -137 -136 -68 30 123 155 130 41 -61 -137 -131 -70 8 120 162 130
5035 130 53 -55 -123 -148 -77 19 112 142 121 34 -60 -153 -155 -84 16 89 149 117 43 -52 -129 -153 -103 1 85 139 123 47 -59
5064 -59 -133 -147 -88 -1 103 152 133 52 -33 -134 -138 -93 -5 94 152 140 66 -43 -109 -153 -89 -2 96 155 138 73 -44 -120 -145
5093a45M3R0R2O6j6o9j06p4l4M5P8J02N6ko7r2q9l6M6R3Q2O6jo1j06p5l6L7Q5
5122b8J02O0Jo4j05o0l8J6R7Q8P4Jo3r1r2l6L2Q5R5N7J3n8q8r8k8K6O9R6O3K3
5152A49o6r6q3n1K4Q5R3O4J9n7q9r0m6J6P7R0Q0J0m1j06q0m4J6P1R5P2K3m2r8
5181er2m4K3N9J10O8Rl3q0r3m6%P6J07O3L2n7q1q1o5J0P4Q7P5L4n2p6r2n8QN7
5212f3J04P4M3m4r4q6p8J5O0R9Q9Qk5q4r2o2lP3Q8P7L1m1p7p4q0J9M5R3Q5L4l7
5243I7p7q6n3j0P3O7J05L6l2q4q4q0J9M4Q4Q8L7k7p5q5p6rO0Q0P8N5k7o8j03o0
5273a13j1M4R0P4N8l5n7j01q2MM0Q8P6M0qp7p7p9j5M2Q9Q7N3k0o0r7p9rM3P6Q8
5304G2N4ko3q8q8j2N0P0P8M3J5o7r0p6l0M3Q0Q5O8k1o1p8r2j8M2P7Q5M5J1p6q2
$$ plain form
5093 -145 -102 -12 80 146 130 61 -45 -119 -153 -108 -30 72 128 126 59 -33 -122 -158 -112 -19 63 129 128 67 -39 -114 -150 -113 -28
5122 -28 74 134 135 71 -34 -94 -132 -116 -19 69 143 144 81 -10 -102 -138 -106 -21 74 131 144 86 -2 -100 -128 -102 -33 63 126 149
5152 149 83 -13 -96 -147 -123 -38 55 119 138 81 -8 -98 -144 -128 -51 39 119 129 88 -18 -98 -142 -126 -55 40 112 135 93 -5
5181 -5 -97 -141 -118 -59 51 119 128 95 15 -78 -124 -124 -48 59 122 154 97 16 -65 -130 -120 -46 41 116 150 98 22 -70 -128 -120 -63
5212 -63 41 115 158 114 20 -66 -144 -129 -69 30 119 127 102 18 -74 -136 -139 -66 22 99 130 89 12 -62 -142 -123 -78 15 100 134 97
5243 97 20 -66 -119 -129 -56 11 116 152 120 36 -48 -128 -109 -65 19 107 144 117 42 -43 -119 -128 -68 12 90 145 118 50 -53 -113
5273 -113 -124 -80 10 84 142 107 50 -51 -133 -129 -89 -1 75 115 107 30 -47 -126 -141 -99 -10 77 130 110 50 -47 -126 -135 -92 -16 72
5304 72 126 124 61 -27 -115 -127 -77 -7 71 114 129 62 -28 -104 -134 -91 -11 74 142 121 60 -18 -110 -128 -86 -9 76 121 132 56 -26
5335b6o7l3L0P8P8N7nn5o8p7m6K9O5R5N5Om5q8q1l1K9P4Q2O6Jm5q7p9m1K3P0R4
5367E8O4Pn2p8j03k2L9N9Q8N4J7m2r2q0l9K7P6O9O5Qm2p7q9l8RQ5P3N8K3m9p8
5398bp9n4K5N9R1O3J4m6p2q3n6K2N4J00N9K8m7q5p1l9J4N4Q0P5J8l1q5p8m8K3
5428i7N9O4P7K3m3o7p9m8%O7Q4O3L0k8q1q8m8j0O3Q9O5K8k0q3q1n4oM7R5O8M5
5459A34l3q1q0n5j8O0Q0P8L2l2p1o9n9kN3P2P2L5k0p6p8n2qN5O8R3K8j7q8o6n3
$$ plain form
5335 -26 -93 -126 -96 -18 60 117 112 57 -11 -88 -134 -105 -40 55 110 116 71 -17 -98 -129 -100 -26 56 122 123 78 -9 -88 -129 -106 -36 58
5367 58 122 129 77 -1 -104 -126 -87 -28 60 114 131 89 -3 -83 -122 -95 -19 50 115 123 81 4 -85 -123 -114 -29 44 102 125 76 -2
5398 -2 -81 -135 -110 -51 40 103 117 71 -1 -84 -140 -118 -64 36 95 123 76 -9 -80 -119 -105 -51 29 104 122 91 6 -72 -120 -97
5428 -97 -38 26 103 126 83 16 -63 -111 -111 -44 40 103 133 105 24 -64 -112 -122 -59 30 95 123 103 20 -61 -115 -121 -74 21 89 134
5459 134 101 20 -60 -115 -133 -73 7 85 117 85 14 -55 -114 -116 -63 9 81 116 96 20 -58 -110 -118 -63 5 98 126 109 21 -45 -98
$$ [...]
8191A4
##END NTUPLES=NMR FID
##END=
