##TITLE=1H_LR-709-C1-OCT2
 CDcl3+DMSO, 8 sc, 
 30.1.2020
##JCAMPDX= 6.0         $$ Bruker NMR JCAMP-DX V2.0
##DATA TYPE= NMR FID
##DATA CLASS= NTUPLES
##ORIGIN= UXNMR, Bruker Analytische Messtechnik GmbH
##OWNER= root
$$ XWIN-NMR		Version 3.5
$$ Thu Jan 30 14:23:20 2020 Russian Standard Time (UT+4h)  she@DPX200
##.OBSERVE FREQUENCY= 200.1315
##.OBSERVE NUCLEUS= ^1H
##.DELAY= (6, 6)
##.ACQUISITION MODE= SIMULTANEOUS
##.ACQUISITION SCHEME= undefined
##.AVERAGES= 8
##.DIGITISER RES= 18
##SPECTROMETER/DATA SYSTEM= spect
##.PULSE SEQUENCE= zg30
##.SOLVENT NAME= CDCl3
##.SHIFT REFERENCE= (INTERNAL, CDCl3, 0, 15.7039)
##AUDIT TRAIL= $$ (NUMBER, WHEN, WHO, WHERE, WHAT)
$$ ##TITLE= Audit trail, XWIN-NMR		Version 3.5
$$ ##JCAMPDX= 5.01
$$ ##ORIGIN= Bruker BioSpin GmbH
$$ ##OWNER= she
$$ F:/spectra/data/she/nmr/H-F/1/audita.txt
$$ ##AUDIT TRAIL=  $$ (NUMBER, WHEN, WHO, WHERE, WHAT)
(   1,<2020-01-30 14:22:08.43 +0400>,<she>,<DPX200>,
      <created by zg, POWCHK disabled, PULCHK disabled
       configuration hash MD5:
       00 E9 B6 7A A2 85 ED C7 34 08 36 98 17 FE 4E 26
       data hash MD5: 16K
       82 E5 D0 93 AA 47 9D 32 E5 97 9C 0A 10 E7 8E 85>)
$$ ##END=
$$ 
$$ hash MD5
$$ 8E 7A 49 A3 1A 78 C5 5B 49 45 FA 93 6C 70 DA FC
##$RELAX= 
##$RELAX= 
##$RELAX= 
##$RELAX= 
##$RELAX= 
##$RELAX= 
$$ Bruker specific parameters
$$ --------------------------
##$DU= <F:/spectra>
##$EXPNO= 1
##$NAME= <H-F>
##$PROCNO= 1
##$TYPE= <nmr>
##$USER= <she>
##$AMP= (0..31)
100 100 100 100 100 100 100 100 100 100 100 100 100 100 100 100 100 100 
100 100 100 100 100 100 100 100 100 100 100 100 100 100 
##$AQSEQ= 0
##$AQ_mod= 1
##$AUNM= <au_zg>
##$AUTOPOS= <>
##$BF1= 200.13
##$BF2= 200.13
##$BF3= 200.13
##$BF4= 200.13
##$BF5= 200.13
##$BF6= 200.13
##$BF7= 200.13
##$BF8= 200.13
##$BYTORDA= 1
##$CFDGTYP= 0
##$CFRGTYP= 5
##$CHEMSTR= <none>
##$CNST= (0..31)
1 1 145 1 1 1 1 1 1 1 1 1 1 1 1 1 1 1 1 1 1 1 1 1 1 1 1 1 1 1 1 1 
##$CPDPRG= <>
##$CPDPRG1= <>
##$CPDPRG2= <>
##$CPDPRG3= <>
##$CPDPRG4= <mlev>
##$CPDPRG5= <mlev>
##$CPDPRG6= <mlev>
##$CPDPRG7= <mlev>
##$CPDPRG8= <mlev>
##$CPDPRGB= <>
##$CPDPRGT= <>
##$D= (0..31)
0 1.2 0 0 0 0 0 0 0 0.06 0 0.03 0 0 0 0 0.0002 0 0 0 0 0 0 0 0 0 0 0 0 
0 0 0 
##$DATE= 1580379727
##$DBL= (0..7)
120 120 120 120 120 120 120 120 
##$DBP= (0..7)
150 150 150 150 150 150 150 150 
##$DBP07= 0
##$DBPNAM0= <>
##$DBPNAM1= <>
##$DBPNAM2= <>
##$DBPNAM3= <>
##$DBPNAM4= <>
##$DBPNAM5= <>
##$DBPNAM6= <>
##$DBPNAM7= <>
##$DBPOAL= (0..7)
0.5 0.5 0.5 0.5 0.5 0.5 0.5 0.5 
##$DBPOFFS= (0..7)
0 0 0 0 0 0 0 0 
##$DE= 6
##$DECBNUC= <off>
##$DECIM= 24
##$DECNUC= <off>
##$DECSTAT= 4
##$DIGMOD= 1
##$DIGTYP= 9
##$DL= (0..7)
0 120 120 120 120 120 120 120 
##$DP= (0..7)
150 150 150 150 150 150 150 150 
##$DP07= 0
##$DPNAME0= <>
##$DPNAME1= <>
##$DPNAME2= <>
##$DPNAME3= <>
##$DPNAME4= <>
##$DPNAME5= <>
##$DPNAME6= <>
##$DPNAME7= <>
##$DPOAL= (0..7)
0.5 0.5 0.5 0.5 0.5 0.5 0.5 0.5 
##$DPOFFS= (0..7)
0 0 0 0 0 0 0 0 
##$DQDMODE= 0
##$DR= 18
##$DS= 0
$$ [...]
##$SUBNAM2= <"">
##$SUBNAM3= <"">
##$SUBNAM4= <"">
##$SUBNAM5= <"">
##$SUBNAM6= <"">
##$SUBNAM7= <"">
##$SUBNAM8= <"">
##$SUBNAM9= <"">
##$SW= 24.9337058887773
##$SWIBOX= (0..15)
0 0 2 0 0 0 0 0 0 0 0 0 0 0 0 0 
##$SW_h= 4990.01996007984
##$TD= 16384
##$TD0= 1
##$TE= 0
##$TE2= 300
##$TE3= 300
##$TEG= 300
##$TL= (0..7)
0 120 120 120 120 120 120 120 
##$TP= (0..7)
150 150 150 150 150 150 150 150 
##$TP07= 0
##$TPNAME0= <>
##$TPNAME1= <>
##$TPNAME2= <>
##$TPNAME3= <>
##$TPNAME4= <>
##$TPNAME5= <>
##$TPNAME6= <>
##$TPNAME7= <>
##$TPOAL= (0..7)
0.5 0.5 0.5 0.5 0.5 0.5 0.5 0.5 
##$TPOFFS= (0..7)
0 0 0 0 0 0 0 0 
##$TUNHIN= 0
##$TUNHOUT= 0
##$TUNXOUT= 0
##$USERA1= <user>
##$USERA2= <user>
##$USERA3= <user>
##$USERA4= <user>
##$USERA5= <user>
##$V9= 5
##$VALIST= <valist>
##$VCLIST= <CCCCCCCCCCCCCCC>
##$VD= 0
##$VDLIST= <DDDDDDDDDDDDDDD>
##$VPLIST= <PPPPPPPPPPPPPPP>
##$VTLIST= <TTTTTTTTTTTTTTT>
##$WBST= 1024
##$WBSW= 4
##$XGAIN= (0..3)
0 0 0 0 
##$XL= 0
##$YL= 0
##$YMAX_a= 452413
##$YMIN_a= -263644
##$ZGOPTNS= <>
##$ZL1= 120
##$ZL2= 120
##$ZL3= 120
##$ZL4= 120
##$ABSF1= 10
##$ABSF2= 0
##$ABSG= 5
##$ABSL= 3
##$ALPHA= 0
##$AQORDER= 0
##$ASSFAC= 0
##$ASSFACI= 0
##$ASSFACX= 0
##$ASSWID= 0
##$AUNMP= <proc_1d>
##$AZFE= 0.1
##$AZFW= 0.1
##$BCFW= 1
##$BC_mod= 2
##$BYTORDP= 1
##$COROFFS= 0
##$CY= 11.3945322036743
##$DATMOD= 1
##$DC= 2
##$DFILT= <>
##$DTYPP= 0
##$F1P= 16.9975609425685
##$F2P= -3.02152046262296
##$FCOR= 0.5
##$FTSIZE= 0
##$FT_mod= 4
##$GAMMA= 1
##$GB= 0.15
##$INTBC= 1
##$INTSCL= 1
##$ISEN= 128
##$LB= 0.24
##$LEV0= 0
##$LPBIN= 0
##$MAXI= 10000
##$MC2= 0
##$MEAN= 0
##$ME_mod= 0
##$MI= 1.114404
##$NCOEF= 0
##$NC_proc= 0
##$NLEV= 6
##$NOISF1= 3.799351
##$NOISF2= 2.8
##$NSP= 1
##$NTH_PI= 0
##$NZP= 0
##$OFFSET= 15.70392
##$PC= 1
##$PHC0= -9787.073
##$PHC1= 11.60081
##$PH_mod= 1
##$PKNL= yes
##$PPARMOD= 0
##$PSCAL= 0
##$PSIGN= 0
##$REVERSE= no
##$SF= 200.130013532006
##$SI= 16384
##$SIGF1= 3
##$SIGF2= 2
##$SINO= 400
##$SIOLD= 16384
##$SREGLST= <1H.CDCl3>
##$SSB= 0
##$STSI= 0
##$STSR= 0
##$SW_p= 3612.71676300578
##$SYMM= 0
##$S_DEV= 0
##$TDeff= 0
##$TDoff= 0
##$TI= <>
##$TILT= no
##$TM1= 0
##$TM2= 0
##$TOPLEV= 0
##$USERP1= <user>
##$USERP2= <user>
##$USERP3= <user>
##$USERP4= <user>
##$USERP5= <user>
##$WDW= 1
##$XDIM= 8192
##$YMAX_p= 0
##$YMIN_p= 0
$$ End of Bruker specific parameters
$$ ---------------------------------
##NTUPLES= NMR FID
##VAR_NAME=  TIME,          FID/REAL,        FID/IMAG
##SYMBOL=    X,             R,               I
##VAR_TYPE=  INDEPENDENT,   DEPENDENT,       DEPENDENT
##VAR_FORM=  AFFN,          ASDF,            ASDF
##VAR_DIM=   8192,          8192,            8192
##UNITS=     SECONDS,       ARBITRARY UNITS, ARBITRARY UNITS
##FACTOR=    0.0002004,     1,               1
##FIRST=     0,             0,               0
##LAST=      1.6414764,     0,               0
##MIN=       0,             -263644,         0
##MAX=       1.6414764,     452413,          0
$$ Real data points
##PAGE= N=1
##DATA TABLE= (X++(R..R)), XYDATA
$$ [...]
1987A15m20o16M15J042J88N71o00l86r83l66nN45N88K25K01M2j26q05l12m93J46
$$ 115 -305 -921 -506 536 724 1295 695 309 -674 -1040 -1045 -500 88 313 514 556 430 -375 -687 -1180 -1034
2008a034K79P25Q79q4k36n82q86j98N49K88O82Q8NM6l58l89O8p5k83L26O29O13
$$ -1034 -755 -30 849 765 529 -53 -939 -1137 -588 -300 382 470 475 521 163 -226 -158 -233 -516 -190 439 1052
2030A052K04k56p03k45n87K89L57N26M38K18l93j81l38l67l91K24M10K98N11L47
$$ 1052 1256 1000 297 52 -535 -246 111 637 1075 1293 900 719 381 14 -377 -153 257 555 1066 1413
2050A413m04n13q32k84J67M28P50J29l56P23j123j90k00j76J29K57j94M48L54
$$ 1413 1009 496 -336 -620 -453 -25 725 854 498 1221 98 -92 -292 -468 -339 -82 -276 172 526
2069E26l61m28J9m55q23R45O86P16Kq56l64l25m6l64K15L65L94O57q2m12k49m94
$$ 526 165 -263 -244 -699 -1522 -577 109 825 827 -29 -393 -718 -764 -1128 -913 -548 -154 503 421 9 -240 -734
2091g34j33J14L96N41M51n1n31k72k70N4R3K26q8J78P35k51p0m94m23j86K77L74
$$ -734 -867 -753 -357 184 635 584 53 -219 -489 -435 -342 -116 -204 -26 709 458 388 -106 -529 -715 -438 -64
2113f4M50J45J91l43l46n46j40K95L42j37L31R7j38k45m6j53l48J54K2P45K90
$$ -64 386 531 722 379 33 -513 -653 -358 -16 -153 178 275 137 -108 -154 -307 -655 -501 -479 266 556
2134E56Q4m20m71l67J20O5N14J71J85J89J06n32k71n07O4J63P33K41k21N28o13
$$ 556 640 220 -251 -618 -498 -433 81 252 437 626 732 200 -71 -578 -514 -351 382 623 402 930 317
2155C17l52k97Q3L09R8N91K81k56p9m77j66m83L38M74L06R8J85k60n29r6l43l7
$$ 317 -35 -332 -249 60 158 749 1030 774 695 218 52 -431 -93 381 687 785 970 710 181 85 -258 -295
2177b95K78K36L68q7J50k68n09l71K11p3K15N55K33N1l22m28m19n12K26L22K19
$$ -295 -17 219 587 500 650 382 -127 -498 -287 -360 -145 410 643 694 372 -56 -475 -987 -761 -439 -220
2198b20P86m7j07m11j63l03n6p1M62N23J0J17l24m48k10k22KJ69N55N19J91l56
$$ -220 566 519 412 1 -162 -465 -521 -592 -130 393 403 520 196 -252 -462 -684 -682 -513 42 561 752 396
2220C96k28o49k11J81l5J54M74M41j86j29m61j90j69J51J18K74J53K03k79j61
$$ 396 168 -481 -692 -511 -546 -392 82 523 337 208 -253 -443 -612 -461 -343 -69 84 287 8 -153
2240a53l54l57P9K95K75K88L52M8k12o69m90K25J54Q3K17N45J92k15k37l80k97
$$ -153 -507 -864 -785 -490 -215 73 425 473 261 -408 -898 -673 -519 -436 -219 326 518 303 66 -314 -611
2261f11L53l4K79M51J51j21l86k60k74J1L38N31L53P2k08j8j33l91l25m0L33K35
$$ -611 -258 -292 -13 438 589 468 82 -178 -452 -441 -103 428 781 853 645 627 494 103 -222 -262 71 306
2283C06K80R1R0m27l78l93M62J83N1J61k43M01j81j18n26P1j03J92M6M49J04k17
$$ 306 586 677 767 340 -38 -431 31 214 265 426 183 584 403 285 -241 -170 -273 -81 -35 414 518 301
2305C01M3o83j97R1K94J31K59L4m6j96q1n54P1J65O59L02q1j18m08K80o89j94
$$ 301 344 -339 -536 -445 -151 -20 239 273 227 31 -50 -604 -533 -368 291 593 512 394 -14 266 -423 -617
2327f17N96M5M5J49J52Kn6k12n64L33k09L29J24Q3L53m24k38k77k10O55l57M41
$$ -617 -21 24 69 218 370 372 316 104 -460 -127 -336 -7 117 200 553 129 -109 -386 -596 59 -298 143
2349A43R0%k01P2l77l71J34o5J21N85L12l95l39k60j45N8k6M20j37N70N1n86k6
$$ 143 233 233 32 104 -273 -644 -510 -575 -454 131 443 48 -291 -551 -696 -638 -664 -244 -381 189 240 -346 -372
2372c72j53p9m7K93M93kr7J8k25l7n11Q8K58L63K74M17m11m7j96l45L69o85O22
$$ -372 -525 -604 -651 -358 135 133 36 54 -171 -208 -719 -631 -373 -10 264 681 270 223 27 -318 51 -634 -12
2395a2M21J54M2M48q31j76q2j57O0K49N01M69m8o67l35l28P8m9O4P33O4J13k81
$$ -12 409 563 605 1053 222 46 -36 -193 -133 116 617 1086 1038 371 36 -292 -214 -263 -199 534 598 711 430
2418D30k25k54k3m20L00K35P04k81K1n19M8l21M48k16P2K41R5J33k70m1l08n3
$$ 430 205 -49 -72 -492 -192 43 747 466 487 -32 16 -305 143 -73 -1 240 335 468 198 157 -151 -204
2440b04k86L18O03j50K54j24M8p05j54o7L25J70o6M84K3p4l04l88R1j51M01L0
$$ -204 -490 -172 431 281 535 411 459 -246 -400 -467 -142 28 -38 446 469 395 91 -297 -206 -357 44 74
2462G4J21M55k75k34m75j28K27J66L91Q1k01j64l2j54o9j02q2j8L85K58r4k91
$$ 74 195 650 375 141 -334 -462 -235 -69 322 403 202 38 6 -148 -217 -319 -401 -419 -34 224 130 -161
2484a61j75k91l10K98M33K64o9j73L58l56j93j2J51l77J81M8N21pl76K41n87Q4
$$ -161 -336 -627 -937 -639 -206 58 -11 -184 174 -182 -375 -387 -236 -613 -432 -384 137 130 -246 -5 -592 -508
2506e08K5L09L93K06l59k6k22q4j76J33J14L98j22M49n4n1n29p4m56M82M72K01
$$ -508 -483 -174 219 425 66 40 -182 -266 -442 -309 -195 203 81 530 476 425 -104 -178 -634 -152 320 521
2528E21R2o4j93l47k08J11J60J27J44K32k6l18j51K82k59m6k20P24M29l04o8n32
$$ 521 613 549 356 9 -199 -88 72 199 343 575 549 231 80 362 103 57 -163 561 990 686 618 86
2550H6k33j07J48P5k27N15mJ64j02q9l0m59j90P1K37M67L40m47qm75mj81M56j85
$$ 86 -147 -254 -106 -31 -258 257 253 417 315 226 196 -263 -453 -382 -145 322 662 215 207 -268 -272 -453 3 -182
2574a82K81L40l60J06o4k69j48Q6j32J66N26m2L74p65k29m5j17N53j1M1O1L3r2
$$ -182 99 439 79 185 121 -148 -296 -210 -342 -176 350 308 682 -83 -312 -357 -474 79 68 109 170 203 111
2597A11j15N7k12k27K76J70j76J78N13l91p49n8J39M30J80q1j54K6NO9l11k47
$$ 111 -4 53 -159 -386 -110 60 -116 62 575 184 -565 -623 -484 -54 126 45 -109 -83 -78 -9 -320 -567
2619e67J7j28O44m6K21j67j23k53l6k0Q6J75N84n24J13l06l15K48j08J54K46K91
$$ -567 -550 -678 -34 -80 141 -26 -149 -402 -438 -458 -372 -197 387 -137 -24 -330 -645 -397 -505 -351 -105 186
2641A86r1J21J45k66l03k12L68K89J79j32m23J92J6J24q8j59K65j50J84J47J20
$$ 186 95 216 361 95 -208 -420 -52 237 416 284 -139 53 69 193 105 -54 211 61 245 392 512
2662E12k33j9r0j84p5Q5M82O2m60L84m25r1J18j33K50l24L16K39j90k59P4l13
$$ 512 279 260 170 -14 -89 -4 478 540 80 464 39 -52 66 -67 183 -141 175 414 224 -35 39 -274
2684b74k42K48M89K36m7j59j38n14K11j00J25K58J98k10L29l1k03k78N3q2O9J55
$$ -274 -516 -268 221 457 410 251 113 -401 -190 -290 -165 93 291 81 410 379 176 -102 -49 -131 -62 93
2706I3K27J31k03k99r6Q5j05N2J96J7M8K36l22p7j79J33j92J71K08o7N83l57m32
$$ 93 320 451 248 -51 -147 -62 -167 -115 81 98 146 382 60 -17 -196 -63 -255 -84 124 57 640 283 -149
2729a49j76k64L02J16k87O95j83J98j16l20l0r5j10j9K76P8M55n25K7k04n9j5
$$ -149 -325 -589 -287 -171 -458 237 54 252 136 -184 -214 -309 -419 -438 -162 -84 371 -154 -127 -331 -390 -405
2751d05K18q4J09K5R3o5j42j69k7J89o3K43j0M07L5o36j41oK21Q4L76j74O2L88
$$ -405 -187 -271 -162 -137 -44 -109 -251 -420 -447 -258 -321 -78 -88 319 354 -282 -423 -429 -208 -124 252 78 140 528
2775E28m62O0l69j74M88j29Q9M05M3l2l43l12J38m67P06m1J65o4J14j49k13l1
$$ 528 66 126 -243 -417 71 -58 31 436 479 447 104 -208 -70 -537 169 128 293 229 343 194 -19 -50
2797e0o8p2K43Q9M5j9L5r9j65k06K20J36J26j6o3q4j64Q8n3Q8k4J79J34k70J0
$$ -50 -118 -190 53 142 187 168 203 104 -61 -267 -47 89 215 199 136 52 -112 -24 -77 11 -13 166 300 30 40
2822D0J71j29m9j44LN81l99J57J38j56j0j13j80Q0J52j49J98m12O51m04R9j17
$$ 40 211 82 33 -111 -108 473 74 231 369 213 203 90 -90 -10 142 -7 191 -221 430 26 125 8
2844Hj04k0L6L41j27L0m63J82n2l1j91J67J69j65L27j03q8k15L34l31j43L02R0
$$ 8 -96 -116 -80 261 134 164 -299 -117 -169 -200 -391 -224 -55 -220 107 4 -84 -299 35 -296 -439 -137 -47
2867d7K04pk29l38Q1J37o5O3P6J49k4k37L19k71r2J93k67r4M85L21j03m19l1k4
$$ -47 157 150 -79 -417 -336 -199 -264 -201 -125 24 0 -237 82 -189 -281 -88 -355 -449 36 357 254 -165 -196 -220
2891b20J69J7j24J29J32j42j56L38m87K87OMK34J58Jl31j63j27k12M12k39N66
$$ -220 -51 -34 -158 -29 103 -39 -195 143 -344 -57 -51 -47 187 345 346 15 -148 -275 -487 -75 -314 252
2913B52j60N2J57k66j97M71k26L66l87K46K6M4J4m05K89o88L74j64J23j9J48L59
$$ 252 92 144 301 35 -162 309 83 449 62 308 334 378 392 -13 276 -412 -38 -202 -79 -98 50 409
2935D09K44p46J01k11M62k16l8K43o0k18J36j71m3J25o1N61m48K98k68m1j11L03
$$ 409 653 -93 8 -203 259 43 5 248 188 -30 106 -65 -108 17 -44 517 69 367 99 58 -53 250
2957B50l61q0J42K34P5M2j02j90L0J10k03K19k88M35k36m7j01J86p1m43K06J38
$$ 250 -111 -191 -49 185 260 302 200 10 40 150 -53 166 -122 313 77 30 -71 115 44 -399 -193 -55
2979e5K36k98L14j29l8j31oj42k2M28r6k53L32k4k48j24J48R7l47L03j8l1K36
$$ -55 181 -117 197 68 30 -101 -107 -249 -271 157 61 -192 140 116 -132 -256 -108 -11 -358 -55 -73 -104 132
3002A32l26q1O1k67M99j36L9L47m8l94j07J26J71l86N33j62J46j96J49P5m20J41
$$ 132 -194 -275 -214 -481 18 -118 -79 268 220 -174 -281 -155 16 -370 163 1 147 -49 100 175 -245 -104
3024a04L2J78p2O7J35n87K65j33J16j22n1L66L19j84j69j4k51K45j68R8J87q1
$$ -104 -72 106 34 101 236 -351 -86 -219 -103 -225 -276 90 409 225 56 42 -209 36 -132 -34 153 72
3046G2p6K35j69P8l59M17j07j06K00J67k56L18m87K7Q1k28M6K79L53j33p6k44
$$ 72 -4 231 62 140 -219 198 91 -15 185 352 96 414 -73 -46 35 -193 -147 132 485 352 276 32
3068C2J06j68J80J11P8k94J81o9K21k5p31J14K26J67O0M4K18k55q0k1l25J74K17
$$ 32 138 -30 150 261 339 45 226 157 378 353 -378 -264 -38 129 189 233 451 196 116 95 -230 -56 161
3091A61P8k10L10l1m08K02K3k37m6J37N9L17j98j83k65O5p7J86n7P2m8J72J71
$$ 161 239 29 339 308 -100 102 125 -112 -158 -21 38 355 157 -26 -291 -226 -303 -117 -174 -102 -150 22 193
3114A93m63j9J74J21m31K99R2J93k31K46l20J71l97L90j57j59J76j61K99j65n5
$$ 193 -270 -289 -115 6 -425 -126 -34 159 -72 174 -146 25 -372 18 -139 -298 -122 -283 16 -149 -204
3135b04k64J79L1J20J15M7K22l11J93j2m56L19j43k1K41m6j11K25k48k51K40r0
$$ -204 -468 -289 -258 -138 -23 24 246 -65 128 116 -340 -21 -164 -185 56 10 -101 124 -124 -375 -135 -225
3157b25L46j2R3j05L4j93j56J1l8L02k8J97k48J13l23K57n69M58j74J1L87J55
$$ -225 121 109 202 97 131 -62 -218 -207 -245 57 29 226 -22 91 -232 25 -544 -86 -260 -249 138 293
3179B93R0m51q8m3K57N9N0j56K98k37j80J04J86k94OJ06L33j3j41k44L14l15k3
$$ 293 383 -68 -156 -199 58 117 167 11 309 72 -108 -4 182 -112 -106 0 333 320 179 -65 249 -66 -89
3202h9J5p3K93K34m14J04J29j14J37j8P9l70j0J66J37m1M1j23j40L90k35j10L
$$ -89 -74 -147 146 380 -34 70 199 85 222 204 283 -87 -97 69 206 165 206 83 -57 333 98 -12 -9
3225iL33m83P2j77M16m8k56J01r2Q6k59J97j46J13j47R1j0M35k69r0J9oj23J28
$$ -9 324 -159 -87 -264 152 104 -152 -51 -143 -57 -316 -119 -265 -152 -299 -208 -218 217 -52 -142 -123 -129 -252 -124
3249a24k98O77k21j29J64L96p33K52J25l83J00K13M0p5J81k70M7o4L03n21J41
$$ -124 -422 255 34 -95 69 465 -268 -16 109 -274 -174 39 79 4 185 -85 -38 -102 201 -320 -179
3270a79L75l45K53k02J0K96n26K8K69j81K96J08j60j18M8j63K30j1j47k27N44
$$ -179 196 -149 104 -98 -88 208 -318 -290 -21 -202 94 202 42 -76 -28 -191 39 28 -119 -346 198
3291A98k4j30Q8m1P1j55K7j59J67j80N14l87q1N1j32m7J06K84j64N1K12k64k37
$$ 198 174 44 132 91 162 7 34 -125 42 -138 376 -11 -92 -41 -173 -220 -114 170 6 57 269 5 -232
3314b32K29O2R6J91j33R3J09m13M3L14l38o8Q1K90m0k8L6j05l79M61k88K0K47
$$ -232 -3 59 155 346 213 306 415 2 45 359 21 -47 34 324 284 256 292 187 -192 269 -19 1 248
3337B48l33L40O9k84k2J18k6j09R7R1l93N27l82j87J32L48k63J15j94J70k9q0
$$ 248 -85 255 324 40 18 136 110 1 98 189 -204 323 -59 -246 -114 234 -29 86 -108 62 33 -47
3359d7R8o1Jj17j04J1K06K1n98O02l2J09l09J48J47o3J19k00K21j41n4j73k5J05
$$ -47 51 -10 -9 -126 -230 -219 -13 8 -590 12 -20 89 -220 -72 75 12 131 -69 152 11 -43 -216 -241 -136
3383a36K37j70K28j28J52n98M00j10l5L35k60J82j65L15j90n1j3j5M9L6J19j97
$$ -136 101 -69 159 31 183 -415 -15 -125 -160 175 -85 97 -68 247 57 6 -7 -22 27 63 182 -15
3405a5o9j13P3J0J25R5m4j15J49j57J74n5j32J73k14k35L78j21J14l5o1P0k21
$$ -15 -84 -197 -124 -114 11 106 62 -53 96 -61 113 58 -74 99 -115 -350 28 -93 21 -14 -75 -5 -226
3428b26L8L58p2N3j49K05p6j68q5J53k21P5J51NJ43k13j47Q9K68l35J50J38j35
$$ -226 -188 170 98 151 2 207 131 -37 -122 31 -190 -115 36 41 184 -29 -176 -87 181 -154 -4 134 -1
3451ar9q0M70K3o68K93K09P8k77N99k70j86J69k88J0J97P5M2j57J11k5k14K26
$$ -1 -100 -180 290 313 -355 -62 147 225 -52 547 277 91 260 -28 -18 179 254 296 139 250 225 11 237
3474B37m07p7J79K74j70J69j26j15m6j30J49J43j34J90r4n1l7kL2l43L17J96k62
$$ 237 -170 -247 -68 206 36 205 79 -36 -82 -212 -63 80 -54 136 42 -9 -46 -48 -16 -359 -42 154 -108
3497a08J55j61M14l55J2n5l05L01K0J11j9r4k21N8K78l68J55j86K85J06J02k61
$$ -108 47 -114 300 -55 -43 -98 -403 -102 -82 29 10 -84 -305 -247 31 -337 -182 -368 -83 23 125 -136
3519a36J87k86k8K18L7J52J18k61L6j31N8j34j16l8J41O1J57r8o4J72o8r0J11
$$ -136 51 -235 -263 -45 -8 144 262 1 37 -94 -36 -170 -286 -324 -183 -122 35 -63 -127 45 -23 -113 -2
3542bj21K79k20m8L52j14l03j02M8O1n3M80l38N7J47k63j17K71j96J56N8L52p84
$$ -2 -123 156 -64 -112 240 126 -177 -279 -231 -170 -223 257 -81 -24 123 -140 -257 14 -182 -26 32 384 -400
3565d00M6P51m92K58J85j093J002q1J16J47k74M01m36k19L70k49K63p90O13M1
$$ -400 -354 397 -95 163 348 -745 257 176 292 439 165 566 130 -89 281 32 295 -495 118 159
3585A59L8R1j92j28M9n0K96l68K84j67K88l06J54l69L62k92K10K49k95M8n3j3
$$ 159 197 288 96 -32 17 -33 263 -105 179 12 300 -6 148 -221 141 -151 59 308 13 61 8 -5
3607eqJ17l32j2J91N25l05k78j40K09k33J57J92l67L37q5j60J00K24l75K7M33
$$ -5 -13 104 -228 -240 -49 476 171 -107 -247 -38 -271 -114 78 -289 48 -37 -197 -97 127 -248 -221 212
3629B12j93k48L27n07L17m8P3k01K44K24k53J35k60M43m79J08R2q7j9m7Q9r7p
$$ 212 19 -229 98 -409 -92 -140 -67 -268 -24 200 -53 82 -178 265 -214 -106 -14 -101 -120 -167 -78 -175 -182
3652a82j06j10M4m8J83J83N3l4K41j96k50J0K64K3k11K08j55K48j13j95J16j07
$$ -182 -288 -398 -354 -402 -219 -36 17 -17 224 28 -222 -212 52 75 -136 72 -83 165 52 -143 -27 -134
3674a34n1r6L70Qk52K98k35j50Q4K76J54m19J21K53k22p5J64L3n71P72L1j430
$$ -134 -185 -281 89 97 -155 143 -92 -242 -158 118 272 -147 -26 227 5 -70 94 127 -444 328 359 -1071
3696a071K135o95r07P89M1l33o6k20N58O3p48P61o6m24n10N99l78M86j51j84Q18
$$ -1071 1064 369 -538 251 292 -41 -107 -327 231 294 -454 307 241 -183 -693 -94 -472 14 -137 -321 497
3717D97q75Q09k58M82p47q5O32j39l47L35K00n78N48n89L4J12K10L72p98K82K77
$$ 497 -378 431 173 655 -92 -177 455 316 -31 304 504 -74 474 -115 -81 31 241 613 -185 97 374
3738C74p23N45j8n6j61N7M2p3J48p3j76J85L1r4J07k74J32L01m45J95JK46k20
$$ 374 -349 196 178 122 -39 18 60 -13 135 62 -114 71 102 8 115 -159 -27 274 -171 24 25 271 51
3761E1j20q6J87J85m41j42R9J62J93q7k41K73p3K71k11l09L01j2K08o0k45J19
$$ 51 -69 -155 32 217 -224 -366 -267 -105 88 1 -240 33 -40 231 20 -289 12 0 208 148 -97 22
3783B2j70M8J17K6m1J8J88m13J92J46k64j21k7N0K81J12k23J81n2m9L01m80L77
$$ 22 -148 -100 17 43 2 20 208 -205 -13 133 -131 -252 -279 -229 52 164 -59 122 70 21 322 -158 219
3806B19l46L81ml61L68j34m1j93P9Oo9rL71k86K62j05j72O4J2k65J3K84J31J00
$$ 219 -127 254 250 -111 257 123 82 -111 -32 -26 -95 -104 267 -19 243 138 -34 30 42 -223 -210 74 205 305
3830C05l45m06M33J03l69j04M79l8p7j56J13n7L13k16J91P7J09m60J36j0j58J36
$$ 305 -40 -446 -13 90 -279 -383 96 58 -19 -175 -62 -119 194 -22 169 246 355 -105 31 21 -137 -1
3852aj88K32k8J96j17K20j60q6N8j75K36k27j5J76pj47K00k4J16k2l18K53M6l
$$ -1 -189 43 15 211 94 314 154 68 126 -49 187 -40 -55 121 114 -33 167 143 259 237 -81 172 218 215
3876B15k19J25m12M59j20M4J35p6l1j38j32K84k6k97L1K48j92J43J3j30r0k75
$$ 215 -4 121 -291 168 48 92 227 151 120 -18 -150 134 108 -189 -158 90 -102 41 54 -76 -166 -441
3898d41O91k19k65L18OL5k25Kq1p5R4j14L56o6k07L42m40K72J1j19n8P3K41m76
$$ -441 250 31 -234 84 90 125 -100 -98 -179 -254 -160 -274 82 16 -191 151 -289 -17 -6 -125 -183 -110 131 -345
3922c45M12j27k30R3K62j09k30Q0L14O5R3k20pK4L32m23K15l74K24k6Q9K00m64
$$ -345 67 -60 -290 -197 65 -44 -274 -194 120 185 278 58 51 75 407 -16 199 -175 49 23 112 312 -152
3945a52J52J34k58M6MJ83k74J73J81l11J32k00K67j95L18j41J48n1j93j05J11
$$ -152 0 134 -124 -78 -74 109 -165 8 189 -122 10 -190 77 -118 200 59 207 156 -37 -142 -31
3966c1K23l78K68j33K40p0m85M40J15j62n0Qn7JJ98J25q3J26l00n3rL0Q4J79o6
$$ -31 192 -186 82 -51 189 119 -366 74 189 27 -23 -15 -72 -71 127 252 169 295 -5 -58 -67 -37 47 226 160
3991A60l68J33J30O1k2Mq8K63l92j50J40K63J61j92l2k14K00J9r9l75L18k4J23
$$ 160 -208 -75 55 116 94 98 10 273 -119 -269 -129 134 295 103 71 -143 57 76 -23 -398 -80 -104 19
4014A9j38k71K39j77K52O9J05l5j33o8J58P6j00M1p1l47L35j24K04l18M02o1q4
$$ 19 -119 -390 -151 -328 -76 -7 98 63 -70 -138 20 96 -4 37 -34 -381 -46 -170 34 -284 118 57 -27
4037b7k39J92J89m02L0j88M17O8N1J9k60p7Q9J18K20j29k17M49m61J06j33R5j49
$$ -27 -266 -74 115 -287 -257 -445 -28 40 91 110 -150 -227 -138 -20 200 71 -146 303 -158 -52 -185 -90 -239
4060b39j42J4K29K26P4n55M44j42j75k8M12k55R7j11J57k00J12K83k66m5J97L8
$$ -239 -381 -367 -138 88 162 -393 51 -91 -266 -294 118 -137 -40 -151 6 -194 -82 201 -65 -110 87 125
4082A25k60M10r1j30J8j13J92k39P6k13K31q2j51L62R2j22k06j8J05K55M3k69
$$ 125 -135 275 184 54 72 -41 151 -88 -12 -225 6 -76 -227 135 227 105 -101 -119 -14 241 284 15
4104A5nr4J58K73k76j80K97k74L94l4n12N11m19O02p99j01L23K00k7L0J30m34
$$ 15 10 -84 74 347 71 -109 188 -86 308 274 -238 273 -146 456 -343 -444 -121 79 52 82 212 -222
4126b22J29j99L63r5m5P7J6R2J2p0l4J13j81J15J26j93j96k17L49J84j33N8N1
$$ -222 -93 -292 71 -24 -69 8 24 116 128 58 24 137 -44 71 197 4 -192 -409 -60 124 -9 49 100
4149A00J08k41m1J98L8j77j07J61M0l0o1k17M26k97J3k61M01J29m40L21j31nq8
$$ 100 208 -33 -74 124 162 -15 -122 39 79 49 -12 -229 197 -100 -87 -348 53 182 -258 63 -68 -73 -161
4172a61L17l82L00P9k9J5l04J86k24K32j17K61l69K52j51m9K64k48J09l27R9N3
$$ -161 156 -226 74 153 124 139 -165 21 -203 29 -88 173 -196 56 -95 -144 120 -128 -19 -346 -247 -194
4194a94J7K9J13o8L6n4OK23k17K89l22n5Q8k06M76o4j29j47J76N6j91Q1J41k6
$$ -194 -177 -148 -35 -103 -67 -121 -115 108 -109 180 -142 -197 -109 -315 161 97 -32 -179 -3 53 -138 -57 84 58
4218E8L5J70j44J83k73n0M32l19m7l20M00R1j40P3nl05J36q1j25R5L25N3l62K66
$$ 58 93 263 119 302 29 -21 411 92 45 -275 125 216 76 149 144 -161 -25 -106 -231 -136 189 242 -120 146
4242A46m23R4L55k54P1j30K77l82K45j79J10J21l3j8J8j64l6j21L71qpK6k34J28
$$ 146 -277 -183 172 -82 -11 -141 136 -246 -1 -180 -70 51 18 0 18 -146 -182 -303 68 60 53 79 -155 -27
4266b7M8L22n19mJ20K21l1k05%k06J68L16l95J89j13K07k20J28K2R2L36l76N3
$$ -27 21 343 -176 -180 -60 161 130 -75 -75 -281 -113 203 -192 -3 -116 91 -129 -1 21 113 449 73 126
4289A26j18j65J73r7l40L3Q58j47k57K6k28M90l50j46J61K06l09o5J44J83k1l8
$$ 126 8 -157 16 -81 -421 -388 470 323 66 92 -136 354 4 -142 19 225 -84 -149 -5 178 157 119
4311A19k01m9j55K66j91N4J8NP1J90n8p6j10l5j91L80L3J20l96l24J19L26j47
$$ 119 -82 -131 -286 -20 -211 -157 -139 -134 -63 127 69 -7 -117 -152 -343 37 70 190 -206 -530 -411 -85 -232
4334b32J52k8j41L33m1k32j93L57m4K62p8k18J43J96j76P8J02n29J97j48M39k46
$$ -232 -80 -108 -249 84 43 -189 -382 -25 -69 193 115 -103 40 236 60 138 240 -289 -92 -240 199 -47
4356d7M48k59l47J53L62K3l74j22L61j48k66J40j27N63k32p0j58o4K17r2J05J1
$$ -47 401 142 -205 -52 310 333 -41 -163 198 50 -216 -76 -203 360 128 58 -100 -164 53 -39 66 77
4378G7k07N3j9R4j24L43r4j42j0n3M4N1k60M5J49j27J51J75j05k95L00K31l54
$$ 77 -130 -77 -96 -2 -126 217 123 -19 -29 -82 -38 13 -247 -202 -53 -180 -29 146 41 -254 46 277 -77
4401g7K41R1k93J24j91K50k75r1J92r9J93p5P0m6k17N59n30L27O7m8M4P9p6k69
$$ -77 164 255 -38 86 -105 145 -130 -221 -29 -128 65 -10 60 14 -203 356 -174 153 220 172 216 295 219 -50
4425e0mk28N9J75R7l70J97J6K29n70J92K24O9Q9j57lJ19k27R2j36K60M9p2p4j9
$$ -50 -54 -282 -223 -48 49 -321 -124 -108 121 -449 -257 -33 36 125 -32 -35 84 -143 -51 -187 73 122 50 -24 -43
4450d3q8M5J42j92j21K47K71m95M89j81L7kp5J25k50j85L20j54M4O0k5R0RJ06
$$ -43 -131 -86 56 -136 -257 -10 261 -234 255 74 111 109 34 159 -91 -276 44 -110 -66 -6 -31 59 68 174
4474A74j55K14k99L31j06M0k42N9J49j33J97l2m2j60K73l35K35k52l4j1L7lK26
$$ 174 19 233 -66 265 159 199 -43 16 165 32 229 197 155 -5 268 -67 168 -84 -118 -129 -92 -95 131
4497A31j73P3r9L91j68j81L4J38j07J30l04R5J09p2k41J99O9rP3j85K56k64J58
$$ 131 -42 31 -68 323 155 -26 8 146 39 169 -135 -40 69 -3 -244 -45 24 15 88 -97 159 -105 53
4520E3o9j86K65p9J4j2K62k93J73mr0n1j03N9J8K58J9l6k44J54l42J48J52J00
$$ 53 -16 -202 63 -16 -2 -14 248 -45 128 124 34 -17 -120 -61 -43 215 234 198 -46 108 -234 -86 66 166
4544A66j53p3j31L73l89K38k58M59k18O2P8J19o17L67P9k89k3J65j07j14k2J62
$$ 166 13 -60 -191 182 -207 31 -227 232 14 76 154 273 -344 23 102 -187 -210 -45 -152 -266 -288 -126
4566a26r0L06n8Q1j62N9j1R8j59KRj0J44j48J76l55J48N8lK68l82K96q5p7j44
$$ -126 -216 90 32 113 -49 10 -1 97 -62 -60 -51 -61 83 -65 111 -244 -96 -38 -41 227 -155 141 56 -21 -165
4591a65M00k50Q0n0l94M81q6k18K41k9j03J20r3K1J60J2K6m19L03j94k5J31RJ16
$$ -165 235 -15 65 15 -379 102 16 -202 39 10 -93 27 -66 -45 115 127 153 -266 37 -157 -182 -51 -42 74
4615G4k5j19J36J9q6j07J43j79L36l99M0J17j87J14R1J83j60j4p5M26l86L4L5
$$ 74 49 -70 66 85 -1 -108 35 -144 192 -207 -167 -50 -237 -123 -32 151 -9 -23 -98 328 -58 -24 11
4638A1n0l1M63m18j61L6K06k35j7M25k35J72P9k00J93l0Qk00K62k07M6j47j03
$$ 11 -39 -70 393 -25 -186 -150 56 -179 -196 229 -6 166 245 45 238 208 216 16 278 71 117 -30 -133
4661a33J28L3l3j97P4J88j29p0J09l5k02L64j48l4J5J82k03j20K07K70n18L02
$$ -133 -5 28 -5 -202 -128 60 -69 -139 -30 -65 -267 97 -51 -85 -70 112 -91 -211 -4 266 -252 50
4683E0k07Q7J37k53K48n1n8j30l3K38m2J70j20j57r9o2J08J05J68j50n5K38k04
$$ 50 -157 -70 67 -186 62 11 -47 -177 -210 28 -14 156 36 -121 -220 -282 -174 -69 99 -51 -106 132 -72
4706g2k93K02L4J13J02k55R2J23j55L5J12j90K79k14P8J00l28L26j94j59J10J29
$$ -72 -365 -163 -129 -16 86 -169 -77 46 -109 -74 38 -152 127 -87 -9 91 -237 89 -105 -264 -154 -25
4728b5J31P1R7j19l38M41Qo2p7n2k22K9k04R7N1J42j92L72j10J46l7p7m2k1P0
$$ -25 106 177 274 155 -183 258 266 204 127 75 -147 -118 -322 -225 -174 -32 -224 148 38 184 147 70 28 7 77
4753G7J32l61K34j51J36j35K68n3j90J43k92K29r8L66j44lk40J91j91K11r3P8
$$ 77 209 -152 82 -69 67 -68 200 147 -43 100 -192 37 -61 305 161 158 -82 109 -82 129 36 114
4775A14j46J00j46j19L04n3J37j21k0k29K27K1k08J35P5J53m75O6K25R1j5k57
$$ 114 -32 68 -78 -197 107 54 191 70 50 -179 48 69 -139 -4 71 224 -251 -185 40 131 116 -141
4797a41J83n0R1n5j05J69k97L72l00P4k71O09n06K89j30J29j73R7Q8j75j29Kj87
$$ -141 42 -8 83 28 -77 92 -205 167 -133 -59 -330 279 -227 62 -68 61 -112 -15 73 -102 -231 -229 -416
4820d16M53q2j4j40K60j60J03k9j81K74l38J71O3j38Q2P6j21Mk07K44k4l3j99
$$ -416 37 -45 -59 -199 61 -99 4 -25 -206 68 -270 -99 -36 -174 -92 -16 -137 -133 -340 -96 -120 -153 -352
4843c52L02K55j93k18J39q2J74J6K2k70K56j55L48m32J97J17j6J08l41P6L46k19
$$ -352 -50 205 12 -206 -67 -149 25 41 63 -207 49 -106 242 -190 7 124 108 216 -125 -49 297 78
4865G8jN7J0l57K74j33K45M0p0n1K9j79R1Q4j04kj04R5j85M04k40l5J18p1k6j6
$$ 78 77 134 144 -213 61 -72 173 213 143 92 121 -58 33 117 13 11 -93 2 -183 221 -19 -54 64 -7 -33 -49
4891d9L60k41k84K10J20K06k92Q7m2o8M0p0K86q2j98J24l57L31J8m94L20J82j46
$$ -49 311 70 -214 -4 116 322 30 117 75 7 47 -23 263 181 -17 107 -250 81 99 -395 -75 107 -39
4914c9m15M98L5j82L38m76K33j02P4J5J25L3J16m68M49m43k12l70O94p0m72P69
$$ -39 -454 44 79 -103 235 -241 -8 -110 -36 -21 104 137 253 -215 234 -209 -421 -791 -97 -167 -639 130
4936A30l89K01r3J59k40K0L78k23J24J03j39p6j2q6O3Q3J31m03Q8k3L9K33P8j02
$$ 130 -259 -58 -151 8 -232 -212 166 -57 67 170 31 -45 -57 -143 -80 3 134 -269 -181 -204 -165 68 146 44
4960D4j43l20M85Mn2M7j47J60N5N4l84J25k65M66R0k97K18l21J57kP9k15j06J76
$$ 44 -99 -419 66 70 18 65 -82 78 133 187 -197 -72 -337 129 219 -78 140 -181 -24 -26 53 -162 -268 -92
4984i2J90J6k01R1k47M18q7j83o7K97j16j41J28J90m02J77R1n0J80n45K54J18
$$ -92 98 114 -87 4 -243 175 88 -95 -162 135 19 -122 6 196 -206 -29 62 12 192 -353 -99 19
5006A9m2j48M39l68p0M37k89L31l78p4O5K33k23M5J47J00l53J44K56k91J29j8
$$ 19 -23 -171 268 -100 -170 267 -22 309 -69 -143 -78 155 -68 -23 124 224 -129 15 271 -20 109 91
5028I1j2K1l6j8l6o2J44j25J41P7m93K71P9J72J9j62N0j64n4j3l71M94K10k14
$$ 91 79 100 64 46 10 -52 92 -33 108 185 -308 -37 42 214 233 71 121 -43 -97 -110 -481 13 223 9
5052Il06K71j4R8k37L88P3j12j64r6k42K66j34J94k10J43J66j06rQ7J10k63J92
$$ 9 -297 -26 -40 58 -179 209 282 170 6 -90 -332 -66 -200 -6 -216 -73 93 -13 -22 65 175 -88 104
5075A04N4l49N19l54n1J90Lr3k9m00K33K55j60J75k52O5j29R9K11k44q0K15L16
$$ 104 158 -191 328 -26 -77 113 116 23 -6 -406 -173 82 -78 97 -155 -90 -219 -120 91 -153 -233 -18 298
5098B98l14r2K7j41K6K15n4l9J74j42N7j42Q7j62Q1J10l39L58J89p2k79K86l56
$$ 298 -16 -108 -81 -222 -196 19 -35 -74 100 -42 15 -127 -40 -202 -121 -11 -350 8 197 125 -154 132 -224
5121b24Q4J17N3P3j13J32k5p1n5J73m31L64J53j47k06N5J85r9N3J94k56M4M9L0
$$ -224 -140 -23 30 103 -10 122 97 26 -29 144 -287 77 230 83 -123 -68 117 18 71 265 9 53 102 132
5145A32J57m27J41O6j90P3J02o9N8J22k27J26J17j20Q7j28l4p1J35j58J03J70
$$ 132 289 -138 3 69 -121 -48 54 -15 43 165 -62 64 181 61 148 20 -14 -85 50 -108 -5 165
5167A65qm18K76j97K38K55o11K96K51l58M38l2l30r8K80M1k73Q9l9N9k05K21o3
$$ 165 157 -261 15 -182 56 311 -300 -4 247 -111 327 295 -35 -133 147 188 -85 4 -35 24 -181 40 -23
5190b3j43P06p35K82m4j46K84l00rJ96j26N0P6j2N1l68L47l00K70q4K6J40k08
$$ -23 -166 540 -195 87 43 -103 181 -119 -128 68 -58 -8 68 56 107 -261 86 -214 56 -28 -2 138 -70
5213g0K75l55J54J55k35J10l08J48k59J53L85j55R1l1k60K08k97K93J74j28j82
$$ -70 205 -150 4 159 -76 34 -274 -126 -385 -232 153 -2 89 58 -202 6 -291 2 176 48 -134
5234a34Q8LNK97j7m86L44rP3k57O0J03M4j78M34l47K0J18QRk33j31L15l76L54
$$ -134 -46 -43 -38 259 242 -244 100 91 164 -93 -33 70 114 -64 370 23 43 161 169 178 -55 -186 129 -247 107
5259A07K06L68j61k68l5r69Q20m57O02j02K3j39k6J06K40m04J70k9J09k33J08
$$ 107 313 681 520 252 217 -752 68 -389 213 111 134 -5 -31 75 315 -89 81 52 161 -72 36
5280C6J79j37k89M30k89J94k42K19j81K75j82N6Kpo8N8n6q3j61L65l04L77l62
$$ 36 215 78 -211 219 -70 124 -118 101 -80 195 13 69 71 64 -4 54 -2 -85 -246 119 -185 192 -170
5303a70J48j3L39j24l1j57j69J49J47k82L52j04Q7k8n5L8O8j05p6K65j98j8n7
$$ -170 -22 -35 304 180 149 -8 -177 -28 119 -163 189 85 172 144 89 127 195 90 14 279 81 63 6
5326FO9j90N1P7n1j81K00N2R8k22j0N3M1M7l50J02L11J24k64M7j28p8j12K82M2
$$ 6 75 -115 -64 13 -38 -219 -19 33 131 -91 -101 -48 -7 40 -310 -208 103 227 -37 10 -118 -196 -308 -26 16
5351A6k17o1K12J59j93J79m00J94Q8K5j11K90j24L5Q2R6k00Q9k67K08j01p4K38
$$ 16 -201 -262 -50 109 -84 95 -305 -111 -23 2 -109 181 57 92 174 270 70 159 -108 100 -1 -75 163
5374A63K21k52m07K77J13L7j66K07k06P2m9k5M08l04j74J40L9J37k55j26m1L49
$$ 163 384 132 -275 2 115 152 -14 193 -13 59 10 -15 393 89 -85 55 94 231 -24 -150 -191 158
5396A58n8j69O5J02J59k33N3j99O2q8L16k53k1K66m2j51K94j74L55n44N0R2J03
$$ 158 100 -69 -4 98 257 24 77 -122 -60 -148 168 -85 -106 160 118 -33 261 87 442 -102 -52 40 143
5419A43j36NJ24j92j09L85R0l83O4R7M8m68Q6K92J30n55M8N49r9r5j68O0l6q0
$$ 143 7 12 136 -56 -165 220 310 -73 -9 88 136 -332 -246 46 176 -379 -331 218 119 24 -144 -84 -120 -200
5443b00L42j24J0J11n03J98J65J39k47O3L04l46P8L00j62Km0l32K3L08m35K86
$$ -200 142 18 28 139 -364 -166 -1 138 -109 -46 258 -88 -10 290 128 130 90 -242 -219 89 -346 -60
5465f0L50l21K21k18J98k67L4K66k50j11L5Q1j37K63j25o2j47J42O3K93l09r3
$$ -60 290 -31 190 -28 170 -97 -63 203 -47 -158 -123 -42 -179 84 -41 -103 -250 -108 -45 248 -61 -154
5487a54K18N0j66O5l66L13J89l76K29l5N6K88p15N26j19m5J22M6k19J15j14J28
$$ -154 64 114 -52 13 -353 -40 149 -227 2 -33 23 311 -404 122 3 -42 80 126 -93 22 -92 36
5509C6j02j10J82j92J62R4k2Rj08K6J83k07pK65J52m71J59J10j46k2n0R0M5k94
$$ 36 -66 -176 6 -186 -24 70 48 57 -51 -25 158 -49 -56 209 361 -110 49 159 13 -9 -59 31 76 -218
5533b18J38j56L40k45K45j86l1J49j45L94n09J52J49J76j09kk17Q6j76R8j09J60
$$ -218 -80 -236 104 -141 104 -82 -113 36 -109 285 -224 -72 77 253 144 142 -75 11 -165 -67 -176 -16
5555a6J79L8l5k53K94k8k58L4J12k02J38j90J59j12K22j81K7l5J36J23j66l3j22
$$ -16 163 201 166 -87 207 179 -79 -45 67 -135 3 -187 -28 -140 82 -99 -72 -107 29 152 -14 -47 -169
5578a69o7M80k20j58Q0K07j57Q1j6M8k54J81k3N2q1Q9q9j32j74M71m8j35j21L17
$$ -169 -236 244 24 -134 -54 153 -4 77 61 109 -145 36 13 65 -16 73 -16 -148 -322 149 101 -34 -155 162
5602A62l95K22P8k37pK87nm18L50L65m09J23j35j7P2J86l45J22R4j77N94o97M21
$$ 162 -233 -11 67 -170 -177 110 105 -313 37 402 -7 116 -19 -36 36 222 -123 -1 93 -84 510 -187 234
5625B34l66M8j55O81m74m9R9M52k93m19J48OK66k25J34j7J31j71j06mK6j85M55
$$ 234 -132 -84 -239 442 -32 -81 18 470 177 -242 -94 -88 178 -47 87 70 201 30 -76 -80 -54 -239 216
5648B16n8j28j70M88p06L25J68J56l82j00K56J0K08j02k66J85j45K11k45Np7q5
$$ 216 158 30 -140 348 -358 -33 135 291 -91 -191 65 75 283 181 -85 100 -45 166 -79 -74 -151 -236
5670b36K92J44J01j84n7j04K03P3j27n5m2r4J37K26m09p6n5k4M95l03J88j19L2
$$ -236 56 200 301 117 60 -44 159 232 105 50 8 -86 51 277 -132 -208 -263 -287 208 -95 93 -26 6
5693FJ60j02m2R6l29L2N6J80j53L1q4r1J08j1q3O7J14J58J19m66K72j52J87r1
$$ 6 166 64 22 118 -211 -179 -123 57 -96 -65 -149 -240 -132 -143 -226 -159 -45 113 232 -234 38 -114 73 -18
5717a8k0M2j54J24J67j44L4q5J82l38K02J53j54J3L1l12L69m23L53j27L52k56
$$ -18 -38 4 -150 -26 141 -3 31 -54 128 -210 -8 145 -9 4 35 -277 92 -331 22 -105 247 -9
5739iJ02j87j01L29k60K63l46M31j01Pn6j49o2o7J1J94K91k96K0K0qL74l72K05
$$ -9 93 -94 -195 134 -126 137 -209 222 121 128 72 -77 -139 -206 -195 -1 290 -6 14 34 26 400 28 233
5763B33k41q9J58k25J90J34m64K76J35n9oOr5J36k58K3M62l51L6j95M64n17J72
$$ 233 -8 -97 61 -164 26 160 -304 -28 107 48 42 48 -47 89 -169 -146 316 -35 1 -194 270 -247 -75
5786g5nn2M25l72J16M55m65k11K84K39k20J95k09m8J21l4k11q1K32j42L60k90
$$ -75 -80 -132 293 -79 37 492 27 -184 100 339 119 314 105 57 178 144 -67 -148 84 -58 302 12
5808A2k00J75J44p6M1l8n2J27n1J2n2KJ20l09K01j09L6J29j35J3q2L6j45J72R5
$$ 12 -188 -13 131 55 96 58 6 133 82 94 42 44 164 -145 56 -53 -17 112 -23 -10 -92 -56 -201 -29 66
5833F6j78J83j73R6m11K34N10l34l13K43k38L02j26o8L30j74l9q9K36j12O3K5
$$ 66 -112 71 -102 -6 -417 -183 327 -7 -320 -77 -315 -13 -139 -207 123 -51 -90 -179 57 -55 8 33
5855C3j80L77J01l73j04L5K14L0l07K25Q9K5l59J16l5L3nj43J49J62P2k62J13
$$ 33 -147 230 331 -42 -146 -111 103 133 -174 51 140 165 -194 -78 -113 -80 -85 -228 -79 83 155 -107 6
5878FQ3n1n3J69j66k06l5K32K87k22j76J22J5M7P1j24R2K4l9j27K60P2k92j42
$$ 6 89 38 -15 154 -12 -218 -253 -21 266 44 -132 -10 5 52 123 -1 91 115 76 -51 209 281 -11 -153
5902a53K82m6j21J18K65l72j51J26lL6L80R2n42J95p5K40o23N95j32J06k60K6
$$ -153 129 83 -38 80 345 -27 -178 -52 -55 -19 361 453 -89 106 31 271 -352 243 111 217 -43 -17
5924a7k46Q8K87RJ2l95J48K75j97r2K75j56k18K27k48K39J63k43J00l32K22j22
$$ -17 -263 -175 112 121 133 -262 -114 161 -36 -128 147 -9 -227 0 -248 -9 154 -89 11 -321 -99 -221
5946b21n3L28k28J24m7K20j70j73j88N36M7j55n8m3L3o1N7J3J73l95J83L50l56
$$ -221 -274 54 -174 -50 -97 123 -47 -220 -408 128 175 20 -38 -81 -48 -109 -52 -39 134 -261 -78 272 -84
5969h4J84J64m41K82k50R7j79J32q7M03l31K36k02J50k35L92m1j77K13j29k09
$$ -84 100 264 -177 105 -145 -48 -227 -95 -182 221 -110 126 -76 74 -161 231 190 13 226 97 -112
5990a12p3K61k78K8K30j8n2j46n3J92M14l19k02j27J40K66O9m93p1K46nL79l70
$$ -112 -185 76 -202 -174 56 38 -14 -160 -213 -21 393 74 -128 -255 -115 151 220 -273 -344 -98 -103 276 -94
6013i4M7Q8j69j7J01J82l8j24K7J3M4r4LJ17k96K51L2l42L49R8J24l65K1P8k6
$$ -94 -47 41 -128 -145 -44 138 100 -24 3 16 60 -34 -31 86 -210 41 73 -269 80 178 302 -63 -42 36 10
6038A0M9k06J55m5L4M1j95J09M8K08k43o6M09k86n6M9J30j5J6q6j17j19p5K72
$$ 10 59 -147 8 -37 -3 38 -157 -48 0 208 -35 -101 308 22 -34 15 145 130 146 60 -57 -176 -251 21
6062B1L0k02L52k54K02k61r9K67k97J09RJ48m8j14J84Lj30J06J9O8J10k77J11
$$ 21 51 -151 201 -53 149 -112 -211 56 -241 -132 -123 25 -23 -137 47 50 -80 26 45 113 223 -54 57
6085E7J83l81K76l16M41J5k58k44K14P1r4l7K4j29L06j07k30n6k9M05m7j27m7
$$ 57 240 -141 135 -181 260 275 17 -227 -13 58 -36 -73 -49 -178 128 21 -209 -265 -294 111 64 -63 -110
6108a10N8j30L08m04K10k75K76m5P9p5r8J62J74k87K79j93q5L55j16j54m6R3J01
$$ -110 -52 -182 126 -278 -68 -343 -67 -112 -33 -108 -206 -44 130 -157 122 -71 -156 199 83 -71 -117 -24 77
6131G7J13j32R6j00oj64m0j6J73j14R2L3j32J72j44m8Q4qL13p6j11J11m38J26
$$ 77 190 58 154 54 48 -116 -156 -172 1 -113 -21 12 -120 52 -92 -140 -56 -64 249 173 62 173 -265 -139
6155a39J63k15J25J84M7j32O8j33k02M65j72NJ04N9l00j85N16m64J39J57k27J93
$$ -139 24 -191 -66 118 165 33 101 -32 -234 231 59 64 168 227 -73 -258 258 -206 -67 90 -137 56
6177E6M4m08L87l25L22j10jK1J67n4m16L23K50k82J51J5q4K7j34O0j05O6R4j87
$$ 56 100 -308 79 -246 76 -34 -35 -14 153 99 -317 6 256 -26 125 140 56 83 -51 9 -96 -30 64 -123
6201a23J48K1r6K17l70L21j41k79N13m44L43o8j12N8N0q0O9P0k19J26n2j08Q3
$$ -123 25 46 -50 167 -203 118 -23 -302 211 -233 110 42 -70 -12 38 -42 27 97 -122 4 -48 -156 -73
6224g3K67l97Q6K2R9o3N0J1j61L22k34J01k04J59Nj74J17L17m42J45k74K43j15
$$ -73 194 -203 -117 -95 4 -59 -9 2 -159 163 -71 30 -174 -15 -10 -184 -67 250 -192 -47 -321 -78 -193
6247a93J94L4l14L16p9J23q2k15L67j26m96L26j60J49N4N6j99L24j49q5l32O53
$$ -193 1 35 -279 37 -42 81 -1 -216 151 25 -471 -145 -305 -156 -102 -46 -245 79 -70 -155 -487 166
6269A66l01M7K02k01K08L4q0k80J71j13J06o2K30q3j99J31k88L05J1K25p6j56
$$ 166 -135 -88 114 -87 121 155 75 -205 -34 -147 -41 -103 127 44 -155 -24 -312 -7 4 229 153 -3
6291cJ97k01L34j85oK6j23Q7j25k18J60j8k14J83J64j91K74k08K35j75J6K2k95
$$ -3 194 -7 327 142 136 162 39 126 1 -217 -57 -75 -289 -106 58 -133 141 -67 168 -7 9 31 -264
6314b64J47j39K66j1l22N08l87M28l23J03j27J5J46ol60L70n9k9J87l3k08M5N3
$$ -264 -117 -256 10 -1 -323 185 -202 226 -97 6 -121 -106 40 34 -326 44 -15 -44 143 110 -98 -53 0
6337@n2R5l72L79OJ97k25L8q7k27K42K05j91P3k1j01J51M8j72l7k33K2o6K34J32
$$ 0 -52 43 -329 50 56 253 28 66 -21 -248 -6 199 8 81 60 -41 110 158 -14 -51 -284 -262 -328 -94 38
6362C8k49K62J43K9j02n23M96j11J34n75M87L90l99k08J79j96N2L14l95R9j37
$$ 38 -211 51 194 223 121 -402 94 -17 117 -458 29 419 20 -188 -9 -205 -153 161 -234 -135 -272
6383b72M52m35L73q4Q4L3k59J89J42l71J21m7K14k04r2j4K25P3k2j72P5N2j6j65
$$ -272 180 -255 118 34 118 151 -108 81 223 -148 -27 -74 140 -64 -156 -170 55 128 106 -66 9 61 45 -120
6407a20K20J66m15L38j68Oj52J62J6N3j75p6P3O3j73j1L04j44K25k35L4j30M3
$$ -120 100 266 -149 189 21 27 -125 37 53 106 -69 -145 -72 -9 -182 -193 111 -33 192 -43 -9 -139 -96
6430i6J11O0m2k8J83q6k06j86K87o2J72n6j98J86K2l6J79J45q75Q79O3n45K82
$$ -96 15 75 33 5 188 102 -104 -290 -3 -65 107 51 -147 39 61 25 204 349 -526 353 416 -129 153
6453A53j80j39j55L36O8j41P6p8N4j84M5L35j26j05ML5k45J85l8L71m60L49p1
$$ 153 -27 -166 -321 15 83 -58 18 -60 -6 -190 -145 190 64 -41 -37 -2 -247 -62 -100 271 -189 160 89
6476H9m7K6J4p8r4J37l1J33o39N72R9j80K84k80Q9j1k16L8K41j51O6Nl02M20j25
$$ 89 42 68 82 4 -90 47 16 149 -490 82 181 1 285 5 94 83 -133 -95 146 -5 61 66 -236 184 59
6501E9J81l12j2J41j28rK70j50l2l6k31K13k20L44q0O1K21k73J94l31K45n34K76
$$ 59 240 -72 -84 57 -71 -80 190 40 8 -28 -259 -46 -266 78 -2 59 280 7 201 -130 115 -419 -143
6524a43O7p1J35j26mJ47J8J0j92J72j0k49K77kJ48r7j2o6K2j01j94P58o59J94
$$ -143 -76 -147 -12 -138 -142 5 23 33 -159 13 3 -246 31 29 177 80 68 2 24 -77 -271 487 -172 22
6548B2L65m69J57j98J96J59j38j48o5K26j82K02Q4m28L32k0j55n6J2O5k0o4L37
$$ 22 387 -82 75 -123 73 232 94 -54 -119 107 -75 127 211 -217 115 95 -60 -116 -104 -39 -59 -123 214
6571B14r2o4p7K60j09l64M06k37m1R7nJ50J00m7K0k99K02J4k25K98k10J07j97
$$ 214 122 58 -19 241 132 -232 174 -63 -104 -7 -12 138 238 191 211 -88 114 128 -97 201 -9 98 -99
6594i9n5M38k54J03k42K45Nj40K11l56l6L30J65l00j91L54j51L02m93Q1j81M54
$$ -99 -154 284 30 133 -109 136 141 1 212 -144 -180 150 315 15 -176 178 27 329 -164 -83 -264 190
6616A90k52l6P0k63M39j26l3k47O65k62k39l6L60l44R7Q7lJ18k13k29L2L82j51
$$ 190 -62 -98 -28 -291 148 22 -11 -258 407 145 -94 -130 230 -114 -17 70 67 185 -28 -257 -225 157 6
6639FK39j09j41J95j28l05L43n9r5J6J92l1k06K6l5L1J66j94L93k03l03J32K67
$$ 6 245 136 -5 190 62 -243 100 41 -54 -38 154 123 -83 -57 -92 -61 105 -89 304 101 -202 -70 197
6662A97m0j0j05l2k3l30M68j33j69J64j63R1k90L15M03l43M3o0JJ11p6O3J05j16
$$ 197 157 147 42 10 -13 -343 125 -8 -177 -13 -176 -85 -375 -60 343 0 43 -17 -16 95 19 82 187 71
6686G1k42K02K0Q2k36J9L3L47k51j3j8R1j06M4J10n4O5j89J04k13L38j57j44l5
$$ 71 -171 31 51 133 -103 -84 -51 296 45 32 14 105 -1 43 153 99 164 -25 79 -134 204 47 -97 -132
6710a32O9L14J90m03K4j9J84k07r0R6J8K95j90k38J23MJ14p9J06k59PJ18P3p8
$$ -132 -63 251 441 38 62 43 227 20 -70 26 44 339 149 -89 34 38 152 73 179 -80 -73 45 118 40
6734D0k57K99j78P2j75J48J48k64L31l62K98j2l42O9L27j80j8P2k56M72l16K45
$$ 40 -217 82 -96 -24 -199 -51 97 -167 164 -198 100 88 -254 -185 142 -38 -56 16 -240 232 -84 161
6756A61q9l69J88r7K45l07K48k13J88J30j07M26j99l21P1j0K71l74L44j60j0J3
$$ 161 72 -297 -109 -206 39 -268 -20 -233 -45 85 -22 404 205 -116 -45 -55 216 -158 186 26 16 29
6778B9J39j60p5pK63j78l3L2n1J88n2q4j8j81Q8J65p9J12k32L6K02j85N8K07p1
$$ 29 168 8 -67 -74 189 11 -22 10 -41 147 95 11 -7 -188 -100 65 -14 98 -134 -98 104 -81 -23 184 113
6803A13J1lj0J41l58j00L08j51NK05j02MR4j48Q8L6M8k11q1N53l95M5j81Q5rk4
$$ 113 124 121 111 252 -106 -206 102 -49 -44 161 59 63 157 9 97 133 181 -30 -111 442 47 92 -89 -4 -13 -37
6829c7K47j24k93K64J17K2o9j57L7j98k9K09n3j6q9K0R0p1K42j1k9k53J13K02
$$ -37 210 86 -207 57 174 196 127 -30 7 -191 -220 -11 -64 -80 -169 -149 -59 -130 112 101 72 -181 -68 134
6853A34N1k70J27mL1k39J65o6K23j25J14j63P5j84K46k07K06M9k37L41j16l85
$$ 134 185 -85 42 38 69 -170 -5 -71 152 27 141 -22 53 -131 115 -92 114 163 -74 267 151 -234
6875b34K63Qk0P1j68q8K35j82O9K14l7p3K0j39J12j66J05J71k25O5k66L36j37
$$ -234 29 37 17 88 -80 -168 67 -115 -46 168 131 58 78 -61 51 -115 -10 161 -64 1 -265 71 -66
6898f6jp7J49n8L2Q8Q2j21p3J00j92K28R2m03R2j0K92%q3o4Ko1J0J83m11J72n5
$$ -66 -67 -144 5 -53 -21 67 149 28 -45 55 -137 91 183 -220 -128 -138 154 154 71 7 9 -52 -42 141 -270 -98 -153
6925a53J53lJ01o7K56j58l7k74OK65Q9j28Kk16N2P0M7k9K92r4l09k00N65k76Q9
$$ -153 0 -3 98 31 287 129 92 -182 -176 89 178 50 52 -164 -112 -42 5 -24 268 174 -135 -335 230 -46 43
6950D3J35k95K01J01j07J44K4j50k31K42j32m2K09k47L86m01J38J74j60p5J07
$$ 43 178 -117 84 185 78 222 246 96 -135 107 -25 -67 142 -105 281 -120 18 192 32 -43 64
6971F4K83k51k15P1L06k13j11J18K5j30j69O16n20J35j18K08M8k07O2r4J2r8L49
$$ 64 347 96 -119 -48 258 45 -66 52 77 -53 -222 394 -126 9 -109 99 147 -60 2 -92 -80 -178 171
6994A71k93L02k39J42oO5l42N6r9K88l42J22J5L84m55J35nO9K75l14L67k28l65
$$ 171 -122 180 -59 83 77 142 -200 -144 -243 45 -297 -175 -160 224 -231 -96 -101 -32 243 -71 296 68 -297
7017b97J98k54J83L6J41n2J38j88J76J01o5k29O1k00J17K66K11l65Q3j75L25l68
$$ -297 -99 -353 -170 -134 7 -45 93 -95 81 182 117 -112 -51 -251 -134 132 343 -22 61 -114 211 -157
7039a57j7L81l58K11k8O5k64K51j16n5R4K16l95J91K87k66MJ63k08j14K7K55l84
$$ -157 -174 207 -151 60 32 97 -167 84 -32 -87 7 223 -172 19 306 40 44 207 -1 -115 -88 167 -217
7062b17J59N0R7q5j96K81p6j47L68j39k59RJ53J00o9J40j09N0j83K00j10J91%
$$ -217 -58 -8 89 4 -192 89 13 -134 234 95 -164 -155 -2 98 29 169 60 110 -73 127 17 208 208
7085B08j51l22j83N10jk89R3Q9l25K35J1J63r8K24o4j68N0P8l45N7K56O1l3j04
$$ 208 57 -265 -448 62 61 -228 -135 -46 -371 -136 -125 38 -60 164 100 -68 -18 60 -285 -228 28 89 56 -48
7109d8l1p2M34k05J30j40r4o6J65j40J42R8L6l61K50k5j29P9k96M09k38J86j4
$$ -48 -79 -151 283 78 208 68 -26 -92 73 -67 75 173 209 -152 98 73 -56 23 -273 136 -102 84 70
7132G0k35J70l0j27K04j93q4K92j10k67L98j29k95N75j21j34J56Q8mm79N02l64
$$ 70 -165 5 -25 -152 52 -141 -225 67 -43 -310 88 -41 -336 239 118 -16 140 228 224 -255 247 -117
7154a17l7L12l00J49L67l10J14O2j39j38n9k1J20j47K94j03J59k85m4L27j10j14
$$ -117 -154 158 -142 7 374 64 178 240 101 -37 -96 -117 3 -144 150 47 206 -79 -123 204 94 -20
7176b0m5L77j74k6k74L8K87J40k96Q9N9j5k89K26k10J80k30O2L5L13j50l6j35
$$ -20 -65 312 138 112 -162 -124 163 303 7 96 155 140 -149 77 -133 47 -183 -121 -86 227 77 41 -94
7199i4K32p9k65K85J34j71Jj70K22n3J2J25Q2L8m10K89j55l4K28k47J27k18P8
$$ -94 138 59 -206 79 213 42 43 -127 95 42 54 179 261 299 -111 178 23 -11 217 -30 97 -121 -43
7222d3O3o9J70m10K93K23k57n9Q4o7J2K70l12R6m4L7r4k3J70p6j5N55n61P3Lk17
$$ -43 20 -49 121 -289 4 227 -30 -89 -5 -72 -60 210 -102 -6 -50 -13 -107 -130 40 -36 -51 504 -57 16 19 -198
7248a98J08M7K3l96K56K69n0j19m0j47K68j55K28Rk69J65k9J20k6n8J10M2p4o4
$$ -198 -90 -43 -20 -416 -160 109 59 -60 -100 -247 21 -134 94 103 -166 -1 -30 90 64 6 116 158 84 20
7272B0O4j00j2k00L17k17J09K14o57N30rJ12l67J77j75j48K80J93k86q3K79k19
$$ 20 84 -16 -28 -228 89 -128 -19 195 -462 68 59 171 -196 -19 -194 -342 -62 131 -155 -238 41 -178
7294a78K3K36l64K65J53p2k74K26q9L10j60k10L27k70P9r1J1K60j49Q0j7k6n1
$$ -178 -155 81 -283 -18 135 63 -211 15 -74 236 76 -134 193 -77 2 -89 -78 182 33 113 96 70 19
7317A9K33k25J43J94m13L99l00j27j4J40p8N9k3O6k17K23J4n4O9p9j83J65k5j17
$$ 19 252 27 170 364 -49 350 50 -77 -91 49 -29 30 7 73 -144 79 93 39 108 29 -154 11 -14 -131
7341a31L60k19j68K32M3K62k70j19J47O9k00PJ23l10J24J14k06J82l3j4l1k8L36
$$ -131 229 10 -158 74 117 379 109 -10 137 206 6 13 136 -174 -50 64 -142 40 7 -7 -38 -66 270
7364B70k26k29J33L41l48J76j34K08l08O8J23oj98J03J87J48j96n1j0K05l42j08
$$ 270 44 -185 -52 289 -59 117 -17 191 -117 -49 74 68 -130 -27 160 308 112 61 51 256 -86 -194
7386a94R7l7K05j00p8K56j48k1l28K52O0n6k33N9M91l60K38j91K72l31J59l6j34
$$ -194 -97 -134 71 -29 -107 149 1 -20 -348 -96 -36 -92 -325 -266 225 -135 103 -88 184 -147 12 -24 -158
7409a58J33J11k59J1L7k3O8k8k8L5mL2Q8O6K6l07r0N97k13K42l45q0K47n68N87
$$ -158 -25 86 -173 -162 -125 -148 -80 -108 -136 -101 -105 -73 15 81 107 -200 -290 307 94 336 -9 -89 158 -410 177
7434A77l26L20k56J68q5j05K07k56J09K52k82J03l8J79Q1m03o5J85Mk42J82K77
$$ 177 -149 171 -85 83 -2 -107 100 -156 -47 205 -77 26 -12 167 248 -155 -220 -35 -31 -273 -91 186
7456A86j89k57l9K53j53M20n18N04l7N7J60l24J20l27J48J61l00M2J87l75M07
$$ 186 -3 -260 -299 -46 -199 221 -297 207 170 227 387 63 183 -144 4 165 -135 -93 94 -281 126
7477A26O8j98r5L96j78l1j44K52j35n8J47j69P5J07J69q8k40J84k03o8O24n55
$$ 126 194 -4 -99 297 119 88 -56 196 61 3 150 -19 56 163 332 244 4 188 -15 -83 541 -14
7499a4j3J61J11n09K72nJ2lN1m5Lk01j28K37J92o9j03O2n0Q2n8l3J10o3J15M1
$$ -14 -27 134 245 -264 8 3 15 12 63 18 21 -180 -308 -71 121 52 -51 11 -39 43 -15 -48 62 -1 114 155
7525A55l00J52K15k54J6n8K54r9k8q7K6M7J56j59j51L95m90K72J17j21M5k64K06
$$ 155 -145 7 222 -32 -16 -74 180 81 53 -34 -8 39 195 36 -115 280 -210 62 179 58 103 -161 45
7548D5J66m73J81L5K58l57K81k57J51j17N2O1j47J3K50j91J48l10K61k22K43k77
$$ 45 211 -262 -81 -46 212 -145 136 -121 30 -87 -35 26 -121 -108 142 -49 99 -211 50 -172 71 -206
7570b06j3O2K47J76k97j2j0J96j65K0q4j90L51j79L68k27j58J75j12R7J1M9j79
$$ -206 -219 -157 90 266 -31 -43 -53 143 -22 -2 -86 -276 75 -104 264 37 -121 54 -58 39 50 99 -80
7593h0K3K29k63J16Rj8Q0Mm5K56j64k82l5M19q5k53Jj48K3J36R0j3j44J59J93
$$ -80 -57 172 -91 25 34 16 96 100 55 311 147 -135 -170 249 164 -89 -88 -236 -213 -77 13 0 -144 15 208
7618B08K3m31K14k6J0j67k16M28j91p5K47j6j3Q9K63l90j02l1K70r3M7n2K3P2
$$ 208 231 -200 14 -12 -2 -169 -385 43 -148 -223 24 8 -5 84 347 -43 -145 -176 94 1 48 -4 19 91
7642I1j36J21r1p7J47%j44k1MJ31PQ9k94J61n4J78k91K95o2j23l4M3J17m9J77
$$ 91 -45 76 -15 -92 55 55 -89 -110 -106 25 32 121 -173 -12 -66 112 -179 116 54 -69 -103 -60 57 8 185
7667A85j24j66Q5N2j18K02j70J46j84L36l2m25J04Q2q7J42m66M58J78j24j45J52
$$ 185 61 -105 -20 32 -86 116 -54 92 -92 244 212 -213 -109 -27 -114 28 -438 20 198 74 -71 81
7689H1j11Q3j72N3O6J22j17qj06J4K30l10M35M5l97J35On8J52r0j7K26l41j9P2
$$ 81 -30 53 -119 -66 0 122 5 -3 -109 -95 135 -175 260 305 -92 43 49 -9 143 53 36 262 -79 -98 -26
7714b6R6M2j91J36j33Q3J16j53k2K9n2J18j81P7j7O4J41K39k69q0J29r5rkJ47
$$ -26 70 112 -79 57 -76 7 123 -30 -52 -23 -75 43 -138 -61 -78 -14 127 366 97 17 146 51 42 40 187
7739A87j22q6l38L43QL9J29l22L46j58M0lk36K81j09j3R2j07K23k69O7j39J36
$$ 187 65 -21 -359 -16 -8 31 160 -162 184 26 66 63 -173 108 -1 -14 78 -29 194 -75 -8 -147 -11
7762a1K05l01J91K8j59j88K23j53K85k43R4J99k79J26j51L4K12q5m3J34k67o8
$$ -11 194 -107 84 112 -47 -235 -12 -165 120 -123 -29 170 -109 17 -134 -100 112 27 -16 118 -149 -217
7784b17R0K77l57L55n30J13L29j80j04K91J45j45j88J66J2r4r4J87%o9J22j47
$$ -217 -127 150 -207 148 -382 -269 60 -120 -224 67 212 67 -121 45 57 -37 -131 56 56 -13 109 -38
7806c8j3k0j62K69p0J3J97l1K4m12K47q3oO5j70L04P3M6q0rj83p3J22j49K16q7
$$ -38 -51 -71 -233 36 -34 -21 176 145 169 -243 4 -79 -85 -20 -190 114 187 233 153 144 -39 -112 10 -139 77 -10
7832a0j00K03J27o5l9k90L09l34M01k10K5j92K16J01j03J32k92J33J8J33j72o2
$$ -10 -110 93 220 155 116 -174 135 -199 202 -8 17 -175 41 142 39 171 -121 12 30 163 -9 -71
7854g1Q6J93mk59Oj08q5K04P7J84j17%k58L34P5M0l32J35k21M8P9l6J03j72ML4
$$ -71 15 208 204 -55 -49 -157 -242 -38 39 223 106 106 -152 182 257 297 -35 100 -121 -73 6 -30 73 -99 -95 -61
7880f1P6l1K49l28l09L90j11K6J89j85N1k64J88k2P2j59j03K90k7J06j02M8k01
$$ -61 15 -16 233 -95 -404 -14 -125 -99 90 -95 -44 -308 -120 -142 -70 -229 -332 -42 -69 37 -65 -17 -218
7903b18J37j6R9J21j45k6M8k60l2L98j87j84J58J18r3k5J03k71L18L0l24K84q3
$$ -218 -81 -97 2 123 -22 -48 0 -260 -292 106 -81 -265 -107 11 -82 -107 -4 -275 43 73 -251 33 -50
7926e0O7J0Q3l1Q9m59M41j41n3L2k6R3%r2j24L31o1j7L0q2j71K65j91l0R5L30
$$ -50 17 27 110 79 168 -291 150 9 -44 -12 -38 55 55 -37 -161 170 109 92 122 40 -131 134 -57 -87 8 338
7952C38k65j61J20L3j64l5L18J54l13j8J25k67P9J71j36p0K83j37K34r3rl51J69
$$ 338 73 -88 32 65 -99 -134 184 338 25 7 132 -135 -56 115 -21 -91 192 55 289 196 187 -164 5
7975EP7J5k39K30L6N6j99J78j62j64J87J56o2j91R2J29lJ11j25P2j36j95K59k29
$$ 5 82 97 -142 88 124 180 -19 159 -3 -167 20 176 114 -77 15 144 141 252 127 199 63 -132 127 -102
7999a02j3m3O8J44K1R9l10J67J47k94J65j42J25J36j04k42J14K69l40K28j21K35
$$ -102 -115 -158 -90 54 75 174 -136 31 178 -116 49 -93 32 168 64 -178 -64 205 -135 93 -28 207
8021B07j34k5j98K91r0QJ2k3r2p1J48K5j33K71j87j22O6k32K19Q1l2K34k62j94
$$ 207 73 48 -150 141 51 59 71 48 -44 -115 33 58 -75 196 9 -113 -47 -279 -60 21 -11 223 -39 -233
8045b33M14j45j37K32n4L2r4j08k5J6j64J76r0J34J13J3m9n4k42K44k12L18j8
$$ -233 181 36 -101 131 77 109 15 -93 -118 -102 -266 -90 -180 -46 67 80 31 -23 -265 -21 -233 85 67
8068F7K58m87N10n23K10L8j42O0l3l5J33K91n88L33l31J30j29L19q0k12L58j20
$$ 67 325 -162 348 -175 35 73 -69 -9 -42 -77 56 347 -241 92 -239 -109 -238 81 1 -211 147 27
8090B7J1l90K94J44J9j26M8n29N28K34l50K30j77K6J65j95l8K80q6K33n11M02
$$ 27 38 -352 -58 86 105 -21 27 -502 26 260 -90 140 -37 -11 154 -41 -79 201 115 348 -163 239
8112B39l28J90j78N4R4r7K14k3j49j51K95O6k06J27l81K39j27J41N3R3j90k26
$$ 239 -89 101 -77 -23 71 -26 188 165 16 -135 160 226 20 147 -234 5 -122 19 72 165 -25 -251
8134b51J94NJ64K4m4j95K39q8j15K57k65JkK50k6j90K49k69O1J95k82j69K09j30
$$ -251 -57 -52 112 136 92 -103 136 48 -67 190 -75 -74 -76 174 148 -42 207 -62 -1 194 -88 -257 -48 -178
8158a78L79l01J13J2L29l7l30K50k37J05j99P8j58K22N1q3J32j02q7K15j38J55
$$ -178 201 -100 13 25 354 317 -13 237 0 105 -94 -16 -174 48 99 16 148 46 -41 174 36 191
8180A91q4K7j8l8k01j4R3j54J61K50m00
$$ 191 107 134 116 78 -123 -137 -44 -198 -37 213 -187
8191a87
$$ Imaginary data points
##PAGE= N=2
##DATA TABLE= (X++(I..I)), XYDATA
0@%%%%%%Qj6J6j7K5l5M3n6O8q3J02j19J39j63J92k24K59k98L44l96M52n15N83
$$ 0 0 0 0 0 0 0 8 -8 8 -9 16 -19 24 -32 36 -47 55 -64 75 -88 104 -120 139 -159 185 -211 241 -274 309
29C09o60P44q36R38j050J176j311J458j621J798j995K209k445K709k999L322l684
$$ 309 -351 393 -443 495 -555 621 -690 768 -853 945 -1050 1159 -1286 1423 -1576 1746 -1938
46a938M090m553N085n695O410p267Q311r615J1299j3572J6831k1933L1146n3138
$$ -1938 2152 -2401 2684 -3011 3399 -3868 4443 -5172 6127 -7445 9386 -12547 18599 -34539
60c4539K03474K83478j01090q1086j44591r1218r7585m8910m4096P196L6848R6049
$$ -34539 168935 452413 351323 270237 125646 34428 -63157 -112067 -156163 -148967 -112119 -16070
72a6070J06197J02880M8109L451m3032m8480n1304n4725q5457r9707q5535k4182
$$ -16070 90127 193007 241116 244567 201535 153055 101751 47026 -38431 -138138 -223673 -247855
84b47855M3055R6270J03323Q0594L9705Q923j6883l9211o6124q5636r0735o8752
$$ -247855 -204800 -108530 -5207 75387 115092 124015 107132 67921 1797 -83839 -174574 -243326
96b43326k0318M0383P9434P7702M4828J7853J7551L1773L3678J1597k4263n4356
$$ -243326 -263644 -223261 -143827 -66125 -21297 -3444 14107 45880 79558 91155 66892 12536
108A2536o2787m8164k2018L448J8392K6636L5961N3007P0586P0982L7203j7459
$$ 12536 -50251 -98415 -120433 -116985 -98593 -71957 -35996 17011 87597 158579 195782 178323
120A78323n9045o4216l9472q995O645K184q545q618P637K6815L3471K5030R172
$$ 178323 119278 55062 15590 6595 13240 15424 6879 -1739 5898 32713 66184 91214 100386
133A00386n832j3200q588l777j5219m1744o1095n0048j1114L2008N1509M0503
$$ 100386 94554 81354 72766 68989 53770 12026 -49069 -99117 -110231 -78223 -26714 13789
145A3789J5531k715p903p125p670j5209k7277l4130l1100j1221J1464J9179Q874
$$ 13789 29320 26605 18702 11577 3907 -11302 -38579 -72709 -103809 -115030 -103566 -84387 -75513
158g5513o969k893J8190M4271N1230L1310k836l3207m2725l2460j6405p313J429
$$ -75513 -82482 -85375 -67185 -22914 28316 59626 56790 23583 -19142 -51602 -68007 -75320 -73891
171g3891O499J8232K9674M1094M0666K2571l790k0258j5214J665J2489K005k0302
$$ -73891 -67392 -49160 -19486 21608 62274 84845 81055 60797 45583 47248 59737 61742 41440
184D1440l4897k5684l976J9944L0948L1980K4199J2673L431j891p777k4639m5280
$$ 41440 6543 -19141 -23117 -3173 27775 59755 83954 96627 100058 98167 90390 65751 20471
197B0471n1107l3085O29K8818L6480K2058J568o735l730N724O087l714j7415k5898
$$ 20471 -30636 -63721 -63092 -34274 2206 24264 25832 19097 15367 21091 27178 23464 6049 -19849
211a9849k7285j9555r821m868m400k200J0653L1105M5775L9950J1595k2380l9504
$$ -19849 -47134 -66689 -76510 -81378 -85778 -87978 -77325 -46220 -445 39505 51100 28720 -10784
224a0784l3810j6354l191L399N778Q230J0668J6745K2475K0580Q709m349q098
$$ -10784 -44594 -60948 -64139 -60740 -54962 -46732 -36064 -19319 3156 23736 32445 28096 19998
237A9998Q33J2286J1245m155k3306k9830j6920P156K6206L1364K4703J3369L064
$$ 19998 20831 33117 44362 40207 16901 -12929 -29849 -22693 3513 34877 59580 72949 76013
250G6013l813p789j2661k1055k5790k1488p187J1817K2368J7043j072j4994j2837
$$ 76013 72200 64411 51750 30695 4905 -16583 -23770 -11953 10415 27458 26386 11392 -1445
263a445K550J4117J2046J276j0933j8479k1547j7941j0839n516l097Q23J1607
$$ -1445 1105 15222 27268 28544 17611 -868 -22415 -40356 -51195 -56711 -59808 -58985 -47378
276d7378K3003K6709J5892o663k4933k6259j2180M114J1359Q000J488m231l256
$$ -47378 -24375 2334 18226 11563 -13370 -39629 -51809 -47695 -36336 -28336 -26848 -31079 -34335
289c4335L292R426J1168P421M401M142Q314J0372N201p939k1059k2172o268J4032
$$ -34335 -31043 -21617 -10449 -3028 1373 5515 13829 24201 29402 21463 404 -21768 -28036 -14004
303a4004K4310K1791J1698K692j941l909l457k634m665o833o306j497M646N293
$$ -14004 10306 32097 43795 46487 44546 40637 37180 34546 29881 23048 16742 15245 19891 25184
317B5184l009j3134j3383j862J4287K1682J5243M36j3976k1344j9993j2011n105
$$ 25184 22175 9041 -4342 -6204 8083 29765 45008 45444 31468 10124 -9869 -21880 -26985
330b6985j256N74K822O030R566R281K484p858j4948j0434K247J1557Q107j791
$$ -26985 -28241 -27667 -24845 -18815 -9249 32 2516 -5342 -20290 -30724 -28477 -16920 -8813 -10604
344a0604j1302j2346p400K169R147J3342J2018Q859M865K462Q04l855j1626j5043
$$ -10604 -21906 -34252 -41652 -39483 -30336 -16994 -4976 3883 8748 11210 12014 8159 -3467 -18510
358a8510q434O126J8048J8314J0186l24o271n853q30M793O816M778N37l255m530
$$ -18510 -26944 -20818 -2770 15544 25730 25406 19135 13282 12452 17245 24061 28839 29376 26121 21591
373B1591m732m676o304o616j922O902J5620J5046M168q471j6487j6075r186j566
$$ 21591 16859 12183 5879 -737 -2659 4243 19863 34909 39077 30606 14119 -1956 -11142 -12708
387a2708K967N055K909n34m082m296k567k714l561k763L856Q679Q059N35r072
$$ -12708 -9741 -4686 -1777 -2311 -6393 -10689 -13256 -15970 -19531 -22294 -18438 -9759 -1700 -1165 -10237
402a0237j4248j2776m576M604J0543J1947R153M051k6k803l887l687l026j692
$$ -10237 -24485 -37261 -41837 -37233 -26690 -14743 -5590 -1539 -1565 -4368 -8255 -11942 -14968 -16660
416a6660L492R007J0431O026k238q786q142q61O739J2153J1428P483K009n167
$$ -16660 -13168 -4161 6270 12296 10058 1272 -6870 -7731 -992 11161 22589 30072 32081 26914
430B6914r426q918m446j080J167M448P893Q922L444m516r029q964m314J857N109
$$ 26914 17488 8570 4124 3044 4211 8659 16552 25474 28918 24402 15373 6409 2095 3952 9061
445I061N157J362k635p571r601p800l522N32L110O116O652N324J737n595j0798
$$ 9061 14218 15580 12945 5374 -4227 -12027 -15549 -15017 -11907 -5791 861 6185 7922 2327 -8471
460h471j1957o895j03O555P593N247K635j166m391m554j052L833O269N092M296
$$ -8471 -20428 -27323 -27426 -20871 -13278 -8031 -5396 -6562 -10953 -15507 -16559 -12726 -6457 -1365 2931
475B931K401j138n293q239o186l95P067J1398J1015P537K339k753o994p280l713
$$ 2931 5332 4194 -1099 -9338 -15524 -15919 -8852 2546 13561 21098 23437 20684 13690 6410 2697
490B697J17L264M314L654K169q33k687m261l701N1L937O616M253L19n525p471
$$ 2697 2814 6078 10392 14046 16215 15382 12695 8434 4733 4784 8721 15337 19590 19909 14384 6913
506F913q704p811m677J804O054O787M361J606k389n229o949o733k977J381M215
$$ 6913 -1791 -9602 -14279 -12475 -6421 366 4727 6333 3944 -1285 -8234 -14967 -17944 -16563 -12348
521a2348L272P93j934l713m151l202K87M762P713P577M278p48n469p815o761k256
$$ -12348 -9076 -8283 -10217 -13930 -18081 -21283 -20996 -16234 -8521 -944 3334 2586 -2883 -10698 -17459 -19715
537a9715J971P159R008P846L799r06k968l245k041p73K664N352N502K331k361
$$ -19715 -17744 -10585 -1577 6269 10068 9162 6194 2949 908 135 2799 8151 13653 15984 13623
552A3623n119n341k675R17L444O885O774M028j008m912o050o132n804l682O91
$$ 13623 8504 3163 488 1405 4849 11734 18508 22536 21528 16616 10566 4434 -1370 -5052 -4361
567d361N101O351M099p64m525o989n976j748K404M061L786J038k916o019o575
$$ -4361 740 7091 11190 10426 5901 -1088 -7064 -8812 -6408 -2347 1439 2477 -439 -6458 -13033
582a3033m658j402K413M692P154O674M141j667o619r011o071l96L842O366O491
$$ -13033 -17691 -19093 -16680 -11988 -4834 1840 5981 4314 -2305 -11316 -17387 -17783 -13941 -7575 -1084
597a084N004N35l031l030j482J202J953K874M379M104K460j864n085o504l726
$$ -1084 3920 4455 1424 -1606 -3088 -1886 67 2941 7320 11424 13884 12020 6935 431 -3295
612c295Q51N917Q589P325K227k828o046o564m315j499J62K115K639L718J983R3
$$ -3295 -2444 3473 12062 19387 21614 18786 12740 6176 1861 362 524 2639 5278 8996 10979 11072
628A1072m623p253o079j433L807N500L958L56l735p333p315l507J289L833L124
$$ 11072 6449 -804 -6883 -8316 -4509 991 4949 5305 1570 -5763 -13078 -16585 -15296 -11463 -8339
643h339K489K959J461j020m766n989m875k8M827P024O254J470k957n760m614k34
$$ -8339 -5850 -2891 -1430 -2450 -7216 -13205 -18080 -18108 -13281 -6257 -3 1467 -1490 -7250 -11864 -12098
659a2098L377M722L763L016J351J047K11j225l773m110q38M375P482O413J712
$$ -12098 -8721 -3999 -236 2780 4131 5178 5389 4164 391 -3719 -4557 -182 7300 13713 15425
674A5425k627n674n462j964K266N171L703J522q80j859j956k628m386l505p29
$$ 15425 12798 7124 1662 -302 1964 7135 10838 12360 11480 9621 7665 5037 651 -2854 -3583
689c583M042N957M668R21m994p802p182k551K611M609L052K68k304k228j807m08
$$ -3583 459 6416 11084 12005 7011 -791 -7973 -10524 -7913 -3304 -252 16 -2288 -4516 -6323 -6731
705f731o40j376p12J981N018M180K91l880o622n738j108M386P117O562K755r86
$$ -6731 -7371 -8747 -9459 -7478 -2460 1720 2011 -1869 -8491 -14229 -15337 -10951 -3834 2728 5483 4497
721D497k798k390k32j80j198P0K393N114M694J574j762n159m922q89M435P076
$$ 4497 1699 -691 -923 -1103 -2301 -2231 162 5276 9970 11544 9782 4623 -299 -1188 3247 10323
737A0323N049L55l612n005m421j729K67L46J675K305L156L607L7l566p684o942
$$ 10323 15372 15727 12115 7110 2689 960 1227 1573 3248 5553 8709 12316 12353 8787 1103 -5839
753e839k476K854N215M310O73l619n571m966o62K068J701O78K03J388J718m03
$$ -5839 -8315 -5461 -246 4064 4737 1118 -4453 -9419 -10081 -8013 -6312 -5634 -5431 -4043 -2325 -2728
769b728k626m799m669j433L165O969O738K297k744m917l863j472J913K820K205
$$ -2728 -5354 -10153 -14822 -16255 -13090 -6121 617 2914 170 -4747 -8610 -10082 -8169 -5349 -3144
784c144J918K425K389J520r60l849m019j404L731P439O315J695k964o008n551
$$ -3144 -1226 1199 3588 5108 4148 299 -3720 -5124 -1393 6046 12361 14056 11092 5084 -467
799d67k086K464M549L434Q32q0P7l25j302l949l581k434J478M534M469J985l654
$$ -467 -2553 -89 4460 7894 8726 8646 8723 8398 7096 3147 -434 -2868 -1390 3144 7613 9598 5944
816E944o476n969j639K071L360J926K13j92o64p66j164k868l155k522J968N545
$$ 5944 -532 -6501 -8140 -6069 -2709 -783 -570 -762 -1426 -2192 -3356 -6224 -9379 -11901 -9933 -4388
832d388N371K195k779n550m571j810K853M993M370J040r80o80K07J15j192k089
$$ -4388 983 3178 399 -5151 -9722 -11532 -8679 -3686 684 1724 744 64 271 386 -806 -2895
848b895m07K598M755N016K307j881n063m646j432L091N336L678K53j764k000j736
$$ -2895 -3302 -704 4051 9067 11374 9493 4430 -216 -1648 1443 6779 10457 10710 8946 6946 5210
864E210p97p90l66j047K66L139L647J637l148n728n412k354K060L874L154N26
$$ 5210 4413 3623 3257 2210 2476 5615 9262 10899 7751 2023 -3389 -5743 -3683 191 3345 3871
880C871l061l518k360l13J83m32r78L89K323K869J094k088m827n026k021K656
$$ 3871 810 -2708 -5068 -5381 -5198 -5630 -6608 -6219 -3896 -1027 67 -2021 -6848 -11874 -13895 -11239
896a1239N749N501J744k791l394k471l11J320J613Q15J061J608K787J815o24l222
$$ -11239 -5490 11 1755 -1036 -4430 -6901 -7212 -5892 -4279 -3464 -2403 -795 1992 3807 3183 -39
912c9l792o13L215N898M614J350l316m274l563j90J968K154J332l10J042K001
$$ -39 -3831 -4444 -1229 4669 9283 10633 7317 3043 -520 -710 1258 3412 4744 4434 5476 7477
928G477J321j270l832m607k526J024M239M850J462l285n630m130j308J617K377
$$ 7477 8798 7528 3696 -911 -3437 -2413 1826 6676 8138 4853 -777 -4907 -6215 -4598 -2221
943b221J678K71l2k28l69q15l364l816j863J849N081N386J428k337m386l945j064
$$ -2221 -543 -272 -304 -532 -901 -1716 -5080 -8896 -10759 -8910 -3829 1557 2985 648 -3738 -7683 -8747
960h747K104L723K674J75l95k29J142J69j202k155m95J635M183N149K628j931
$$ -8747 -6643 -2920 -246 -71 -466 -695 447 616 -586 -2741 -3236 -1601 2582 7731 10359 8428
976H428m590m307j621K391L607K928O68q35m48j67K6r79k209k257K08L016L634
$$ 8428 3838 -469 -2090 301 3908 6836 7504 6669 6221 6054 6080 5101 2892 635 843 3859 7493
993G493J769k454m814m936j887J448L442L343Q67j679k651j742o90j647j856j364
$$ 7493 9262 6808 1994 -2942 -4829 -3381 61 3404 4271 2592 -59 -1801 -2491 -4138 -5994 -7358
1009g358P62K633L145J974q18m106m130j447J541L878L313P00j719k418j257j95
$$ -7358 -6596 -3963 -818 1156 338 -3768 -7898 -9345 -7804 -3926 -613 87 -1632 -4050 -5307 -5502
1025e502Q41P91P75M91J984K947K282k64l467l716j600J632L213L740K122o71
$$ -5502 -4661 -3870 -3095 -2604 -620 2327 4609 4345 878 -2838 -4438 -2806 407 4147 6269 5598
1041E598k482j641k34P59M22J6N2J341J426O91j103l306l475j838J492L794L982
$$ 5598 3116 1475 1241 2000 2422 2438 2490 3831 5257 5948 4845 1539 -1936 -3774 -2282 1512 5494
1058E494R78k237l940k592j422L89P71N79K98j06L30J021j94k364k481j616J344
$$ 5494 6472 4235 295 -2297 -3719 -3330 -2559 -1980 -1682 -1788 -1458 -437 -631 -2995 -5476 -7092 -5748
1075e748L011L327J194j801l108l261p29J604K160J966J001J98J320P33l79j753
$$ -5748 -2737 590 1784 -17 -3125 -6386 -7115 -5511 -3351 -1385 -384 -186 1134 1867 1488 -265
1091b65k027j025J242L129L715K031j101l230l058j91J575K252K115R78r3m73
$$ -265 -2292 -3317 -2075 1054 4769 6800 5699 2469 -589 -780 795 3047 5162 6140 6047 5574
1107E574l97j360j405j968j135J256K584L229J308j729l449l091k092N97K141
$$ 5574 5177 3817 2412 444 -691 565 3149 6378 7686 5957 2508 -583 -2675 -2078 63
1122F3J779Q01q77j598q43j116j484j066l18J222K387J902J155j472l343l688
$$ 63 1842 2643 1766 168 -675 -1791 -3275 -4341 -4659 -3437 -1050 852 2007 535 -2808 -6496
1138f496j525J180K484K458J083M81l72p75o28j044j63m94O63K446K503J542q79
$$ -6496 -8021 -6841 -4357 -1899 -816 -335 -707 -1482 -2110 -3154 -3317 -3811 -3148 -702 1801 3343 2464
1155B464k704k805r82J439L191L008K112j90j922j948j319o43k58J58J075J965
$$ 2464 -240 -3045 -4027 -2588 603 3611 5723 5533 3611 1663 344 -299 -557 -399 676 2641
1171B641J674R80r59k239k472j751Q44J841K231N05j413j364k054j087k36L97
$$ 2641 4315 5295 4336 2097 -375 -2126 -1282 559 2790 3295 1882 518 -1536 -2623 -2859 -2462
1187b462L6Q74J058J436N24q17k493l130j442O00J987K922J266k16j387j713m26
$$ -2462 -2426 -1552 -494 942 1466 649 -1844 -4974 -6416 -5816 -3829 -907 359 143 -1244 -2957 -3383
1204c383k47Q31O19J074R81P80M84p48j286j508q63J346K796K656J895o78j778
$$ -3383 -3630 -2799 -2180 -1106 -125 655 1139 391 -895 -2403 -3266 -1920 876 3532 5427 4749 2971
1221B971k189q35K61O53J009J449N17L75J78n24j126j548q87M88K142J590K71
$$ 2971 782 -53 208 861 1870 3319 3836 4211 4389 3865 2739 1191 304 792 2934 4524 4795
1238D795p27k490j876j253%J395J055Q29jJ57l18j557j795j406m67N22J049K117
$$ 4795 4068 1578 -298 -1551 -1551 -156 899 1728 1727 1884 1566 9 -1786 -3192 -3659 -3137 -2088 29
1256B9J166p74j967k150r79L73J258J656J364L93n17j045j037r40q06K52J494
$$ 29 1195 421 -1546 -3696 -4675 -4302 -3044 -1388 -24 369 -148 -1193 -2230 -3170 -3976 -3724 -2230
1273b230K452J962Q98j096j805j714q53J70K075J696Q51O24p93p04q75j016k99
$$ -2230 222 2184 3082 1986 181 -1533 -2386 -2216 -141 1555 2406 3030 2237 1533 658 -358 -657
1290f57R53R43J193J180j4o65k021j793j118J03J491J536R13Q42o03j510k177
$$ -657 296 1239 2432 3612 3598 2933 912 -881 -1999 -1896 -405 1131 2044 2886 2283 773 -1404
1307a404j387m85O48R86J172J425l18p75k059j874q08P67J492J698J387N27j288
$$ -1404 -2791 -3276 -2628 -1642 -470 955 637 -138 -2197 -4071 -4879 -4112 -2620 -922 465 992 -296
1324b96j825j262l17o4O00J691J599J092R7n04j108j087p11K70J707K005J254
$$ -296 -2121 -3383 -3700 -3764 -3164 -1473 126 1218 1315 811 -297 -1384 -2095 -1825 -118 1887 3141
1341C141O9l72j378j436m55J00J749J193J132N91L16r70j928j009q19K26J277
$$ 3141 3210 2838 1460 24 -431 -331 1418 2611 3743 4334 4650 3680 1752 743 -76 150 1427
1358A427J416J051l00m35j863j144o85k30M41J390P94N19r84j327j604j357l0
$$ 1427 2843 3894 3594 3159 1296 152 -533 -763 -322 1068 1862 2381 1397 70 -1534 -2891 -2921
1375b921K12J570J349O94O1j192j430j514k46M28P49J597P89M2q53k90r67m94
$$ -2921 -2709 -1139 210 904 965 -227 -1657 -3171 -3417 -2989 -2240 -643 146 188 -665 -955 -1922 -2416
1393b416J71Q80J422J111M11m85l98j051o06n93P90R30J495J268K06n83j359j483
$$ -2416 -2245 -1365 57 1168 1579 1094 696 -355 -961 -1554 -764 166 1661 2929 3135 2552 1193 -290
1411b90l59N97N42J339P41M12p77j102j167p70k79P36Q34J044R35l00k003j542
$$ -290 -649 -52 490 1829 2570 2982 2205 1103 -64 -834 -1113 -377 457 1501 2436 2136 133 -1409
1429a409j228j34O27P31J150N60j84p69j167o22m62k68N91R64R49O58m18o98j174
$$ -1409 -2637 -2771 -2144 -1413 -263 297 113 -656 -1823 -2445 -2907 -3175 -2584 -1620 -671 -13 -431 -1129 -2303
1448b303j607O65N98J558J553N32N7p62j055r41l2L15J146Q35J310R21J4r23j233
$$ -2303 -3910 -3245 -2647 -1089 464 996 1053 291 -764 -1705 -1737 -1422 -276 559 1869 2790 2804 1881 648
1467F48j026Q6J257J097J359N39o71j003j249o31J1%R16R53J161%m43j333j801
$$ 648 -378 -292 965 2062 3421 3960 3289 2286 1037 406 417 417 1333 2286 3447 3447 3004 1671 -130
1486a30j157p9Q94J077J462J96r02j168j351n60l71M31O42Q54N47j60o60o11j121
$$ -130 -1287 -1366 -472 605 2067 2263 1361 193 -1158 -1718 -2089 -1658 -1016 -162 385 225 -435 -1046 -2167
1505b167j078q2Q43J793J202L70m63j017j213o20K33O66P06Q75R06K97j87o03
$$ -2167 -3245 -3327 -2484 -691 511 881 418 -599 -1812 -2432 -2199 -1533 -827 48 954 1251 1064 461
1523D61r61r70L89O00K003J209J54o15j558j335N1K09J111O99Q44J11M2q35n55
$$ 461 -500 -1470 -1081 -481 1522 2731 2885 2270 712 -623 -572 -363 748 1447 2291 2402 2444 1609 1054
1542A054r96p49OK97J252J148J11j018j497j144o47K91R15P47J06rk67p46k24
$$ 1054 58 -691 -685 -388 864 2012 2123 1105 -392 -1536 -2183 -1892 -977 -230 -124 -133 -400 -1146 -1370
1561a370j055r80K5O06J172J141M74m68j482j249j88P52J160R38L79l9l78ko00
$$ -1370 -2425 -3405 -3380 -2774 -1602 -461 13 -455 -1937 -3186 -3374 -2622 -1462 -524 -145 -184 -562 -564 -1164
1580a164n6l36M03P20J396J075M89o17j611j078J69R71R93R72O75k89o46n31k00
$$ -1164 -1220 -1556 -1153 -433 963 2038 2527 1910 299 -779 -610 361 1354 2326 3001 2712 2066 1535 1335
1599A335J88m98K6O39O64L00Lp50j143j304k62Q14J285P19L07j145n59p74q49
$$ 1335 1523 1025 1051 1690 2354 2654 2657 1907 764 -540 -802 12 1297 2016 2323 1178 619 -155 -1004
1618a004k45l11L03K02J002K15L16l86j595j198m06Q69J633R99L03p04j172q12
$$ -1004 -1249 -1560 -1257 -1055 -53 162 478 92 -1503 -2701 -3107 -2238 -605 394 697 -7 -1179 -1991
1636a991j45K4J053M04O54J021K23r2n03j544l10j46J000J273J273N35j025r12
$$ -1991 -2136 -2112 -1059 -655 -1 1020 1243 1151 648 -896 -1206 -1352 -352 921 2194 2729 1704 792
1654G92p34l64O05P43L62L37M66k36L8n15p87j395l00N59J531J096M03r95j462
$$ 792 58 -306 299 1042 1404 1741 2207 1971 2009 1494 707 -688 -988 -429 1102 2198 2601 1606 144
1673A44r79j181N30L26O88K71J46j48m24l74r89o89m11N58J232J481J65r76j164
$$ 144 -835 -2016 -1486 -1160 -472 -201 -55 -203 -627 -1001 -1990 -2679 -3090 -2532 -1300 181 346 -630 -1794
1692a794j159m85O43R15Q76M95J79p3l47l07q2j84n08O37J370J064J041q16r47
$$ -1794 -2953 -3438 -2795 -1880 -1004 -509 -330 -403 -750 -1057 -1139 -1323 -1831 -1194 176 1240 2281 1465 518
1711E18j218J78K50J231J005L99K8o09m9l36k92l65l90M08P72P62N89m12j085
$$ 518 -700 -522 -272 959 1964 2363 2391 1782 1733 1397 1105 740 350 758 1530 2292 2881 2469 1384
1730A384j486p41N99R35O90J83k94m32q58m23k98j23j85J21O18Q68J12l64j370
$$ 1384 -102 -843 -244 691 1381 1564 1270 838 -20 -443 -741 -864 -1049 -928 -310 558 670 306 -1064
1749a064j059n73O96J157Q05J79J33j276k18k44K93P0K74M52M38K01N28l47q09
$$ -1064 -2123 -2696 -2000 -843 -38 141 274 -1002 -1220 -1464 -1171 -1101 -827 -375 63 264 792 445 -364
1768c64n34k49N09R47J347K86j89j114P8m29L10k30N04N99j88P18l9l47o76j278
$$ -364 -898 -1147 -638 309 1656 1942 1753 639 717 288 598 368 872 1471 1283 2001 1962 1615 939 -339
1788c39j37P57Q54N91K82n22j184o87j031N92M30M48r7j19J88k54k49j246k85
$$ -339 -476 281 1135 1726 2008 1486 302 -385 -1416 -824 -394 54 -43 -162 26 -228 -477 -1723 -2008
1807b008n76N40Q18J031J27l68j322o77m2K41N93P39j40O66kj27j23m16o39P2
$$ -2008 -2584 -2044 -1226 -195 -68 -436 -1758 -2435 -2477 -2236 -1643 -904 -1044 -378 -380 -507 -630 -1046 -1685 -1613
1827a613M84Q41J374L36k45j221n79k19L37J002O28M69O9l59J22j23p36q97P25
$$ -1613 -1129 -288 1086 1422 1177 -44 -623 -842 -505 497 1125 1594 1663 1304 1426 1303 567 -330 395
1846C95K1R24R86K53o93r55j055n46L38Q41P56J79o19j15l09m60q55J21l81M08
$$ 395 416 1340 2326 2579 1886 931 -124 -670 -332 509 1265 1444 825 710 401 -59 -914 -793 -1174 -766
1866g66P72O41K95o81p72r90m51M38N80R95J99j8m64j86l29j79k06k54J008N46
$$ -766 6 647 942 261 -511 -1501 -1952 -1514 -934 61 260 242 -222 -408 -737 -916 -1122 -1376 -368 178
1886A78P39L31k15r50r80m17Q07Q17Q69N22j26l70j88o27j87r0M04L41K34K37
$$ 178 917 1248 1033 83 -897 -1314 -507 310 1179 1701 1575 1205 1017 390 203 113 517 858 1092 1329
1906A329L12q8r73n51m01K58O18N05J20k27k05q07o48R1m6K86K2K10N01j5l95
$$ 1329 1641 1553 580 29 -372 -114 504 1009 1129 902 697 -110 -758 -667 -713 -427 -405 -195 306 291 -104
1927a04q38o25n60J80O46Q47J96K12p39m32l92J12M87k4M44P3J80L1m1p35L1m24
$$ -104 -942 -1567 -2127 -1947 -1301 -454 -258 -46 -785 -1217 -1609 -1497 -1010 -1034 -590 -517 -337 -306 -347 -1082 -1051 -1475
1949a475N63P47P55J01Q1p31n23k58M12K98Q99k19K97j09%k33m11o55Q7N24O82
$$ -1475 -912 -165 590 691 772 41 -482 -740 -328 -30 869 650 947 838 838 605 194 -461 -374 150 832
1970H32N08m0q2o68j225K48K97K68N84M6R0l49j96k63l65m4m90K41Q08K62N78
$$ 832 1340 1300 1218 550 -675 -427 -130 138 722 768 858 509 313 50 -315 -359 -849 -608 200 462 1040
1991A040M7j554k68k88o5P79P21J17L1L2m90k78n52k23O8P61M63K53N56l78o71
$$ 1040 1087 -467 -735 -1023 -1088 -309 412 529 560 592 102 -176 -728 -951 -883 -122 341 594 1150 772 101
2012A01n80n33M28Q37P68j27K05n25l61j37n03K36j97O36L17O35O16p66p90p26
$$ 101 -479 -1012 -584 253 1021 894 1099 574 213 76 -427 -191 -388 248 565 1200 1816 1050 260 -466
2032d66k07j86R27M27M98K12n46o67k50k52kl46M19R32K51r0m33p14n35m39L36
$$ -466 -673 -859 68 495 993 1205 659 -8 -258 -510 -512 -858 -439 493 744 654 221 -493 -1028 -1467 -1131
2053a131O85M54M03O7m39q46l72K67l65L77J91N68K02K61j33l60r97j41P36K53
$$ -1131 -446 8 411 478 39 -807 -1179 -912 -1277 -900 -709 -141 61 322 189 -171 -1168 -1309 -573 -320
2073c20P58l32Q15q13p31m44L27M23l37P08K54M33qk34n41m85m21L73M26M23M76
$$ -320 438 106 921 108 -623 -1067 -740 -317 -654 54 308 741 733 499 -42 -527 -948 -575 -149 274 750
2094G50j57l47j24l15l44K98J80O29N4N9m94J41n15l64j52M79M83L64L25l12l71
$$ 750 593 246 122 -193 -537 -239 -59 570 624 683 189 330 -185 -549 -701 -222 261 625 950 638 267
2115B67o24n1j65M33J33O09k19o2k60k7l18j87L53K1L21M20P7j04j22n87l17J2
$$ 267 -357 -408 -573 -140 -7 602 383 321 61 34 -284 -471 -118 -97 224 644 721 617 495 -92 -409 -397
2137c97N23K23K44J63k11J87m78l36m22J37L17M24K78M94m95k63m51n80N2L65
$$ -397 126 349 593 756 545 732 254 -82 -504 -367 -50 374 652 1146 651 388 -63 -643 -591 -226
2157b26N89L01Q8k69n40J5l17q3j56P36M75L7k91l58m6m81m11K65M68J45J96Q7
$$ -226 363 664 752 483 -57 -42 -359 -442 -598 138 613 650 359 1 -45 -526 -937 -672 -204 -59 137 224
2179B24Om82m19l18K90O7K94M30L14K80n71m91m34l07L06M25N97J65K63m46m88
$$ 224 230 -252 -671 -989 -699 -632 -338 92 406 686 115 -376 -810 -1117 -811 -386 211 376 639 193 -295
2200b95l13m4k65L61O32J80L54l03j77n21q6j75j28N01L03L88L47l83o91j59J17
$$ -295 -608 -652 -917 -556 76 256 610 307 130 -391 -477 -652 -780 -279 24 412 759 376 -315 -474 -357
2221c57l82J98Q50J25j71K40k47n53k96n9J07L30N30k1K42k06l82n26j90M07K41
$$ -357 -739 -541 309 434 263 503 256 -297 -593 -652 -545 -215 315 294 536 330 -52 -578 -768 -361 -120
2242a20J73L13J43n7l67m3n29J08OQ22k9J78L26l69m18m09J34k22Q32r9N58K94
$$ -120 53 366 509 452 85 42 -487 -379 -373 449 420 598 924 555 137 -272 -138 -360 472 373 931 1225
2264A225m43l16n15j28k41M78K93L24j86N0j08l16m47j81K04L88K06K01p1K80
$$ 1225 782 466 -49 -177 -418 60 353 677 491 541 433 117 -330 -511 -307 81 287 488 417 697
2284F97o47l98k9P7O6J07J82K25l87j6O2m55J69n01N10M36K75j5l12k97k46k38
$$ 697 50 -348 -377 -300 -234 -127 55 280 -107 -123 -61 -516 -347 -848 -338 98 373 358 46 -251 -497 -735
2306g35j80P37M06Q6j65R6m15l3k14j01M04K84j5J85K1l57k91k51r4J30M55J79
$$ -735 -915 -178 228 314 149 245 -170 -203 -417 -518 -114 170 155 340 361 4 -287 -538 -632 -502 -47 132
2328A32J82l67j52K45j35l00j15K95k32P25J41n14J05m68j35j13L80P7L55N18
$$ 132 314 -53 -205 40 -95 -395 -510 -215 -447 278 419 -95 10 -458 -593 -706 -326 -249 106 624
2348F24o61j86m7o63N79l69K62L68L51K41j75m09l80j71J04L31J14N77K59l53
$$ 624 -37 -223 -270 -933 -354 -723 -461 -93 258 499 324 -85 -465 -636 -532 -201 -87 490 749 396
2368C96j82m45J34R0m6K16M28M12j04j39q13j1j49J65N9M20L45J24j75l99j55
$$ 396 214 -231 -97 -7 -53 163 591 1003 899 760 -53 -64 -213 -48 11 431 776 900 725 326 171
2389A71j71q2J77O15k29L32k54n8r2k69j53J30j59K14M89J04j04n87m54l20K61
$$ 171 0 -82 95 710 481 813 559 501 409 140 -13 117 -42 172 661 765 661 74 -380 -700 -439
2410d39L62n7K31K74J5j52l69j08k75j45K17N69R3L07k61n13j32p6J28K8J95K47
$$ -439 -77 -134 97 371 386 234 -135 -243 -518 -663 -446 123 216 523 262 -251 -383 -459 -331 -303 -108 139
2432A39J04k8k02n9j64l46K11K63N13j50l2k50m37k9j96n5M63M97j37K01l09N7
$$ 139 243 215 13 -46 -210 -556 -345 -82 431 281 249 -1 -438 -467 -663 -718 -255 242 105 306 -3 54
2454E4k07l80L00j61K14J46r5M66l66j14m36jM5L99M18M7j23j33j30k10j46j16
$$ 54 -153 -533 -233 -394 -180 -34 -129 337 -29 -143 -579 -580 -535 -136 282 329 206 73 -57 -267 -413 -529
2476e29ML22L21K68k00l47K99o98J39k10P35K06K2k53m78q7M13k0j83J88L34r9
$$ -529 -525 -203 118 386 186 -161 138 -560 -421 -631 104 310 332 79 -399 -486 -73 -93 -276 -88 246 147
2498A47M27k65k8Q8m70j44M54J41M29l79J09l20k01k1j17R1J76M7J69L52o2m42
$$ 147 574 309 281 369 -101 -245 209 350 779 400 509 189 -12 -33 -150 -59 117 164 333 685 623 181
2520A81j19o5r2J94K07L67K21m94l12k06m00L97L22j69J92K6j5p2j57k10L5j49
$$ 181 62 -3 -95 99 306 673 894 400 88 -118 -518 -121 201 32 224 250 235 163 6 -204 -169 -318
2542c18J65J41J28K24r3p18j11K39j4P8J75J15J49o0M6l94j67r8J52K06J70K89
$$ -318 -153 -12 116 340 247 -471 -582 -343 -357 -279 -104 11 160 100 146 -248 -415 -513 -361 -155 15 304
2564C04j43J71m43l73j18K26L52j1J27J33L4M4o42J53n25O42j98O38j90L04m44
$$ 304 161 332 -111 -484 -602 -376 -24 -35 92 225 259 303 -339 -186 -711 -69 -267 371 181 485 41
2585D1l04j28m61L02L81J48J10j14k78J29k56J8%K42k04J68K72K04j18k57n99
$$ 41 -263 -391 -852 -550 -169 -21 89 -25 -303 -174 -430 -412 -412 -170 -374 -206 66 270 152 -105 -704
2606g04P1J85J70K69L72m01N7K16l47k48M0K39k20M29j55L18M25o45j59n9q1L51
$$ -704 -633 -448 -278 -9 363 -38 19 235 -112 -360 -320 -81 -301 128 -27 291 716 71 -88 -147 -228 123
2628A23K43J50j22k89j8l09L91j0KJ65P6L39k85K34m29j74n6r5J87N75m37L51
$$ 123 366 516 394 105 87 -222 169 159 161 326 402 741 456 690 261 87 31 -64 123 698 261 612
2650F12k41l39J15J1k62J53M4N6K29j78m4j23m7l49l1K47L28r4m2o8j47j36L04
$$ 612 371 32 147 158 -104 49 93 149 378 200 156 33 -14 -363 -394 -147 181 87 45 -23 -170 -306 -2
2673bn9K16r7M1J85k72k63J64k5r6N1Q4K52j4J65k53n57K97m46K90L92p2N61l04
$$ -2 -61 155 58 99 284 12 -251 -87 -112 -208 -157 -73 179 165 330 77 -480 -183 -629 -339 53 -19 542 238
2697B38L1j2k41j80k50J19J62K12L95n92Kj07K2j48j36P08k33n1L15m28oR2m42
$$ 238 269 257 16 -164 -414 -295 -133 79 474 -118 -116 -223 -201 -349 -485 223 -10 -61 254 -174 -180 -88 -530
2720e30J91m29N81M22j82L33n92k69n9K06m7L12K7N3K45l19j91j14n1R2M12J9
$$ -530 -339 -768 -187 235 53 386 -206 -475 -534 -328 -375 -63 -36 17 262 -57 -248 -362 -413 -321 91 110
2742A10k9j2K0q0k06l50K44K96J38K29j47J46j75k93PJ9P3qO02r6J0J3l21k87
$$ 110 81 69 89 9 -197 -547 -303 -7 131 360 213 359 184 -109 -102 -83 -10 -18 584 488 498 511 190 -97
2766i7j49q7L46K27J8K54l10j97N4j98n7L44K77j77J76kl10J20l36j62k1M68J28
$$ -97 -246 -333 13 240 258 512 202 5 59 -139 -196 148 425 248 424 422 112 232 -104 -266 -287 181 309
2789C09J69o0Pj60l22o6P0o5J76n8J39j1Q6j5j97j03k60R5L46L13k24l77K13K59
$$ 309 478 418 425 265 -57 -123 -53 -118 58 0 139 128 214 199 2 -101 -361 -266 80 393 169 -208 5 264
2813B64k60j25m9L76MK07l55k45K61k61j97J34J75M00K62m54N5k94j13j87M41
$$ 264 4 -121 -170 206 210 417 62 -183 78 -183 -380 -246 -71 329 591 137 192 -102 -215 -402 39
2834C9l80J15K13l15K75j06k82K6J65r7Q7K35J12n9l25l84J39J15M19o1J87J13
$$ 39 -341 -226 -13 -328 -53 -159 -441 -415 -250 -347 -260 -25 87 28 -297 -681 -542 -427 -8 -69 118 231
2856B31k24j84K12j91p7j9J09p6K34m9Q0J00l48J67j05J71k30O22k06j44J66m67
$$ 231 7 -177 35 -156 -233 -252 -143 -219 15 -34 46 146 -202 -35 -140 31 -199 423 217 73 239 -228
2878b28R5O6l3M5K49n0L00k50J03l60K6J5Q5m4J19L81j30L9k27l98M15J76k23
$$ -228 -133 -67 -100 -55 194 144 444 194 297 -63 -37 -22 63 19 138 519 389 428 201 -197 218 394 171
2901A71m7j73K78M23n19l18N7M54j029P37K50NK28l21j33J05l63O9J71N56m34
$$ 171 124 -49 229 652 133 -185 -128 326 -703 34 284 289 517 196 63 168 -195 -126 45 601 167
2922A67L0j48Rp2j53P3K53J56m47J59r10Q85N08r50K51j65M39N1o1k55K38m15
$$ 167 197 49 58 -14 -167 -94 159 315 -132 27 -883 2 510 -440 -189 -354 85 136 75 -180 58 -357
2944c57J19j31J00L7J51K3P7j25K60m73%L72j65n0K77k30J92j71r3l7j43L40j1
$$ -357 -238 -369 -269 -232 -81 -58 19 -106 154 -319 -319 53 -112 -162 115 -115 77 -94 -187 -224 -367 -27 -38
2967c8L58L2l08k30J01K16k40k73K84K91j07J85k25j65k26J91j01K8K2K69J7r1
$$ -38 320 352 44 -186 -85 131 -109 -382 -98 193 86 271 46 -119 -345 -154 -255 -227 -205 64 81 -10
2989a0n2r4J76j30P1j71J13K63R0j04r3j40J74k17K7J1K23j40N8K9j66J55m8j36
$$ -10 -62 -156 20 -110 -39 -210 -97 166 256 152 59 -81 93 -124 -97 -86 137 -3 55 84 -82 73 25 -111
3013a11J38k7J62N54m12k37j69L2m6M4K50K9K22k90Q7j60M3j21rJ34j3J29K13
$$ -111 27 0 162 716 304 67 -102 -70 -116 -72 178 207 429 139 226 66 109 -12 -21 113 100 229 442
3036D42o20K22n1j11Q6K00J23K01L4k15k37j48k42M02j61J22P5l86O61l04Q1k44
$$ 442 -178 44 -7 -118 -32 168 291 492 526 311 74 -74 -316 86 -75 47 122 -264 397 93 174 -70
3058g0j51J41J56k68J10K12k1K1k18K8k0K50j53J11l03O36n91m4o8MK12j7J10
$$ -70 -221 -80 76 -192 -82 130 109 130 -88 -60 -80 170 17 128 -175 461 -130 -174 -242 -238 -26 -43 67
3081F7P1k46J69rj45r5J39j42M63k22K4q7j35j8j13m9K4L22o6J14p4o6j98j98
$$ 67 138 -108 61 52 -93 -188 -49 -191 272 50 74 -13 -148 -166 -279 -328 -304 18 -48 66 -8 -74 -272 -470
3105d70M71k59J33l4P7K65m26K32L8l50R3J29O9j57M86l92j23J98j77J71j72O0
$$ -470 1 -258 -125 -159 -82 183 -243 -11 27 -323 -230 -101 -32 -189 297 -95 -218 -20 -197 -26 -198 -138
3127a38L32J63k97M25m59j35j69J53L03j84J96l3L5L5j27m30K10R0L79p9j48K56
$$ -138 194 357 60 485 26 -109 -278 -125 178 -6 190 157 192 227 100 -330 -120 -30 349 270 122 378
3149C78j41P0m38K98k33J01J17P1K80n29J67j0mj10J33J1Q7l3KJ33m34p2J73l64
$$ 378 237 307 -131 167 -66 35 152 223 503 -26 141 131 127 17 150 161 248 215 217 350 -84 -156 17 -347
3173c47L37J0L08k02O1J20l01k94O70l89Q1J39K63j97l45J79rK8J5J54l75K58
$$ -347 -10 0 308 106 167 287 -14 -308 362 -27 54 193 456 259 -86 93 84 112 127 281 -94 164
3195A64k3L2k98L78m10q9J99J00R8K41l02l07j2K95j6o6J3O3J34j45j67j81J69
$$ 164 141 173 -125 253 -157 -246 -47 53 151 392 90 -217 -229 66 50 -16 -3 60 194 49 -118 -299 -130
3218a30K21m11Q4L30q1K90l82l10L39l21J22k9J15K52k99M63m76Q8K3QM0k12L15
$$ -130 91 -320 -236 94 13 303 -79 -389 -50 -371 -249 -278 -163 89 -210 253 -223 -135 -112 -104 -64 -276 39
3241C9J29k17k56j52L25j85J89p1K54j99M00j72j4j41J25K1m9K49o0o9k61L30
$$ 39 168 -49 -305 -457 -132 -317 -128 -199 55 -144 256 84 70 -71 54 75 26 275 215 146 -115 215
3263B15j96N7k33J0J93M5r6J94j36M3p7m7R2nJ6o0L61m36O0J55k85J25P9m33K27
$$ 215 19 76 -157 -147 46 91 -5 189 53 96 19 -28 64 59 75 15 376 -60 0 155 -130 -5 74 -359 -132
3288a32J31L11l73j17K23L1Q5l02M7L28j75J82k48k63J08J32m2J09PL65l21n4
$$ -132 -1 310 -63 -180 43 74 159 -143 -96 232 57 239 -9 -272 -164 -32 -74 35 42 407 86 32
3310C2L5J53k97J92j95J78j06J29L51m63Q3j56M9Jp2L15J45l23j61N37l93q2j25
$$ 32 67 220 -77 115 -80 98 -8 121 472 9 92 -64 -15 -14 -86 229 374 51 -110 427 34 -48 -173
3333a73L1J95Lm3j03k2J5q0k1l2O4M4M01m64j73M31l12k78L69o6Q9j25J16K55
$$ -173 -142 53 56 13 -90 -112 -97 -177 -198 -230 -166 -122 279 -185 -358 73 -239 -517 -148 -214 -125 -250 -134 121
3357A21l70m5J70K04j86j6K89m83L92k79J87R3k59O8K57l24L81j20k57M40j86
$$ 121 -249 -294 -124 80 -106 -122 167 -316 76 -203 -16 77 -182 -114 143 -181 200 80 -177 263 77
3378G7l48K01J20o9K17k43Q2j83M13l81R9m29K46J89L17k35k26m9j58L88k17j60
$$ 77 -271 -70 50 -19 198 -45 37 -146 267 -114 -15 -444 -198 -9 308 73 -153 -202 -360 28 -189 -349
3400c49K32J52M5J3m2j62P6k9pK58k59L88n57K52k24K61l66M37R5L9n8j80J18
$$ -349 -117 35 80 93 51 -111 -35 -64 -71 187 -72 316 -241 11 -213 48 -318 119 214 253 195 15 133
3423A33q1M2j7J32p9k0K46j98R4ok60R4J64k55K63j49J55k2j00p6l22K05L79j10
$$ 133 52 94 77 209 130 110 356 158 252 246 -14 80 244 -11 252 103 258 236 136 60 -262 -57 322 212
3447B12k84m4J55rj49Q4o4j43J95q8P2N2J95j22P5m32J81K05j10Q5J68m26L43
$$ 212 -72 -116 39 30 -119 -35 -99 -242 -47 -135 -63 -11 184 62 137 -295 -114 91 -19 66 234 -192 151
3470A51k69l0J45j11j37O4J51k07J01j78K35M2k56K28O3R8r8n9r6J04j86K36k2
$$ 151 -118 -148 -3 -114 -251 -187 -36 -243 -142 -320 -85 -43 -299 -71 -8 90 -8 -67 -163 -59 -245 -9 -31
3493c1L7J16j86k00P3L25K1n74M44l57J89K79q3k08L8J47j40L14l48M9J60j26
$$ -31 6 122 -64 -264 -191 134 155 -419 25 -332 -143 136 53 -155 -117 30 -110 204 -144 -95 65 -61
3515f1K19l94J56J40j50J58l36j06M54j62J00k61K67Qk34L55M2l34J81j6j60L36
$$ -61 158 -236 -80 60 -90 68 -268 -374 80 -82 18 -243 24 32 -202 153 195 -139 42 26 -134 202
3537B02k23K47k05j23L0L41n3j39k69O53k74k24P4p0L83m19J36J53N7j7m56L02
$$ 202 -21 226 21 -102 -72 269 216 77 -192 461 187 -37 37 -33 350 -69 67 220 277 260 -196 106
3559A06J26n43K91q5M13l85L96n66O40q71J199n02K27k12j42K33k42pj02M4M7
$$ 106 232 -311 -20 -105 308 -77 319 -247 393 -478 721 219 446 234 92 325 83 76 -26 18 65
3580F5l20M35j2J54j6m02M08l13J26k41J52k02k28K03L57j72l13M30Oq8o4K7O
$$ 65 -255 180 168 322 306 -96 312 -1 125 -116 36 -166 -394 -191 166 -6 -319 111 117 29 -35 -8 -2
3603bk52K64J4l9J35Pj36J40k17M7n4N6J57k79P7J59J2j78O5j46n4K04n4J04J92
$$ -2 -254 10 24 -15 120 127 -9 131 -86 -39 -93 -37 120 -159 -82 77 89 -89 -24 -170 -224 -20 -74 30 222
3628B22l53K32j77J64k12K21j55J65J39j74j63K74j74m17J31r0K65j52L98m05
$$ 222 -131 101 -76 88 -124 97 -58 107 246 72 -91 183 9 -408 -277 -367 -102 -254 144 -261
3648b61J42k1K32p1k19L34l94J70K14j57O1j5P6Nm4qj24J93K02n09K11P2j64K21
$$ -261 -119 -140 92 21 -198 136 -258 -88 126 -31 30 15 91 96 52 44 -80 113 315 -194 17 89 -75 146
3672A46n8q4K47J5J02l04j01K08N01q11j60M89m1j09P1K58m00K73j75J96l53N29
$$ 146 88 4 251 266 368 64 -37 171 672 -139 -299 190 149 40 111 369 -31 242 67 263 -90 439
3694D39l84j07l50R51m16j98J26J88O47q84Q0j98j81K6L26p8j76q8L97j90M37
$$ 439 55 -52 -402 549 133 -65 61 249 896 12 92 -106 -287 -261 65 -13 -189 -277 120 -70 367
3715C67o4m20K86M70p99L02R1k30j51M39k18p0k98j75L85k1j38j26M40l41R37
$$ 367 303 -117 169 639 -160 142 233 3 -148 291 73 3 -295 -470 -85 -106 -244 -370 70 -271 666
3736F66q86L68P3k76J66J66j90J52n72L30j29M02k64j32K94j97n4J02N7k28j17
$$ 666 -220 148 221 -55 111 277 87 239 -333 -3 -132 270 6 -126 168 -29 -83 19 76 -152 -269
3757b69K63nQ4l01K17R4J5k14j6J88r6j45KqL55l26k9l3J26Q4j8k27O10p5k22
$$ -269 -6 -11 73 -228 -11 83 98 -116 -132 56 -40 -185 -183 -191 164 -162 -191 -224 -98 -14 -32 -259 351 276 54
3782E4k5l00L52k80L06r4lPm9P1J6j40J58k23J68K65l76K12J81l27J4Q4M2k12
$$ 54 29 -271 81 -199 107 13 10 17 -32 39 55 -85 73 -150 18 283 -93 119 300 -27 -13 71 113 -99
3806i9J42j63K65j21m8k78J44M06k85L8J04k59L25k12J23l02o3N6L43N5l21K10
$$ -99 43 -120 145 24 -24 -302 -158 248 -37 1 105 -154 171 -41 82 -220 -283 -227 116 171 -150 60
3828F0l2p1j0J8M6J5M4q8R6M1j6J54l07k63K53j02M5K48n4R5l86Q8K76j91o1K82
$$ 60 28 -43 -53 -35 11 26 70 -18 78 119 103 257 -50 -313 -60 -162 -117 131 77 172 -214 -126 150 -41 -102 180
3854A80k52J26K18k87L6j84J43pj04K77Np3j40J2L4k34n3J68m8L4K50j20N3n4
$$ 180 -72 54 272 -15 21 -163 -20 -27 -131 146 151 78 -62 -50 -16 -250 -303 -135 -183 -149 101 -19 34 -20
3878b0L33m09J31j8k71R1k13L90j95q0N46j43o0k81j00L52l5O1p2m99M6L83J30
$$ -20 313 -96 35 17 -254 -163 -376 14 -181 -261 285 142 82 -199 -299 53 18 79 7 -492 -446 -63 67
3901F7L7j20o9J73j17j33J40K23k97M48n0l14J99j73j8J72j57O6l9Q8L32n32K48
$$ 67 104 -16 -85 88 -29 -162 -22 201 -96 352 302 -12 187 14 -4 168 11 77 38 126 458 -74 174
3924A74k42QQ6L4K65p8j09rk16J81k52J50j73q8J00J61q7M1J88j38j82M47k05
$$ 174 -68 -60 26 60 325 247 138 129 -87 94 -158 -8 -181 -269 -169 -8 -95 -54 134 -4 -186 261 56
3947E6J43k09J88O2l02K71m48K68N6K3N7K6j87N9k36n4L74k23K52k7j64L3Q1J6
$$ 56 199 -10 178 240 -62 209 -239 29 85 108 165 191 4 63 -173 -227 147 -76 176 149 -15 18 99 115
3971A15j47J04j21N3K00J6k43l9j58J37L39j75k18J28J56m6j66K18m64L28j19
$$ 115 -32 72 -49 4 204 220 -23 -62 -220 -83 256 81 -137 -9 147 101 -65 153 -311 17 -102
3992a02p3L36k13K81k76j30j9jJ64j62J94l62L36M9j5K1k90J56M4K6m31J83J39
$$ -102 -175 161 -52 229 -47 -177 -196 -197 -33 -195 -1 -363 -27 22 7 28 -262 -106 -62 -36 -467 -284 -145
4015a45n0P7l49J36L18K06k39n5R4R0O6j22k03K36j72j32N12j63J4o1j59K50m38
$$ -145 -195 -118 -467 -331 -13 193 -46 -101 -7 83 149 27 -176 60 -112 -244 268 105 119 58 -101 149 -289
4038b89L43K1m0J44k1j05J76k60M04k68k57K12Q2k01j28M14k39l40M69k00r4O5
$$ -289 54 75 35 179 158 53 229 -31 373 105 -152 60 142 -59 -187 227 -12 -352 117 -83 -177 -112
4060a12L8L26n60M35j16K07m22L44k32j60O9P1J66j90N7J62R8l57L11l08J26r3
$$ -112 -74 252 -308 127 11 218 -204 140 -92 -252 -183 -112 54 -136 -79 83 181 -176 135 -173 -47 -140
4082a40K30k63kL57j87k70N08j29k19O03k91j16J07J0qqk03n8k7L71k64J67k6
$$ -140 90 -173 -175 182 -5 -275 233 104 -115 488 197 81 188 198 190 182 -21 -79 -106 265 1 168 142
4105A42j15J43k50j2k5j05R9k00K86J7J09p2J95k81L29n54J86R0k6l60K12J18
$$ 142 27 170 -80 -92 -117 -222 -123 -323 -37 -20 89 17 212 -69 260 -294 -108 -18 -44 -404 -192 -74
4127g4j4l1j21J68j31L89l10L9k53M62L6k96J9Q6j58p8J82K9J40j55K9j67N8L8
$$ -74 -88 -119 -240 -72 -203 186 -124 -85 -338 124 160 -136 -117 -31 -189 -267 -85 -56 84 -71 -42 -209 -151 -113
4151a13K49j33j6L11k37J90k47p6L3j42K40j1m7N3j59J90L1q0k53K39N8j27j6
$$ -113 136 3 -13 298 61 251 4 -72 -39 -181 59 48 1 54 -105 85 116 36 -217 22 80 -47 -63
4174f3J18Pr1j79K13J30kj09p4L47j20Q9k85j1J93l86K53K23o39M53Lk97J26K56
$$ -63 55 62 -29 -208 5 135 133 24 -50 297 177 266 -19 -30 163 -223 30 253 -386 67 70 -227 -101 155
4198A55j21j25q5K09q8J18%J88p6j77R3r7K28k29L16j55K5J0j27J85l68L06P3
$$ 155 34 -91 -176 33 -55 63 63 251 175 -2 91 -6 222 -7 309 154 179 189 62 247 -121 185 258
4221B58k2l0L5l39K72k34J70j92J13n6J01J91l64J65Pj04j00l4KJ13J35j06n5
$$ 258 236 206 241 -98 174 -60 110 -82 31 -25 76 267 -97 68 75 -29 -129 -163 -161 -48 87 -19 -74
4244g4K9q9L0K2J18k15J88K12l51J53J18k68K17j12L19l19J68m2P5l96L59n8J29
$$ -74 -45 -134 -104 -82 36 -179 9 221 -130 23 141 -127 90 -22 297 -22 146 104 179 -217 142 84 213
4267B13j48L2m88P86l08k11J04J00J51j61k13L97j86J40m20K75k24L25r58J41
$$ 213 65 97 -391 395 87 -124 -20 80 231 70 -143 254 68 208 -212 63 -161 164 -794 -653
4287f53J229j381J013k99L89m58M97o65J09J09K25k52J18m3k08K93q6j82O6K72
$$ -653 576 -805 208 -91 298 -160 337 -328 -219 -110 115 -137 -19 -62 -270 23 -63 -245 -179 93
4307I3l19R1J97m14L86j27J96j32l1M5q3J80N7l92J91J96j59J33k56K84P6k5j9
$$ 93 -226 -135 62 -352 34 -93 103 -29 -60 -15 -98 82 139 -253 -62 134 -25 108 -148 136 212 187 168
4330A68k38J75J89k61K41o6r7K8k52K94k90k13L11j6P1J50n7r1n7J24J94k54J16
$$ 168 -70 105 294 33 274 208 111 139 -113 181 -109 -322 -11 -27 44 194 137 46 -11 113 307 53 169
4353A69j99Q5k03J12j06J2J11o6o0l1J94qK48j20l91J11k14M25k1K7K9q9j12m
$$ 169 -30 55 -148 -36 -142 -130 -19 -85 -145 -176 18 10 258 138 -253 -142 -356 69 48 75 104 15 -97 -101
4377a01mj92K34m1K22l04L63j60k48L11k43n9K87m0J34J2j46J35l81K37p3p2K68
$$ -101 -105 -297 -63 -104 118 -186 177 17 -231 80 -163 -222 65 25 159 171 25 160 -221 16 -57 -129 139
4400A39j41j03K69n08M91p4l45K96r9N9j08m8j0QO1R4K29j11j03j2l6L6j24k7
$$ 139 -2 -105 164 -344 147 73 -272 24 -75 -16 -124 -172 -182 -174 -113 -19 210 99 -4 -16 -52 -16 -140 -167
4424a67M8k0L2n0j35K95j62j1J43J0M2nk31P6K07m6j49m1j17O29l79Q3R0l96M23
$$ -167 -119 -139 -107 -157 -292 3 -159 -170 -27 -17 25 20 -211 -135 72 26 -123 -164 -281 348 -31 52 142 -254 169
4449A69k72K13K7J01m31K03J17j03J79j50K33n5l03m7M28j98J62j48J03Q9m40
$$ 169 -103 110 137 238 -193 10 127 24 203 53 286 231 -72 -119 309 111 273 125 228 317 -123
4470a23J84m2p9L21r0K9j74J33k4l9L6l48m1L74k68M7N63n14K31r9q5R2J08m7
$$ -123 61 19 -60 261 171 200 26 159 135 96 132 -216 -257 117 -151 -104 459 -55 176 77 -8 84 192 145
4494A45j62R0m38L39k8p2L6R3k1J72l20K17J68k58j92K47J19j08j68m3L12j66
$$ 145 -17 73 -365 -26 -54 -126 -90 3 -18 154 -166 51 219 -39 -231 16 135 27 -141 -184 128 -38
4516c8q3j2K12j19J50j67k0J51J19J72n66L22l11K5J86k9j35j26J33J74p1k03
$$ -38 -121 -133 79 -40 110 -57 -77 74 193 365 -201 121 -190 -165 21 -8 -143 -269 -136 38 -33 -236
4538b36J31J93r2l89N12k44J22K21j36l5j63j02l2N7J43K43k77O5o2Q7J10j3l1
$$ -236 -105 88 -4 -393 119 -125 -3 218 82 47 -116 -218 -250 -193 -50 193 -84 -19 -81 6 116 103 72
4561G2k57K27R5j35P6P4J23L7m36L10j49j89L25j58K92l87L7J25j41k1J23r6L3
$$ 72 -185 42 137 2 78 152 275 312 -124 186 37 -152 173 15 307 -80 -43 82 -59 -80 43 -53 -20
4584b0K33j60J12k0n7q0j08L75j2m64J21r0O26l52j00J74j62j8j6j7j30K80j34
$$ -20 213 53 165 145 88 8 -100 275 263 -201 -80 -170 456 104 4 178 16 -2 -18 -35 -165 115 -19
4607a9L34k92K3M2k4k19L07r6j28J79J93m01l4K25k29k0K27L0P7K5L7j27j91J29
$$ -19 315 23 46 88 64 -155 152 56 -72 107 300 -101 -135 90 -139 -159 68 98 175 200 237 110 -81 48
4631D8j91J8L87j75j02J22Kq5k41K27k89K64R7rJ0l2l5J30k03k86J47K65l11L21
$$ 48 -143 -125 262 87 -15 107 109 24 -217 10 -279 -15 82 73 83 51 16 146 -57 -343 -196 69 -242 79
4655G9j51p3r2J97Q5k8k4L9l9k47K94n0k0j90J85m3R4k16J54o4K80j69k3j12k41
$$ 79 -72 -145 -237 -40 45 17 -7 32 -7 -254 40 -10 -30 -220 -35 -78 16 -200 -46 -110 170 1 -22 -134 -375
4680c75K97K2J61j98j9j37L07j6N4r4j03J13m1N9l34L94k50K8M05l37J70p7O1
$$ -375 -78 -56 105 -93 -112 -249 58 42 96 2 -101 12 -29 30 -304 90 -160 -132 273 -64 106 29 90
4703I0j37J71K01l85J94j07L7J44r6m8m3j97L44l05K40j70J64J94J20m20j30K75
$$ 90 -47 124 325 -60 134 27 64 208 112 64 21 -176 168 -137 103 -67 97 291 411 -9 -139 136
4725A36l4PK60k87j43O5k63K81K55j11q3k31L38n01J15P0j22K83j79J52L0j17
$$ 136 102 109 369 82 -61 4 -259 22 277 166 83 -148 190 -311 -196 -126 -248 35 -144 8 38 -79
4747g9p0n1K14k78K61l5Q8j01j77J81L6k09L71k40k53K88M7O4k08M76k66j77L0
$$ -79 -149 -200 14 -264 -3 -38 50 -51 -228 -47 -11 -220 151 -89 -342 -54 -7 57 -151 325 59 -118 -88
4770h8o6K03P4j9l22K2o6J84jq6K7p2L64O7j90k94L23J15l55L3J73njm5Q2j31
$$ -88 -154 49 123 104 -218 -196 -262 -78 -79 -165 -138 -210 154 221 31 -263 60 175 -180 -147 26 21 20 -25 57 -74
4796g4j68M50k25j30j3J68J30p8k14K03j37j6k56L57qJ06j16J12j52M9k46L78
$$ -74 -242 208 -17 -147 -160 8 138 60 -154 49 -88 -104 -360 -3 -11 95 -21 91 -61 -12 -258 120
4818A20j5j58k0R8r7p8N03m15J3J26k09L17k17p8J28M5l2J11k42JJ67O6k43J82
$$ 120 105 -53 -73 25 -72 -150 353 -62 -49 77 -132 185 -32 -110 18 63 31 142 -100 -99 68 134 -109 73
4842G3r2p8J48%q5n7K04l14J49J46j89J25l19M40p1m6j83L13k21PK41J06l96p3
$$ 73 -19 -97 51 51 -34 -91 113 -201 -52 94 -95 30 -289 151 80 34 -149 164 -57 -50 191 297 -99 -172
4866a72M66k05j73J68KlqO5m39K39L35m52L41j44Q1k41Q3M14m79J71L65l03n7
$$ -172 294 89 -84 84 86 83 75 140 -299 -60 275 -177 164 20 101 -140 -57 357 -122 49 414 111 54
4889E4j59L4K6K48k41k22L84L8m3j05J30J98k76J82k62m3P0O0moj07j91l1L8K44
$$ 54 -105 -71 -45 203 -38 -260 124 162 119 14 144 342 66 248 -14 -57 13 73 69 63 -44 -235 -266 -228 16
4914A6m78L63J6O6o7R0J68n27K40J27j41O8K96j243P87J57j04K4K3O15p5k04M4
$$ 16 -462 -99 -83 -17 -84 6 174 -353 -113 14 -127 -59 237 -1006 -219 -62 -166 -142 -119 496 421 217 261
4937B61l14k7m23O75J21m17J9J37L5j76J8K56k78r5L84l70L54J06k54R6k55L47
$$ 261 -53 -80 -503 172 293 -124 -105 32 67 -109 -91 165 -113 -208 176 -194 160 266 12 108 -147 200
4959B00Ml57M1J48l03J56K24O9N1m47J62J95M9k63k8L64j3J64m98K07J59j25k80
$$ 200 204 -153 -112 36 -267 -111 113 182 233 -214 -52 143 192 -71 -99 265 252 416 -82 125 284 159 -121
4982a21K46o9J23m6j07k22L84l06J17j48L49m24J61J79J15j34Q9J30k45Lp8p9
$$ -121 125 56 179 133 26 -196 188 -118 -1 -149 200 -224 -63 116 231 97 186 316 71 74 -4 -83
5004h3N9o5Q4o7K19o6R4k82N7J64k85R6k80N5J65P7L2O3K06l52K10j15N2l46L99
$$ -83 -24 -89 -5 -72 147 81 175 -107 -50 114 -171 -75 -355 -300 -135 -58 -26 37 243 -109 101 -14 38 -308 91
5029I1L5k20K55l26J71K11k95P9J02k62J59l2j65J48k6K6J68k04j94J7L11O1k79
$$ 91 126 -94 161 -165 6 217 -78 1 103 -159 0 -32 -197 -49 -75 -49 119 -85 -279 -262 49 110 -169
5052a69P7Q0j23J56k72K58m38N71k36K84j12j33J26j07o6R1J07jk03m06R75k74
$$ -169 -92 -12 -135 21 -251 7 -431 140 -96 188 76 -57 69 -38 -104 -13 94 93 -110 -516 459 185
5074A85l35J31J19j35K97k63J6J58j37O1k00J74o0J44k10K22j54oJ93l09K98k41
$$ 185 -150 -19 100 -35 262 -1 15 173 36 97 -103 71 11 155 -55 167 13 7 200 -109 189 -52
5096e2M3M0M13m27j87m6M9L34r9k20K57j60P9K01n6n0n11M88K62l85r9j5M24k63
$$ -52 -9 31 444 17 -170 -216 -167 167 68 -152 105 -55 24 225 169 119 -392 96 358 -27 -126 -141 283 20
5120B0J37km90K23K85l97Q6J3L64l21j46K47ML17j86k06K86l31J71O3m10K97j6
$$ 20 157 155 -335 -112 173 -224 -138 -125 239 -82 -228 19 23 340 154 -52 234 -97 74 137 -273 24 8
5143HL3J8p4O2l79K87J68k9oK8J8k72J01R2K6l17J65L45l46j83K34L7R0p1K31
$$ 8 41 59 -15 47 -332 -45 123 94 88 116 134 -138 -37 55 81 -236 -71 274 -72 -255 -21 16 106 35 266
5168B66l65j7J01j64K32M8l21K01J94j82J11k63J95j09J23m8J5J06M7k29k0J43
$$ 266 -99 -116 -15 -179 53 101 -220 -19 175 -7 104 -159 36 -73 50 2 17 123 170 -59 -79 64
5190F4n5j28J53N6R8l31J0J40j21N0J06O4Ll05J40J83l71K27r3K85K12r6j07j90
$$ 64 9 -119 34 90 188 -143 -133 7 -114 -64 42 106 109 -196 -56 127 -244 -17 -110 175 387 291 184 -6
5214fm7J42L8l78L23r5J77l59J02qJ29k8j29J70J49k91L90Q2l32Q1OK7j51J01
$$ -6 -53 89 127 -251 72 -23 154 -205 -103 -111 18 -10 -139 31 180 -111 279 361 29 110 116 143 -8 93
5238I3j96J77R2J22M1k98q6L9J13J51j78m9j01k7J28O8J14L23n4l83j95N77m22
$$ 93 -103 74 166 288 329 31 -55 -16 97 248 70 21 -80 -107 21 89 203 526 472 89 -106 471 49
5261D9K41p98J80L79l92R47o40k37K65N4k16K04j3Kj30K87k10k6K03r5k05N2j73
$$ 49 290 -508 -328 51 -341 606 -34 -271 -6 48 -168 36 23 25 -105 182 -28 -54 149 54 -151 -99 -272
5284b72J86J21L8L0k61J26P6q4R2pj82j3J70p2P2k3j5p8P9j32K84j91j75J41J86
$$ -272 -86 35 73 103 -158 -32 44 -40 52 45 -137 -150 20 -52 20 -3 -18 -96 -17 -149 135 -56 -231 -90 96
5309I6m81M60l51N4N99l74k82K25nO8j73M18o1j77k06M59n01k8R7K24k53L36k61
$$ 96 -385 75 -276 -222 377 3 -279 -54 -59 9 -164 254 193 16 -190 269 -232 -260 -163 61 -192 144 -117
5332a17j5L44m11J99O0K18l12l1n8o9J86Q7j81J26k67K54j73J18k43K19J36l34
$$ -117 -132 212 -199 0 60 278 -34 -65 -123 -192 -6 81 -100 26 -241 13 -160 -42 -285 -66 70 -264
5354b64J78q0N0P5L31l09J8J6J2N4l1j30K53N1k2l11K49K22l45k14M04m89K48
$$ -264 -86 -166 -116 -41 290 -19 -1 15 27 81 50 -80 173 224 202 -109 140 362 17 -197 207 -282 -34
5377c4Q2m97P67j49k0l30K73J43j82k23L20k41J27j37J23l30K87PP4l0o7j1m1
$$ -34 48 -449 318 169 149 -181 92 235 53 -170 150 -91 36 -101 22 -308 -21 -14 60 30 -37 -48 -89
5400h9L0j86K34k33O3j37K53K23j57M7j12r3J40K17J2m02N16m67P7J61k52J67
$$ -89 -59 -245 -11 -244 -181 -318 -65 158 1 48 -64 -157 -17 200 212 -190 326 -141 -64 97 -155 12
5422A2J16q0J1K33l70M2NJ12k90K91j01o5K62k97r1J11j30L44j13J55J48n88N53
$$ 12 128 48 59 292 -78 -36 -31 81 -209 82 -19 -84 178 -119 -210 -99 -229 115 2 157 305 -283 270
5445B70n45L44k00L2J21j16q3J91p9k5J47k8k48L15k64M8j22J32J8J82P8m45L17
$$ 270 -275 69 -131 -99 22 -94 -177 14 -65 -90 57 29 -219 96 -168 -120 -242 -110 -92 90 168 -277 40
5468D0J02l5j09j9R0k8l5L1j3m05L19K92l11J85J34l90L35l34L56pJ4k41l1R0
$$ 40 142 107 -2 -21 69 41 6 37 24 -381 -62 230 -81 104 238 -152 183 -151 205 198 212 -29 -60 30
5492C0l67M69k64K12k37J04J56Nk29K17j61j11K36n0J04l2q5R4j77R3Q7O6p7O6
$$ 30 -337 132 -132 80 -157 -53 103 108 -121 96 -65 -176 60 10 114 82 -3 91 -86 7 94 160 83 149
5516A49Q2J75m18J01j30K8p2K91p8j56k12M38j51K69m90L79k46R7J82m19K8N6
$$ 149 231 406 -12 89 -41 -13 -85 206 128 -28 -240 198 47 316 -174 205 -41 56 238 -181 -153 -97
5538i7qK80j12j92q4J00M6K20j27k04K37j48j01J68j49q2L79k46p7K44PN0l41
$$ -97 -105 175 63 -129 -213 -113 -67 153 26 -178 59 -89 -190 -22 -171 -253 126 -120 -197 47 54 104 -237
5561b37L28m00R5K06O8q6j29p6K03n6n5kK34P0j60J04l58J62R4j3n4Rj75K47q9
$$ -237 91 -309 -214 -8 60 -26 -155 -231 -28 -84 -139 -141 93 163 3 107 -251 -89 5 -8 -62 -53 -228 19 -70
5586g0k59L42m6k5l2K3j41m7J78k28L60K65l21K01k12j07l30N77l9j96k1K25l58
$$ -70 -329 13 -33 -58 -90 -67 -208 -255 -77 -305 55 320 -1 200 -12 -119 -449 128 89 -107 -128 97 -261
5609b61L42K81l93j60M42k60J18k09K55o3k78L6J36J90j78l2j9K16k73O8L7k03
$$ -261 81 362 -31 -191 251 -9 109 -100 155 92 -186 -150 -14 176 -2 -34 -53 163 -110 -42 -5 -208
5631b08M2L92k60m0J87m42M01p6J18j57pK11N5k44k46L35J15j32J32l92J47L30
$$ -208 -166 226 -34 -74 113 -329 72 -4 114 -43 -50 161 216 -28 -274 61 176 44 176 -216 -69 261
5653B61j26n0k24J07K5m1K9R7N1K9j14k33K40j17O8m9J91J28k84oR7k51j10L75
$$ 261 135 85 -139 -32 -7 -48 -19 78 129 158 44 -189 51 -66 2 -47 144 272 -12 -18 79 -172 -282 93
5677I3p3o2K4k09K91k43Mq9L2K31K4j16J58m5j18rj30L32J01l39K88j85l3n8j3
$$ 93 20 -42 -18 -227 64 -179 -175 -264 -232 -1 23 -93 65 20 -98 -107 -237 95 196 -143 145 -40 -73 -131 -144
5702a44N0J58J9r1q0k37N48l36L27k28K2j45J28K44j83k9k02J86L8k12K69k04
$$ -144 -94 64 83 -8 -88 -325 223 -113 214 -14 8 -137 -9 235 52 23 -179 7 45 -167 102 -102
$$ [...]
8191A60
##END NTUPLES=NMR FID
##END=
