##TITLE=1H_LR-707A-PhCH3-K
 CDCl3
 8 sc, 
 6.9.2024
##JCAMPDX= 6.0         $$ Bruker NMR JCAMP-DX V2.0
##DATA TYPE= NMR FID
##DATA CLASS= NTUPLES
##ORIGIN= UXNMR, Bruker Analytische Messtechnik GmbH
##OWNER= root
$$ XWIN-NMR		Version 3.5
$$ Fri Sep  6 15:32:04 2024 Russian Standard Time (UT+4h)  she@DPX200
##.OBSERVE FREQUENCY= 200.1318
##.OBSERVE NUCLEUS= ^1H
##.DELAY= (6, 6)
##.ACQUISITION MODE= SIMULTANEOUS
##.ACQUISITION SCHEME= undefined
##.AVERAGES= 8
##.DIGITISER RES= 18
##SPECTROMETER/DATA SYSTEM= spect
##.PULSE SEQUENCE= zg30
##.SOLVENT NAME= CDCl3
##.SHIFT REFERENCE= (INTERNAL, CDCl3, 0, 15.7039)
##AUDIT TRAIL= $$ (NUMBER, WHEN, WHO, WHERE, WHAT)
$$ ##TITLE= Audit trail, XWIN-NMR		Version 3.5
$$ ##JCAMPDX= 5.01
$$ ##ORIGIN= Bruker BioSpin GmbH
$$ ##OWNER= she
$$ F:/spectra/data/she/nmr/H-F/1/audita.txt
$$ ##AUDIT TRAIL=  $$ (NUMBER, WHEN, WHO, WHERE, WHAT)
(   1,<2024-09-06 15:30:45.14 +0400>,<she>,<DPX200>,
      <created by zg, POWCHK disabled, PULCHK disabled
       configuration hash MD5:
       00 E9 B6 7A A2 85 ED C7 34 08 36 98 17 FE 4E 26
       data hash MD5: 16K
       46 EC B5 15 A8 C9 23 A4 27 FD C5 5A 76 78 7D 31>)
$$ ##END=
$$ 
$$ hash MD5
$$ E4 9D 0F 71 2E D7 57 6F 80 11 75 01 98 CE 63 56
##$RELAX= 
##$RELAX= 
##$RELAX= 
##$RELAX= 
##$RELAX= 
##$RELAX= 
$$ Bruker specific parameters
$$ --------------------------
##$DU= <F:/spectra>
##$EXPNO= 1
##$NAME= <H-F>
##$PROCNO= 1
##$TYPE= <nmr>
##$USER= <she>
##$AMP= (0..31)
100 100 100 100 100 100 100 100 100 100 100 100 100 100 100 100 100 100 
100 100 100 100 100 100 100 100 100 100 100 100 100 100 
##$AQSEQ= 0
##$AQ_mod= 1
##$AUNM= <au_zg>
##$AUTOPOS= <>
##$BF1= 200.13
##$BF2= 200.13
##$BF3= 200.13
##$BF4= 200.13
##$BF5= 200.13
##$BF6= 200.13
##$BF7= 200.13
##$BF8= 200.13
##$BYTORDA= 1
##$CFDGTYP= 0
##$CFRGTYP= 5
##$CHEMSTR= <none>
##$CNST= (0..31)
1 1 145 1 1 1 1 1 1 1 1 1 1 1 1 1 1 1 1 1 1 1 1 1 1 1 1 1 1 1 1 1 
##$CPDPRG= <>
##$CPDPRG1= <>
##$CPDPRG2= <>
##$CPDPRG3= <>
##$CPDPRG4= <mlev>
##$CPDPRG5= <mlev>
##$CPDPRG6= <mlev>
##$CPDPRG7= <mlev>
##$CPDPRG8= <mlev>
##$CPDPRGB= <>
##$CPDPRGT= <>
##$D= (0..31)
0 1.2 0 0 0 0 0 0 0 0.06 0 0.03 0 0 0 0 0.0002 0 0 0 0 0 0 0 0 0 0 0 0 
0 0 0 
##$DATE= 1725622244
##$DBL= (0..7)
120 120 120 120 120 120 120 120 
##$DBP= (0..7)
150 150 150 150 150 150 150 150 
##$DBP07= 0
##$DBPNAM0= <>
##$DBPNAM1= <>
##$DBPNAM2= <>
##$DBPNAM3= <>
##$DBPNAM4= <>
##$DBPNAM5= <>
##$DBPNAM6= <>
##$DBPNAM7= <>
##$DBPOAL= (0..7)
0.5 0.5 0.5 0.5 0.5 0.5 0.5 0.5 
##$DBPOFFS= (0..7)
0 0 0 0 0 0 0 0 
##$DE= 6
##$DECBNUC= <off>
##$DECIM= 24
##$DECNUC= <off>
##$DECSTAT= 4
##$DIGMOD= 1
##$DIGTYP= 9
##$DL= (0..7)
0 120 120 120 120 120 120 120 
##$DP= (0..7)
150 150 150 150 150 150 150 150 
##$DP07= 0
##$DPNAME0= <>
##$DPNAME1= <>
##$DPNAME2= <>
##$DPNAME3= <>
##$DPNAME4= <>
##$DPNAME5= <>
##$DPNAME6= <>
##$DPNAME7= <>
##$DPOAL= (0..7)
0.5 0.5 0.5 0.5 0.5 0.5 0.5 0.5 
##$DPOFFS= (0..7)
0 0 0 0 0 0 0 0 
##$DQDMODE= 0
##$DR= 18
##$DS= 0
##$DSLIST= <SSSSSSSSSSSSSSS>
$$ [...]
##$SUBNAM2= <"">
##$SUBNAM3= <"">
##$SUBNAM4= <"">
##$SUBNAM5= <"">
##$SUBNAM6= <"">
##$SUBNAM7= <"">
##$SUBNAM8= <"">
##$SUBNAM9= <"">
##$SW= 24.0689170037331
##$SWIBOX= (0..15)
0 0 2 0 0 0 0 0 0 0 0 0 0 0 0 0 
##$SW_h= 4816.95568400771
##$TD= 16384
##$TD0= 1
##$TE= 0
##$TE2= 300
##$TE3= 300
##$TEG= 300
##$TL= (0..7)
0 120 120 120 120 120 120 120 
##$TP= (0..7)
150 150 150 150 150 150 150 150 
##$TP07= 0
##$TPNAME0= <>
##$TPNAME1= <>
##$TPNAME2= <>
##$TPNAME3= <>
##$TPNAME4= <>
##$TPNAME5= <>
##$TPNAME6= <>
##$TPNAME7= <>
##$TPOAL= (0..7)
0.5 0.5 0.5 0.5 0.5 0.5 0.5 0.5 
##$TPOFFS= (0..7)
0 0 0 0 0 0 0 0 
##$TUNHIN= 0
##$TUNHOUT= 0
##$TUNXOUT= 0
##$USERA1= <user>
##$USERA2= <user>
##$USERA3= <user>
##$USERA4= <user>
##$USERA5= <user>
##$V9= 5
##$VALIST= <valist>
##$VCLIST= <CCCCCCCCCCCCCCC>
##$VD= 0
##$VDLIST= <DDDDDDDDDDDDDDD>
##$VPLIST= <PPPPPPPPPPPPPPP>
##$VTLIST= <TTTTTTTTTTTTTTT>
##$WBST= 1024
##$WBSW= 4
##$XGAIN= (0..3)
0 0 0 0 
##$XL= 0
##$YL= 0
##$YMAX_a= 231106
##$YMIN_a= -215631
##$ZGOPTNS= <>
##$ZL1= 120
##$ZL2= 120
##$ZL3= 120
##$ZL4= 120
##$ABSF1= 10
##$ABSF2= 0
##$ABSG= 5
##$ABSL= 3
##$ALPHA= 0
##$AQORDER= 0
##$ASSFAC= 0
##$ASSFACI= 0
##$ASSFACX= 0
##$ASSWID= 0
##$AUNMP= <proc_1d>
##$AZFE= 0.1
##$AZFW= 0.1
##$BCFW= 1
##$BC_mod= 2
##$BYTORDP= 1
##$COROFFS= 0
##$CY= 11.3945322036743
##$DATMOD= 1
##$DC= 2
##$DFILT= <>
##$DTYPP= 0
##$F1P= 15.6554695791079
##$F2P= 12.8336369535428
##$FCOR= 0.5
##$FTSIZE= 0
##$FT_mod= 4
##$GAMMA= 1
##$GB= 0.15
##$INTBC= 1
##$INTSCL= 1
##$ISEN= 128
##$LB= 0.24
##$LEV0= 0
##$LPBIN= 0
##$MAXI= 10000
##$MC2= 0
##$MEAN= 0
##$ME_mod= 0
##$MI= 1.114404
##$NCOEF= 0
##$NC_proc= 0
##$NLEV= 6
##$NOISF1= 3.799351
##$NOISF2= 2.8
##$NSP= 1
##$NTH_PI= 0
##$NZP= 0
##$OFFSET= 15.70392
##$PC= 1
##$PHC0= -25993.99
##$PHC1= 13.78748
##$PH_mod= 1
##$PKNL= yes
##$PPARMOD= 0
##$PSCAL= 0
##$PSIGN= 0
##$REVERSE= no
##$SF= 200.130013532006
##$SI= 16384
##$SIGF1= 3
##$SIGF2= 2
##$SINO= 400
##$SIOLD= 16384
##$SREGLST= <1H.CDCl3>
##$SSB= 0
##$STSI= 0
##$STSR= 0
##$SW_p= 3612.71676300578
##$SYMM= 0
##$S_DEV= 0
##$TDeff= 0
##$TDoff= 0
##$TI= <>
##$TILT= no
##$TM1= 0
##$TM2= 0
##$TOPLEV= 0
##$USERP1= <user>
##$USERP2= <user>
##$USERP3= <user>
##$USERP4= <user>
##$USERP5= <user>
##$WDW= 1
##$XDIM= 8192
##$YMAX_p= 0
##$YMIN_p= 0
$$ End of Bruker specific parameters
$$ ---------------------------------
##NTUPLES= NMR FID
##VAR_NAME=  TIME,          FID/REAL,        FID/IMAG
##SYMBOL=    X,             R,               I
##VAR_TYPE=  INDEPENDENT,   DEPENDENT,       DEPENDENT
##VAR_FORM=  AFFN,          ASDF,            ASDF
##VAR_DIM=   8192,          8192,            8192
##UNITS=     SECONDS,       ARBITRARY UNITS, ARBITRARY UNITS
##FACTOR=    0.0002076,     1,               1
##FIRST=     0,             0,               0
##LAST=      1.7004516,     0,               0
##MIN=       0,             -215631,         0
##MAX=       1.7004516,     231106,          0
$$ Real data points
##PAGE= N=1
##DATA TABLE= (X++(R..R)), XYDATA
0@%%%%%%%%qJ6j6J7k5L2l7M5n6O6p5R0j06J26j50J75k01K30k62K99l44L91m40
31b33M95n58O27p01P81q68R68j080J199j327J467j625J801j994K207k445K716
48A430l021L370l776M252m816N500o355P451q912J0970j4095J9479m4684K64313
62B31106r9199k75625J76815j7466r3176J76285k0108k61709J15857J96710r2176
73C7314q5002K9878J9159O5955m0950j10683N5589M0430m6074J19142k497k15549
85a33288R2074J86807j91370m1133K08682j53723j48405K80423L9237k36581R4884
96b393Q8190j75416O2782J38577j70236n6990J79821R302r0713q945j625O2892
108C5246M4700j16374m6565O8854K096P4593N6364k10310n0512K63733l0616k11107
$$ plain form
0 0 0 0 0 0 0 0 0 0 -8 8 -8 9 -16 16 -21 24 -32 34 -41 49 -57 69 -81 94 -107 123 -139 160 -184 207 -233
31 -233 262 -296 331 -370 411 -457 511 -569 630 -697 770 -855 946 -1048 1159 -1286 1430
48 1430 -1591 1779 -1997 2255 -2561 2939 -3416 4035 -4877 6093 -8002 11477 -33207 231106
62 231106 131907 -143718 33097 15631 -77545 98740 78632 -183077 -67220 129490 37314
73 37314 -47688 -17810 1349 67304 26354 -84329 -28740 11690 -34384 84758 82261 -133288
85 -133288 -41214 145593 -45777 -86910 121772 -31951 -180356 100067 139304 -97277 -2393
96 -2393 85797 -89619 -26837 111740 -58496 -115486 64335 73637 -17076 -26021 -27646 35246
108 35246 79946 -36428 -82993 -14139 -12043 62550 118914 -91396 -141908 121825 91209 -119898
120a19898J12834N7672j40548J22568R9322k22167R048K16650j13821j43149J25747
131D258K4809o3354P3277J710q1999K8703L2340r904J4112m6242k3534O5918k9895
144i801k1468J20104n1986j58243J22533J02941j55484O636J11913j12048k493
155d7396J64730j08653j38463J68548O3627j54696o033O2693j7369N3621K8537
166F9146j04734k9303P6189L6502j6631p2513l7598J08738M1254j06748J4291
177b1407O7959o9766J1539P6524j12236m0608J72846k0266j53142P7588P1512
188F0543r5994K3964O8838q7571k0564Q8179k1952m2760M6856O208l9846q718
200b2817J0847L3184J001o0176J6746O3378m2796j8905N8937m7738m0687R8533
$$ plain form
120 -119898 -7064 50608 -89940 32628 131950 -90217 -81169 135481 21660 -121489 4258
131 4258 29067 -34287 38990 40700 -41299 -12596 19744 9840 23952 -22290 -45824 20094 -9801
144 -9801 -31269 88835 36849 -121394 1139 104080 -51404 -44768 67145 -44903 -47396
155 -47396 117334 8681 -129782 38766 102393 -52303 -58336 4357 -13012 40609 69146
166 69146 -35588 -64891 11298 47800 31169 -41344 -78942 29796 71050 -35698 -21407
177 -21407 46552 -23214 -11675 64849 -47387 -87995 84851 64585 -88557 -10969 60543
188 60543 -35451 -11487 57351 -30220 -50784 37395 15443 -27317 19539 25747 -14099 -22817
200 -22817 -11970 21214 22215 -37961 -21215 42163 -633 -19538 39399 -8339 -49026 49507
212D9507k0030j20704Q0181R9474r8369l5611P2047l3965j6678P5658l7713q1833
224f8036O0053N9633m5544k9360J7361J5346J345k2443n003K4625p314p34K7751
237B7680l7093l2183P5339R022r3426K6123P0290o0802k1304P4445k3780m8515
249c4204N5299N14o4801M0032N1314n7482l2758M7194J9729k2155j2025K997P959
262A613O57M1L259j9815j205N1069q903p5364K3604P2733l8708m3932M0706l146
276B609k4311N0889J765p3634K2373O8224m0261m9124L8544K4675k3897k666O895
289B081j0111M920K2675o688l6786K214M7886k363n1821J0526M5108k4055k5849
302b2263L0598l277k4795L4822R086n5665J2630O1271k8225n1055L0739K7001
$$ plain form
212 49507 29477 -91227 -11046 88428 -9941 -45552 26495 -7470 -24148 51510 13797 -68036
224 -68036 -7983 51650 6106 -23254 -5893 9453 10798 -11645 -16648 7977 663 -71 27680
237 27680 -9413 -41596 33743 42765 -50661 -24538 45752 -15050 -36354 38091 14311 -34204
249 -34204 21095 21609 -43192 -3160 48154 -9328 -42086 5108 24837 2682 -9343 -6346 1613
262 1613 2270 2311 5570 -14245 -15450 35619 26716 -48648 -25044 47689 8981 -34951 5755 2609
276 2609 -21702 29187 30952 -42682 -20309 47915 7654 -41470 -2926 21749 -2148 -4814 2081
289 2081 -8030 -3110 19565 12877 -23909 -21695 26191 23828 -27993 -17467 27641 3586 -22263
302 -22263 8335 5058 -19737 15085 24171 -31494 -18864 42407 14182 -36873 -6134 20867
314B0867k6028l157J5941j4326k429K8251n426l7522J0078M2522j3612m4501J4726
327a4616L6980j6929j8106J7675n709j5025L0507O718m6696N964N2474j8596m6168
340c1527K5076K9279k5862q426J8267j2434o868L1208j995m1026R927M3902j6723
353A2798m0544J8833K9179j9588j2721J6151n930q885K6830M84m1801Q852M7661
366C1319j6651m3985J9854L0250j9736j1819J5687r702o581K8684j871m1547J1324
379a4774M6341j6700m2648J7841K8770j7124j0139J1938r758m494K8858k383m1036
392b5308R672M5637j4925m1322J5764K8121j5196r759J1275j1084m866L0237j519
405A6727m1602Q980M5241j4507l9932J5836K5864j4918q086J0979j1808m866L0239
$$ plain form
314 20867 -5161 -8318 7623 -6703 -9132 19119 13693 -23829 -13751 28771 15159 -29342 -14616
327 -14616 22364 5435 -12671 5004 -705 -15730 14777 21495 -25201 -19237 33237 14641 -31527
340 -31527 -6451 22828 -3034 -11460 6807 -5627 -12495 18713 16718 -24308 -14381 29521 12798
353 12798 -27746 -8913 20266 678 -12043 4108 -1822 -10707 16123 16607 -25194 -16342 31319
366 31319 14668 -29317 -9463 20787 1051 -10768 4919 -4783 -11364 17320 15449 -26098 -14774
379 -14774 31567 14867 -27781 -9940 18830 1706 -8433 3505 -6253 -10747 18111 15728 -25308
392 -25308 -15636 30001 15076 -26246 -10482 17639 2443 -7316 3959 -7125 -11991 18246 16727
405 16727 -24875 -15895 29346 14839 -25093 -9257 16607 1689 -6397 4582 -7226 -12092 18147
418A8147j754m0359Q003M4098j3275l9500J6126K5497j6381p836J2994j3049n905
431a3194L1552k064m1326J0171M3393j5483l6571J7160K1729j5297n851R448j1152
444g485k676K6938k423l6803P286M1880j1803l8651J4556K6342j6624q872J4462
457F127j2375p217L1860k497m2741J2867M4214j8510l4803J8064J7865j4090m69
470a705O342j4915M56K5867m151l2028P317L6173q748l5850J1391K6241j4785
483A605j0408J5774j1032j2189L2482K477m4285J2042M4172k3568l3356K6821
495E35J5508k0402K749O242j7680O567K6331j2600k9392J2759L1217q900l1158
508a8224P120K6516r714j5269J1917n742j1178L1133M765m9976Q528N4294k0715
$$ plain form
418 18147 16393 -23966 -15963 28135 14860 -24640 -8514 16983 602 -7234 5760 -7289 -13194
431 -13194 18358 16294 -25032 -14861 28532 13049 -23522 -6362 15367 70 -5781 3667 -7485
444 -7485 -10161 16777 14354 -22449 -15163 26717 14914 -23737 -9181 17161 537 -8335 6127
457 6127 -6248 -13465 18395 15898 -26843 -13976 30238 11728 -23075 -5011 12854 -1236 -1705
470 -1705 4637 -10278 -9822 16045 11894 -20134 -12817 23356 14608 -21242 -9851 16390 1605
483 1605 -8803 6971 -4061 -16250 16232 18709 -25576 -13534 30638 7070 -26286 535
495 535 16043 -4359 -1610 4632 -13048 -6481 19850 7250 -22142 -9383 21834 12934 -18224
508 -18224 -11104 15412 5698 -9571 2346 -3396 -14574 16559 21324 -28652 -20124 34170 13455
521A3455l9230K5800J2699k2783J3181J0142l0058M847L3916j4912k8496J6221
533e218K2198r533j7618L371J4868m585r988J0468j801j6609J9075J3524l6597
546a8445K650M7009k2033m2364L6313K0841l4640O214J6616k9249O412L9929k5756
559C497l4136L1065K3252k2246j3847O088J1329N296r391p623k49j20J8960R129
573B1004m0628q123N2745l212m6115K1689K0672l3984J3337K8476m1948q584N2247
586B7576j6034m1050L0743J9307k8452K533J4943j2669j394Q384l924m50m98L29
600f56N788j2963l728L3439p716m5458K4947L6442l5701p723L0298k8512r335
613b0878N2366j9426n4064M1396L6396m2565r198K2774j1052M775J8186k3363
$$ plain form
521 13455 -25775 25 12724 -10059 3122 13264 -16794 -11947 21969 7057 -21439 -5218
533 -5218 16980 7447 -10171 -6800 8068 3483 -6505 3963 2162 -14447 4628 18152 -18445
546 -18445 -15795 31214 9181 -33183 3130 23971 -10669 -4455 12161 -17088 -10676 29253 3497
559 3497 -30639 426 23678 1432 -12415 -6327 5002 10298 907 -6716 -6965 -7085 11875 21004
573 21004 -19624 -27747 24998 21786 -24329 -2640 18032 -15952 -2615 25861 -16087 -24671 27576
586 27576 11542 -29508 1235 20542 -7910 -5377 9566 -3103 -4497 3887 -37 -487 -985 -656
600 -656 5132 -7831 -11559 21880 14164 -31294 -6347 30095 -5606 -13329 16969 -11543 -20878
613 -20878 31488 12062 -42002 -606 35790 -6775 -15973 6801 -4251 524 18710 -4653
625d653j7927K2566J5364n401j8101j1784K6105J5274l0940L93K4365k3860k792
638a1391L6829k7791k9897N1542L635n5180K7851L4193m4670o99M2373k6659k1260
651b1124L2909n909k0944K3064L383k4877L336J4285P716k422k4766L51L4292
664A9294j0136k2491K0094q490j9783M2941J878o2439K4994N6067m3251k5055
676b6377M0223j4556j5298M3073j4616n0272L1661L4793k8476j1139J0013l732
688d703Q822M286j2974M490J510q230J7219m420k8342K6200K0532m3678N117M2786
702B8615l5097j9828N2253j1853m3493L5607J1680m1214K5310K8654m7943r288
714b6597M2742l096j7126L864q036L694J8457r362j0454K334m753J7190J0407
$$ plain form
625 -4653 -22580 -14 15350 9949 -8152 -19936 6169 21443 -9497 -9104 15261 -8599 -11391
638 -11391 25438 -2353 -32250 19292 22927 -32253 -4402 29791 -14879 -15578 26795 136 -21124
651 -21124 11785 5876 -15068 7996 11379 -13498 -10162 4123 11839 9417 -15349 -14998 19294
664 19294 9158 -13333 6761 -1729 -21512 21429 23307 -39132 -14138 41929 -1322 -26377
676 -26377 13846 -710 -16008 27065 12449 -37823 -6162 28631 155 -10984 -971 -4703
688 -4703 4119 8405 -4569 -79 1431 -6799 10420 6000 -22342 3858 24390 -19288 -14171 28615
702 28615 -6482 -26310 25943 14090 -29403 6204 17884 -23330 1980 30634 -17309 -26597
714 -26597 16145 13049 -4077 -213 -8249 -4555 13902 4540 -5914 -3580 -8333 8857 19264
727A9264m0881j273N2365j6252l8015L0311J456k9201M0247J1756o3700J1576
739b2347N5914l0265k4240L3371j0287k0300K9128Q40k5385J2738J0443j1635
751b025L00j610J235J2020j3127q683K5665j1106k6086L4398J1836m1156J2915
764e424K3559l7100R903M6705m0769l6495N0597J1449l5284J3709P228k5256J9337
777B159K0111k9951r511K3192N217p486j3400o491K4902R497k5769J447R077j6217
791a3223J9739K2351m4567j2099N0503j2068l5642L3756P684l7774K0430K2271
803B1361l5393L162L3514k1905j8194K3315P79j3785O800L475j213j069j0723
816i876O407J6494j1588n185J0538j9284m18M0772j6201m4600K9552K6348l2285
$$ plain form
727 19264 -21617 -22890 29475 13223 -24792 5519 6975 -22226 18021 29777 -33923 -22347
739 -22347 33567 3302 -20938 12433 2146 -18154 10974 11814 -13571 -833 9610 -2025
751 -2025 -1725 -3335 -2100 9920 -3207 -11890 13775 2669 -23417 10981 22817 -18339 -5424
764 -5424 18135 -18965 -9062 37643 -3126 -39621 10976 22425 -12859 850 8078 -17178 2159
777 2159 22270 -7681 -17192 6000 11217 3731 -9669 -16160 8742 18239 -7530 -6083 2994 -13223
791 -13223 6516 28867 -15700 -27799 22704 10636 -25006 8750 16434 -21340 -910 21361
803 21361 -14032 -10870 22644 739 -17455 5860 6639 -7146 -346 3129 1916 847 -9876
816 -9876 -3469 13025 1437 -3748 6790 -12494 -12912 27860 11659 -32941 -3389 22959 -9326
829i326L378K1405k7536J718L6308k4613l0171L4240J6707k5815o351N829K92
842c935J1425K927j4145m615L477Q967R699j7078j2085K5181N30k8426J6351J9106
856A7379k6645J074K4678k3534r823L5787p916l1835K2730J4033k8448K646K2877
869A3003j0014q783N992m058J45J1560P30j0108r321M307K0200l249k6061Q611
883g046K1305j6894o671J8357j1993p244K8130j0245l4569K3524K8589k6251j2431
896a3439J6977n918l980J7042o064j6116R893J1048q769p752O194R500m808j4717
910a0909N378J4083q171m682J0609r040q686K2024l78k5703J3764K0802k4705
923e614j1064K4420P3j3407Q179j707j3756J4435J4864j6494j3257J2422J0657
$$ plain form
829 -9326 -5948 15457 -12079 -10361 25947 1334 -28837 5403 22110 -3705 -10056 -4227 -3935
842 -3935 7490 10417 -3728 -8343 -4866 4101 13800 -3278 -15363 9818 10348 -18078 -1727 17379
856 17379 -9266 -8192 16486 -7048 -16871 18916 11000 -20835 1895 15928 -12520 -9874 13003
869 13003 2989 -5794 198 -3860 -3715 7845 8575 -1533 -10854 -6547 13653 10404 -15657 -7046
883 -7046 14259 -2635 -9306 9051 -2942 -10186 17944 7699 -26870 -3346 25243 -1008 -13439
896 -13439 3538 -2380 -6360 10682 4618 -11498 -1605 9443 674 -7078 -884 8616 3808 -10909
910 -10909 -5531 8552 381 -4301 6308 -2732 -11418 10606 10228 -15475 -1711 19091 -5614
923 -5614 -16678 7742 7815 -5592 2587 880 -12876 1559 16423 -71 -13328 -906 9751
936I751p657r865N336Q041m639m233L620m344K54J6850n625k5082J0495K4780
950A7682j4630j4344J4440p13j0379J2029K966j6863O520J7061j3647j3676J4977
963A423J0568j1429p013N151K267j897K682J593p908l24J2894l195j6133R482
977a839J6131j4364j2540J4389L685r448N733K664j4164N334J7337j0185j4669
990a1936J3032R406j2772n187R072K087m800K141o91o667M458J2222o618j4446
1004a0699P951J3700j0000r798J0923K553q540L810K889r444M607J4100j0383
1017A669j4950J3156J2270j2258p236Q715K51m391M690j15q269M745J1612q333
1031A556j3100J0890J2561j0708r647Q903K153m899M462M08j0150M319J4163q636
$$ plain form
936 9751 2094 -7771 -2435 5606 967 -3266 354 -3990 -3736 13114 7489 -17593 -7098 17682
950 17682 3052 -11292 3148 2435 -7944 4085 7051 -9812 -3292 13769 122 -13554 1423
963 1423 11991 562 -6451 -1300 967 -930 1752 3345 -4563 -4887 8007 4812 -11321 -1839
977 -1839 14292 -72 -12612 1777 5462 -3986 1747 4411 -9753 -4419 12918 2733 -11936
990 -11936 1096 10502 -2270 -7457 1615 3702 -1098 1043 352 -6315 -1857 10365 3747 -10699
1004 -10699 -2748 10952 952 -8846 2077 4630 -3910 -100 2789 -6655 -2048 12052 1669
1017 1669 -13281 -125 12145 -113 -7349 1366 1617 -2774 1916 1801 -6468 -1723 9889 1556
1031 1556 -11544 -654 11907 1199 -8448 455 2608 -2291 2171 2579 -7571 -3252 10911 2275
1045B275j3590J0861J1495j0768p694Q158J306m169M756l55j0186M507J3721p243
1059C074j3411R153J1066r522o922P954N50m860N322M72j0321L815J3320o601
1073C089j2728Q446J0098q682n677P320k19m622N423N40r997L200J3050o256j2627
1088i642R121R246r227m952P658n30n148N168J581r665K909J2272o175j2621R479
1103e26R639j0223m709Q569r38n700O086P10r449M098J1477p434j1131R502Q942
1118H913r347m802P081m10m317M534J091r077K987J2055o520j2274R410J0667
1132I991j0223n993Q470m00n837P269K7j1185M733J2870q336j0925J0055P298
1146G814q573l696N722n45k555N048j100q773L072J1858l982j3276O745J1516
$$ plain form
1045 2275 -11315 -454 11041 273 -7421 737 2043 -2126 2630 2275 -7911 -3404 10317 3074
1059 3074 -10337 -1184 9882 360 -6562 1392 1942 -2918 2404 2876 -7445 -3630 9690 3089
1073 3089 -9639 -1193 8905 223 -5454 1866 1647 -2975 2448 2988 -7009 -3809 9241 2985 -9642
1088 -9642 -521 8725 -502 -5454 2204 1674 -3474 1694 3275 -6390 -3481 8791 2616 -10005 -526
1103 -526 9113 -1110 -5819 2750 1812 -3888 2198 2908 -6541 -2443 9034 1600 -9531 -29 8913
1118 8913 -434 -5236 1845 1435 -2882 1652 2743 -6334 -3347 8708 2188 -10086 -676 9991
1132 9991 -232 -6225 2245 1845 -3992 3277 3304 -7881 -3148 9722 1386 -9539 516 7814
1146 7814 -759 -4455 1267 722 -1833 3215 2115 -6658 -3586 8272 4290 -8986 -2241 9275
1160I275r177o005Q473o33o579Q365P94j3780N441J5012q996j2595J0658O702
1174F955q435n1M019m549n66O940k424q231L170R962l163j1535M148J1362n787
1189A815o748P600j064p983R404M440j5791K055J6918q681j2598J3314M507j1156
1203c968K696N797p380q5Q419m058q022M620P363l870o821L626P781n010o918
1218e830P358K537q429N596M959j4052J224J8815q864j6565J4632Q044j4267K357
1232b485Q368r982K18J2202p724j0767J0646O897p652m732K956N441o09m989J504
1247g08K513n483M135O864j2737l062J8307n301j7498J4072J0306j7138J689J2677
1261H636j2701k153J6571q548j3699J3821O887j2784j468P632L32j196k381j706
$$ plain form
1160 9275 98 -5907 2566 1933 -4646 3719 4513 -9267 -3826 11186 2190 -10405 253 6955
1174 6955 -1480 -1531 2488 -2061 -2627 4313 1889 -6342 -3172 6790 3627 -7908 -3760 7602 1815
1189 1815 -4933 2667 1603 -6380 3024 7464 -8327 -6272 10646 1965 -10633 2681 7188 -3968
1203 -3968 -1272 4525 -2855 -2940 5479 1421 -6601 -1981 5382 1512 -5309 -1683 6098 1088 -5830
1218 -5830 1528 4065 -4364 1232 6191 -7861 -6637 12178 3314 -13251 1381 9425 -4842 -2485
1232 -2485 5883 -4099 -3881 8321 597 -10170 476 7373 -279 -5011 -2055 3386 2777 -2212 -708
1247 -708 1805 -3678 457 7321 -5416 -8478 9829 4528 -12970 1102 11408 -5730 -4041 8636
1261 8636 -4065 -6218 10353 1805 -11894 1927 8814 -3970 -5438 2194 2526 1330 -1051 -2757
1275b757L490Q93m85K020q847j969J7498k325k0471R377J5301j4935j403J3079
1289H466j2130n279K1217p302k0508J5102J2826j5980j652Q900n619R66O458n385
1303H0l818L838J294J248l531m782R062K105j4432N805J4453j4302m930J7179
1317I269q403j1518J9437j703k1677J4844J4392k2145k230J7864n887o609Q485
1330D119n543n349J2270R28r440j827K234O642K419j2856j53J4724o100q717J1908
1345E259m211j0898J8366J325k5495J0374K1533j9211p325J8513q219r263J6898
1358G646j809j5206J0228O243j1648J357O542k637m18k946j404R587k387j0090
1372f942R361K111j1508R834N742k0058O950K1107j9830j2717K3762p41j5361
$$ plain form
1275 -2757 733 1626 1141 3161 -5686 -7655 9843 7518 -12953 -3576 11725 -3210 -4613 8466
1289 8466 -3664 -8943 12274 4972 -15536 -434 12392 -3588 -5240 3660 -1959 -993 5465 80
1303 80 -3738 100 1394 2642 -889 -5671 3391 5496 -8936 -3131 11322 -2980 -7910 9269
1317 9269 866 -10652 8785 7082 -14595 249 14641 -7504 -9734 8130 2243 -4366 4119
1330 4119 -1424 -6773 5497 6425 -3015 -4842 -2608 4034 6453 -6403 -6556 8168 2068 -6649 5259
1345 5259 1048 -9850 8516 9841 -15654 -5280 16253 -2958 -10283 8230 11 -9252 7646
1358 7646 5837 -9369 859 7102 -4546 -3189 3353 716 298 -2648 -4052 5535 3148 -6942
1372 -6942 2419 4530 -6978 2856 8598 -11460 -4510 16597 -3233 -15950 7812 7071 -8290
1385h290J2532K87j7066J4248J2941j9443m968J3933j196m023J292l883L315N435
1399E114o841K58L156n963P102O633j8162m80K1613r999j4560J8250l48j8487
1413a2714J6019Q296k1394N954J6710j7157n981J8801m330j1385P997O45m308
1426b847N311j500l899M999k052r06M543q086o00J5931q174j7059J6214P891j6807
1441g041O968R108j8658M305K1025j6302j3383K0613N57j5326Q092M176r074O031
1455A091M458r984P79O848p70k26m488l338J0121J03j2526Q574O927j4955M691
1470b695J2164j4199k022J9231j1380j5365J9872M276j9083P130R801j2887J973
1483c184J0224r204k644R998k843n739J615J582L773o84r413L563Q882p762n51
$$ plain form
1385 -8290 4242 4529 -12537 1711 14652 -4791 -9759 4174 2978 -1045 247 -3636 -321 5114
1399 5114 -1727 -1469 1687 -4276 2826 9459 -8703 -9183 12430 2431 -12129 6121 5773 -12714
1413 -12714 3305 11601 -9793 -3839 12871 -4286 -10267 8534 4204 -7181 816 1461 -2847
1426 -2847 2464 964 -2935 2064 12 -894 3649 -4437 -5037 10894 2720 -14339 1875 9766 -7041
1441 -7041 -73 9035 -9623 -5318 15707 -595 -13978 6635 7192 -8134 -42 4134 -4940 1091
1455 1091 5549 -4435 -3656 3192 2422 2196 -2292 -5630 4491 4594 -7932 642 7569 -7386 -2695
1470 -2695 9469 -4730 -6752 12479 1099 -14266 5606 9882 -9201 -2071 7730 -5157 -3184
1483 -3184 7040 -2164 -4808 5190 2347 -3392 -1777 -195 3578 2894 -6519 -2956 5926 -1836 -2387
1498b387Q865r997l995J7793o530j6405J5703P799j9322L970J2516j1500q41J2375
1512H044r198p954J3403K180r930J461L471j479P93k087j7M098l542k195O213
1527C261m650l268J1823k993j5222J1337R966j5252j60J2783r625n240J3901m704
1541A957j0657J1928M339j3095J273Q559k955k383J091j712R66J656m41Q35k683
1556a322k180P828p61j0644O768R000j1808k935J1355n546n715J2216k936j3236
1570i916J0492Q643j2229j693R374l777m511M931m56k880K551R15k261j724J822
1585g19M891j554p535L457O829p095k014Q380m382o250R334K07j0408P000Q597
1600H738j1327l808J0639j738o086M948P92n807K815M133l745k190L495K230l369
$$ plain form
1498 -2387 6478 -3519 -7514 10279 3749 -12656 3047 10846 -8476 -4506 8010 -3490 -4331 8044
1512 8044 -1154 -9108 4295 6475 -3455 -1994 1477 -2 791 -1296 -1313 2785 -757 -2952 3261
1527 3261 -1389 -4657 7166 4173 -11049 288 10254 -4998 -5158 7625 -2000 -7240 6661 1957
1541 1957 -8700 3228 7567 -5528 -4255 4304 1349 -1034 57 -1655 -689 967 526 1361 -1322
1556 -1322 -3502 4326 3565 -7079 -311 8689 -3119 -6054 5301 -245 -5960 6256 3320 -9916
1570 -9916 576 9219 -3010 -4703 4671 894 -3617 1314 858 -2022 529 1444 -817 -2541 -719
1585 -719 4172 2618 -4917 -1460 5369 -1726 -3740 4640 258 -5992 3342 3549 -6859 141 8738
1600 8738 -2589 -6397 4242 2504 -3582 1366 2158 -3649 -834 3299 -446 -2636 859 3089 -280
1615b80l329L951M154n023k905M971j487l378O659M9r647M847Q756q438m454R788
1631D234q54p649M166K606n445K469M804n111m274N873L572m369k946L168J913
1646B157l410l5L190j925k370M793q85o735M528P273o892n268P345J136n405L074
1662E71K237n626Q41O094m210m673N731L778n861k632M629J641k989K7J351l007
1678b098J12N318j733o135L539N820m933m218O146J477n351J654K116m558J176
1693a668O080l659o029N061M610n449j967N020K65l971J772J638l658P97M368
1708C210k716n297M521N213n042l428M964P28m236K302K206m184L10N105l500
1723A56m881N164M152n415k526M789P53l580J534J461l801O19M509k808m665M666
$$ plain form
1615 -280 -3609 342 4496 -527 -3432 1539 52 -3326 3333 3382 -6265 -1418 7338 -1100 -5554 4234
1631 4234 3380 -4269 -103 2503 -2942 -473 4331 -780 -5054 819 4391 22 -2924 244 2157
1646 2157 -1253 -1288 1902 -23 -2393 2400 1515 -5220 -692 6581 -311 -5579 1766 2902 -2503 571
1662 571 2808 -2818 -1977 4117 -93 -4766 965 4743 -1118 -3750 879 2520 -469 -442 909 -2098
1678 -2098 -1986 3332 1599 -4536 -997 4823 -110 -4328 1818 3295 -2056 -402 1714 -2844 -1668
1693 -1668 4412 753 -5276 -215 4395 -1054 -3021 1999 2264 -1707 65 1703 -1955 -1158 3210
1708 3210 494 -4803 -282 4931 -111 -3539 1425 2153 -2083 219 2425 -1759 -1449 3656 156
1723 156 -4725 439 4591 -824 -3350 1439 2192 -1388 146 1607 -2194 -1575 2934 126 -4539 127
1739A27M387n406k575M911J307l928Q61J771l559P20N234l617m927N195M062n496
1755i33k746N054R06l692J441J294l597J484M325l356m440M170M698m929l100
1770c421M608J090l458J363R98l510J158M824k926n682M850M898n323k996M961
1785A434N36l388K174N75l678J470M810l757m866M685L721m289k015L627Q95k884
1801i50J107J577l331J64M975l049n470M990M441n374k550N540m21l775L160Q69
1817A903m104J432M236m038l619M987L100m578k236L548R03k133P08J199k636
1832a328o9L899j249n612M240M952o004l270O855J9m905L778O40n451K647N051
1848D193n025l347N617J205m557m1L544l76j744L49J12p83J89L016j060n480L166
$$ plain form
1739 127 4514 -892 -3467 1444 2751 -1177 -316 1455 -2104 -1384 3850 233 -4694 501 4563 -933
1755 -933 -3679 1375 2281 -1411 30 1324 -2273 -789 3536 180 -4260 -90 4608 -321 -3421
1770 -3421 1187 2277 -1181 182 1180 -2330 -1172 3652 726 -4956 -106 4792 -531 -3527 1434
1785 1434 1970 -1418 756 1331 -2347 -877 3933 176 -4690 -5 3716 -573 -2588 1039 1934 -950
1801 -950 157 1734 -1597 -1433 3542 493 -4977 13 4454 -920 -3470 2070 1649 -2126 1034 1903
1817 1903 -2201 -769 3467 -571 -4190 797 3897 -681 -2917 631 1534 -599 109 1308 -1328
1832 -1328 -1397 2502 1253 -4359 -119 4833 -1171 -4441 2414 2433 -2472 1306 1946 -3505 -858 4193
1848 4193 -832 -4179 1438 2643 -1914 -1955 1589 1213 -531 -182 -70 -853 -664 2352 1292 -4188 -1022
1865a022N575n371l342O836K4n929L529K204n470K330N669o606m181P758J824
1880C828o013M25K905j660J97J610r55j421J163J388j517k997J949N507l860n431
1896d882N831J666n489L689L462p756N61Q110n480n062P911J014p862K999M556
1911C268m300M61L012k992j715L279O38j996j262Q49L083k120l882M915K705o527
1927b584J255M735n807j48Q928n647p876Q966K936q923K962N609o557k35O284
1942C898m165k951N572J10m511N00J090J078L69k679J165K524l988Q09N361m735
1958e53l472P761k315p407P898L827j0842J790Q457o200k162P945m085n646P812
1973B808K32o583K688L187k354q92n14J92L445j397k435L013k198k431P185p32
$$ plain form
1865 -1022 4553 -818 -4160 2676 2700 -3229 300 2504 -2966 -636 5033 -1573 -5754 2004 3828
1880 3828 -2185 -1760 1145 -515 -318 1292 337 -1084 79 1467 -50 -3047 -1098 4409 549 -4882
1896 -4882 949 2615 -2874 815 4277 -3479 -2918 5192 -288 -5350 2561 3575 -4287 -1288 3268
1911 3268 -1032 -571 2441 -551 -2266 1013 1651 -345 -1607 -758 2325 205 -3677 1238 3943 -2584
1927 -2584 -1329 3406 -2401 -2549 6379 732 -7144 1822 4758 -4165 -1203 4406 -2151 -2386 3898
1942 3898 -267 -3218 2354 2464 -2047 -1547 -457 621 990 -1689 -524 2000 -1988 -1179 4182 -553
1958 -553 -4025 3736 1421 -5986 1912 5739 -5103 -3313 5144 -1056 -3218 4727 642 -5004 2808
1973 2808 3040 -3543 -855 2332 -22 -914 -1428 -1236 2209 812 -1623 1390 -808 -3239 3946 3214
1989C214r492N360O739r499Q4R321o776l787R709l058q327Q882K863r003J786
2004a984N147m723R9M121l072l24J095j276J850Q13l555K817J141o575L600O883
2020F057q379k748R851m218o126R801q77j0001P883M898j0746P32R153n223l347
2035c290N448k723k208N555o84l730J456l00J046K189m777q08O594l881m045P607
2051C449j952p165Q542K449j1595M786Q396r009j664R196n903m923Q970r55o887
2066d265M568K078m832K634K062k913L72p8j073M112k166m857N632J985p144M362
2082D77L854q947L361Q331r434m237J1475k079q188O896Q75p922O531M868q535
2097b674l96N995k092j542J617k406J207K159l188J218J508m140K528M424o926
$$ plain form
1989 3214 -6278 -918 5821 -3678 -3594 5727 -1049 -4836 4873 1815 -6512 2370 5233 -3770 -1984
2004 -1984 3163 -1560 -1461 2660 -412 -736 359 -917 933 1746 -1809 1008 2149 -4426 -826 6057
2020 6057 -2322 -5070 4781 563 -5563 4238 3361 -6640 1243 6141 -4605 -3873 5280 57 -3290
2035 -3290 2158 -565 -2773 2782 2098 -1632 -176 -476 570 2759 -2018 -2826 3768 -113 -4158 3449
2051 3449 1497 -5668 2874 5323 -6272 -1486 6910 -2099 -3763 5433 -470 -5393 3577 2622 -4265
2066 -4265 303 2381 -2451 183 2245 -668 -296 -374 -1447 2665 499 -4358 1274 3259 -3885 477
2082 477 4331 -4616 -1255 7076 -2358 -6595 4880 2801 -5387 1509 2384 -5538 993 5861 -2674
2097 -2674 -3070 2925 833 -709 908 -1498 -291 1868 -1320 -102 1406 -2734 -206 4218 -2708
2112b708n22Q405n097n336R101j313q936P259M460r409K110O856p268j116Q046
2127D532l241m802M059N73j928J624j354j089K566p89r38K288k721p36O768l722
2143A090p068P402L107q378L537L724q029K255R208p654m908Q877l98n927M325
2158A163Q36m887K696K681l767j01K139q79J133j383j676L985n47m298L961J847
2174B903p105K886N993o450j362P284m205m744Q289K52q099L522M810n636M19
2189a243L402l336o66L877j552k009R03J039J495r54l383J936L367l826l51L416
2205B115m319r15P055k223o711O084K906o903K176M561n418q51N434k797l699
2220c505M934L42l258J309J075r80J4K8N13P09k673j1L177j568j808L556j420
$$ plain form
2112 -2708 -3230 5175 78 -5258 3843 2530 -6406 853 5313 -4096 -1986 4870 -2398 -3514 4532
2127 4532 1291 -3511 548 1121 -807 817 -537 -1626 940 151 -787 1501 -1220 -1956 4812 1090
2143 1090 -5978 1424 4531 -3847 -310 3414 -4615 -2360 6848 -806 -5714 3163 2765 -3162 1163
2158 1163 1999 -2888 -192 2489 -1278 -1379 760 -119 1014 -369 -2045 1940 1393 -2905 1056 2903
2174 2903 -4202 -1316 4677 -1773 -3135 4149 -56 -4800 3489 3741 -4358 -836 3974 -1662 -1243
2189 -1243 2159 -1177 -1843 2034 482 -1527 -624 415 1910 956 -2427 -491 2876 -950 -1301 2115
2205 2115 -2204 -3119 3936 1713 -4998 1086 3992 -2911 -735 3826 -1592 -2443 2991 194 -3505
2220 -3505 1429 1771 -1487 -178 897 -83 -69 -41 472 1181 -1492 -1503 1674 106 -1702 1854 434
2237D34m121N090K665o304mN649l445k619M530j809l469M979P52m732P44M030
2253B370j565j841J084n43J016j02j30K63j656l26L204l10l989K769K627m557
2269a686J0M501k510k850M551r49m275L191K973m412l5L474j495k398K464P64
2285A318j822K67J81l46j41M89J096j305j993K638J712l186m09L499j380k644
2301b026L136L9l375K338K364m110o58M208o18k809J751Q34j837P9J911j202j504
2318a479J606Q28j502q82K053R79k624k98L002j141j873K100J96l119J771K449
2334B066l235o02L645o65l177K012J900k397m14J769r24j399J867N99j880o46
2350a481K194N32k423P28J946j318j496J919j05j880J473J568k642j176L428l86
$$ plain form
2237 434 -3687 1403 4068 -2236 -2240 3409 -36 -2655 1875 66 -3403 1576 2328 -2404 -1660 2370
2253 2370 805 -1036 48 -495 521 419 289 552 -1104 -1430 1774 1464 -2525 244 2871 -1686
2269 -1686 -1676 2825 315 -2535 2016 1067 -3208 -17 2956 -1456 -1491 1983 488 -1910 554 1318
2285 1318 -504 -237 -56 -402 -543 -54 1042 -263 -2256 382 2094 -1092 -1501 1998 618 -2026
2301 -2026 1110 1149 -2226 112 2476 -1634 -2292 1916 1298 -1511 240 1074 -763 -684 1227 25 -1479
2318 -1479 127 955 -547 -1429 624 1603 -1021 -1319 1683 542 -1331 769 965 -2154 -383 2066
2334 2066 -1169 -1771 1874 1209 -1968 44 1944 -453 -867 902 -22 -1421 446 1045 -835 -1481
2350 -1481 713 1245 -1178 -450 1496 178 -1318 601 496 -1384 89 1657 -985 -2161 1267 881
2366H81k481J582J629k118l50J984p66j815J553J057k407k59K744l85k115R32
2382c34K076j960n40J736j98k226J090J748j896p31K346l16k197J367J689j733
2398g9p40K150p40j862J506J222k331l77K367k73k080R80J395j301n42J686m55
2415E26j660J069J533k545k95K144P0j889O48J871j682q28K125l97k031J853P54
2432A266j953l17K032k60j994R43J417j805m23K110o12j462J184J475k287o26
2448a312K357m07k025J271J734k230k7J814n71k068J830R85k160m66K136j77j817
2465a133J449R82j900k11J757l68j507J027R40j781l78K057k75k039J238J491
2481A349j613q67K298m10k120J639J294k553m96K700p40j776J656Q46j634O2J235
$$ plain form
2366 881 -1600 -18 1611 -507 -857 1127 361 -1454 99 1156 -1251 -1510 1234 849 -1266 -334
2382 -334 1742 -218 -758 978 780 -1446 -356 1392 -504 -1235 1111 795 -1402 -35 1654 -79
2398 -79 -819 1331 591 -1271 235 1457 -874 -1251 1116 843 -1237 -257 1138 -163 -705 981 526
2415 526 -1134 -65 1468 -1077 -1372 772 842 -1047 -399 1472 -210 -1038 1087 690 -1341 512 1266
2432 1266 -687 -1004 1028 768 -1226 -283 1134 -671 -1094 1016 404 -1058 126 1601 -686 -1312
2448 -1312 1045 638 -1387 -116 1618 -612 -639 1175 604 -1464 366 1351 -809 -1275 861 684 -1133
2465 -1133 316 1298 -602 -813 944 576 -931 96 1036 -745 -1123 934 659 -1380 -142 1349
2481 1349 -264 -1131 1167 757 -1363 276 1570 -983 -1479 1221 481 -1295 361 1207 -427 -365 870
2498H70q15p85P25R75j420l85J172k45j212R43J862j807j075J949N3k352J697
2515A50J413k664p3K545j323j870K585O54k461L66K088j417r14J713J19j943J93
2532h39J434j15j231P20J009q67p03J756j99k369J137K165k760r62K905o64j751
2549a334J702Q76k889J449K329k146j969K554J97j392M38M71p28l45R37M75j053
2566d28m37J742J87k632O58K369j799j118K399k94l228L102J605l107jK639j937
2583b80j199K811l28k982J627J381j452j50J175q11j90M46M32R0r11j24K038j946
2601c73j426K344P16k720J611J353l239O36M114k795k731L582L7k868K110J455
2617A806l223L99J892p99r78J387J26l95m13j79Q38o96n57J350Q1l126J281L464
$$ plain form
2498 870 55 -730 -5 970 -450 -835 337 92 -1120 -177 1685 -122 -1197 752 805 -1547 150
2515 150 1563 -1101 -1174 1371 48 -1822 763 1417 -1044 -678 1410 -7 -921 792 911 -1032 -839
2532 -839 595 480 -751 -31 978 111 -592 1164 965 -1404 -267 1898 -862 -1824 1081 417 -1334
2549 -1334 368 1244 -1645 -196 2133 -13 -1982 572 769 -623 -185 286 -442 -787 150 625 -428
2566 -428 -865 877 1064 -1568 -910 1459 -340 -1458 941 647 -2581 521 2126 -981 -982 1657 -280
2583 -280 -1479 1332 1004 -1978 -351 1030 -422 -572 603 -208 -398 48 480 570 -341 -465 1573 -373
2601 -373 -1799 545 1261 -1459 152 1505 -1734 -1098 3016 221 -2510 1072 1109 -1759 351 1806
2617 1806 -1417 -1018 874 75 -903 484 610 215 -198 -377 461 -235 -792 558 639 -2487 -1206 2258
2635B258k151j236K888j664k686M439M06m900J533K911k588m01K775j894j273
2650a583K530j07j966O90J151M1l28j528J22J896r31m7Q68j683j356M458p73l757
2668b303K488J619l652J561K624l338q45M125j764k945K742R08j958J274K75k103
2684a292M26J760j34n5j437r11K329O04j780Q33J57k477K756J947m655Q8M301
2701B460k468k138L540r08k797L782N61m620J802L039j991l19N99j524M4J893
2717I55j11l03r58r74J451J783k710P76J662k463l24L484k497k751M695K58m376
2734b403J979K187k994J475K855m301j331L690L81k072O54n91l59J530L25j089
2750f4J71o06N41J765k493j478L767o34k739K021R18l580K719K761m594j376M692
$$ plain form
2635 2258 107 -1129 1759 95 -2591 1848 2254 -2646 -1113 1798 -790 -1191 1584 -310 -1583
2650 -1583 947 840 -1126 -436 715 756 428 -1100 -978 918 -13 -60 808 -875 -2231 2227 1454 -2303
2668 -2303 185 1804 -1848 -287 2337 -1001 -1846 2279 515 -2430 312 1220 -738 536 811 -1292
2684 -1292 -866 894 760 705 -732 -1643 686 1290 -490 343 500 -1977 779 2726 -1929 -1841 2460
2701 2460 -8 -2146 1394 486 -2311 1471 2032 -2588 -786 2253 262 -57 542 -982 -938 955
2717 955 844 541 -417 -1391 60 1843 -867 -91 1571 -892 -1216 2268 -229 -2980 1715 1973 -2403
2734 -2403 -424 1763 -1231 244 3099 -1202 -2533 1157 1538 -534 120 -471 -830 700 1025 -64
2750 -64 107 -499 42 1807 -686 -2164 1603 969 -1770 251 1169 -2411 308 3069 -1525 -2901 1791
2767A791j163j763K905j364k946K127K331k303j34N32j31L43M90j206Q14j64p29
2784e70J499p59k467K687J773k899r78K991j824l26L903k611l929L996J867l321
2800i68P82J617k790M58K479j389j373J843j31n17on54O08Q87j408J3R46k131
2818a634P77L200k220k247L136K0k918K762J311m204P93L571k658q05K163q06
2834B41j572K168L33k785J199J501o70p74k98j2K168j316p65J171r63n44K666
2851A748m14l389J609K669k903n07K797k057j352L179p47k502K097J283k199J11
2867e77J283j006R6P37J1m25m74j29R14L93j525O49N78j442J040J779k851p40
2885a689L225j217k093K366O02k382J502J007k424n9L088j453j451J066K6q4J86
$$ plain form
2767 1791 628 -1135 1770 406 -2540 -413 1918 -385 -519 13 -118 225 715 -491 323 159 -570
2784 -570 929 170 -2297 390 2163 -736 -1714 1277 -547 -873 3030 419 -3510 486 2353 -968
2800 -968 -186 1431 -1359 -901 1578 189 -1184 659 528 11 5 -549 59 946 -462 -449 497 -1634
2818 -1634 -857 2343 123 -2124 1012 1032 -1886 876 2187 -2017 -1224 2347 -311 -1116 1047 241
2834 241 -1331 837 1170 -1615 -416 1085 415 -359 -657 -669 1499 183 -582 589 -374 -918 1748
2851 1748 1334 -2055 -446 2223 -680 -1187 1610 -447 -1799 1380 633 -1869 228 1511 -688 -577
2867 -577 706 -300 -204 533 544 119 -355 -484 430 823 -702 -53 525 -917 123 1902 -949 -1689
2885 -1689 1536 319 -1774 592 1194 -1188 314 1321 -1103 -1162 1926 473 -978 88 114 30 216
2902B16j45j21j76K08P50j61j466O34J315j462p91K446j007j382J713M67k258
2919a220N67K524k111r07K204o36j603J524P43j661J27O83l10j95O96j38m86k14
2937d13N91Q41j694m18J746k35j550Q81Q96j317N20K040k343n43K069J1k016J048
2955A14N40j053j7J286j072q02J253L97r44k19P53K74j069j0J177m70j071R70
2973C7P17j290K30J005p80j295K202j5j886R19J493j609n16R36q8n60P93L0q29
2992e06K84J082m36j064O18O69k34j052N96K90l26j69J048r64o17J510K09k082
3010a144P63J071r33o51J374n63p33O48Q36j116J17J055j51j241K20R36k89k80
3028h1J03q0o86Q30Q23j166l68J230K66j574M27J284j137m91J211o44n02O69P63
$$ plain form
2902 216 71 -50 -226 -18 732 571 -895 -261 1054 -408 -1199 1247 240 -1142 571 1038 -1220
2919 -1220 -653 1871 -240 -1147 1057 421 -1182 342 1085 -576 -449 234 -76 -271 425 287 -199 -413
2937 -413 178 1019 -675 -1093 653 418 -1132 -251 645 -672 -152 1888 -455 -998 1071 1082 -934 114
2955 114 654 -399 -416 870 -202 -1004 249 646 -298 -517 236 510 -559 -569 608 138 -933 37
2973 37 754 -536 -306 699 -81 -1376 826 811 -1075 -156 1337 -272 -788 148 60 -500 293 323 -506
2992 -506 -222 860 424 -640 -22 647 413 -639 -43 247 -79 -248 800 -164 -781 729 938 -1144
3010 -1144 -381 690 -243 -894 480 -83 -816 -168 668 -448 -331 724 573 -668 -448 488 199 -81
3028 -81 22 -58 -744 86 909 -257 -625 605 871 -703 -276 1008 -129 -620 591 -53 -555 114 877
3047H77j246qJ086l65q74O64Q02j096j62Q27m94m58P73K03j052Q5R52K0p97j7
3067b80J133j114l12Q73n6j052P28P55j070l86J350%j389Q21N96j054RO12k27
3086f3m66M04O03r58J13Q47J04r29N05L72o51p9N88l21r12Q29P27j231k32J251
3106E01M1j112P08N33q62j8M41j93m77Q02J06q21j64J092k51o16R5L29l92M5R49
3127G36o09n41K73Q42j425K43J101k41o41mQ00q59J46O44p18k86P10K20o48o12
3147h69J356j26o40J23M77m72k21Q72k88j001P01N91r40j96J068j83q81Q58J3
3166B42o67K70P81r57m37J100J76j098p8J366k54p72R3M51n7l87L43l6j027J221
3186B73J39o11n49J052L90j219M76O34p89J1Q45j175m14J433K23j218O8O43j52
$$ plain form
3047 877 -369 -377 709 344 -530 134 936 -160 -322 505 11 -447 326 529 -523 -438 514 534 -263 -280
3067 -280 853 -261 -573 300 244 -808 -80 675 -395 -781 569 569 -820 1 597 -457 -448 164 -63
3086 -63 -529 -125 478 -480 -367 480 584 -345 160 532 -119 -198 390 69 -843 -14 713 -518 -750 501
3106 501 542 -570 138 671 -191 -209 232 39 -438 364 470 -351 -515 577 326 -290 -195 134 -258 -213 736
3127 736 127 -414 -141 701 -724 -481 620 379 -262 -266 534 -325 -179 465 -253 -539 171 391 -257 -869
3147 -869 487 361 -279 -156 321 -151 -372 500 212 -789 -88 503 -437 -633 435 252 -629 229 242
3166 242 -425 -155 626 -331 -768 332 508 -590 -668 698 444 -328 -235 216 159 -228 115 79 -948 273
3186 273 412 -199 -748 304 694 -525 -49 585 -204 -193 652 -523 -937 496 719 -499 -431 212 60
3205F0j96K70p7l14J63L55l51k76L11K98m51p10J084M00j122N38R28j117j02J382
3225A073j108p61J581K05j971N08J285o62m05N21o22J48P41n03j81k06L21L16
3243B80m85p87J431N45j251j86R81q35J8J223j004j090J853K82j889K64J555q81
3261B4n93J029l99n95J127j57r47K43M66N8l23n10K66P03m41k61Q03l17j003J255
3281D28l87j105J477P01k243R6J962p27q53J259n78o36J389Q6j674L87R68p63
3299b13j47L13j75P12l6p88K44L51o69J106m55j246J070J032j812J2J815j085
3317B9j162J939k66j479J230M12j546M15J346j394j49J096n72k48M79m83M31O11
3335F89j075k5O85p89L97J136j805m49K219o88j348J299L27j563J481J128k596
$$ plain form
3205 60 -136 134 57 -257 -94 261 -90 -366 -55 243 -208 -918 166 566 -556 -18 910 -207 -309 1073
3225 1073 -35 -796 785 990 -981 -473 812 150 -255 266 -356 -208 533 30 -151 -357 -36 280
3243 280 -205 -992 439 984 -267 -453 528 -307 -289 934 -70 -1160 693 975 -914 -650 905 24
3261 24 -569 460 61 -534 593 436 -511 -268 198 256 -67 -577 -311 392 -49 -310 493 176 -827 428
3281 428 41 -1064 413 1114 -1129 -1033 929 202 -651 608 30 -606 783 869 -805 -418 550 -213
3299 -213 -360 -47 -222 490 454 -334 -90 261 -408 698 243 -1003 67 1099 -713 -701 1114 29
3317 29 -1133 806 540 -939 291 703 -843 -428 918 -476 -625 471 -101 -349 130 -353 78 689
3335 689 -386 -411 274 -515 -118 1018 -787 -1236 983 295 -1053 246 573 -990 491 1619 -977
3352i77K70J957r06j129Q96p9k64O78k24j006P71N42k86J31r10Q4J128q05j019
3371a148J676J3j642R87Q86j686J063J179j685p61K283j016j593J896M28j263
3387c83M07L38q42O99N36j224l18Q08K03J98n09r79J273N66j412K47J120j116
3405c88K18J311j964o70K720m01k059J190M93j009L32J391j940K40J421q32n6
3422cN97m73p89O96m31N38N71j143q8J339j185j1J361j004q44J797j17k564J708
3441d5J568k206J52J239j467L31J924j127j770J390M19m07L57l89n10R93o10m40
3459e98Q01o0j48P20n57j118J536J044k458M22P41r40J61J750j367j249K499p96
3477C83j307J414M58j503M17M38p65O04M6n26K90L12n65L69J22n86N72P19k359
$$ plain form
3352 -977 -707 1250 344 -785 111 32 -232 446 222 -784 -13 529 243 374 -536 -452 676 -129 -1148
3371 -1148 528 541 -1101 -114 772 -914 149 1328 -357 -1118 1165 149 -1444 452 880 -383
3387 -383 24 362 -480 219 755 -469 -787 21 224 422 -87 -1066 207 773 -639 -392 728 -388
3405 -388 -170 1141 -823 -1493 1227 826 -1233 -43 450 -559 -227 1164 -776 -536 885 53 -3
3422 -3 594 121 -668 28 -403 135 706 -437 -525 814 -371 -382 979 -25 -869 928 811 -1753 -45
3441 -45 1523 -683 -531 708 -759 -428 1496 369 -1401 -11 408 1 358 -31 -541 452 -158 -598
3459 -598 203 143 -5 715 158 -960 576 1620 -838 -416 325 -615 -454 1296 -71 -1320 1179 383
3477 383 -924 490 948 -555 -138 300 -465 139 185 -341 -51 261 -304 65 187 -399 173 892 -1467
3496a467P81J897j435p36J352m88o01J717J2k379P81J838j532l60R56m75l55J422
3514I28r32l76M93L10O0k57q35N54Q91q65m54P24l65r82J948m60j383J485R0j667
3534a093P23J609j441p71J306o7r03Q93m8m66M71O9o41J97L22J52L81r39o37J165
3554B82L46j098N17J57p25J004L12j501J9J968j168r26J145k79l63Q73k61j527
3572a225Q63R52m05m12m9O6K50K57p77P71l28k14P91l39q74Q26P27j485l6J343
3592G02n65m45O06J56j397Q92L38j002J98J360r53o59Q03L40ll46k77k96R71j95
3612B28l58R7j31L05L94p12k26R37J9j206M98L19o68M75N10j227J79J470n98q68
3632e63M24M69m59m8J21M1Q2K88m96l58L32O69l40m43o5N37Om66L89M24q78J62
$$ plain form
3496 -1467 -686 1211 -224 -960 392 -96 -697 1020 1032 -1347 -566 1272 -260 -620 336 -139 -494 928
3514 928 -4 -380 113 423 483 226 -609 -55 836 -29 -483 241 -124 -1106 842 382 -1001 484 574 -1093
3534 -1093 -370 1239 -202 -973 333 266 -637 256 208 -258 213 282 -359 -162 160 312 693 -246 -883 282
3554 282 628 -470 47 204 -521 483 795 -706 -687 1281 113 -813 332 53 -310 563 302 -1225
3572 -1225 -362 590 185 -227 -276 -210 40 297 -480 291 -37 -251 540 201 -673 153 880 -605 -641 702
3592 702 137 -308 298 454 -943 -51 287 -715 -517 843 -110 -769 34 374 371 25 -252 -548 423 228
3612 228 -130 -33 -164 141 535 -177 -403 534 553 -653 -155 164 -504 -29 481 -746 -567 903 305 -563
3632 -563 -139 330 -129 -177 -56 -15 67 355 -141 -499 -167 502 162 -281 -346 191 197 -269 120 544 -334 -172
3654a72P34p45l02J260m53j181R20O6K13l91N8k24J88J26l81l14K87P53m73k63
3674b94K06N18J68r00K13L93J1j56L60q99k32R45K71j230M19P40m36k66K28l77
3694c18p3J021o86m30J51Q06k01q52K92N96O3k49l7j02q5N77l86n35L32O70p0
3715D84r34M23P3l4l9J01l51q8P94k05r27M86Q48l25p87k84J016N7j18l81J18
3736g3j73O72k31p50L98O38l39n42j66J068l06k86M54o49J70K60O3o95O42K41
3756C96l14o29P4Q52k72l35O3N5J13K99rn26J37M30p3r05M52N95k05l66K30K39
3778C01k72J83Q7j038L42P48k22m64Q3N41n26N34j94l00J19N58n78l65J13M09
3798E9K26p58M5P34K58r52L77J49lK73m58m78J30N46p0q01N21L91k07K7L3m2o7
$$ plain form
3654 -172 562 -183 -485 775 322 -859 61 127 340 -51 7 -217 -29 97 -284 -598 -311 442 -31 -294
3674 -294 -88 430 598 -302 -89 304 315 159 519 -380 -612 333 604 -626 -207 533 97 -169 59 -318
3694 -318 -391 630 -56 -486 -335 471 270 -582 -290 306 369 120 83 -19 -104 473 87 -448 -116 554 484
3715 484 -450 -27 46 12 -27 74 -277 -365 429 224 -703 -217 631 306 -481 -765 251 308 190 -191 -73
3736 -73 -246 426 195 -555 -157 481 142 -400 -566 502 196 -90 364 -285 -115 145 208 -487 155 396
3756 396 82 -547 -473 379 107 -228 -165 -110 3 302 293 -233 -96 334 261 -644 -192 403 198 -168 62 301
3778 301 29 212 299 -739 -397 351 129 -335 -252 289 -237 297 103 -197 -78 480 -98 -463 -350 59
3798 59 285 -473 -428 306 564 -388 -11 138 135 408 -50 -528 -398 148 78 -723 -202 189 -18 9 42 0 -67
3821f7L06m4p44k5R23k44l23j19N06p7j27J10k62J90K85j69o72K57N06k01l94
3842c85M21M79o66M38p0l77P4N97l42p70K06N84J6p87J66N90M8k03L03l87k61
3863c26M96M7o58K39N98K56j029L39M09l93M74l96n08L62O11l98p92O82N71k56
3883C28o71k8O39O7n20J16J87m2J13l06k17k4R21o49k46L07L87n42M75K44j037
3904d98P0J126j95j125M45N15k65j30n5J88M28k03k05N1k74L50o6n28J97N46k43
3925A29m99l2N13l2P5K83o24K8J025o71q73Q95L72o76j16J25k81J99L22k64j74
3946b76K84K10L1j62n79O03M09j123M9Q30j35m31L82j88j53Q02n68o23O67L35
3966C64l04n73Q77m70r3N05m41K9M20j11l96l8K97j25K65n68q4O78k8m70M77j70
$$ plain form
3821 -67 239 195 -549 -574 349 105 -218 -337 169 92 -35 75 -187 3 288 119 -553 -296 210 9 -385
3842 -385 36 515 -151 287 217 -160 -86 511 169 -601 -395 189 205 -582 -416 174 222 19 322 -65 -326
3863 -326 170 217 -441 -202 396 652 -377 -38 371 -22 452 56 -452 -90 521 123 -669 13 584 328
3883 328 -343 -371 268 335 -185 -69 118 76 189 -117 -334 -358 563 -86 -332 -25 362 -180 295 539 -498
3904 -498 -428 698 503 -622 -177 338 73 -57 -112 76 504 301 96 147 -127 223 157 -371 -174 372 129
3925 129 -370 -402 111 79 154 437 -187 -159 866 195 -678 217 589 -87 -203 -78 -359 -160 162 -102 -276
3946 -276 8 218 249 87 -492 111 520 -603 -554 276 141 -290 92 -96 -249 553 -15 -638 29 364
3966 364 60 -513 364 -106 -199 306 -135 -106 314 203 -193 -231 66 -59 206 -362 -446 232 204 -266 211 41
3988D1n04Q65P1j177O88P84j107k35M38l16r0J080n60n71N37P2J35p4j18j2N19
4009D66n99j36R2O48o54M78j17k50L64R0q49K17R60q78n21Q99j66m81R91o93n67
4030g06P24N67r56L28k3j49L44k19l84K36K83k95l8N59k61J16Q8o91M4J004m17
4051A54n81N53M3p33P58J43j006J120R3r71J35O34k21L3m6n36J25Q03m76m2O7
4072D9n90N82N79r13m06J433m79q29P83o6n67L68L80r53J71J293q81o98Q79Q6
4092B21l04L35o5p30Q29m4p63K86L19j07K42j30r13J166o4p73M90K07p42M10N61
4113D31r59K62J051j226j96J023P2l64l4k99j30K59N48r00K32L89L48n38l27K46
4133a12N38L42j187k81P43k53J08N71q84M8J128o95n27N32L52l88K02J5p52L53
$$ plain form
3988 41 -463 402 473 -704 -16 768 -339 -574 -136 -452 -542 538 -22 -593 -56 16 151 77 -41 -53 466
4009 466 -133 -269 -177 471 -183 295 178 -72 292 382 -467 -250 710 -168 -689 210 44 -437 554 -139 -706
4030 -706 18 585 -371 -43 -66 -215 129 -90 -474 -238 45 -250 -288 271 10 126 214 -477 -433 571 154
4051 154 -427 126 169 -564 194 337 -669 451 544 -427 -292 342 121 154 108 -428 -303 500 24 -18 49
4072 49 -541 41 620 -293 -699 734 255 -574 209 143 -424 -56 324 -629 -458 835 -46 -744 135 221
4092 221 -83 252 187 -543 286 242 -521 -235 84 -23 219 89 -824 342 278 -495 -5 202 -540 -130 431
4113 431 -528 -266 785 -441 -637 386 458 94 60 -239 -369 -110 438 -462 -230 159 507 -31 -358 -112
4133 -112 426 768 -419 -700 43 -210 -102 469 -415 -367 761 66 -461 71 423 35 237 252 -500 -147
4153a47Q79q32j46N45m4m08L22n36L21K02l11P7J00k09k83L20K83m40Q37o5j402
4174i37P67Q51r30j63O89q87L76R91j139l37J097M31o52m81L64l5M89m05n55o5
4194e31O29k28N9k50n9Q20K49j012K40J53m16K31J96m27j38J218n39r06O93M38
4214D20o36K70L8j84L60m33l1m4N51j94o17N40k33K65K79q20L40Q14n65L6Ok55
4236i3NN17l68r88R67N56o83l10J62L32J93K81o50n36N99J91m72J15p3O29Op07
4258c27J44O20q8m38L22l79J8L75j23n33L09L27k44j59L49J51m07L56m30j82M87
4279A48J18n94K76m0O00j17j81m75M02J16j21m94L95r1L62m78k69L33Q67m58o97
4300c98K35K70J09l39L43n39N36k8l70k70M57K98l9o49J95L81K39n53rj27K09
$$ plain form
4153 -147 732 -100 -246 299 255 -153 169 -367 -46 156 -155 -78 22 -187 -470 -150 133 -307 530 465 -937
4174 -937 -170 681 -249 -412 277 -610 -234 757 -382 -719 378 809 157 -324 40 5 494 89 -466 -531
4194 -531 98 -130 -71 -321 -380 440 689 -323 -83 70 -346 -115 81 -346 -484 734 195 -711 -18 420
4214 420 -216 54 92 -92 268 -165 -196 -240 311 117 -500 40 -193 72 351 -469 -129 685 120 156 162 -93
4236 -93 -88 429 61 -927 40 596 -87 -397 -235 97 290 571 -79 -615 -16 175 -297 -182 -255 374 380 -327
4258 -327 -183 437 349 -89 233 -146 -128 247 124 -409 -100 227 -17 -176 173 324 -83 273 -157 -339 148
4279 148 266 -328 -52 -92 508 391 210 -265 137 253 132 -362 33 -58 304 -174 -443 -110 757 299 -398
4300 -398 -163 107 216 -123 220 -319 217 189 -181 -451 6 304 265 -384 -189 192 431 -122 -131 -258 -49
4321d9N00p23J52J35L51j44o47K72L53l29K98j45n52M68N47n37l88N81L01l33
4341A11l13L49l5J03l08q6J13J88K9o2n90L35P24l03n50M25K49m87L28j89l52
4362c21M62L42n12m95M01N82m54k0P7j16p4J10k88J87k06O48k38l92K44J22l5
4383B4j71J62j59K44j29m4j54o0P07o83j01M15L41o73L3J02L58l33K44l3m70L04
4405g6K89m91j35M05L41m87j09K03L19k62J16k1k41J19K94n36J84N0K98j55k18
4426a13J94k69J53M12l40j96R1M76o81k57L28M48m76j52J5L81P1O4j57m34J11
4447c31M44K35n83M24m7j56j10K78k88k23N61m29l85O05O29n14l57J79K79k16
4467ek24J39J25J88j44p6m58L79k42K91j86lM27l95k19J07K44K91rm85K21K45
$$ plain form
4321 -49 451 -272 -120 15 366 222 -425 -153 200 -129 169 24 -528 -60 487 -50 -438 143 444 111
4341 111 -202 147 112 215 -93 -179 -66 122 151 89 -501 -166 558 255 -295 130 379 -108 220 31 -321
4362 -321 141 483 -29 -524 -123 459 5 -15 62 -54 -128 -18 -306 -119 -325 323 85 -307 -63 59 24
4383 24 -147 15 -144 100 -29 -73 -227 -287 420 -263 -364 51 392 -281 -248 -146 212 -121 123 90 -380 -76
4405 -76 213 -278 -413 -8 333 -154 -263 -60 259 -3 113 92 -149 -30 264 -272 -88 -38 260 105 -113
4426 -113 81 -188 -35 377 37 -159 -68 408 -273 -530 -202 246 -230 -382 -367 14 85 149 -8 -442 -331
4447 -331 113 348 -235 189 142 -14 -124 154 -134 -357 204 -225 -610 -5 624 110 -247 -68 211 -5
4467 -5 -229 -90 35 223 79 3 -455 -76 -318 -27 -213 -216 211 -184 -403 -296 -52 239 230 -255 -34 211
4489B11L80q97m6r6P95j25k24j15O8J97J73k94k44K74m9O8o15L69L81j52j98J74
4511C5l30M13N6j84k38L07L34m76o82Q59J38P4j79m28O1L87J01k57K2J31P4l32
4533a14j97K18M62k69k01j30K01kL26K9p79M36L94j46q27Q81j51m0k02r4r4M20
4555A21o0k0o05N51K62j19k19P9R9k17j2O3j48J52J63p1j59j79P74k99l66J41
4577f9M01l73J1L8k89J19N77n45m82P39j53n2j07L39j43n2mk93K8K54K45J9o50
4600d42J97M80k72n02N71O11n14m1n6l35K45K70l33k48M63Q2l14K07k98J41K72
4621A84l75j56K74M40k95j23k5m1K13l6n26M32K71Jm11K88k66r1Q37o40k34P15
4643D36j51m36P1J36M4O1k75k34R1P94j21o33J64K0L15k67m21L17M3K14q9O8l01
$$ plain form
4489 211 591 -306 -352 -448 347 222 -2 -117 -49 148 321 27 -217 57 8 76 -539 -170 211 59 -139 35
4511 35 -295 118 174 -10 -248 59 393 -83 -765 94 232 306 127 -301 -240 147 248 -9 13 144 218 -114
4533 -114 -311 -93 369 100 -101 -231 -30 -32 294 323 -456 -20 374 228 -599 282 131 91 -111 -205 -299 121
4555 121 61 41 -564 -13 249 130 -89 -10 89 -128 -140 -77 -225 -73 90 19 -140 -319 455 156 -210 -69
4577 -69 332 -41 -30 8 -281 -162 415 -130 -612 127 -26 -78 -185 154 11 -41 -45 -338 -310 -56 189 208 -442
4600 -442 -245 235 -37 -539 32 643 129 88 32 -303 -58 212 -121 -369 94 176 -138 69 -229 -88 184
4621 184 -191 -347 -73 367 72 -51 -76 -117 96 60 -466 -34 237 238 -173 115 -151 -242 595 -45 -279 436
4643 436 285 -151 -80 56 100 161 -114 -348 -257 537 416 -217 -53 -33 282 15 -406 -89 -46 168 79 147 -154
4666a54J39L24j18m68K67N90m85j64j3J83m48L95l08K41K1k05J12O6M2j69L89
4687B37k35j6M61m39k76M3L40l10O31k02p41Q47K63n05o43O12q0J95K53q51K3
4708c93N75J49m62k12L89L0K56l26j84L38J37j71j48J8k40L55K73m63K1J38k14
4729a34J52r0K90l16L1j6R0N4M25p32J41K67K54l02l57N8J11L52n48J91k41K44
4751g6K41k95k34O07L29o58k67N17p9q7K48n03m9L19N68p68m21J298o52P4j31
4772a9j40p9M61o5k94K33j14j41L71j87q2J99j35k67R6M52m31M14p3m10M68L73
4794F30p10q8Q29m62l37J43q5K68j76K64o30K63M72l88qn32J97O44O3n40p9O63
4816D01n06J22J01m95N50L15m87n61N22M08o61L48K35p08Q82k75k26j48K82j1
$$ plain form
4666 -154 -15 309 191 -277 -10 580 95 -69 -82 101 -347 48 -260 -19 2 -203 -91 -25 17 -152 237
4687 237 2 -14 447 8 -268 -225 115 -195 436 234 -507 340 603 98 -545 67 -13 182 435 -416 -393
4708 -393 182 331 -131 -343 46 76 332 6 -178 160 297 126 -22 -4 -244 111 384 -79 -58 80 -134
4729 -134 18 -72 218 -98 -67 -83 7 61 486 -246 -105 162 416 114 -243 -185 -74 278 -270 -79 -320 -76
4751 -76 165 -130 -364 243 572 -86 -353 164 85 -2 246 -257 -306 13 581 -187 -608 690 38 112 -19
4772 -19 -159 -238 223 158 -136 97 -17 -158 213 26 -56 143 8 -259 -163 289 -142 272 199 -211 257 630
4794 630 -80 -168 661 199 -138 5 -80 188 12 276 -354 -91 381 -7 -15 -547 -350 294 357 -183 -262 401
4816 401 -105 17 118 -377 173 488 1 -560 -38 370 -291 57 292 -416 466 191 -35 -183 99 88
4836H8L5j02Ok6M25n12l8M31r2j71N2m5k44M09k60l02N42M29r38J01O3N40j12
4859B79j57j57j87L52J7l22p6k4M02J98k01k17q6M36k73L7k79J15M69l11n26N63
4881E2J69l28j62K55k74K10L87j44j90M8J74n72J98K53l9L00m99L31M6L2j97J33
4903A83k60J22M41l25n94O48J61m41m9J78j88J58K91m42m48Q26q0k5l49J64m0
4924f9J94p1m84K82M10J64m04l59M98k11m0lj36L45N2m41K80J12k99L72j64o0
4946c2J12K60n16k47M24J70l31R6kj45M84k4p05N09L39R5m81k41O6M05ol95Ko6
4970b29L75K77l32q90M93O15n88Q6J21K04N1l3k59j09M70j89J64m86K83J79m85
4991b82L59j98J23L39o65N15l36L03j33oo6J87K97m44p17O29L68k18j56J38k62
$$ plain form
4836 88 123 21 27 1 426 -86 -124 307 215 44 96 51 -193 216 -44 -346 196 625 -313 -212 -149 391 279
4859 279 122 -35 -222 130 147 -175 -251 -275 127 325 124 -93 -179 257 -16 21 -258 -143 326 15 -511 52
4881 52 221 -107 -269 -14 -288 -78 309 165 -25 23 197 -375 -177 76 37 337 -162 169 215 247 50 183
4903 183 -77 45 486 161 -433 215 376 -65 -114 64 -124 34 325 -117 -565 261 181 156 -193 -29 -69
4924 -69 125 54 -430 -148 262 426 22 -337 161 -50 -90 -93 -229 116 168 -273 7 119 -180 192 28 -32
4946 -32 80 340 -176 -423 1 171 -160 -64 -66 -211 273 249 -456 53 392 487 6 -235 -169 236 230 -165 -163 -229
4970 -229 146 423 91 -799 -306 309 -279 -193 -72 132 183 150 -109 -218 252 63 227 -259 24 203 -282
4991 -282 77 -121 2 341 -324 191 -145 158 25 19 -47 140 437 -7 -724 -95 273 55 -101 37 -225
5012b25L07K50o23J50K72J97m01m9k95Q02r2n38j56K10M27j92k36L08q5Q8r7k61
5034b39J40L87k5j89k08o5K75J96k73r1L10R2l35j75J15j15M05l18j73K48J57
5055A19k72L54k17l4j69K08l62J31K84k53L44l92Q5j38K55J44k52P0K38k07j94
5076b58K66l8n9J98j58J58RJ65k70l77J40O44k73o94N28K19J6l21J44R9K10O5
5098D13o93N7J87J87l6m61M34L01l58j97lK31k14J95j76Q3Q1J14l01j63K97j25
5120a47K44Q5l59k21O68j18k34l46J35P15n06j9M5n0J93L27r37N51L4L01l81M7
5142B7k3J0L8k59j56M94p8Q4k71m47R03n04L39n85M99j6j44p6j8L5J46M4q3N0
5166IN3M37o85j03O31l64P3k50O9N7K73k4m09J33r1L01K3l78J32L82n59k0N53
$$ plain form
5012 -225 82 332 -291 -141 131 328 -73 -122 -417 385 293 -245 -401 -191 236 44 -192 116 31 119 22 -239
5034 -239 -99 288 263 74 -134 -199 76 272 -1 -92 218 310 -25 -200 -85 -200 205 -113 -286 -38 119
5055 119 -153 201 -16 -50 -219 -11 -373 -242 42 -211 133 -259 -174 -312 -57 87 -165 -95 143 -64 -258
5076 -258 8 -30 -89 109 -49 109 118 283 13 -364 -224 420 147 -547 -19 200 216 -105 39 138 348 413
5098 413 -280 -223 -36 151 115 -346 88 389 31 -166 -169 62 -152 43 -133 -50 31 145 -156 -319 -22 -147
5120 -147 97 182 -177 -398 270 152 -82 -428 -293 422 -84 -103 -58 -108 85 412 -525 26 60 361 -20 27
5142 27 4 14 52 -207 -363 131 53 137 -134 -581 322 -182 157 -428 71 55 -89 -165 -183 -148 -2 42 -41 9
5166 9 62 499 -186 -289 342 -22 51 -199 -130 -73 200 176 -233 -100 -191 110 133 -245 -113 269 -290 -310 243
5189B43J38k67k09K10k05o1M16q18L18L55J32m02J25m6J16Lr8k8L6L8p1j02L66
5212A89j73R9j71L2J5l8N5l04N13n94N55J46l26j81K94J18j50o7j13o0J55j47
5234a53j48J11M40l02N8L4L5K66p10p1M20p2k90K86Q4N5Q7P2m39m98Q21J08j61
5257C3j11k3J40j17M6n1l83P52j13j62l49J83K08K01j68m48L22K2K06l38j10Q5
5279a75N46k59k71M87p9o49M12k9k73J89J70l02P1L48j2l82L52K5J54j97j83k83
5301c40L54J39l30M75k22K1M50k09m64P0L56l25J7L00j72j68N16n10r9R3N18m32
5323C8J6l29L49K84l85j24K72L14o19lJ61k12L49p2k36K58J54o21N25j60J64k22
5345i9J33j57j79P15qn62J97J27J7k30l5K32J47Q7l85q8L40l24N7m0l82K23M19
$$ plain form
5189 243 381 114 -95 115 -90 -151 265 -553 -235 120 252 -150 -25 -71 45 48 -50 -78 -42 -4 -75 -177 189
5212 189 16 115 -56 -24 -9 -47 8 -296 217 -377 178 324 -2 -183 111 229 79 12 -101 -161 -6 -153
5234 -153 -301 -190 250 -52 6 40 75 341 -369 -440 -20 -92 -382 -96 -12 43 130 202 -237 -735 86 194 33
5257 33 -78 -101 39 -78 -32 -83 -466 286 173 11 -338 -155 53 254 86 -362 -40 -18 188 -150 -260 -175
5279 -175 371 112 -159 328 249 -400 12 -17 -290 -101 69 -233 -162 186 174 -208 144 169 323 126 -57 -340
5301 -340 14 153 -177 298 76 97 547 338 -126 -56 300 -25 -8 292 120 -48 468 -42 -141 -48 470 38
5323 38 54 -275 74 358 -27 -151 121 435 -184 -187 -26 -238 111 39 -197 61 215 -406 119 -41 123 -99
5345 -99 34 -123 -302 413 405 -157 40 167 184 -46 -81 151 298 385 0 -88 252 -72 -15 -55 -437 -214 205
5368B05j63l46P5L46n26Q47n72n85O89J27L08m05J57l51M15J29n05J36K48q9n03
5389c63M62q1J23ol59K88o7J96l11K25k26j71M55qn44N24M46q60J89L13N9m49
5411a65P7K74l17N30j92m44J25K97l53L01k53k18O69j92l29Q7J4J69j56M23o30
5432b83j23Q47k68m38M76m31p1K88j98J11K5L66m22MK89p9k42J74j42K24J98n09
5454b04K46M16p42M04J39n47M28M07m85p17Q26M5n02L8K67j36O6K87o37K60N44
5475D03l55j81q5K51j34K45l61j0K47J89k04l0j73j58Q59k99l25J02J14k07K02
5496I0Nk77L33j25k25M9M3J02j79L8K22l32M1j7K25K4n0o6M0J53J6Kll08J59L11
5522B71m95p9M65k28R7N80m49m73P14J06n95k31N25m62M26j77l19K81K55k14J47
$$ plain form
5368 205 42 -304 -229 117 -409 438 -134 -719 -30 97 405 0 157 -194 221 350 -155 -19 229 140 -363
5389 -363 99 18 141 135 -224 64 -3 193 -118 107 -119 -290 165 157 -387 137 583 -277 -88 225 284 -165
5411 -165 -88 186 -131 399 207 -237 -112 185 -168 133 -120 -338 331 139 -190 -103 -89 80 -76 347 -283
5432 -283 -406 441 173 -265 211 -220 -291 -3 -201 -90 -65 301 -121 -117 172 93 -149 25 -117 107 305 -204
5454 -204 42 458 -284 120 259 -288 140 547 62 -655 171 216 -286 -248 19 -117 -51 236 -401 -141 403
5475 403 48 -133 -218 33 -101 144 -217 -227 20 209 5 -25 -198 -356 503 204 -121 -19 95 -112 90
5496 90 95 -182 151 26 -199 -150 -107 -5 -184 -146 76 -256 -215 -232 -7 17 -33 -99 -59 94 110 112 109 -199 -40 271
5522 271 -224 -303 162 -66 31 611 162 -311 403 509 -86 -317 208 -254 172 -5 -324 -43 212 -2 145
5543A45l29K08K38Q7m45j00M37m66K22M75o23k4N80n48j98O6N37n59K11J69m09
5564c26L62L30n31j25O24o24k61M57J3o7J02J9l42L85R4j49K53n4o5J41j95k49
5586b08K23M48p36J38N2j6R7M89o88q0O17k54j04J56l4j05k0J4l97L19K68l78
5608a99O4L4O7p1K04m2P3j46k49J69j41K04J8j8p8j40P35k77k51l19M42J17J64
5631C60j83l36L56K51n61K5k14M91j22l23j58L34M59m96k3J8J27k39M82k88j61
5652b01L88N7j76j80N46m21j87q8K46j37J28K73m15P8M9j63J87j9K41k11J49o5
5674G9j42J25l5k12K58k91K59L01p03J40K35O3k36M00k90j85L96j51k20j47N26
5695A70J71m36l66O8M20rj11J83K03l49M1o6K80j39N9j47qj4K02K17l09l03K75
$$ plain form
5543 145 -184 24 262 349 -96 -196 241 -225 -3 472 -151 -175 405 -143 -341 -275 262 -297 -86 83 -326
5564 -326 36 366 -165 -290 334 -290 -551 -94 -81 -148 -46 -27 -369 16 110 -39 214 160 95 236 41 -208
5586 -208 15 463 -273 -135 -83 -99 -2 487 -201 -281 336 82 -22 134 100 -5 -25 -11 -408 -89 179 -199
5608 -199 -135 -101 -34 -105 99 57 130 -16 -265 -96 -237 -33 -15 -33 -111 -251 484 207 -44 -363 79 196 360
5631 360 177 -159 197 448 -113 -88 -302 189 67 -256 -414 -80 379 -117 -140 -122 5 -234 248 -40 -201
5652 -201 187 244 68 -112 434 13 -174 -262 -16 -153 -25 248 -167 -89 -40 -203 -16 -35 206 -5 144 79
5674 79 -63 62 27 -185 73 -218 41 342 -361 -221 14 77 -159 241 -49 -234 162 11 -209 -356 170
5695 170 341 -95 -461 -393 27 18 -93 90 293 -56 -15 -81 199 60 119 -28 -36 -50 152 369 60 -243 32
5718C2r8L37l69j92M79ok63k7j5P3l47J67k1N43k37O7k38k96K31M45ln79M60M7
5742A90K45l30k1o7j37K95n58J95L38J47j95j28J33O5r1k10L28n46J35J35j59
5763b36N5K22K00p15K06M92k97m5K68k89M9M76m0o89K37K18j08N1l26L22j12k32
5785b93M14j2r9K08o0m58L81Q7p0j13J40n7l0K7k55N4j81L59J30l10r5O07l12
5808F2n4k42K03n3K89l84j90K87L66j50l62Q7l14L20K74n10N70J58j94k26j1K0
5830e4j2R0ok21K14L55m70J40j60L22k23K27m8L9j4j56p5j53J67K32k35J39j28
5853c0j21M42k32o6l94N13O3m34R4LM67k35k4j04Q0l85K77K29l93O77n57m7j06
5876b83K09K86l26K75j96j91K69J76k28J93k0J26L2m61J02J80k01k03O09l00q6
$$ plain form
5718 32 -66 271 -98 -290 189 183 -80 -107 -122 -49 -396 -229 -250 293 56 123 -115 -411 -180 265 262 -317 143 190
5742 190 435 105 84 17 -120 175 -383 -188 150 297 102 -26 107 172 81 -129 199 -347 -212 -77 -236
5763 -236 -181 41 241 -474 -268 224 -73 -118 150 -139 -90 386 346 -343 -106 112 4 55 -271 51 -61 -293
5785 -293 121 109 10 218 158 -300 81 168 98 -15 125 68 38 65 -190 -136 -317 42 172 -138 -233 374 62
5808 62 8 -234 -31 -84 205 -179 -369 -82 284 134 -228 -141 -455 -135 139 -371 199 357 163 -63 -74 -54
5830 -54 -66 24 18 -203 11 366 -104 36 -124 198 -25 202 154 193 179 23 -52 -205 -38 194 -41 98 -30
5853 -30 -151 291 59 -7 -401 112 175 -259 -165 -162 305 70 46 -58 22 -363 -86 143 -250 427 -130 -177 -283
5876 -283 -74 212 -114 161 -35 -226 43 219 -9 184 164 290 322 -139 -37 143 -58 -261 348 48 -38
5897c8J4j78K42K36k97j06L29k59J64K6j1k53J08j82J11j59K19K68k11Qo6k51
5919b86L08L32o80L29J85j87k13K46o8J28lm15L27J30j11J68j48j98K40r2K78
5940B70m78M37j87o7o0M36k69K29k01k08k2M04jn0M0k57l69K95om03N03J34n11
5963c41L04J90k56M95k35l70J24K37n3r1l4o7K59j91k00L27k35kJ92L3k69L30
5985A47L7l87L8K1M33k68n5M90o65L65J57m25j64O52k15m64M50j41r7J01M1q0
6007b9K69l18K07j84J21m45L61j94k35L19J66k38K27J18j77M23l81p4p4K12M2
6028A16m82M80j17q0l6N7j6m2L34l15R7K81k43J85Mm99L52K44m06k16N45q0j24
6051C9k5J58n90O22j41j55J25j62J76oJ60j98j41QM43o08M00m1j03k38q6R4O11
$$ plain form
5897 -38 -24 -202 40 276 -21 -127 202 -57 107 133 122 -131 -23 -205 -94 -253 -34 234 23 31 -35 -286
5919 -286 22 354 -326 3 188 1 -212 34 -34 94 91 -324 3 133 22 190 42 -156 84 -8 270
5940 270 -208 229 42 -25 -85 351 82 311 110 -98 -120 284 283 233 273 16 -353 -58 -64 -467 36 170 -341
5963 -341 -37 153 -103 392 157 -213 -89 148 95 4 -30 -97 162 -29 -229 98 -137 -139 53 86 -183 147
5985 147 184 -203 -165 -144 289 21 -34 456 -209 156 313 -112 -276 376 161 -303 147 6 -91 10 51 -29
6007 -29 240 -78 129 -55 66 -379 -18 -212 -447 -128 38 -200 27 145 -32 391 10 -64 -138 74 116
6028 116 -366 114 -3 -83 -119 -62 -78 -120 214 -101 -4 277 34 219 223 -276 76 320 -86 -302 243 163 39
6051 39 14 172 -418 204 63 -92 33 -129 47 41 201 3 -138 -130 313 -295 105 64 -39 -277 -363 -269 342
6074C42k90j9L06k23j59n7K04o86Q50j16k38m9M60m91O8N9j12J3L3K17j46o3K85
6097A88r6J9q5k13J81M83n69k23J49mM07R4n10K28N01o69P3L46p67K69K46m72
6119d24L28j28M72k38K19k81J04J12j86k9K77p7m93L02K44m37N03k44l86K47L17
6140B02L2m02L72K4l74Q3j10j2L08J46n17j08M55n2J0o7k00J20L47l80j93L19
6162Cj48p5M77k12j12K24j67k10K49J75l73K83O3l15K81j04r2r4L82ol56K05j99
6185a21q7M86q4k18K19M2j20n22L04p9M32k33j00J42K91j47l63nJ28n2M20k70
6207F3l72L65J17j13j13k2j64K89J3l61J69j6J35N7M6p2j74L03j89J39K35m61
6229a26j33J75K8k58M70k34k14L79K72n03j08L48j09rL49k29q5L58l78M9p7q3
$$ plain form
6074 342 52 33 339 116 -43 -100 104 -582 268 152 -86 -135 325 -166 -98 -39 -151 -138 -105 112 -34 -97 188
6097 188 92 111 26 -187 -6 477 -92 -315 -166 -170 237 331 -179 49 550 -119 -46 300 -467 -198 48 -424
6119 -424 -96 -224 248 10 229 -52 52 164 -22 -51 226 149 -344 -42 202 -235 268 24 -362 -115 202
6140 202 234 -168 204 228 -146 -63 -173 -185 123 269 -248 -356 99 47 57 -10 -210 -90 257 -123 -316 3
6162 3 -145 -220 257 45 -67 157 -10 -220 29 204 -169 114 177 -138 143 39 -53 -147 235 229 -127 78 -121
6185 -121 -208 278 194 -24 195 237 117 -405 -101 -180 252 19 -81 61 352 205 -158 -163 -35 -87 333 63
6207 63 -309 56 173 60 -53 -75 -239 50 63 -298 -129 -145 -10 47 93 21 -153 150 -39 100 335 -126
6229 -126 -259 -84 -56 -314 156 -78 -292 87 359 -144 -252 96 -13 -22 327 98 13 371 -7 42 -35 -118
6251a18j8M11l52J16J35n3l16M43j66j50K99j12m14L57J20j90kK81j50l32L81
6272A70l35r4K84J84l95L59k5j58j03J85j33K65l58k04L31J72K0k81j01j6J13
6293a20L11n44K21L3M17n95L18O3k85N94k31n67Q9L41j6j40J2Q9J69j94J91j18
6315C8j89L16j50K5N0k5K12j06o23N94j45j20J46O3l60K63K86k25k6m1j02K03
6337H4j29q9J99J50j60k39Q5M07l46J8k2m25O91j93j75J38j57K33j60P2j79M00
6359B03M4j82m27O45j80k66L82m13r1J45L42l52m1M61m06j00K26k32M92m46M11
6380B15l0M6l72K8K82k06J10l38L72l85M77m5j18j75j38L93n0J29n09Q0L05k49
6402a78n8J8k3J03J28j44K44J9j25R7k3k17J30J55k42K2J9L57m14j81L12L40j81
$$ plain form
6251 -118 -136 275 -77 39 174 121 -195 248 82 -68 231 119 -295 62 182 -8 -10 271 121 -211 170
6272 170 -165 -259 25 209 -186 173 148 -10 -113 72 -61 204 -154 -358 -27 145 165 -116 -217 -233 -120
6293 -120 191 -353 -132 -99 318 -277 41 104 -181 413 182 -385 -296 45 29 -111 -99 -10 159 -35 156 38
6315 38 -151 165 15 40 90 65 277 171 -452 142 -3 -123 23 86 -274 -11 275 50 24 -17 -119 84
6337 84 -45 -134 65 215 55 -184 -99 308 -38 -20 -42 -467 224 31 -144 -6 -163 70 -90 -18 -197 203
6359 203 247 65 -362 283 103 -163 219 -194 -285 -140 202 -150 -191 270 -136 -236 -10 -242 250 -196 215
6380 215 185 231 -141 -113 169 -37 73 -265 107 -278 199 154 36 -139 -277 116 66 195 -314 -234 71 -178
6402 -178 -236 -218 -241 -138 -10 -154 90 109 -16 81 58 -159 -29 126 -116 -94 -75 282 -132 -313 -1 339 158
6425A58L9k39k87M32J27m45L87Q6k83K13k87M02l82L09j77j42J55J17k89L1k09
6446b84L08Kj15nL35k07o0L3k96L20j12o3J38K17k03n4J57J23n1nk79L58l44j07
6470a94L83j81p4K5L84o34M57n7j67K34l76J35J10j2P1m5J68k72j53M47j65j46
6492f2N0L19K7k48k94J41j25K98l14r3M72l75K33j00r4l4l7M84k18r5J38k10l78
6515e15M96J32nK22k91M9J46k03J78k60K12k09o0j09K73M9l5n79N90j63P2K06
6537A96l4j41k98M59nl81J72j91L26l77K83k01M10k23L3k66J37J87m18L22K02
6558A92p3K12l1m67J05M55l16n26L65L8L4R4k30J9L33m36L55L3mJ35L6n81l69
6581f27P25j70L87n35K71q7K34Kj62j69K39k02K77k40K07k25K63j43j47L70r9
$$ plain form
6425 158 197 -42 -329 103 230 -215 172 258 -25 188 -99 303 -79 230 53 -89 66 183 -106 -75 -284
6446 -284 24 26 -89 -94 241 34 -26 7 -289 31 -81 -144 -6 211 8 -46 111 234 183 178 -101 257 -87 -194
6470 -194 189 8 -66 -41 343 -291 166 109 -58 176 -200 -65 45 33 104 59 227 -45 -198 249 84 -62
6492 -62 -12 307 334 86 -208 -67 -192 106 -208 -301 171 -204 29 -71 -165 -199 -236 248 30 -65 73 -137 -515
6515 -515 -19 113 108 330 39 88 234 31 209 -51 161 -48 -108 -217 56 105 70 -509 81 -82 -10 196
6537 196 162 21 -277 182 177 -204 -32 -223 103 -274 9 -192 218 -5 28 -238 -101 86 -332 -10 192
6558 192 119 331 300 -167 -62 393 77 -449 -84 -46 -12 82 -148 -129 204 -232 123 156 152 287 323 -258 -627
6581 -627 98 -72 315 -220 51 -36 198 200 38 -131 108 -94 183 -57 150 -75 188 45 -102 268 169
6602A69m73Q2N69k29k16L52j65m14M08m2K20l41R3k6J96j34l15J54J83jQ2N2j10
6625I4p7k85n7M17L8j89K5J60Pk62r8L8K25j04J41k84K05j84J37J09j88J1K23
6648A02Ol34L03k66J98J73j49o6P7r9Q7j33K80J28l26J19J09m52M21J93k54n7
6670F0J95pj14j64j72r2L87l65K24m1J68k74J66J28l14L85m3m01L41l8j02K35
6692A62j81j40l8O53l77m78L91k90M93j33j97J16M40m55J6K69m61L10J9j26l26
6713c33N80r1l01Q4j37K75J20l15kL13j0m1r6K50m03k65N94m90J11k74N35k99
6735a95L55l4ok53J71j51J59k1q7j13N59n48K40Q5l84L00m6Q3m03M01O9k20K33
6758A94j53j40R1R8n3K35J93p05l4M09k97j11J10q9K43o2J01j21J77l44J95M3
$$ plain form
6602 169 -304 -222 347 118 -98 254 89 -325 83 41 261 -80 13 -13 183 49 -266 -112 71 70 152 204 94
6625 94 17 -268 -325 92 130 -59 -34 126 133 -129 -227 -189 36 -68 73 -211 -6 -190 -53 56 -132 -121 102
6648 102 108 -226 77 -189 9 182 33 -33 44 -55 32 -101 179 307 -19 100 209 -243 178 371 117 60
6670 60 255 248 134 -30 -202 -294 93 -272 -48 -89 79 -195 -29 99 -215 170 127 -274 67 29 -73 162
6692 162 -19 -159 -197 456 79 -399 -8 -298 195 62 -135 -19 421 -34 -18 251 -210 100 119 -7 -333
6713 -333 247 156 -145 -61 -198 77 197 -118 -120 193 183 142 46 296 -107 -372 222 -268 -157 -431 104 -195
6735 -195 160 126 120 -133 38 -113 46 25 -62 -175 384 -164 76 161 -223 77 31 114 -289 112 181 -39 194
6758 194 41 -99 -8 90 37 272 465 -240 -274 135 -162 -273 -163 -252 -9 -71 30 -91 86 -258 -63 -20
6780b0J47R4m50L54l20K87p2L8kP2k9j09J71r4m6j71J77J18Q6m26J32K41J25m58
6804a55m4K41l41L71r5k13K78K92l54LK63j94K09j84k10MK54N8j96jK15m88L26
6827C9q8m94P11R0k79j25L36o8Jl67R8J60K42l49L25k13j02m0K91k45k20O00L9
6850C42n69L09K3k74K52kJ25l78K03r4K03L10n92J31M27m16K42L2k91j20L34j75
6872B2Q5J63O0l41J55rn77L50J48j90j66K06j6j76L14k36%J01M17k11j31M0j01
6895i3j2N9j99L58k60k6K63q8k42K18J49r9n6K20j6l72M23l55J4K4J05k47L86
6918A54l1M9j37j9M1k67N10m62J33Ml90L98J76m19J23M03k87J67l04K79J78p5
6940B24l52K16O8J47k72m6J97l04J77q5N2L2K34m3l45R1L1j62k4J19k32L86L4
$$ plain form
6780 -20 127 221 -229 125 -195 92 20 58 56 128 99 -10 161 67 21 -150 27 145 231 -195 -63 178 303 -155
6804 -155 -199 42 -299 72 -23 -236 42 334 -20 -17 246 52 261 77 -133 -129 125 183 -13 -14 201 -287 39
6827 39 -49 -543 168 258 -21 -146 190 122 123 -244 -146 14 256 -93 232 19 -83 -123 168 -77 -297 303 342
6850 342 -227 82 105 -169 83 81 206 -172 31 -63 140 450 -142 -11 416 0 242 274 -17 -137 197 22
6872 22 107 270 330 -11 144 135 -442 -92 56 -134 -300 -94 -110 -286 28 -208 -208 -107 310 99 -32 8 -93
6895 -93 -105 -46 -245 113 -147 -173 90 2 -240 -22 127 28 -28 192 176 -196 227 -128 -114 -90 15 -232 154
6918 154 123 172 35 16 57 -210 300 -162 -29 -25 -415 -17 159 -260 -137 266 -21 146 -158 121 299 224
6940 224 -128 88 156 303 31 -15 182 -122 55 -30 22 54 288 245 -100 -9 22 -140 -164 -45 -277 109 143
6963A43o67P34m00J6L14l04J72J79Lk37O6j98L32j98J86j02j84J54k17m6J40J04
6985a0p7J44j62J02m9J68j2n6M0K9n2m01K52Q4j6j64K77j47K40l97N47m37J38
7008D1K94l42Q8j38J91l35O09m03N6m07L59M9j3j42K28j72L3Nk35L24k61mO22
7031D47k37j64J68k36J37j23JN4k11q2J80J77M4m22L92N6k33J57N6M0k12j05J66
7054E0O5K98j34m77L25j38Q0J19m8j3n6J10j50k97K85k28M3K06J76m09L72k09
7076c0j66r0J92P1N1o6R5j94lMK72k34k34L40J29j99K62l00J82q8r5J50k6P4j37
7101d0N0j6q2K21J14k26J79p6M5k00l3J95l48l1J00L25m12L62r8j50J07J40j05
7124B1r7j45K10k2K21l35J42K25j77j52J7N8l84O85k64j7P8P6j6j51R8k08K17
$$ plain form
6963 143 -524 210 -190 -174 140 -164 8 187 190 -47 19 -179 153 -45 141 39 -145 9 -208 -254 -114 -10
6985 -10 -87 57 -105 -3 -52 116 104 48 88 117 65 -336 -84 0 -16 -180 97 -50 190 -207 340 -97 41
7008 41 335 -7 81 -57 134 -201 408 5 61 -346 13 62 49 -93 135 -37 -4 1 -234 90 -171 -175 447
7031 447 210 46 214 -22 115 -8 -7 47 -164 -246 -66 111 155 -267 125 181 -52 105 161 201 -11 -116 50
7054 50 115 413 279 -198 127 -11 69 188 140 127 71 181 31 -266 19 -209 -166 40 216 -193 179 -30
7076 -30 -196 -286 -94 -23 28 -38 57 -137 -140 -136 136 -98 -332 8 137 -62 200 -100 82 -6 -101 49 23 97 -40
7101 -40 10 -6 -88 133 247 21 200 124 169 -31 -64 131 -217 -248 -148 177 -235 127 29 -121 -14 126 21
7124 21 -76 -221 -11 -33 188 -147 -5 220 43 -109 -92 -34 -418 267 3 -14 64 140 124 -27 71 -137 80
7147H0L2J68k19M2R1k20q5J67N4j33k1P6j30P0P3J55k16P4j98q0K74j34j06k11
7171c97N76o1k24J47r1N4K5j02j92o6K17L9k58N23k45M8p8j02K16k13K06K1l1
7194A2m9P6j02J70j90k57L60M3P2k36K44j48j87L68l12q3K99j91K10k62N05o1
7216B81k64q6rk08O81m38L4j23J20K52o8j53R1j37j42J30K17J22m64LJ70R7m69
7239c63O17k20J48l20m7L01j87PJ18j09m6R0l9j81L37k65M7K8J01j22o6Rm2M27
7263B23l73L14L6K30m38J47p7k24J35J09l32K51K54m45j67N01L6p08Q75j56l86
7284a95M58o2m36O4L96j58r0j02Q1K48k74J45k21K08J78k79J60J09l72%L42k77
7306g7K7P0j33K08J56l68j01N97n55k28L75K72k66K33k59l9L40m52K5O2L08j67
$$ plain form
7147 80 112 280 61 103 194 -26 -111 56 110 -23 -44 32 -98 -28 45 200 -16 58 -140 -220 54 -80 -186 -397
7171 -397 179 118 -106 41 -50 4 29 -73 -265 -331 -114 -75 -333 190 -55 -7 -85 -187 29 -184 22 43 12
7194 12 -37 39 -63 107 -83 -340 20 63 135 -101 143 -5 -192 176 -136 -219 80 -111 99 -163 342 281
7216 281 17 -69 -78 -286 395 -43 -9 -132 -12 240 172 19 110 -27 -169 -39 178 300 -164 -161 9 106 -363
7239 -363 254 34 182 -138 -185 116 -71 -64 54 -55 -101 -11 -50 -231 106 -159 -112 -84 17 -105 -171 -162 -204 223
7263 223 -150 164 200 430 -8 139 62 -162 -27 82 -250 1 255 -190 -357 144 180 -528 347 191 -195
7284 -195 263 201 -235 -171 225 67 -23 -125 -44 204 -70 75 -146 62 240 -39 121 230 -142 -142 200 -77
7306 -77 -50 20 -113 95 251 -117 -218 379 -176 -404 -29 243 -23 210 -49 -88 252 -200 -175 -113 195 28
7328B8M6K52n42k7J74L5j33L80j1k06j59K03j84M01j00l20L94j09k45J85j00K11
7350A73l3j74j56L40k40J39Jp1r4j26O2J92j39L01k3k98J65q7J35L9l05K87R9
7373A87Rn09L37K90l03L26j73J00l14L48m97L04L4j73K17k49l1l51M15K35k94
7394i2K13K14m77J12J40k34Q7L67n65mN50j81m94N34j93J09p6k4n2J21J87l29
7416h7K05j4l18M18l8k51J94j11K8J51J9j51P1j39M2P1J3k09n9J16J15j94J85
7439E7k83j97N60K40l69j21L57m92M33K07m49L04k61J9J19n2q1K00l07j34K67
7460A7k8J32m24J91Pj70J91L47l09L1J34l19q9O58l62r5J98k50J09K8P3m11Q2
7483b59M90k34J63R7o46O23om77M35J22l44r3K26j15J4M41l32k51M56k53k00N79
$$ plain form
7328 28 74 326 -216 -243 -69 -34 -167 213 202 -4 -163 40 -144 257 157 -163 231 122 -123 62 -38 173
7350 173 140 -34 -190 150 -90 49 50 -21 -115 -241 -179 13 -126 175 152 -146 19 -68 67 106 -199 88 187
7373 187 196 -313 24 314 11 337 164 264 -50 298 -199 105 139 -34 183 -66 -97 -448 -33 202 -92
7394 -92 121 335 -142 -30 110 -124 -37 330 -235 -239 311 130 -364 170 -23 86 10 -14 -66 55 242 -87
7416 -87 118 104 -214 204 166 -85 109 -2 26 177 196 45 116 -23 19 90 103 -106 -165 -49 66 -128 57
7439 57 -226 -423 137 377 8 -113 244 -248 185 392 -57 247 -14 5 124 72 -9 191 -116 -250 17
7460 17 -11 121 -303 -112 -105 -275 -84 263 -46 -15 119 -200 -289 369 7 -88 110 -140 -31 -3 70 -341 -259
7483 -259 231 -3 160 257 -389 234 228 -249 186 308 -36 -129 97 -18 -4 437 105 -146 310 57 -143 436
7505D36m14l70L79J63m27L95j94j95J29k0M0K17L08n82J25R7J93m32L08m72o0
7526c76N23J12m05J2J33j20L08p2j61J17qj08MJ18l23L91K3m78K04K15j1k76L51
7549A73l04Q3J38l10l5J12J39o50P37Nk84L6L23o8k25N02m28q1k27L84m9J28J2
7572A11n00L84J09o6qj2l3K41J29o70O05j68k66K76L35o65k1K04j27J50J3Q0j79
7595g8j88J96j26l8K15o6J6J53j93J61j22J76j00Q3k54l8N12m35j48O72k66l67
7617b35J48l7o5K93j65J7p2q6K40J04l11L39j48o5n5kL29n10O19m33J25k01L72
7640B01K06m53K79j25l06M40l60J53J47r0j04O6K03M0m17K3R7lM4j69n7L35J5
7663A65j48k5k17K75J4J28j83J5n3l10K88J0o5K49m34J38K13j66J95k72J90j17
$$ plain form
7505 436 22 -348 31 194 -233 162 -32 -227 -98 -118 -78 139 447 -135 -10 87 280 -152 156 -316 -376
7526 -376 147 259 -146 -134 -1 -121 187 115 -46 71 63 -45 -41 77 -246 145 168 -310 -106 109 98 -178 173
7549 173 -131 -48 90 -220 -255 -143 -4 -654 83 88 -196 -160 163 95 -130 372 -56 -137 -364 20 -29 99 111
7572 111 -389 -5 104 38 30 18 -15 226 355 -315 290 122 -144 132 467 -198 -219 -15 -142 8 21 101 -78
7595 -78 -266 -70 -196 -234 -19 -85 -69 84 -109 52 -70 106 6 89 -165 -203 309 -126 -274 398 132 -235
7617 -235 -87 -124 -189 104 -61 -44 -116 -202 38 142 -169 170 22 -43 -98 -100 229 -281 338 -95 30 -171 201
7640 201 407 -46 233 108 -198 242 -118 35 182 92 -12 54 257 297 -120 -97 0 -3 41 -128 -185 150 165
7663 165 17 -8 -225 50 64 192 9 24 -29 -339 -51 -41 -106 143 -291 -153 60 -106 89 -183 7 -110
7685a10J35n3J84k34k89L15o1j46L53j55J09n8k17L73l57K88rn5j24K62J21l31
7707e9j37P0L96n53K88N9l27L37j69n3o5M17j68j9l72N03q9Pp0J00J86m9m06K77
7731A04o5k28M02l14M6p9R9K88l63r6J68J64n0m06L23K99j70Jj87j7K26l39K42
7754D8K9j75j0k58N64l13K86J22m41J12k7K66k16J36p7k9L31l74j42n2L38j20
7776bk08N39m85p8K68J8pK14o03K43J99m9K0o2Ol22N61j45K8j05k90J52J18j38
7800a28K78J6k70j62L63k13L57j67Pk99j2J95K36o0l84K9M78l70N9J88j36M7n2
7823@N4j96l9L22l7m73K13K60K9k55J55q5K31l66K90jK9j44j72K25j26J5k09J78
7847a02K94m00K89J83m74L74L3l5R3l05j52K06J41k49L5j53J94N9o1K2J86m16
$$ plain form
7685 -110 25 -28 156 -78 -367 -52 -113 -259 94 -61 48 -10 -227 146 -211 77 68 13 -111 151 272 -59
7707 -59 -196 -126 270 -283 5 64 -263 74 -95 -148 -213 204 36 17 -355 148 59 66 -4 96 282 233 -173 104
7731 104 39 -189 213 -101 -55 -134 -35 253 -110 -206 -38 126 76 -330 -7 292 122 123 -64 -81 145 -194 48
7754 48 77 -98 -108 -366 198 -115 171 293 -148 -36 -63 203 -13 123 46 17 348 -26 -168 -220 118 -2
7776 -2 -210 329 -156 -234 34 52 45 259 -344 -101 98 49 69 7 13 -309 252 107 135 30 -260 -108 10 -128
7800 -128 150 166 -104 -266 97 -116 241 74 81 -218 -230 -35 201 141 -243 -214 264 -106 -47 141 5 52 0
7823 0 54 -142 -181 141 104 -369 -156 104 133 -122 33 -52 179 -187 103 102 131 -13 -185 40 -86 -71 -280 -102
7847 -102 192 -208 81 264 -210 164 197 162 255 -50 -202 4 145 -104 -69 -222 -28 31 -30 -8 178 -238
7869b38N1Q6L36l7m77K44m0j03J20P1L17l57K93j59j33j01q7K60J56j90j19K09
7891A02k56R7n9K36j09j81o4J48M5M2l4P0J66k79nJ25p0%l13M29J80L8k89l0j66
7916a77J73J01K5p5K5j27k3R1L4j11J05J67k82n2j32K88K47j88k66K36j01J73
7938A31j65n7K22l25q2J42J87pJ37j78j60K24M7k01J69k19K69J19n34L84j4J02
7960A91O6j78j49K28l89J61K37l17OL22k57J62J23k36k3K54l12J13q1R1J0j43
7982a21J05L20l16J9j31J99R8l83K5J49Jo2L3J23k8k2P6k47K03L70m75J39l0j49
8006a04J44P6l31J99j87K40l0J76j24jR6k11K51J21l32k17M90n05K9K33J64P2
8028B49O8l03k16L72J3l54J9K72m63N26j58k50R6J54j0j09M03n20L39kJ64k34
$$ plain form
7869 -238 -187 -101 235 198 -279 -35 -75 -178 -58 13 330 -27 266 107 -26 -127 -214 46 202 12 -107 102
7891 102 -154 -57 -116 120 11 -170 -234 -86 -41 1 -33 37 203 -76 -81 44 -26 -26 -339 90 270 308 19 -11 -177
7916 -177 -4 97 122 47 72 -55 -78 13 47 -64 41 208 -74 -126 -258 30 277 89 -177 59 -42 131
7938 131 -34 -91 131 -194 -276 -134 53 46 183 5 -155 69 116 -85 84 -135 134 253 -281 103 89 191
7960 191 257 79 -70 158 -231 -70 167 -150 -144 178 -79 83 206 -30 -53 201 -111 2 -79 12 22 -121
7982 -121 -16 304 -12 7 -124 75 173 -210 -185 -36 -35 -97 -64 59 31 9 85 -162 41 411 -64 75 45 -104
8006 -104 40 116 -215 -16 -203 37 7 183 59 58 154 -57 194 315 -17 -234 256 -249 -220 13 177 249
8028 249 317 14 -202 170 183 -171 -152 120 -343 183 25 -225 -129 25 15 -94 309 -211 128 126 290 56
8050E6O5o4l9K27j77mL2p2j6K00K39l61l79L38n0OM2n2n13O55m8p0J7J90k64k7
8076f9L47p82P47r7k63L52J4l85o2M56Q5l96J38j82k46N10rk98M02m92K03J68
8098A41j85J18M18l00k13j77M37m53n6K13o4J35K24m6l04J42r7J52n8m68K7O09
8120A95kk00J17j77j37K37k8O7m95N88Ok36R1j49K08Q4p7m15M67j41j2L25j84
8143A32k23J23J72k84k5J60L8m01N79j33l98N97l80K0J55r8j95L81l55P9k42K13
8165h5L18j03M6l63J12P9k24J20L67l98qN28l04l46N80l23k74O69o15j1M33Kj76
8188B4j31J23k79
$$ plain form
8050 56 121 57 18 245 68 64 96 24 8 208 447 86 -293 45 -5 1 43 -9 -522 133 85 15 32 222 -42 -69
8076 -69 278 -504 243 146 -117 235 249 -136 -198 258 343 -53 85 -97 -343 167 158 -140 262 -230 -27 141
8098 141 -44 74 492 192 -21 -198 239 -214 -270 -57 -121 14 238 192 -112 30 -67 85 27 -441 -414 195
8120 195 193 -7 110 -67 -204 33 5 72 -423 165 171 -65 26 -123 85 169 92 -323 144 3 -9 316 132
8143 132 -91 32 204 -80 -105 55 93 -308 271 138 -260 337 -43 -23 132 34 -161 220 -135 -56 -298 -85
8165 -85 233 130 176 -187 -75 4 -220 -100 267 -131 -139 389 85 -261 319 -4 -278 391 -224 -235 198 200 24
8188 24 -107 16 -263
8191b63
$$ Imaginary data points
##PAGE= N=2
##DATA TABLE= (X++(I..I)), XYDATA
0@%%%%Qj6J6j6J6k4L2m0M8n6P3r0J07j30J55j80K12k51K91l35L84m40N04n73O48
29C43p32Q27r31J045j169J304j451J615j797J994k209K445k706K999l323L679
45A933m077M530n046N632o312P112q062R224j0681J2559j5091J8710k4334L4319
59B0416n7191J95632L8087m12575J84468R7945j28529R4495N2029k44676R0041
70f9858K35979j07049j47270P1106L4965K2445k9552r5619M8032R5036n6985M0039
82D1269K5028j80109M0406K18952j48398j23992K10918n4614j86674K35912R7847
93A76545k78343K7030J68272j49337r115J69437j24906r6613J90233K7681j42427
104d1543k780L9662K9887K9034r7039n0920J08654L0277l307L0171j49557o5371
$$ plain form
0 0 0 0 0 0 8 -8 8 -8 8 -16 16 -24 24 -32 41 -49 58 -72 83 -97 115 -136 155 -180 204 -236 268 -305 343
29 343 -389 438 -493 552 -617 687 -764 851 -946 1048 -1161 1284 -1422 1577 -1746 1933
45 1933 -2144 2386 -2660 2972 -3340 3772 -4290 4934 -5747 6812 -8279 10431 -13903 20416
59 20416 -36775 158857 196944 -215631 -31163 66782 -61747 32748 84777 -159899 -69858
70 -69858 166121 59072 -88198 -17092 17873 40318 10766 -84853 -36821 58215 1230 41269
82 41269 66297 -113812 -73406 145546 -2852 -126844 84074 29460 -157214 78698 176545
93 176545 -101798 -74768 93504 -55833 -64948 104489 -20417 -117030 73203 100884 -41543
104 -41543 -44323 -4661 25226 54260 -42779 -93699 14955 45232 41925 72096 -77461 -142832
116a42832K49503J6041k51573P6295J44786j34823L6462J29366j87223n0902K30037
127A15137o8481j86905J33200Q6947r8884L3240K9613q9237J8286N9696k6728
138E884n900j7391k5969O4845N749n0576P5562j4028j50531Q9423J41147j46598
150b8383n1244J44417o3020o1963J47146n6657j61695J46905J03273j72085k9904
161h3210J16484q014j036K3633r0792l0360R7721K9505m7422n1311j3648R3729
173C5279M8128j12259j8766R2136m6720l3364P9867o2744o2539J51541J1309j72182
185i0314N1459J17125r3104k2564Q7444o2616m5439R6219k059o7984L7178K0170
197B5515m7750l409K6047J9416q92m7561N743O6877k9827m6550N3035j4188n6098
$$ plain form
116 -142832 106671 122712 -128861 -52566 92220 -42603 -6141 123225 -63998 -114900 115137
127 115137 46656 -140249 -7049 79898 -18986 14254 43867 -45370 -27084 32612 5884
138 5884 -16 -17407 -43376 21469 27218 -23358 52204 38176 -112355 -22932 118215 -28383
150 -28383 -79627 64790 1770 -60193 86953 30296 -131399 15506 118779 -53306 -83210
161 -83210 33274 25260 24224 47857 -42935 -73295 24426 53931 6509 -44802 -58450 35279
173 35279 83407 -28852 -47618 44518 -2202 -35566 44301 -18443 -80982 70559 81868 -90314
185 -90314 -38855 78270 -14834 -37398 50046 -12570 -58009 38210 36151 -31833 5345 25515
197 25515 -22235 -25644 403 19819 18927 -28634 -22891 43986 14159 -32391 20644 6456 -49642
210d9642P6224J4049j14124N3483J16478r5453p0429Q9696j024m7216N9268j2228
222A9082q3256N4069P3176n6144m3918L0826J9613o287j7505m681K6236Q86j5951
235c854J7894j7136l3850N7242K3232q8240P339Q7395m4749m6795P2339k978o6024
248c8185M1815K5037o3361K1833O0151n1675m2369N5445K5530l5135j5189J0831
260e272J0039K99n163J506q159l516L4800k977o5407J5523P7583l1517o1294M2464
274a091K2046l4373K8528J3698o6552J0070P3313l2695n9769M1883L7330l1769
286F19j2640J4533m311K39J6277p653k9437M730M2595j612n0590N368N0174j7558
300A0734l6793K8689J2280k8547J9274J8303m7670J278O0401k1706n8246L0897
$$ plain form
210 -49642 26582 40631 -73493 -20010 96468 1015 -69414 20282 19258 -27958 31310 19082
222 19082 -64174 -10105 63071 6927 -36991 -6165 13448 7161 -10344 -15025 11211 12097 -3854
235 -3854 14040 -3096 -36946 20296 43528 -44712 -37373 50022 5273 -41522 30817 27839 -38185
248 -38185 3630 28667 -34694 -12861 47290 -4385 -46754 8691 34221 -914 -16103 -5272
260 -5272 4767 5066 -97 1409 -6750 -10266 24534 21557 -43850 -28327 49256 17739 -43555 -1091
274 -1091 20955 -13418 15110 28808 -37744 -27674 45639 12944 -46825 -4942 32388 619
286 619 -12021 2512 -1799 -1560 14717 7064 -22373 -17643 24952 23340 -27250 -21882 28292 10734
300 10734 -26059 2630 14910 -13637 5637 23940 -23730 -22452 37949 16243 -42003 -11106
312a1106M0293k8987j4610K1759o009r317K1638j926l3761P961M0316j2425m4088
325c0262J4337M2028j5314k8279J7251O769j6769J8577J1733l9981r29N0930j3037
338A7054n0951K2802L8602k6329j8775K2862j538j2673K2270K029l7091O076M3101
351B7439j3883m3467J8115L5746j9385k1112J8636L809j2950J6287N118l5170
363b0817M154M5657j3766m7092J8836L8310k0736k0495J8226J237j1379K0008
375A2143K496l6427O453M4820j4864m5805J7852L6413j7114j9857J4584P09q289
388f886J9864J555l6169N541M4136j2300m5367J6032L5799j6115j9122J3955l45
401E78q046K1212J236l6811N563M4289j2617m3858J5870L3313j5642j6979J3466
$$ plain form
312 -11106 29187 200 -14410 7349 1340 -7977 13661 11735 -22026 -14065 26251 13826 -30262
325 -30262 -15925 26103 10789 -17490 -239 6530 -10239 8338 20071 -19910 -20839 30091 17054
338 17054 -33897 -11095 27507 1178 -17597 5265 3727 -8946 13324 15353 -21738 -15662 27439
351 27439 13556 -29911 -11796 23950 4565 -16547 2089 5898 -7052 9235 14353 -20817
363 -20817 -16663 28994 15228 -31864 -13028 25282 4546 -15949 2277 3514 -7865 12143
375 12143 14639 -21788 -15335 29485 14621 -31184 -13332 23081 5967 -13890 694 1403 -6886
388 -6886 12978 14533 -21636 -16095 28041 15741 -29626 -13594 22205 6090 -13032 923 578
401 578 -7468 13744 14980 -21831 -16268 28021 15404 -28454 -12584 20729 5087 -11892 1574
414A574j757p858K1205J838l5661M549M3072j1232m3306J5011L3240j6227j7114
427a2666J5229k786r228K3161K364l7942N993M3271j3613m0491J6343K9789j6629
440B795j4245J3462k553o226J9356L79l2801M585M0662r666m1775J2911L3805
453B0689j6114j7963J6326j634j1015K2496K749l8476Q115M4739j6982m0526J9226
466h370K6294j6401r094J0214p376j925K0635k917k8960N896L4320q228l7094
479b3006R469L2192j2802j9043J5482L04j4332K2383Q401l9894M005M6234j8730
492A0663l9843K5740K4931k4893n994J3933j0850P85K2817j0354k8321J3424L0816
505B2854j1027l2082P460K9470q090k2415J1243O086j1642J8356R018m2122J489
$$ plain form
414 1574 -183 -8041 13164 15002 -20659 -16110 26962 15730 -27576 -12565 20675 4448 -12666
427 -12666 2563 -223 -9451 13710 16074 -21868 -15875 27396 13783 -26708 -10365 19424 2795
440 2795 -11450 2012 -541 -6767 12589 12968 -19833 -15248 25414 15748 -26027 -13116 20689
453 20689 4575 -13388 2938 1304 -9711 12785 15534 -22942 -14827 29912 12930 -27596 -8370
466 -8370 17924 1523 -7571 2643 -4733 -6658 13977 11060 -17900 -12004 22316 14088 -23006
479 -23006 -13537 18655 5853 -13190 2292 2596 -11736 10647 19048 -20846 -16841 29393 10663
492 10663 -29180 -3440 21491 -3402 -9396 4537 -6313 -5528 17289 6935 -21386 -7962 22854
505 22854 11827 -20255 -12795 16675 8585 -13830 -2587 3499 -8143 10213 19231 -22891 -21402
518b1402N4490j5163m9139K4129K6640k5289O41J7856k3402k313L3306j0509l1962
531b2117J6752K5543j3600k0253O311J5841l004j3007P022M901j4219J0629J6419
544A7218k8070o910M3580j2519m7359L0789L2906l7775p352K7771j9234n162L7096
557B4979j7450l8283L0174K8373k7907j7856J3915J2163Q03j0955q196O092M436
570B88R028N299k9823j0220M8653L663n2425J2709L4567k9480l582L3410k9219
583g132j9661M9913l980m8928K5579L0975l2310p031K1880r230p542J1385k102
596A816m327K620j007L700n317n839K3557j020m1853J6231M4087l1919k4617L5214
610A1326j0465k1048M2772m799n6509L3069M6568m4723k2629L4617k892r222J6393
$$ plain form
518 -21402 33088 17925 -31214 -7085 19555 -5734 -5093 12763 -10639 -12952 20354 9845 -22117
531 -22117 -5365 20178 6578 -13675 -7364 8477 5473 -7534 -512 4389 -9830 799 17218
544 17218 -10852 -17762 25818 13299 -34060 -3271 29635 -8140 -15492 12279 -6955 -12117 24979
557 24979 7529 -30754 -580 27793 -114 -17970 -4055 8108 8911 -2044 -10240 -4148 288
570 288 9316 14615 -15208 -25428 23225 26888 -25537 -12828 21739 -7741 -11323 22087 -7132
583 -7132 -26793 23120 19140 -29788 -4209 26766 -5544 -12575 9305 75 -7467 3918 1816
596 1816 -2511 109 -898 2802 -2515 -8354 15203 14183 -27670 -11439 32648 729 -23888 11326
610 11326 861 -20187 22585 17786 -38723 -5654 40914 -3809 -26438 8179 5287 -3935 12458
623A2458j6513j8921K6482J6467j5392j5691l961K1585J6030k9485r758K9380
635A2681j2168j5436L2649j2573l6222M2055J8102n5778J2507M7346l8822j7491
647b3150M6075j5172l3661L2326P265k8616J6536J1631k5752K483K0605M08p611
660C367j7065M2L1479m222l1183J5518Q444k2038K7386J2322n5492J1635O3077
673D3270l6430m2990M4646N242l0208L1129K5n0002K5931M4285l2575k2476K0317
686A64K195O55N808j3543l55Q683p760P646L956k4500J4702K7143l6283r429M6466
701B5548k0655l3734M6127L927n1297K5848K9199m0804P414L6780l9757j8838
713c0242M8936J828l1321N060L435n78J5393p926j5833P352K659O319R281k9304
$$ plain form
623 12458 -4055 -22976 3506 19973 4581 -11110 -15071 6514 22544 -6941 -16699 12681
635 12681 513 -14923 17726 5153 -31069 10986 29088 -26690 -14183 33163 -5659 -23150
647 -23150 22925 7753 -25908 6418 13683 -14933 1603 13234 -12518 -10035 10570 10978 3367
660 3367 -13698 -13656 17823 13601 -17582 -2064 6380 -15658 11728 24050 -31442 -19807 43270
673 43270 6840 -36150 8496 13738 -16470 14659 14684 -35318 -9387 34898 2323 -20153 164
686 164 2359 3014 8822 -4721 -5076 3607 -4153 3493 7449 -17051 -2349 24794 -11489 -20918 25548
701 25548 4893 -28841 17286 21213 -30084 -4236 24963 -15841 -8427 28353 -11404 -30242
713 -30242 18694 20522 -10799 -5739 -2304 -2882 12511 4585 -11248 -3896 -1237 5082 14363 -14941
727a4941p394M9424o981m9175K4902K1522l1765K0087K1915n5861j21O4006k2314
740A3304m1775L3977N763k7904K2344J0416k9519P604J8029j4225m002O183j642
753a447P920o288j2152K0609k12k7460K3208K0997m0471p79L5319k6138p699M4281
767B9688k6930m3676M8820K4845m5263K279K1456k1199O763K4720k7399j4905
779b0801K8932N829j6219q121j81J9861R658k7240n495J9878r262M475K0765l3401
793a1322j9741N0452O40m4926K4202K2826l8364P093L2422k9914r941L5933j3910
806E450k6963K4726Q937j9777M594Q279m879j264m883L245J5593j0007j3022J2459
820B488o412o679L1175p378m5266K3648L7756l2112j1810K8703j7495j0517L3800
$$ plain form
727 -14941 -22335 27089 20108 -29067 -4165 17357 -14408 5679 27594 -28267 -28388 35618 13304
740 13304 -28471 5506 11269 -16635 5709 16125 -13394 -5790 12239 -1986 -5988 195 -1447
753 -1447 6473 185 -11967 8642 8430 -19030 4178 25175 -15296 -16075 19244 -6894 -14593 29688
767 29688 2758 -40918 7902 32747 -12516 -10237 11219 -9980 -3217 21503 -5896 -20801
779 -20801 8131 13960 -2259 -10380 -10561 9300 18958 -8282 -13777 6101 -3161 1314 22079 -11322
793 -11322 -31063 19389 20029 -24897 -695 22131 -16233 -9140 23282 -6632 -16573 19360 5450
806 5450 -21513 3213 12150 -7627 -3033 5246 367 -897 -5780 -2535 13058 3051 -9971 2488
820 2488 -3924 -10603 20572 13194 -32072 -8424 29332 -2780 -14590 14113 -3382 -13899 19901
833A9901j4056l4711L1600K4092l2498j1094J6506K891M322J952j5170l899R937
846b27O667L291j2892j2714K1606P576k7841Q204K5019k2404j0149K7881j2681
859A336j8862L1226J217l6045J6139K3607k6987m715K6739p381j6073Q637K104
872I42k776R039j319j1520l942O798J4711k785k3988N541K4545j2699j4767J8822
886F602k431j4069K0589q77l3274J7310L3208k6556k0914K2740L021j0268J2678
899G759j639j7809Q598J4121j0490q361P718P578n332j2484N217J5248o709j0011
913f596R809j963j0547J6368M716k4821O758K3482j9559j6238K5901N562j9695
926f823M354N486j1222R391J4301j6650j4206J5140J1388j0041r728O119Q920
$$ plain form
833 19901 5845 -28866 2734 26826 -5672 -16766 -260 2631 6953 8905 -6265 -10164 -227
846 -227 6440 9731 -3161 -15875 5731 13307 -14534 -6330 18689 -3715 -13864 14017 1336
859 1336 -17526 13700 14917 -21128 -4989 18618 -8369 -13084 13655 6274 -9799 -1162 942
872 942 -1834 7205 5886 -5634 -9576 -2778 11933 9148 -14840 -9299 15246 2547 -12220 6602
886 6602 4171 -9898 10691 9814 -23460 -6150 27058 502 -20412 2328 5349 -4919 7759
899 7759 6120 -11689 -3091 11030 540 -7821 -103 7475 2143 -10341 -5124 10124 3415 -6596
913 -6596 3213 1250 -9297 7071 11787 -13034 -6276 17206 -2353 -18591 7310 12872 -6823
926 -6823 -2469 3017 -8205 1186 15487 -1163 -15369 -229 11159 1118 -8610 -2491 6429
939F429m577o397M484M69k518J1263k893k2264P704K6688j2951k0377J4628P294
953F982j3307P181P402j5266K426J7130j1085j5500J4860J1782j3251q776Q063
966a359M654k708J47J698n137j506J0306p73j4663O117J6245j2056j5530J4920
980C55R264j2449R26O394j0643J749J6434q155j6536J2099J1856j3484p199J1450
994B061L468p110N56J548m065K756R906n980j3936P003J4877r272j1770J0465
1008E07O604j0496Q83O413p385Q88J2479p915j4730J1865J3872j2767j0135J0382
1022D65M053o824K165K765o638K229J0069o805j2564J0238J2818j0999j1773J0059
1036g42O110o722J095K807p267J768J2103n744j4589R742J2896j1285r985J0231
$$ plain form
939 6429 1852 -4545 -61 408 -2110 9153 6260 -16004 -8300 18388 5437 -14940 -312 6982
953 6982 -6325 856 8258 -7008 -4582 12548 1463 -14037 823 12605 -646 -9422 -1359
966 -1359 3295 587 734 2432 -2705 -4211 6095 5322 -9341 -3224 13021 965 -14565 355
980 355 9619 -2830 -1904 4490 -6153 -4404 12030 3875 -12661 -562 11294 -2190 -9389 2061
994 2061 5529 -1581 -1025 523 -3542 -786 9120 3140 -10796 -3793 11084 1812 -9958 507
1008 507 7111 -3385 -2502 3911 -3474 -2586 9893 1978 -12752 -887 12985 218 -9917 465
1022 465 4518 -2306 -141 2624 -4014 -1785 8284 1479 -11085 -847 11971 972 -10801 -742
1036 -742 5368 -1354 -259 2548 -4719 -2951 9152 3408 -11181 -1439 11457 172 -9813 418
1050D18M527o822K127J901p631K712J2498o217j3953Q324J2286r606q538Q387
1064D13L581o081K153K806p793J783J2193n705j3550Q051J1848r126q295Q402
1078F80K686o173L146K817p775J572J1351m696j2836P576J1267r437p609Q760
1092A329K391o746L034L494p606J002J1280n124j2421Q172J0806r672p906R833
1106A866J821p434L588L098p272J294J1503n850j1877Q683J0019r492p308P988
1120F27L114o412K337L074o517L54J1156m924j2249P934J1871j0034q807R901
1134A425K461o890L795L224r599K180J2438o677j2109R477R395r735n747P018
1148F56J677l625K382P50o468J567J0735l562j2567N417J2508q368r122R334K494
$$ plain form
1050 418 4945 -1877 250 2151 -5480 -2768 9730 3513 -10440 -2116 10170 564 -7974 413
1064 413 3994 -2087 66 2872 -4921 -3138 9055 3350 -10200 -2149 9699 573 -7722 680
1078 680 3366 -2807 339 3156 -4619 -3047 8304 3608 -9228 -1652 9615 178 -7431 1329
1092 1329 3720 -3026 8 3502 -4104 -3102 8178 3054 -9367 -1195 9611 -61 -7967 1866
1106 1866 3687 -3747 -159 2939 -4333 -3039 8464 2614 -9263 -580 9439 -53 -7361 627
1120 627 3741 -2671 -334 2740 -3777 -3423 7733 2809 -9440 -1506 10365 331 -8476 1425
1134 1425 3886 -3004 791 4015 -5584 -3404 9034 2357 -9752 -275 9120 -615 -6362 656
1148 656 2333 -1292 1090 1840 -4628 -3061 7674 4112 -8455 -3038 9470 1102 -8020 1314 3808
1163C808q129M839M062j1302K270J5734p859j4453J0532R664r972l910O663k359
1177d12k193N413j073p459L128R564l156j1068L794J1334n018r432O953K820q273
1192e078N454O795j3237j164J7273n656j5128J1536Q892j3197r84R011n600l054
1206d137Q582k271q669M930P518m284o377L111P579m168q055N886N676q172R11
1221a940P074r847k102J7381m986j8730J2427J3029j5646k807J2013o912m734
1234e780J2192m330j1963R939Q648q970o057N569M721j222n146M51L875m032J012
1249a093O888q865n469J6272o24j9000J0037J5071j6585m787J5647p308q314J5516
1263G386l296j5770J1601J0645j3854l539J0582J61m042r89j843M025J368k476
$$ plain form
1163 3808 -4321 518 4580 -6722 -4452 11282 3423 -11030 -498 9166 -806 -4716 1947 -412
1177 -412 -2605 2808 1735 -5724 -2596 6968 3812 -7256 -3462 7872 2854 -6578 375 3195 -5078
1192 -5078 376 7171 -6066 -7230 10043 4387 -10741 795 9687 -3510 -4494 4517 -1083 -4137
1206 -4137 4445 2174 -6495 -1565 5953 1669 -4708 -1597 5982 1814 -6241 -355 5321 -2851 -1940
1221 -1940 5134 -4713 -6815 10566 5580 -13150 -723 12306 -3340 -6147 5866 -1046 -5780
1234 -5780 6412 2082 -9881 58 8706 -264 -6321 -752 3969 2747 -2399 -1948 1927 -2105 -1093
1249 -1093 5795 -3070 -8539 7733 7109 -11891 -1854 13217 -3368 -8155 7492 184 -8130 7386
1263 7386 4090 -11680 -79 10566 -3288 -6827 3755 3916 -126 -1115 -2958 1067 2435 -41
1277d1M67l784k495J3235J091k0203N920J8941j2618r234J5340o236r535J7178
1291H026q17k2010J2203J7015j6544o623J2513k060l628O571l933n720N446J962
1305B401j317j803l456N557M649j2393J929J5411j0195j1351J6721j402j5208
1318a0457J4298M998k1302R223J8286j9501q062K1464l001j2897Q221L27p369
1331e772R485L040j1720j068O440L524R47j0061k025J5093k789j2723R662K700
1345D733j3075J1699O975k3049M049K5473j5476j5373K0070n82j4905J3721L702
1358G962j6960O710J0800j1801k007R409k404l286L39j115O535M43j0809N781
1372d03O449j0958L320R962j5755Q8K1761j4341j7201K3485O207k1258P110Q492
$$ plain form
1277 -41 426 -3358 -5853 7382 8473 -11730 -5810 13131 513 -8721 6619 383 -9152 8026
1291 8026 7209 -14801 -2598 14417 -2127 -8750 3763 1703 -1925 4646 713 -5007 439 2401
1305 2401 1084 -719 -4175 1382 6031 -6362 -4433 10978 783 -10568 6153 4751 -10457
1318 -10457 3841 8839 -12463 -3240 15046 -4455 -12517 8947 5946 -6951 1270 1597 -5772
1331 -5772 3713 6753 -4967 -6035 405 3929 4876 -5185 -7210 7883 5094 -7629 2033 4733
1345 4733 -8342 3357 10332 -12717 -8668 16805 1329 -14044 6026 5444 -9461 4260 7962
1358 7962 -8998 -2288 8512 -3289 -5296 4113 1709 -1577 -1238 -2353 4182 4625 -6184 -403
1372 -403 6046 -4912 -1592 8370 -7385 -7297 14464 123 -17078 6407 12614 -8644 -1534 6958
1386F958j5789P509J5763j8150r094J7994R82r028K168j065J416N270n368k771
1400c205N445l108R49O884j3208m194K1434m624j9405J4975P632j9421Q732J4279
1414A3165j9755j199K0008j2688j1965J9439K56j6151P347N756o196L276J086
1427B379n530M045R35l656L632l282l282J2665l652j7828J3007J4055j8231n17
1441e260J4016j3880k443K0997j0810j8844J9995O842j8472M501R964r490J581
1454a303P413r178j400Q549j077l766j068k708P618K518j2003M090J0564j2219
1468c970j774J5213j0190p979J7891n098j8069J6272J0395k0861J935J5006j0502
1481a731l597J2133o422o521J0329n06q554L182L197O60j91p101J670J0435o313
$$ plain form
1386 6958 -8831 -1322 14441 -3709 -12803 5191 6173 -2855 -687 -1752 -336 4934 -434 -3205
1400 -3205 2240 -868 81 6965 -6243 -10437 10997 6373 -13032 1943 9575 -9846 -1114 13165
1414 13165 -6590 -7789 12219 -469 -12434 7005 7261 -8890 -1543 4213 -1983 1293 2379
1427 2379 -3151 894 1829 -1827 1805 -1477 -4759 7906 4254 -13574 -567 13488 -4743 -5260
1441 -5260 8756 -5124 -7567 13430 2620 -16224 3771 10613 -7859 -3358 6606 -2884 -1303
1454 -1303 6110 -3068 -4468 4081 3004 -762 -1830 -4538 3080 5598 -6405 -2315 8249 -3970
1468 -3970 -5744 9469 -721 -8700 9191 4093 -13976 2296 12691 -8170 -6235 8771 -1731
1481 -1731 -5328 6805 383 -6138 4191 3685 -4869 -1687 1510 2170 1979 -5122 -3452 6983 670
1496F70n185Q796m415p233J4681j378j7849J1473J2540j8439j884J6844p957p148
1510f484J3111m910j1198J2586M729j2233N71O341k518m14m4j001L623j639l598
1525c078N220r54n282Q326M23j4230P664J2807j3947n046J4726m683r580J2616
1539D982j09j2748Q919P680j3577j412J1654k481o374K575J37K92K140j152k46
1554B80p60j744N129J008r828L841J0359r904o277J2450j214r358R405J580j3252
1569h285O875J1514j2008n160J1222j753o936M942J649l859J895J762k557j197
1583a896K053L070j103o539K124P443n044n428Q439o82q209P268L880j0474L374
1598a724J0044r618o189J1508M99r159L976L508n906J986N172l671l612L772K333
$$ plain form
1496 670 -4515 4281 -134 -7367 7314 5936 -11913 -440 12100 -6339 -8223 8621 664 -6484
1510 -6484 6627 1717 -9481 3105 7834 -4399 -3828 2513 -5 -419 -463 -1464 2159 520 -3078
1525 -3078 2142 1188 -4094 4232 4655 -9575 -1911 10896 -3051 -8097 6629 1946 -7634 4982
1539 4982 4873 -7875 1044 8724 -4853 -6265 5389 2908 -3466 -891 -754 -462 1678 526 280
1554 280 -480 -2224 2905 3913 -5915 -2074 8285 -1619 -7896 4554 3340 -6018 3387 4967 -8285
1569 -8285 -1410 10104 -1904 -7064 4158 2405 -4531 411 2060 -1799 96 1858 -699 -1896
1583 -1896 157 3227 2124 -4415 -2291 5152 108 -5320 3119 2437 -5772 1496 5376 -5098 -1724
1598 -1724 8320 -1298 -7487 4021 4520 -4639 -663 2845 -3061 -1075 4097 426 -3186 586 2919
1613B919l012l278L869L547m663l797N215J079m618M616J697q223K472R251o957
1628A17o422R183J577r019K513N703n352lN510l957m849O334L619n211l262L673
1644A54K493l381j343L239n64k713L273Q08n497K380P715o114p119P790L437o976
1660b418Q16M156m498p38O433k532n775N423M360o577k848N381K098l850j158
1675a727K185j450q00M509p47n637K265O615m776n108N785K817o330L09L831k988
1691a247r10N848k197o528M710N352n044l351M837O24m060O15K958k483m42L700
1707B382j629m799L759N326m611m313M409K520m798M76L560l297q64M344j483
1722I82n135M347M582n482l319N399J287m104K10K485k404m30M302j905m658L905
$$ plain form
1613 2919 -93 -3371 498 4045 -618 -4415 800 1879 -2739 1877 3574 -4649 -2177 7074 117
1628 117 -6305 2878 4455 -4564 -2051 3652 -1700 -1703 3807 -150 -4999 1335 4954 -257 -3519 154
1644 154 2647 -734 -2077 1162 598 -2115 1158 1966 -3531 -1151 6564 450 -6669 1121 4558 -2418
1660 -2418 -1602 2554 -1944 -2682 3751 1219 -4556 867 5227 -1350 -4198 1183 3281 -569 -1727
1675 -1727 458 -992 -1792 2717 1970 -3667 -1402 5213 437 -4671 1114 3931 -2399 -2090 1741 -1247
1691 -1247 -2157 3691 1494 -5034 -324 5028 -16 -3367 1470 2094 -1966 -1351 1607 -876 -1318 2382
1707 2382 753 -4046 -287 5039 428 -3885 524 3044 -1754 -1278 2282 -1015 -1879 2465 982
1722 982 -4153 194 4776 -706 -4025 1374 2661 -1443 -1233 1252 -1152 -1582 2720 815 -3843 62
1738F2M324m742l834N545J702m451J1K555k501M2M359k511m122L572N093n851
1754g47l329N164J901m595L05K407k320j35M178k027n013M385M615n198l645N065
1770A011J830l940J29K018k616L02M280k272n318M083N528n184l998N308J721
1785B882m342J150J740l218M38M197k593m255M223M136m229l421M451J634m062
1800a269J23K398k328p20M375j578n376L941N525n257l913N705R85m618J630K500
1816B123l933L03M521l214l705M704L041m586k470L885J249k408l16J852j637
1831e91r17L393m86m788K831N494n285m061O438J736o059J667K671m608J010N607
1847D052m161m372N559K287m979l56L803k44k432j92R19m80L71J814q78l847J727
$$ plain form
1738 62 4386 -356 -4190 1355 3057 -1394 -1383 1172 -1329 -1287 3072 561 -3561 11 5104 -747
1754 -747 -4076 1088 2989 -1606 -1301 1106 -1214 -1349 2829 802 -4211 174 4789 -409 -4054 1011
1770 1011 2841 -1099 -970 1048 -1568 -1266 3014 742 -4576 -493 5035 -149 -4147 1161 2882
1785 2882 -1460 -310 1430 -1788 -1350 2847 254 -4001 222 4358 129 -3292 1159 2793 -1269
1800 -1269 -1146 1252 -1076 -1796 2579 1001 -4375 -434 5091 -166 -4079 1626 2611 -2007 -377 2123
1816 2123 -1810 -1507 3014 -200 -3905 799 3840 -746 -3216 669 1918 -490 -806 1046 -591
1831 -591 -1508 1885 1399 -3389 -558 4936 -349 -4410 2028 3764 -2295 -628 2043 -2565 -1555 4052
1847 4052 -109 -4481 1078 3365 -1614 -1970 1833 1589 -843 -1035 -116 -596 -225 1589 711 -3136 -1409
$$ [...]
8191g2
##END NTUPLES=NMR FID
##END=
