##TITLE=1H_LR-707-K-Et2O
 CDCl3, 8 sc, 
 5.3.2020
##JCAMPDX= 6.0         $$ Bruker NMR JCAMP-DX V2.0
##DATA TYPE= NMR FID
##DATA CLASS= NTUPLES
##ORIGIN= UXNMR, Bruker Analytische Messtechnik GmbH
##OWNER= root
$$ XWIN-NMR		Version 3.5
$$ Thu Mar  5 14:05:58 2020 Russian Standard Time (UT+4h)  she@DPX200
##.OBSERVE FREQUENCY= 200.1315
##.OBSERVE NUCLEUS= ^1H
##.DELAY= (6, 6)
##.ACQUISITION MODE= SIMULTANEOUS
##.ACQUISITION SCHEME= undefined
##.AVERAGES= 8
##.DIGITISER RES= 18
##SPECTROMETER/DATA SYSTEM= spect
##.PULSE SEQUENCE= zg30
##.SOLVENT NAME= D2O
##.SHIFT REFERENCE= (INTERNAL, D2O, 0, 15.7039)
##AUDIT TRAIL= $$ (NUMBER, WHEN, WHO, WHERE, WHAT)
$$ ##TITLE= Audit trail, XWIN-NMR		Version 3.5
$$ ##JCAMPDX= 5.01
$$ ##ORIGIN= Bruker BioSpin GmbH
$$ ##OWNER= she
$$ F:/spectra/data/she/nmr/H-F/1/audita.txt
$$ ##AUDIT TRAIL=  $$ (NUMBER, WHEN, WHO, WHERE, WHAT)
(   1,<2020-03-05 14:05:02.89 +0400>,<she>,<DPX200>,
      <created by zg, POWCHK disabled, PULCHK disabled
       configuration hash MD5:
       00 E9 B6 7A A2 85 ED C7 34 08 36 98 17 FE 4E 26
       data hash MD5: 16K
       33 DF 7D 7D 19 50 AC C2 1C 69 9A 33 28 B8 41 DA>)
$$ ##END=
$$ 
$$ hash MD5
$$ 25 A2 F3 B6 5D A1 E4 16 7E E5 F7 1A 29 64 EA 12
##$RELAX= 
##$RELAX= 
##$RELAX= 
##$RELAX= 
##$RELAX= 
##$RELAX= 
$$ Bruker specific parameters
$$ --------------------------
##$DU= <F:/spectra>
##$EXPNO= 1
##$NAME= <H-F>
##$PROCNO= 1
##$TYPE= <nmr>
##$USER= <she>
##$AMP= (0..31)
100 100 100 100 100 100 100 100 100 100 100 100 100 100 100 100 100 100 
100 100 100 100 100 100 100 100 100 100 100 100 100 100 
##$AQSEQ= 0
##$AQ_mod= 1
##$AUNM= <au_zg>
##$AUTOPOS= <>
##$BF1= 200.13
##$BF2= 200.13
##$BF3= 200.13
##$BF4= 200.13
##$BF5= 200.13
##$BF6= 200.13
##$BF7= 200.13
##$BF8= 200.13
##$BYTORDA= 1
##$CFDGTYP= 0
##$CFRGTYP= 5
##$CHEMSTR= <none>
##$CNST= (0..31)
1 1 145 1 1 1 1 1 1 1 1 1 1 1 1 1 1 1 1 1 1 1 1 1 1 1 1 1 1 1 1 1 
##$CPDPRG= <>
##$CPDPRG1= <>
##$CPDPRG2= <>
##$CPDPRG3= <>
##$CPDPRG4= <mlev>
##$CPDPRG5= <mlev>
##$CPDPRG6= <mlev>
##$CPDPRG7= <mlev>
##$CPDPRG8= <mlev>
##$CPDPRGB= <>
##$CPDPRGT= <>
##$D= (0..31)
0 1.2 0 0 0 0 0 0 0 0.06 0 0.03 0 0 0 0 0.0002 0 0 0 0 0 0 0 0 0 0 0 0 
0 0 0 
##$DATE= 1583402702
##$DBL= (0..7)
120 120 120 120 120 120 120 120 
##$DBP= (0..7)
150 150 150 150 150 150 150 150 
##$DBP07= 0
##$DBPNAM0= <>
##$DBPNAM1= <>
##$DBPNAM2= <>
##$DBPNAM3= <>
##$DBPNAM4= <>
##$DBPNAM5= <>
##$DBPNAM6= <>
##$DBPNAM7= <>
##$DBPOAL= (0..7)
0.5 0.5 0.5 0.5 0.5 0.5 0.5 0.5 
##$DBPOFFS= (0..7)
0 0 0 0 0 0 0 0 
##$DE= 6
##$DECBNUC= <off>
##$DECIM= 24
##$DECNUC= <off>
##$DECSTAT= 4
##$DIGMOD= 1
##$DIGTYP= 9
##$DL= (0..7)
0 120 120 120 120 120 120 120 
##$DP= (0..7)
150 150 150 150 150 150 150 150 
##$DP07= 0
##$DPNAME0= <>
##$DPNAME1= <>
##$DPNAME2= <>
##$DPNAME3= <>
##$DPNAME4= <>
##$DPNAME5= <>
##$DPNAME6= <>
##$DPNAME7= <>
##$DPOAL= (0..7)
0.5 0.5 0.5 0.5 0.5 0.5 0.5 0.5 
##$DPOFFS= (0..7)
0 0 0 0 0 0 0 0 
##$DQDMODE= 0
##$DR= 18
##$DS= 0
##$DSLIST= <SSSSSSSSSSSSSSS>
$$ [...]
##$SUBNAM2= <"">
##$SUBNAM3= <"">
##$SUBNAM4= <"">
##$SUBNAM5= <"">
##$SUBNAM6= <"">
##$SUBNAM7= <"">
##$SUBNAM8= <"">
##$SUBNAM9= <"">
##$SW= 24.9337058887773
##$SWIBOX= (0..15)
0 0 2 0 0 0 0 0 0 0 0 0 0 0 0 0 
##$SW_h= 4990.01996007984
##$TD= 16384
##$TD0= 1
##$TE= 0
##$TE2= 300
##$TE3= 300
##$TEG= 300
##$TL= (0..7)
0 120 120 120 120 120 120 120 
##$TP= (0..7)
150 150 150 150 150 150 150 150 
##$TP07= 0
##$TPNAME0= <>
##$TPNAME1= <>
##$TPNAME2= <>
##$TPNAME3= <>
##$TPNAME4= <>
##$TPNAME5= <>
##$TPNAME6= <>
##$TPNAME7= <>
##$TPOAL= (0..7)
0.5 0.5 0.5 0.5 0.5 0.5 0.5 0.5 
##$TPOFFS= (0..7)
0 0 0 0 0 0 0 0 
##$TUNHIN= 0
##$TUNHOUT= 0
##$TUNXOUT= 0
##$USERA1= <user>
##$USERA2= <user>
##$USERA3= <user>
##$USERA4= <user>
##$USERA5= <user>
##$V9= 5
##$VALIST= <valist>
##$VCLIST= <CCCCCCCCCCCCCCC>
##$VD= 0
##$VDLIST= <DDDDDDDDDDDDDDD>
##$VPLIST= <PPPPPPPPPPPPPPP>
##$VTLIST= <TTTTTTTTTTTTTTT>
##$WBST= 1024
##$WBSW= 4
##$XGAIN= (0..3)
0 0 0 0 
##$XL= 0
##$YL= 0
##$YMAX_a= 365164
##$YMIN_a= -224300
##$ZGOPTNS= <>
##$ZL1= 120
##$ZL2= 120
##$ZL3= 120
##$ZL4= 120
##$ABSF1= 10
##$ABSF2= 0
##$ABSG= 5
##$ABSL= 3
##$ALPHA= 0
##$AQORDER= 0
##$ASSFAC= 0
##$ASSFACI= 0
##$ASSFACX= 0
##$ASSWID= 0
##$AUNMP= <proc_1d>
##$AZFE= 0.1
##$AZFW= 0.1
##$BCFW= 1
##$BC_mod= 2
##$BYTORDP= 1
##$COROFFS= 0
##$CY= 11.3945322036743
##$DATMOD= 1
##$DC= 2
##$DFILT= <>
##$DTYPP= 0
##$F1P= 16.9975609425685
##$F2P= -3.02152046262296
##$FCOR= 0.5
##$FTSIZE= 0
##$FT_mod= 4
##$GAMMA= 1
##$GB= 0.15
##$INTBC= 1
##$INTSCL= 1
##$ISEN= 128
##$LB= 0.24
##$LEV0= 0
##$LPBIN= 0
##$MAXI= 10000
##$MC2= 0
##$MEAN= 0
##$ME_mod= 0
##$MI= 1.114404
##$NCOEF= 0
##$NC_proc= 0
##$NLEV= 6
##$NOISF1= 3.799351
##$NOISF2= 2.8
##$NSP= 1
##$NTH_PI= 0
##$NZP= 0
##$OFFSET= 15.70392
##$PC= 1
##$PHC0= -9793.599
##$PHC1= 24.00082
##$PH_mod= 1
##$PKNL= yes
##$PPARMOD= 0
##$PSCAL= 0
##$PSIGN= 0
##$REVERSE= no
##$SF= 200.130013532006
##$SI= 16384
##$SIGF1= 3
##$SIGF2= 2
##$SINO= 400
##$SIOLD= 16384
##$SREGLST= <1H.CDCl3>
##$SSB= 0
##$STSI= 0
##$STSR= 0
##$SW_p= 3612.71676300578
##$SYMM= 0
##$S_DEV= 0
##$TDeff= 0
##$TDoff= 0
##$TI= <>
##$TILT= no
##$TM1= 0
##$TM2= 0
##$TOPLEV= 0
##$USERP1= <user>
##$USERP2= <user>
##$USERP3= <user>
##$USERP4= <user>
##$USERP5= <user>
##$WDW= 1
##$XDIM= 8192
##$YMAX_p= 0
##$YMIN_p= 0
$$ End of Bruker specific parameters
$$ ---------------------------------
##NTUPLES= NMR FID
##VAR_NAME=  TIME,          FID/REAL,        FID/IMAG
##SYMBOL=    X,             R,               I
##VAR_TYPE=  INDEPENDENT,   DEPENDENT,       DEPENDENT
##VAR_FORM=  AFFN,          ASDF,            ASDF
##VAR_DIM=   8192,          8192,            8192
##UNITS=     SECONDS,       ARBITRARY UNITS, ARBITRARY UNITS
##FACTOR=    0.0002004,     1,               1
##FIRST=     0,             0,               0
##LAST=      1.6414764,     0,               0
##MIN=       0,             -224300,         0
##MAX=       1.6414764,     365164,          0
$$ Real data points
##PAGE= N=1
##DATA TABLE= (X++(R..R)), XYDATA
0 0 0 0 0 0 0 0 0 8 -8 8 -8 16 -16 24 -24 32 -40 48 -56 64 -76 89 -102 118 -136 156 -178 201 -231 260
30 260 -292 331 -371 415 -461 516 -575 639 -707 787 -872 966 -1067 1181 -1309 1451 -1611
47 -1611 1793 -2001 2242 -2524 2859 -3268 3780 -4435 5316 -6568 8495 -11877 19512 -74135
61 -74135 131351 295806 18408 -85165 45852 79874 -128987 -159141 77854 231813 83220
72 83220 -69196 -46984 7727 -18852 18271 105859 70730 -67257 -75857 5557 -40201 -150242
84 -150242 -49607 159900 125004 -108246 -128223 78483 95647 -144204 -200960 66148 231073
95 231073 60062 -99002 13714 126250 -5983 -135445 -9409 164016 109577 -46651
105 -46651 -75703 -31578 -35502 -6826 99375 116933 -19431 -112993 -67059 -51374 -113018 -41267
117 -41267 174628 206288 -43819 -205725 -55562 105695 15306 -87141 47307 182303
127 182303 37922 -166508 -90409 128542 142121 -12233 -52587 22878 9178 -77490 -64638
138 -64638 24454 40027 3482 17755 27553 -44663 -87705 -11914 37123 -49519 -93773 46926
150 46926 162676 39470 -129110 -66636 91593 56002 -81792 -34656 126774 95285 -103136
161 -103136 -143997 27724 132022 49146 -33090 -12748 -13814 -84125 -93565 -2144 67342 56223
173 56223 29371 -3464 -76834 -110811 -14161 97721 55550 -55140 -36662 57851 27309 -79726
185 -79726 -37164 119338 118467 -60568 -134914 -4552 90244 7533 -71159 855 80815 23021
197 23021 -65985 -45429 19000 8930 -37303 -33839 -209 17824 34064 40395 -8052 -67922
209 -67922 -36796 51887 54516 -24062 -29638 51086 48902 -60949 -79039 59369 139565 23821
221 23821 -109179 -71235 33516 25692 -36824 -2431 77715 52287 -55340 -90566 -22296 40455
233 40455 40836 13664 -11104 -26686 -14031 20695 27459 917 3571 38284 19783 -55527 -63546
246 -63546 35966 96007 17527 -71191 -28175 59957 36606 -51194 -47464 33028 39691 -37919
258 -37919 -59455 18765 72753 25734 -45037 -48863 -5349 22689 19995 6124 -3937 -1784 6311
271 6311 -3178 -20955 -920 50653 50276 -31377 -87714 -29490 60126 51248 -21676 -29945 23197
284 23197 19836 -50204 -62688 20504 75698 18305 -61831 -52216 15876 41439 9766 -15811
296 -15811 -3922 8985 -5147 -26952 -19944 19668 47526 20409 -38224 -51767 3681 50509
308 50509 19930 -38225 -33105 16778 21069 -25768 -30252 28989 54814 -8174 -71674 -40653 37924
321 37924 53054 -1166 -34850 -9479 18271 2639 -20201 -3331 33738 31072 -18670 -53815
333 -53815 -23807 37459 53366 6205 -36953 -22452 14613 9949 -19790 -10809 33000 36284 -21931
346 -21931 -58803 -13411 53512 47909 -16060 -43833 -7313 25014 6617 -17713 3056 37459
358 37459 22485 -31179 -46961 2803 52709 35352 -22209 -41378 -4038 27340 11022 -14376
370 -14376 -81 28635 13414 -35203 -42690 12698 57758 28394 -33223 -42372 3978 32289
382 32289 7888 -16896 1604 26308 4965 -37797 -31662 25404 55525 14237 -42349 -39172
394 -39172 10167 31914 4635 -16950 1352 20759 -2249 -37188 -22757 30756 49017 1091
406 1091 -47896 -33854 17518 33493 1510 -19520 -221 16741 -6434 -35182 -14217 35691
418 35691 41393 -11214 -51996 -25407 26104 32226 -4225 -21870 -8 14295 -9292 -30898
430 -30898 -5525 37716 32238 -21615 -51206 -16099 33870 31684 -10063 -25220 32 14161
442 14161 -10314 -28147 1902 40003 23730 -31574 -48374 -2426 41018 25522 -17091 -24248
454 -24248 3062 12050 -9541 -18201 10950 36014 13073 -34204 -40637 5592 43031 23634 -20578
467 -20578 -28001 3791 17586 -5543 -17629 12204 36874 5919 -43123 -36429 21393 49012
479 49012 12522 -28200 -18567 12300 11553 -10908 -8523 19980 26517 -5646 -35320 -19144 23529
492 23529 39508 9127 -26927 -22862 8887 19330 -3034 -14185 10597 28412 -1750 -39747
504 -39747 -19776 36371 43358 -10595 -44364 -11797 28342 16608 -13440 -5390 21842 12940 -25129
517 -25129 -32013 5449 37572 24093 -13580 -31105 -14296 13553 20336 2847 -10086 1695
529 1695 9563 -12903 -34363 -5987 44779 39892 -21968 -51607 -8280 33291 11409 -23771 -5952
542 -5952 28533 10695 -34293 -29437 20582 38613 3024 -29758 -20433 4862 11995 3935 -4121
555 -4121 -4983 391 5392 -4145 -16632 -3423 23521 15004 -29075 -39808 11513 49424 13396
568 13396 -37090 -22888 20314 10370 -29387 -16072 37710 38972 -21625 -51398 -11327 31193
580 31193 22689 -3557 -6734 -2761 -10315 -14818 -3038 10778 17983 19823 3247 -30786 -38029 4830
594 4830 43177 18385 -26911 -15149 26039 13850 -34117 -23828 36984 43340 -21521 -50025
606 -50025 1785 43425 11175 -28782 -9738 23467 11592 -16014 -9511 10658 6611 -7588
618 -7588 -6525 757 3677 15802 24255 -3013 -39770 -25095 26816 34843 -7888 -18128 21100
631 21100 23682 -32554 -49026 18798 66804 17617 -47843 -31749 18331 13342 -16790 635
643 635 38525 22466 -28004 -39179 -8096 13274 14871 17686 10731 -13435 -21749 3384 16036
656 16036 -9040 -16768 18216 30031 -17455 -45259 3953 50220 9964 -46520 -19193 41039
668 41039 25020 -37194 -35025 21020 27988 -17321 -23278 21883 33681 -9440 -35592 -16858 2266
681 2266 5012 15380 24838 1264 -28183 -16382 9443 37 -15184 14956 42222 -2785 -62682
694 -62682 -35345 42129 47596 -13043 -26408 18341 17481 -41437 -49519 20722 60333 14232 -32091
707 -32091 -15141 11317 -3550 -17433 4020 19347 1482 -10341 2023 2638 -13152 -2563
719 -2563 25154 12210 -27848 -20635 27408 25217 -30805 -39194 23436 49907 -2924 -36081 5952
732 5952 33645 -14830 -54588 -7502 54041 36740 -16654 -20940 3407 -3015 -19175 1561 29150
745 29150 16860 -10252 -11926 -7471 -15521 -2579 37777 40133 -15354 -47235 -9579 22882 -4932
758 -4932 -23598 23197 56486 3391 -58199 -29592 35308 27329 -23893 -19445 26617 23548 -20914
771 -20914 -24536 14477 24234 -4579 -13940 3087 3656 -9107 -2424 9875 -3412 -13744 12606
784 12606 33941 969 -39297 -18876 20640 5484 -27657 -22 51394 29218 -42212 -50330
796 -50330 10267 35213 -2487 -19120 12950 21794 -18785 -37531 726 34955 20633 -5292
808 -5292 -10588 -15428 -24053 -9063 21521 22611 -1451 -3308 10971 -5640 -36084 -18050 32538
821 32538 30776 -22019 -33906 14780 34052 -10002 -33737 5908 34295 -1865 -36955 -10790
833 -10790 26378 11242 -19615 -10381 17024 15328 -3254 -6315 -4896 -14820 -13325 8635 18712
846 18712 3721 -1441 13488 4745 -30200 -30939 18682 42610 2195 -33634 -8981 23031 3138
859 3138 -23189 3330 39631 16070 -36180 -37346 5685 23978 7828 857 11728 7046 -12862
872 -12862 -15645 -1874 4021 3874 9232 7124 -10480 -14147 11332 25568 -734 -25241 -4962
885 -4962 22109 4382 -25413 -9179 28509 20109 -19478 -20071 18654 26681 -9660 -30247 -7654
898 -7654 15036 6916 -2449 7270 13751 179 -13641 -12119 -4299 3529 13612 13451 -7100 -22030
912 -22030 -4894 20338 13022 -10361 -6454 12749 1828 -28964 -21951 22064 37097 2067 -25643
925 -25643 -8172 12241 481 -16902 -4621 15888 8829 -11872 -12322 3597 12283 6624 -2633
938 -2633 -10617 -11832 -1608 8735 3916 -7654 -2525 11668 6351 -14017 -12369 12447 16654 -12505
952 -12505 -28434 -2912 25156 14431 -10634 -8656 8117 3297 -16489 -14877 8967 18964 3383
965 3383 -13403 -10857 2310 10345 7807 -958 -7371 -5656 -331 -2657 -6585 2752 18589 14184
979 14184 -11930 -23598 -1944 18548 7366 -13294 -7933 10734 8557 -9270 -9146 11862 18563
992 18563 -2538 -20721 -10970 9016 13458 1977 -5120 -1134 4242 2513 -3421 -4214 3847 8686
1006 8686 28 -13635 -10023 11045 20608 4904 -13906 -9461 6422 5521 -7971 -6183 11112
1019 11112 14357 -5195 -17631 -3258 16800 14045 -5763 -13433 -3633 5521 2418 -2644 1503
1032 1503 9948 6800 -7444 -14764 -3643 12567 12231 -4143 -13732 -3436 9712 5878 -5050
1045 -5050 -3336 7909 5631 -10636 -15925 1516 17856 10383 -9567 -13641 695 9396 1137
1058 1137 -7138 -1726 6444 1694 -10494 -10009 5759 15852 6059 -11947 -14014 405 9180 2390
1072 2390 -6086 -1451 6687 1913 -10362 -9109 7402 15263 1753 -15358 -12508 4821 11354 1224
1086 1224 -6552 -641 5668 -668 -11048 -6064 9298 13609 -1320 -15093 -8686 7699 11053 173
1100 173 -7492 -944 5165 -1125 -9140 -3059 11142 12116 -4296 -15070 -5843 10296 10963 -2071
1114 -2071 -7737 -218 5495 -1565 -7711 -367 12066 9261 -7137 -14616 -2377 12367 9579 -3559
1128 -3559 -8065 382 5199 -1034 -5941 1366 11654 6361 -9193 -13527 724 14353 8534 -6180
1142 -6180 -8584 1577 6647 -1634 -5710 3124 11305 3200 -11976 -11115 5337 14375 5225 -7908
1156 -7908 -7391 2473 5479 -1508 -4418 2974 8284 626 -11017 -9059 6183 14419 4078 -10169
1170 -10169 -8929 3384 6630 -2324 -5833 3554 9257 -1638 -13079 -6125 10164 12504 -2398
1183 -2398 -12524 -5327 5227 4409 -2877 -2295 4253 4497 -4402 -9603 -3234 8108 9456 -2282 -11776
1198 -11776 -6470 6128 8221 -1740 -6435 1250 5613 -4409 -12826 -1864 13975 10386 -7912
1211 -7912 -14193 -509 9749 2941 -6132 -2201 4901 1112 -7745 -6518 4611 10860 4624 -6562
1225 -6562 -10030 -2883 5967 6141 -1962 -5079 1695 5669 -2541 -9115 7 12745 6350 -11783 -13052
1240 -13052 4847 14018 1992 -9282 -1653 8204 1632 -8952 -4332 8647 8652 -3371 -9329 -2735
1254 -2735 5988 7229 2935 -3119 -5197 -1342 3040 846 -2523 2558 9781 3127 -12198 -11038 7771
1269 7771 15842 677 -12604 -3260 8857 2145 -9152 -1384 13343 8843 -9582 -13189 513
1282 513 9709 4458 -1984 -1248 632 -444 -740 163 -416 1192 3910 1016 -7826 -6664 7933 12955
1298 12955 -2163 -14450 -2795 11872 4567 -11371 -5346 11043 7112 -11121 -11638 8170 14833
1311 14833 -1209 -12649 -4837 4131 1639 -1943 2493 4684 -577 -4904 -3925 -2860 -899 6456
1325 6456 8695 -2732 -14056 -5209 10705 7251 -7510 -5166 9142 5575 -13674 -13857 9058
1338 9058 18205 -867 -14643 -3149 9384 1119 -9233 -1798 7944 3138 -6494 -3836 3181 2854
1352 2854 56 1022 -1423 -6143 -1759 8569 5577 -7748 -8283 6309 8644 -6413 -9597 7851
1366 7851 14036 -6219 -19356 -1934 17646 8680 -9609 -5512 7905 2354 -10814 -5805 10324
1379 10324 10811 -2181 -6720 -2423 -850 -510 5397 7192 -2356 -8024 339 5471 -2950 -6441 7613
1394 7613 15010 -2890 -18036 -3901 15359 7049 -12008 -6659 12665 9203 -10248 -9569 8698
1407 8698 11356 -5886 -11063 1862 8692 1206 -3106 948 823 -4023 -581 6516 2412 -5884 -1482
1422 -1482 5547 -1675 -10357 663 16501 7864 -14876 -13353 7402 10171 -6513 -8295 9786
1435 9786 13260 -7684 -16901 410 14057 3993 -7934 -3007 3436 -1754 -5381 1742 6200 530
1449 530 -2911 508 -1407 -7596 -2312 9839 6905 -9477 -9477 8234 10744 -7159 -12603 4526 12420
1464 12420 -4929 -15104 1854 16368 3164 -13668 -6618 8332 4797 -6136 -3160 5367 1606
1477 1606 -6535 -2869 4443 2962 -105 2507 907 -8754 -8478 6051 12146 -1118 -9619 1431
1491 1431 9321 -3396 -13471 1073 16189 4194 -14736 -8777 10160 9219 -5390 -5866 6520
1504 6520 6145 -6641 -8290 3047 7371 832 -1993 794 -515 -2568 2089 5785 -1564 -7802 -652
1519 -652 8076 1388 -7620 783 12062 2831 -13748 -8095 10927 11217 -6435 -9859 4412 9325
1533 9325 -3208 -7730 4340 10231 -600 -9692 -3937 3810 3195 1444 3022 932 -4477 -3002
1547 -3002 3307 1751 -4028 -582 6863 2012 -9572 -5635 10055 10855 -5946 -11772 1783 8702
1561 8702 -2579 -9253 2280 11098 1208 -10462 -4546 6823 5027 -3377 -4245 587 315 -1016
1575 -1016 1150 3356 -275 -1867 797 -725 -5769 -2891 7074 7054 -5232 -9834 2055 9629 -222
1590 -222 -8790 -906 7559 -345 -10819 -4078 9729 8476 -4188 -7517 121 3247 -1272 -2747
1604 -2747 902 2120 -580 -1991 -917 -347 930 3806 1879 -5722 -7458 1741 7691 1107 -5876
1619 -5876 -60 7125 474 -8791 -3430 8000 6628 -6074 -8269 2232 7957 1626 -4157 -212
1633 -212 3053 -492 -4572 -1908 2905 3845 2281 -912 -3223 -1460 3307 4880 -437 -5353 -1523
1648 -1523 4200 1405 -4229 -499 8013 4827 -6112 -8363 2128 7928 1160 -5601 -1210 4723
1662 4723 2080 -3429 -1830 4207 4107 -1891 -5209 -2744 2242 4770 2136 -1430 -2755 15 1904
1677 1904 -509 -3173 42 4572 1684 -5484 -4643 4567 7944 -230 -6812 -2827 3642 1699 -4041
1692 -4041 -1908 4633 4245 -2644 -5473 -680 4019 2755 -2280 -4166 -1410 1553 2124 -381 -952 1817
1708 1817 1846 -2093 -5557 -2514 4724 4908 -1863 -5775 -1346 4422 1600 -3259 -2131 2733 1884 -4164
1724 -4164 -5114 1242 6210 2891 -4016 -4368 142 2566 531 -2205 -971 2099 1472 -2301 -2958 912
1740 912 5213 2092 -4409 -5196 101 4033 1102 -2645 -544 2860 1567 -3445 -3682 2614 5136 401
1756 401 -5236 -3267 2878 4517 643 -2443 -189 2231 -11 -3506 -1836 2956 4963 65 -4610
1771 -4610 -2468 3179 4310 -140 -2863 -767 2535 736 -2501 -1140 3953 4206 -1371 -5595 -1872
1786 -1872 3829 3784 -1234 -3228 141 2696 8 -2348 -118 3751 2979 -2455 -5136 -485 4247 3299
1802 3299 -1556 -3442 217 2477 -158 -2614 -34 3562 1890 -3010 -4688 411 4641 2486 -2906
1817 -2906 -3483 706 2489 -487 -2174 498 3499 951 -3944 -3653 1526 4584 1421 -3265 -3198 1094
1833 1094 1835 -520 -2237 588 2937 539 -4026 -3097 2546 4766 268 -4281 -3180 1655 2494 -1296
1849 -1296 -2567 1350 2737 -764 -4250 -1847 3565 3706 -846 -4252 -1835 2229 2369 -753 -1661 764
1865 764 1907 -831 -3603 -1386 3348 3374 -1109 -4237 -1662 3048 2711 -1654 -2095 1310 2141 -1524
1881 -1524 -3534 399 4924 2953 -2518 -3892 109 3109 1472 -1593 -1102 1209 1282 -1270 -1740 851
1897 851 3504 2053 -2234 -4167 -401 3603 2400 -1887 -1792 1809 2777 -1321 -3223 1108 4634 1027
1913 1027 -4643 -3332 2673 4442 72 -2285 -40 1709 68 -2081 -679 1970 2479 48 -2225
1928 -2225 -1980 1726 3577 1038 -2923 -2747 865 2239 -575 -2225 1670 4562 -19 -5204 -2696
1943 -2696 4277 4148 -2014 -3758 577 3034 -32 -2124 402 2861 755 -2671 -3037 -465 1677
1958 1677 1845 173 -1532 -1551 686 1669 -1254 -2520 196 2523 -527 -4374 -1346 4666 3848 -3255
1974 -3255 -5071 795 3551 -797 -3939 204 3743 231 -4098 -1503 2934 2673 -929 -2585 -2008
1989 -2008 -640 588 1857 1119 -853 -90 1206 -821 -4120 -1388 4114 2989 -3530 -4775 1564
2004 1564 5194 -262 -4103 303 4194 -433 -5376 -2186 4553 3675 -1847 -2594 1086 1894 -815 -1423
2020 -1423 -93 152 -520 336 1090 -184 -104 2635 1673 -2932 -4007 1858 5163 -606 -4656 -710 4697
2037 4697 1462 -4167 -1005 5177 2461 -4959 -5146 2073 4388 265 -1174 1104 1812 -1389 -2323 381
2053 381 1258 649 352 452 -1642 -2499 1028 4406 481 -4108 -1392 3381 878 -4241 -1841 5201
2069 5201 4106 -3895 -4833 2255 4506 -2105 -5077 344 3864 227 -2888 156 2718 120 -2703
2084 -2703 -904 614 -201 530 1748 -213 -3322 -1281 3544 2484 -3022 -2572 2440 1736 -4630 -4060
2100 -4060 3533 7168 -672 -5989 -906 3577 -73 -4034 -375 4855 1238 -4006 -2381 1677 1677 -462
2116 -462 -45 274 -1431 -2144 852 1878 -1321 -1530 2156 2866 -2782 -4545 1261 4541 -932 -5417
2132 -5417 99 5860 1600 -4832 -2073 4034 2066 -4008 -2689 3526 3420 -2089 -2899 635 1916
2147 1916 -134 374 1363 -187 -2608 -742 1697 486 -851 2047 3891 -1122 -5634 -1162 5248
2162 5248 2860 -3420 -1989 4255 2530 -4452 -3429 3841 4965 -1339 -4460 263 3264 -236 -1947
2177 -1947 1054 2274 -442 -1539 -6 407 -1234 -154 2022 775 -2289 -326 3672 1570 -4389
2192 -4389 -3017 3126 3512 -2565 -3283 2802 3961 -2491 -5259 713 5280 829 -3870 -1648 1807
2207 1807 54 -2007 114 2549 842 -1860 -1405 -709 -955 3 2544 2019 -2125 -2545 1699 2219 -1992
2224 -1992 -3087 2355 3961 -1846 -5161 342 4729 1238 -3842 -1556 3427 1505 -3095 -2289 1994
2239 1994 1904 -1328 -1602 854 1032 -639 -647 -65 -1170 -947 1474 2630 -731 -2661 193 2363 -851
2256 -851 -3367 861 4346 644 -4888 -2265 3356 3037 -2252 -2192 2026 2020 -2420 -3247 1063 3213 723
2273 723 -1611 -575 -6 -544 -186 969 98 -651 514 1495 -359 -2239 417 3372 879 -3418 -1601
2290 -1601 2974 2571 -2023 -2680 2042 3089 -977 -2679 745 2985 -128 -2741 -1344 1956 1788 -329
2306 -329 -336 41 -571 -492 218 302 -87 455 1103 -576 -2462 -702 2820 2263 -1975 -3024 842 2531 -562
2325 -562 -2018 1365 3587 270 -3444 -1866 2019 1509 -1161 -1342 427 992 -219 -973 116 405
2341 405 244 90 -625 -973 140 1623 787 -1665 -1646 1308 2023 -607 -2435 166 2194 -184 -2839
2358 -2839 -745 2630 1672 -1855 -2359 194 1647 -138 -1070 66 1002 87 -1103 -1167 -159 1094 887
2375 887 -116 -1521 -1220 754 1384 -48 -1039 530 1337 -470 -2476 -269 2411 1790 -1512 -1947 846
2392 846 1997 -100 -1763 -395 1510 480 -1418 -1085 1146 1740 440 -1307 -1021 585 1255 470
2408 470 -768 -597 697 1040 -442 -982 391 2059 514 -2078 -1759 1210 2384 -22 -1692 -50
2424 -50 1089 453 -1405 -638 1182 1387 -439 -1853 -478 1426 1311 -50 -1063 -131 678 379 -881
2441 -881 -565 867 1428 -145 -1870 -749 1431 1556 -771 -1900 50 1187 98 -1144 -206 1157
2457 1157 949 -952 -1862 -269 1510 802 -1091 -1273 111 1133 59 -1147 -625 853 644 -1239
2473 -1239 -1689 487 1565 1145 -1165 -1632 270 1312 14 -1099 -117 1467 245 -1110 -1285 824
2489 824 1540 427 -1617 -1150 733 796 -151 -994 144 948 -87 -1277 -951 851 1294 39 -1759
2506 -1759 -1085 1025 1118 -293 -1053 154 1028 94 -1593 -628 1436 1368 -276 -1643 -396 1348 805
2523 805 -547 -1069 399 896 -369 -1219 -102 1461 866 -555 -1517 -346 1336 766 -434 -773 447
2540 447 942 -57 -1226 -288 1470 1230 -899 -1657 321 1619 544 -978 -564 406 794 -500 -1111
2557 -1111 416 1534 572 -1158 -1444 240 1437 609 -974 -551 668 1016 -406 -800 297 1326
2573 1326 609 -1401 -1298 535 1544 150 -1414 -644 832 628 -1073 -879 884 982 -122 -1720 -357
2590 -357 996 1214 -309 -896 -371 183 172 -416 -605 179 815 177 -1374 -974 920 1282 -487 -1958
2608 -1958 -671 1174 846 -1024 -871 811 1078 -1058 -2086 -1 1736 446 -1198 -1103 134 863
2624 863 115 -441 -229 325 -248 -670 -929 -320 1061 1050 -281 -1170 -501 1104 444 -1038 -901 995 1256
2643 1256 -971 -1500 733 2080 224 -1510 -587 1264 985 -746 -870 433 859 447 -672 -265 102
2660 102 590 151 -1193 -966 447 1473 1320 -759 -1073 556 770 -817 -1156 925 2177 -94 -2134
2677 -2134 -632 1802 1516 -873 -1212 782 653 -910 -1315 650 1687 999 -193 -485 -409 -51 244
2694 244 -103 -302 -300 637 906 -897 -1355 214 1389 -56 -2027 -319 2075 1056 -1705 -1410 1231
2711 1231 1872 -567 -1568 -28 1135 -289 -1735 142 1648 939 -204 -410 -473 -742 -191 884 226
2728 226 -740 -1 961 -46 -1703 -421 2281 1401 -1945 -2383 372 1288 -677 -1366 1214 2191 46
2745 46 -2468 -1145 1212 327 -1168 -511 891 747 -579 -234 55 -268 -346 703 512 -950 -597 968
2763 968 906 -1302 -1124 1233 2226 -1226 -2615 -403 1422 -105 -1466 476 3079 950 -2507 -1732
2779 -1732 1184 1119 -449 -175 1045 467 -876 -647 687 748 154 869 420 -1347 -1724 428 2175 576
2797 576 -1207 451 1854 -271 -2827 -819 2194 1467 -1649 -899 1895 1608 -1362 -1654 714 1483
2813 1483 -126 -975 350 610 -390 -438 1087 675 -150 226 606 -831 -2469 -308 2150 1418 -861
2830 -861 -740 1324 328 -2820 -1709 2083 2582 -609 -1766 241 1696 -571 -1371 435 1984 267
2846 267 -2225 -1267 465 240 -49 1046 864 -624 -1070 -280 43 -1551 -455 1557 1721 -1267 -1712
2863 -1712 851 1657 -1294 -2185 704 1869 -133 -2631 -820 1861 885 -1213 -239 1693 365 -1726
2879 -1726 -1218 -110 399 428 971 970 -482 -1546 -365 406 -703 -735 1194 1666 -972 -2366 -103 2229
2897 2229 432 -1608 -238 1705 177 -2384 -1340 1783 2341 -383 -1302 256 591 -596 -1027 777
2913 777 740 -8 -56 202 432 -948 234 1168 -413 -1214 65 1615 113 -1803 -429 1692 1485 -1053
2931 -1053 -1392 885 980 -1542 -1878 1215 2422 431 -972 -452 643 -544 -644 292 1038 414 -117
2948 -117 -168 -527 -397 200 1765 477 -1262 -1306 784 558 -924 -697 1760 1873 -1252 -2133 -116 1756
2966 1756 -30 -1404 -28 1289 691 -1140 -483 484 422 -578 -490 303 368 -70 10 -162 -613 -466 960
2985 960 629 -669 -1177 414 719 -443 -1300 901 1956 -173 -1978 -657 1356 745 -962 -1163 681
3002 681 780 -968 -1000 335 1239 -2 -688 -413 -442 -57 256 542 -18 -164 131 383 -781 -1220 302
3021 302 1313 -31 -1624 -704 1087 763 -1066 -1099 847 793 -738 -1181 468 1280 24 -1023 -361
3038 -361 874 503 -147 -72 -296 113 139 272 -20 -333 257 601 -491 -1328 42 1471 890 -980 -808
3057 -808 524 927 -352 -801 400 1034 -41 -1141 -518 1043 841 -419 -516 514 206 -85 -220 -47
3075 -47 198 551 298 -536 -451 421 654 220 -1127 -364 779 696 -337 -655 475 947 -180 -1471 -522
3094 -522 980 782 -687 -842 134 742 38 -179 -40 135 485 -554 -671 120 626 705 -528 -998 -409
3113 -409 434 286 -628 -496 123 552 -527 -1242 -74 1093 611 -994 -1030 468 744 77 -618 -168 473
3132 473 305 -843 -442 424 679 23 -673 -665 43 625 73 -493 -425 394 -41 -580 -495 22 986 -66 -936
3153 -936 -522 657 922 -13 -582 -402 675 238 -554 -314 652 1055 -215 -706 -171 774 786 -108 -608
3172 -608 -24 565 166 -266 -556 603 883 -136 -871 -463 795 620 -260 -570 130 614 -52 -342 -182
3191 -182 652 485 -400 -514 201 1181 631 -602 -553 154 744 -112 -512 -11 393 550 -239 -749 181 953
3211 953 507 -770 -578 243 761 46 -148 -66 485 226 -814 -727 444 787 255 -795 -535 372 570
3230 570 -135 -439 60 512 122 -298 -234 389 774 38 -1007 -759 234 540 -339 -511 142 501 -129 -814
3250 -814 -455 767 884 -451 -783 -154 480 647 -31 -212 170 243 -262 -755 -286 335 650 -494 -770
3269 -770 -429 697 462 -176 -544 -98 105 -169 -400 107 782 610 -593 -842 227 700 190 -800 -468
3288 -468 322 374 -500 -642 341 1026 75 -431 -445 320 604 133 -164 -386 89 479 -78 -522 186 1021 473
3309 473 -675 -634 528 1068 285 -748 -328 718 457 -397 -185 412 636 64 -838 39 790 554 45
3328 45 -119 -150 115 338 -190 -193 -134 391 -93 -672 -437 775 1273 -506 -1165 -560 639 556 -653 -477 723
3349 723 677 -728 -899 108 1185 235 -923 -555 -139 466 -188 133 238 -227 -30 -468 -578 -235 634
3368 634 815 -87 -1169 -315 832 380 -609 -464 588 641 -957 -969 394 1132 -186 -823 -225 831
3386 831 490 -525 -485 -57 170 -629 -54 236 296 276 7 -375 -929 -415 907 617 -702 -538 1 539
3406 539 -410 -701 797 1150 -658 -1529 -708 1244 794 -449 -66 363 125 -695 -666 335 349 -180 -324
3425 -324 -125 -300 -166 808 227 -59 -772 197 642 -375 -854 315 1289 172 -1092 -59 1189 467
3443 467 -1118 -827 776 614 -625 -296 971 645 -521 -1068 -51 855 194 202 226 -315 -598 383 570
3462 570 661 -730 149 654 -511 -1321 79 1932 871 -967 -776 714 810 -789 -768 911 1157 -496
3480 -496 -1321 -132 1022 524 -791 -136 90 -496 -529 -32 260 -157 -266 343 218 -1324 -488 821 157
3499 157 -920 -1154 797 1223 -96 -1105 16 879 -335 -1436 213 1519 -28 -1047 -420 439
3515 439 464 -220 355 567 -523 -937 -440 63 502 305 709 522 -1347 -977 455 1266 -198 -908 462
3534 462 1050 -513 -1449 505 1770 465 -1624 -970 637 805 -636 -566 826 743 -458 -736 278
3551 278 -67 -262 -401 381 267 -154 811 830 131 -1226 -173 853 255 -862 -32 1400 256 -1413
3569 -1413 -770 1442 1279 -746 -1442 28 633 -436 -519 965 1321 9 -699 -543 22 -148 187 631
3587 631 138 -568 -325 565 34 -525 -280 714 58 -1611 -1079 443 1261 -541 -848 351 893 -383
3605 -383 -1266 160 861 150 -488 35 950 440 -358 -399 -93 -386 -138 351 336 -267 -810 -81 425 -218
3625 -218 -121 641 619 -949 -1697 -38 1375 445 -575 67 678 -575 -1553 -570 1000 831 -368 -278 399
3644 399 70 -305 -260 433 316 -633 -249 -39 -570 -216 651 853 -379 -772 -228 770 -128 -1119 -404 1006
3664 1006 375 -970 -192 1114 855 -729 -1103 284 785 -55 -481 38 285 -166 -316 232 117 19 -136
3683 -136 -127 -656 -247 411 1338 374 -720 -698 260 123 -542 140 833 761 -972 -813 340 1059 570 -533
3703 -533 -141 534 -31 -634 -110 739 796 -175 -123 24 -170 328 510 -120 -516 -200 557 393 -293 -530 524
3724 524 186 -1084 -1070 439 985 -37 -764 -267 897 196 -560 -86 226 55 -497 -695 98 658 213
3743 213 119 -493 -222 136 322 486 26 69 346 -82 -491 -503 424 841 -247 -890 -521 641 182 -436
3763 -436 -207 675 231 -837 -424 168 655 153 -410 -68 -162 145 25 366 -276 -267 -165 -165 -196 -103 643 72
3785 72 -216 -764 12 493 165 -430 -516 385 280 -210 -230 532 968 132 -921 -433 88 565 -71 -169 -8
3806 -8 143 -93 -49 -182 369 378 -142 -623 -633 235 835 351 -175 -221 354 120 -100 -192 519 758 -270 -667
3828 -667 -130 763 545 -153 -494 107 -175 192 -109 33 301 368 -32 -526 -152 525 382 21 -601 -176
3848 -176 12 291 -22 -53 421 197 -304 -558 183 854 680 -98 -298 -20 313 156 34 77 450 201 -588
3869 -588 -425 274 712 359 -397 -593 -171 371 84 -356 -111 219 -13 -700 -350 313 745 177 -507 -588
3889 -588 182 56 159 -322 55 291 -393 -369 -284 316 427 -3 -612 -509 -145 594 -9 1 2 -4 -195 -355
3911 -355 -357 405 630 52 -557 -112 416 261 109 -174 112 402 -228 -293 -59 673 482 99 -530 -250 335
3932 335 741 -24 -155 -59 157 40 -176 279 584 354 -218 -705 -232 738 408 -118 -136 212 328 174 -137
3953 -137 76 466 360 -437 -529 393 713 416 -229 -555 7 162 -64 -41 598 200 -130 -359 -525 309 1047
3974 1047 590 -350 -193 -16 522 -63 -336 299 250 -99 -646 -410 580 651 -385 -395 -162 -58 -222 322
3994 322 -180 233 187 -225 -539 -587 436 637 19 -486 -312 -102 227 -97 -327 -234 68 -507 -752 -275 678
4015 678 650 -380 -784 -150 135 196 -173 -70 373 -56 -471 -353 69 424 168 -600 -497 -214 198 62
4035 62 -85 -151 -329 -90 -399 -495 155 800 308 -571 -717 -61 826 285 -241 -96 129 -193 -700 -57 664
4056 664 296 -415 -459 -330 404 225 235 259 -284 -301 -193 -36 -296 198 458 166 -573 -587 475 842 -159
4077 -159 -534 -284 557 29 -427 66 685 610 -587 -647 -47 751 239 -191 272 11 -302 -195 348 201
4097 201 39 107 -45 -273 -454 548 707 -100 -859 -366 346 286 -518 -17 797 328 -417 -475 669 771
4117 771 76 -574 -129 208 -2 -327 35 233 132 -249 -422 -357 -137 122 503 40 -693 -242 340 344 -441
4138 -441 -807 645 143 -770 -482 623 986 89 -862 -368 122 -137 -358 348 374 -275 -516 -223 159 55
4158 55 90 -294 -204 -662 -147 343 513 -183 -226 -95 216 -601 -617 642 851 -543 -1267 -597 1080 185 -209
4179 -209 236 588 -38 -863 -213 309 506 -13 -376 178 -206 47 520 420 0 -299 138 445 95 -198
4199 -198 133 774 -426 -859 -41 1161 347 -644 -357 336 -145 -399 60 547 499 -447 -819 356 432 297
4219 297 205 518 -65 -410 -444 -14 449 206 99 17 -634 -927 -189 997 628 -504 -236 399 450 -895
4239 -895 -282 553 910 -267 -1025 -247 546 -82 -518 -126 252 -187 -145 523 214 -79 -120 59 99 -206 -68
4260 -68 462 282 -520 -656 671 685 -182 -492 302 107 -719 -825 465 1389 568 -999 -668 216 80 -304
4280 -304 239 689 213 -563 -255 -195 333 257 300 200 -482 -1034 -64 528 228 -370 416 749 -641 -802 17
4301 17 943 358 -934 -297 713 387 -778 -148 490 190 -371 -75 173 295 -227 -126 -105 -136 -150 234
4321 234 501 -117 -518 -390 289 390 -39 300 701 -240 -1189 -544 549 821 -73 -202 206 -9 -198 -372
4341 -372 654 976 197 -596 -227 115 218 58 421 229 -260 -396 9 152 14 535 273 109 -491 -335
4361 -335 429 603 -354 -611 163 411 -107 -239 15 526 65 -761 191 269 624 -147 -268 -172 -405 -259 638
4382 638 455 377 -116 -309 -346 -241 -156 623 639 -401 -801 -119 414 3 -109 384 476 -315 -969 -500 526
4403 526 447 31 -401 26 -207 -450 -451 38 -300 -279 20 -123 -181 82 223 219 -448 -139 72 93 -24 -279 114
4426 114 399 30 -551 -292 671 273 -603 -635 38 443 14 39 428 180 -549 -578 30 228 253 388 -191
4447 -191 -523 -386 234 309 2 -397 -89 59 -389 -345 225 559 414 -612 -560 -7 408 68 -379 425 -21
4468 -21 -26 -162 53 383 675 -307 -336 -372 36 195 478 -29 -78 -226 236 24 249 -182 70 -30 -660 -266
4490 -266 169 947 148 -354 -368 -9 -47 -172 449 461 524 -189 -329 -240 147 298 63 -389 30 103 -222 51
4512 51 -2 304 198 -234 -457 106 141 328 -34 -434 -99 125 -200 39 49 -6 42 -631 -564 202 693 490
4534 490 -214 -387 5 48 8 45 -61 -75 -251 -444 -278 55 574 168 -404 -420 -416 -31 154 -187 -78 30
4556 30 12 -358 126 556 415 16 -330 -629 -285 155 347 243 27 5 -82 -571 -37 404 322 -207 -416 -163
4578 -163 56 106 157 70 92 10 5 -187 -231 347 336 -320 -411 -181 304 177 -133 -205 95 -53 -185 -9 116 570
4602 570 141 -386 -624 -169 642 298 51 -122 63 -284 40 -59 334 347 91 -556 -481 392 278 548 -18
4623 -18 -187 -186 -20 -110 72 202 225 -142 -333 364 153 403 75 -327 147 -198 -332 9 132 323 151 220
4645 220 -607 -461 265 360 169 -212 -526 -24 68 193 50 106 114 -627 -456 -66 446 252 139 -283 -134 -218
4667 -218 -47 182 -113 126 -160 -165 -389 -59 54 355 -204 -204 -370 251 126 -104 -96 202 17 -229 -160 155
4689 155 404 293 -380 -91 298 89 378 -173 15 64 -95 -535 -91 -16 106 420 -223 -261 -175 225 380
4710 380 40 -42 -32 -350 -373 -306 28 698 -29 -136 -328 270 206 268 69 -47 -78 -215 -170 160 201 244 -224
4733 -224 -314 -401 337 546 530 -76 -500 249 0 58 -155 399 681 -277 -250 -322 343 237 -33 -249 40 148
4755 148 -82 32 437 343 17 -221 -478 -105 -236 260 281 -140 -120 -50 -46 94 -128 -49 364 -327 -529 -153
4777 -153 392 59 -124 -409 -103 327 -463 105 251 161 8 -413 199 259 348 -85 -11 -293 -245 -5 351 418
4799 418 370 -282 -41 -127 -300 190 367 273 -444 -455 -220 116 -24 -31 260 373 -402 -680 -54 487 229 -110
4821 -110 60 90 -7 -207 60 182 24 -253 -97 113 -247 8 311 126 -402 -473 408 335 192 -473 -81
4842 -81 157 -30 -321 281 523 441 -577 -448 252 390 5 395 46 -288 -256 -158 295 236 -296 93 156 -535
4864 -535 -191 504 608 207 -216 -60 -104 -176 -695 418 671 449 -639 -577 290 501 -5 -46 84 -90 14
4885 14 -215 367 75 -65 -123 -89 34 -1 44 81 13 -431 -175 398 102 -220 85 433 73 -604 -526 273 536
4908 536 536 -489 -61 53 -142 -91 297 744 251 -561 -297 235 259 180 100 160 -79 -434 -49 253 102 454
4930 454 360 4 -692 -304 275 349 -299 -195 -51 259 98 -478 -90 177 228 -251 -337 228 343 -349 -164
4951 -164 49 12 -274 356 482 -47 -338 164 176 -115 199 290 204 -211 -403 -340 503 738 6 130 31 -173
4973 -173 -582 -164 721 820 -15 -349 -181 85 -96 134 561 179 -106 -323 -210 -463 23 54 293 -145 -204
4994 -204 -242 426 330 -398 -142 57 8 -599 -69 139 362 -346 -496 463 296 114 -149 -73 204 -451 -299
5015 -299 -58 288 241 -399 -315 -455 -18 -50 283 527 10 -467 -141 -79 134 236 482 394 -435 -485 25 793
5037 793 97 -99 98 -125 -136 -300 -182 760 286 -51 -385 77 -8 45 -41 67 -233 -73 1 160 -90 -277
5059 -277 125 167 21 -438 -25 454 -91 -459 -231 245 97 -236 -114 385 211 -428 -685 196 558 56
5079 56 3 42 -217 -136 -130 479 320 474 29 -98 -97 -287 131 541 396 -140 -360 204 -42 26 127 409 261
5102 261 -372 -546 235 180 -47 -72 -97 -101 90 15 352 9 125 -304 -274 33 52 204 107 222 -141 -243 405
5125 405 587 -168 -167 15 35 -374 -60 501 596 111 -398 -163 -156 171 127 198 265 -140 -284 -42 369 322 173
5148 173 69 -260 -512 26 316 517 -120 101 111 -138 -29 -13 97 372 77 -475 -240 169 317 -201 -201
5169 -201 36 -295 -459 -320 -16 142 195 -143 -330 -15 100 99 327 -151 -516 59 29 158 13 296 10
5190 10 -331 -746 7 387 493 76 -142 -29 42 62 173 -3 40 -407 -209 -145 218 140 -65 -98 66 -166
5212 -166 -129 92 31 234 117 47 -282 -70 111 404 44 -377 -349 -112 198 110 11 -129 194 -108 -119 120
5234 120 497 276 -152 3 -316 96 52 -26 -33 61 -322 34 -332 -107 650 214 -29 -211 -139 185 171 186 8
5257 8 60 -111 -86 -158 -169 157 305 -324 -78 -50 127 -185 -45 -225 155 29 -420 25 41 317 95 99 -221
5280 -221 -318 342 331 169 -80 -170 -265 -86 -68 -178 215 162 -97 -117 -170 85 183 95 -51 -361 96 -32 84
5303 84 359 327 219 -492 133 -48 235 230 -298 146 74 -107 142 -75 46 212 68 -455 -322 139 31 80
5325 80 -255 -5 -1 -101 285 58 454 186 -132 23 -30 208 234 230 -86 103 270 61 155 -15 199 5 -134
5348 -134 -353 255 -40 300 236 -431 -180 155 272 -16 360 -2 -29 -190 -176 23 464 35 -55 -330 -112
5369 -112 262 285 -8 11 -299 -82 112 40 153 297 0 -189 -87 -51 105 135 -37 7 317 -137 -16 -117
5391 -117 195 33 -2 -90 -197 -97 15 211 187 -211 -232 -249 -110 50 242 432 109 -341 -322 -71 166 37
5413 37 -142 42 68 -110 -81 250 285 364 100 -477 -217 188 -17 37 116 338 -328 -85 61 113 212 -173 -137
5436 -137 -139 -12 -19 146 251 -144 -386 -85 -65 161 80 339 -324 -350 -132 253 450 158 95 -30 -13 202 -220
5459 -220 220 180 268 -43 84 -6 139 142 24 151 -243 -198 211 88 -177 -167 197 -5 -255 -282 558 286 -107
5482 -107 -343 -218 -211 130 -109 136 240 -148 -199 9 257 291 474 -163 -33 -248 -341 202 34 -112 25 -57
5504 -57 -1 252 -263 41 485 -91 -354 -399 -233 147 -238 -175 457 87 -295 -223 185 -69 17 -188 -5 -103
5526 -103 229 366 54 64 -269 80 -180 241 1 -103 160 -170 -185 -48 309 245 -177 -153 -168 12 19 104 315
5549 315 412 -11 -540 -201 -72 108 -2 341 69 -158 -157 184 160 36 -21 -34 -32 -264 -44 -34 -9 -103 -158 131
5573 131 -56 -110 -62 183 245 6 19 -45 129 115 -310 -228 -110 -158 106 135 100 5 -104 -215 -143 165 223 131 63
5598 63 127 -345 -49 466 285 -157 92 26 -214 -301 41 266 58 156 -72 19 153 -2 46 330 280 -68 -392
5621 -392 104 -241 -114 7 338 48 -307 115 -297 29 -119 407 83 72 -92 66 220 136 -124 41 14
5642 14 219 -29 -272 86 157 -21 26 258 464 -336 -66 -209 131 33 -28 285 288 -155 -394 -234 7 238
5664 238 160 178 -36 -381 -327 86 33 346 -124 195 147 -474 -403 31 302 178 -228 -246 -228 -506 -266 -235 177
5687 177 -43 -206 167 163 -194 -190 -336 67 -97 -187 248 724 -253 -189 -320 -198 -48 35 -34 348 -338 -428 0
5710 0 320 147 -6 -22 -35 6 -470 -60 131 70 -29 -272 -159 186 -261 384 291 8 37 5 66 74 -399 -12
5734 -12 434 139 143 -10 305 213 18 -146 -49 -10 308 112 265 285 87 22 -152 66 -65 14 137 -72 79
5757 79 221 9 163 20 -308 -154 195 -96 12 573 547 -46 -123 -39 133 10 -28 87 394 -102 -434 73
5779 73 225 159 107 -372 -267 -394 -187 43 138 -155 161 -64 5 -129 -10 389 289 -1 -437 102 309 -211
5801 -211 -122 100 303 116 -292 -194 60 212 -6 -19 -142 -228 -218 42 58 -60 -310 -237 -18 -189 -145 213 -40
5824 -40 -386 16 -105 214 -48 -58 -12 79 140 12 225 197 175 -114 -202 332 41 5 33 387 270 -23 19 -184
5848 -184 -58 313 -127 -295 60 195 139 377 68 8 -227 -91 -118 -156 -54 108 114 -194 2 -74 -55 44 146
5871 146 -39 213 12 -125 24 234 260 -205 -122 237 144 85 -84 23 -70 -55 -236 202 -14 -53 -178 -178 -140
5894 -140 -249 124 272 47 -330 46 -53 184 -105 -30 71 -59 136 100 136 167 254 166 -168 90 -147 141
5916 141 63 129 164 -74 -5 -17 131 285 101 -459 -188 -17 128 19 177 159 -80 -33 101 -270 128 -77
5938 -77 -106 -164 1 -18 -72 -18 -69 -54 66 -58 -26 -88 226 280 95 -260 -220 -58 79 322 -129 -70 44 -56
5962 -56 -131 -187 47 239 -61 -55 -616 78 355 -21 6 -105 75 -25 -101 38 40 213 -179 -443 -57 19 361
5985 361 103 24 142 122 -25 -127 74 14 -28 218 -29 -167 142 76 -163 229 -69 48 -127 140 -22 206
6007 206 -5 -579 12 256 348 192 164 12 -152 -2 245 52 48 144 -15 -100 113 -143 449 181 94 -164
6029 -164 -181 125 50 276 220 -150 -39 -82 -25 -190 73 383 -189 -28 -109 348 157 -119 406 159 48 -99
6051 -99 -3 -356 595 16 -150 253 -101 311 310 109 18 -246 -211 -13 -110 -141 112 -179 -102 -337 -80 368 -12
6074 -12 85 19 -150 27 -7 0 137 48 -142 -515 -386 53 126 53 209 -54 -189 -235 -82 93 182 85 -190 -115
6098 -115 242 268 134 -24 136 42 -111 -43 -46 -33 185 -22 -102 -57 124 -92 221 -74 -142 28 200 -43 -67
6121 -67 125 28 -136 -412 -97 138 -50 250 132 -9 -300 4 -71 147 -129 163 37 -146 -256 151 539
6142 539 36 222 -374 -346 194 26 -136 0 170 90 -161 56 213 185 -279 58 127 -16 -51 133 116 339
6164 339 -41 2 -172 -6 98 345 -68 -106 -32 168 -54 -55 55 215 68 1 -69 -42 -153 26 -103 -139 44
6187 44 -328 98 24 -39 315 -296 -205 -128 -190 -60 45 61 20 -171 61 -30 90 -121 -231 -221 214 -48 35 63
6211 63 -175 -131 36 -49 -66 73 -214 -412 12 -9 -53 163 238 82 -12 -172 -146 -19 58 195 203 -161 -82 -304
6235 -304 -18 62 -164 -134 -132 -120 -401 -263 -131 -197 -25 202 18 -143 -32 53 209 -9 102 78 100 221 -16
6258 -16 -130 403 27 -71 -338 271 57 -369 -99 -109 46 -147 -162 559 99 -271 89 159 18 -183 295 156
6280 156 -170 -403 54 -38 117 -51 -21 -17 -206 -18 117 350 222 -235 -199 136 -265 -32 -9 57 -268 -404
6302 -404 -213 99 -45 97 -34 222 -30 -341 -99 -180 -99 41 -196 -50 2 -187 48 30 160 -1 -134
6323 -134 427 134 -111 67 66 -255 93 120 444 -113 62 -228 230 217 -5 -134 -155 127 90 -206 -115 275
6345 275 60 -150 258 -156 -144 -263 -52 153 35 81 118 89 -30 34 168 141 64 -127 25 486 32 -13 216
6368 216 216 -385 -107 -295 191 41 -423 36 55 -170 -221 143 34 -10 28 -104 87 -272 -169 -147 14 134
6390 134 -90 197 228 7 -81 369 13 -368 -191 -50 166 12 -146 -179 130 376 5 -58 245 124 -170
6411 -170 -32 -108 269 83 -42 -65 -178 -258 -71 111 -59 -6 -228 -60 -12 59 -105 179 57 23 27 -119 176
6434 176 -161 -224 39 -16 33 -72 134 87 -80 -9 -156 38 -130 47 -65 26 44 -414 176 293 92 75 21
6457 21 184 -210 -259 -96 539 -24 25 -35 -181 11 -166 24 22 6 -206 -16 97 173 -29 23 125 -11 -156
6480 -156 28 316 0 -246 133 36 -126 40 -99 148 -237 30 -144 271 62 29 234 -92 -17 -6 6 179
6502 179 -58 290 -79 -26 -14 134 -27 149 56 -62 -143 11 -61 317 335 275 54 -116 -115 -128 123 -135 141
6525 141 -61 42 306 -195 356 61 -130 111 -12 -91 71 -56 -251 16 -130 -195 -29 108 168 11 -62
6546 -62 -212 10 36 -180 301 -15 -130 -21 -96 122 103 170 -152 -233 147 -27 28 80 -36 278 128 -85 77
6569 77 153 265 -182 -108 -113 48 -155 -334 136 -168 84 -155 34 124 -257 105 235 -103 -107 -501 -4 271 -253
6592 -253 -173 147 -180 226 -402 -88 226 -330 -137 -132 -59 -33 -191 182 166 84 -208 64 124 -104 -82 -49 60
6615 60 -153 -115 -59 -11 21 226 -268 89 212 -137 31 122 16 -236 -76 178 -26 209 143 22 -138 145
6637 145 -130 41 -7 54 158 -190 114 -185 -127 81 259 -244 -174 -1 41 176 -452 42 63 -128 95 241
6659 241 367 36 84 -129 -125 -48 97 83 -15 106 -293 -121 65 152 -83 -128 199 -273 22 147 28 29 187
6682 187 -27 -46 106 -181 -178 196 102 68 -277 -200 110 -103 -50 -123 -114 -95 -138 111 -156 -65 45 -28 -2 43 122 -126
6708 -126 -27 -129 48 25 -37 239 -12 -46 -32 125 -185 -9 127 117 3 -128 83 138 -20 17 73 -209 29
6731 29 -316 -81 -185 127 -12 228 92 -19 194 -69 115 202 47 9 -332 -57 169 16 13 383 -176 -214
6753 -214 -306 -63 426 -225 -31 -30 6 8 -74 198 -67 -226 -122 51 -116 -137 -56 -70 -137 -198 -450 -227 9 -32
6777 -32 -10 14 -96 122 145 89 428 -78 -102 -50 102 155 66 25 -142 41 59 18 102 161 65 -37 133 -54 280
6802 280 42 146 42 148 85 -52 133 233 263 7 -52 -127 -130 -75 -9 -144 -359 172 210 -19 116 -153 -123
6825 -123 -13 -160 52 233 82 -144 -186 124 25 -173 -221 359 196 -117 -46 -153 -147 19 1 68 -258 -93 -145
6848 -145 286 -127 74 2 5 -137 -70 -88 167 232 213 -184 -228 43 -76 -269 -1 316 72 49 -119 265 73
6871 73 -49 275 -206 -375 -47 36 -31 -127 58 -45 159 -19 -66 69 -27 52 232 -304 233 37 60 59 -29 208
6895 208 206 114 302 165 -211 -66 -175 -27 -133 -72 303 3 -119 -145 -60 30 9 -8 -143 79 92 -28 184
6918 184 142 -148 39 -81 190 -13 163 355 225 -26 -168 -125 -44 -42 -111 82 -154 -34 -28 277 -66 59 313
6941 313 157 161 -28 -176 388 135 -104 -372 107 43 -289 -79 -133 165 175 -97 5 305 11 160 143 90
6963 90 -233 -293 212 290 -31 5 -160 -56 -39 -80 123 273 18 -187 126 25 -154 -96 253 230 43 -59 24
6986 24 169 -1 -89 -135 -35 51 0 -32 95 93 -174 -61 -49 89 -70 21 -123 -7 -162 -185 456 93 -25 94
7010 94 466 200 -323 373 351 -163 -54 313 300 -121 -56 94 366 50 -183 -184 -49 398 31 -86 -157 -234 -88
7033 -88 15 97 227 75 48 187 258 85 -28 303 -180 -213 2 -170 -120 -111 -89 31 53 -45 36 112 153 168 126
7058 126 33 -47 -12 124 -77 189 -130 -55 316 236 -274 42 -73 -72 -129 -345 97 264 -161 -343 102 -21 106
7081 106 56 -41 28 4 -153 -62 16 -159 -428 -51 -60 118 170 19 -112 -143 -250 168 5 -421 80 -72 133
7104 133 182 -204 -184 238 -14 -20 172 231 -192 -90 -176 -55 -3 59 -23 -196 -367 -65 23 -16 229 -134 153 193
7128 193 -187 37 -80 428 148 -262 -263 -18 93 160 173 -37 -185 -410 -78 146 86 197 48 -16 133 -147
7150 -147 -94 190 -138 -28 -5 49 58 -105 -50 34 232 -98 -12 80 -35 -96 -111 -66 -100 161 -180 -319 29 -201
7174 -201 190 21 107 68 44 21 221 28 -213 -30 -3 -144 -238 154 224 -14 171 13 101 -185 357 -178 -45
7197 -45 168 233 160 240 185 -187 35 134 -117 -82 340 -37 75 -191 133 315 -96 -25 23 335 41 128 -40
7220 -40 -45 -147 -123 -64 34 -2 -85 -96 -170 -180 316 139 210 113 -125 -118 12 6 -152 -5 -123 157 113 -208 -241 257
7246 257 -137 -220 -106 88 108 155 38 -314 199 263 196 156 4 428 49 140 -163 -172 89 -7 -44 -423 129 -163
7270 -163 -125 66 87 -20 165 -24 81 186 -1 -169 116 21 165 -338 7 -77 -183 -390 -40 217 -161
7291 -161 -184 -229 83 146 -193 -197 -21 305 30 302 -219 -24 -336 -64 -139 -340 17 -30 64 -143 -97 -96 -84 -50
7315 -50 -123 130 296 25 76 25 -38 -320 54 17 -229 -15 232 31 -59 -72 -42 -186 -67 -13 252 97 33 -29
7339 -29 39 21 71 -143 116 234 26 -36 -327 -36 -109 -21 -324 51 31 88 200 85 78 -54 7 106 -47 120
7363 120 -248 -99 165 26 -44 133 484 43 -95 -9 38 -72 -149 44 131 172 25 -268 358 121 -82 66
7385 66 -211 89 -90 167 129 -91 -309 309 -132 282 94 126 315 -42 27 6 119 278 -197 219 152 -201
7407 -201 -166 -125 -411 31 -199 -15 -157 2 109 -103 120 80 -10 -42 264 -73 23 -140 -7 -20 -101 -5 90
7430 90 68 23 -31 -7 157 524 28 303 180 -210 -89 231 -129 116 272 -87 2 -80 -210 -29 113 239
7452 239 -26 -111 -67 84 6 166 188 28 -131 -70 -25 122 52 -3 -157 243 -45 -179 53 179 -126 -97 -418
7475 -418 20 144 188 111 -147 77 56 -74 108 203 -23 134 -78 -116 -77 -116 213 6 47 48 -29 -158 -22 226
7499 226 54 -25 -299 -35 59 97 338 81 10 -229 -100 -111 -12 -271 -102 -423 306 215 -291 -162 -22 103
7521 103 -96 -99 91 252 94 -39 121 -2 250 23 28 -129 -296 16 -119 13 123 -276 -108 -251 -113
7542 -113 -70 -6 181 28 -175 -151 105 -3 229 97 127 -290 -11 139 -5 -66 -32 6 198 -15 -172 -31
7564 -31 63 -11 83 -192 341 209 -80 -102 -153 -270 199 -186 -14 -202 52 348 182 -108 -241 16 -42 220
7586 220 -275 238 219 -406 -83 -93 -7 -23 12 -95 317 104 -38 131 -133 -176 -84 25 91 -118 101 235 -71
7609 -71 45 -292 -40 15 -165 32 -39 -232 -107 17 117 -52 -224 -102 86 75 36 55 300 -46 -261 -71
7631 -71 -213 -100 20 -180 26 36 -188 34 -35 76 1 -209 -111 -424 -227 53 -151 -24 199 -302 -166 242
7653 242 206 -3 -45 62 -4 -2 -87 98 151 -77 65 25 105 34 -88 168 58 -170 8 108 181 -157 -117 -107
7677 -107 27 -212 -289 41 26 -65 -164 -19 134 36 -150 176 261 -17 -149 17 27 -64 122 30 127 -52 -187
7700 -187 -141 37 163 -278 -29 108 139 76 -11 142 75 -228 -192 85 -100 45 73 51 18 -10 309 -10 24 -41
7724 -41 79 345 292 -110 130 88 163 -122 -176 78 -12 231 -186 257 62 -223 99 149 -37 -216 207 15
7746 15 19 -227 -164 -42 273 -358 -190 59 100 -228 192 251 -9 3 61 162 -135 32 -162 177 -76 55 142
7769 142 -64 -76 55 -17 45 -21 61 226 152 148 -38 -28 302 266 99 184 230 42 221 76 -119 270 -178 26
7793 26 220 275 -239 -111 318 29 62 103 -47 112 -342 -158 -175 113 -366 -71 -328 -169 172 -119 124 169
7815 169 72 54 142 -94 -74 97 -15 -147 -157 -152 225 243 -181 -79 219 69 -185 -181 149 367 59 -347 -151
7838 -151 35 -149 17 -187 324 66 -193 -52 152 -101 -145 -168 13 -143 -48 -73 499 158 -151 202 372
7859 372 646 -87 -123 168 -107 -134 200 82 127 142 -289 193 153 36 197 49 -176 -94 -243 -52 156 158 201
7882 201 119 140 -127 -79 61 -304 -81 11 -21 199 177 -145 -200 80 -17 -27 -145 -39 -162 163 -99 120 -17
7905 -17 258 -111 240 -19 330 -145 -77 -204 18 95 -38 74 -109 36 92 -239 14 -43 172 30 -10 67
7927 67 -10 174 -452 205 -82 -11 -213 132 16 1 -220 -221 457 44 -102 176 222 -121 -176 3 213 -25 -29
7950 -29 63 -166 210 -254 289 62 120 -374 -147 -148 149 61 106 -149 -238 -188 164 106 26 -13 5 -120 -180 -224 -90
7975 -90 326 -70 -423 -208 211 -84 7 -267 -189 -105 -7 16 -116 -249 271 -42 407 48 -179 -120 -68 18 96
7998 96 -6 -89 122 -98 -43 240 -327 -99 141 129 241 -126 -118 -40 -278 -48 19 -140 13 119 -96 57 -239
8021 -239 11 169 71 91 -160 56 134 172 -171 193 -128 165 -188 136 275 355 -72 -87 68 -26 -234 176
8043 176 58 54 50 -171 124 46 -244 -13 56 95 140 146 29 95 -10 17 -11 -172 -76 194 143 -133 -158 161 61
8068 61 207 21 -48 121 27 88 -232 -158 -191 243 197 -135 -115 217 192 120 -16 -48 -51 -90 248 119 -154 122 -38
8093 -38 56 5 -308 -128 -81 9 31 170 -9 56 -116 -127 -27 -30 7 42 -96 -197 146 42 32 -69 81 107 -79
8118 -79 -145 -70 -126 69 139 26 122 -24 -175 13 -128 149 201 62 -187 -7 -90 17 178 -128 -206 62 229
8141 229 -125 -114 -94 158 185 -46 -61 39 14 -27 -54 7 -193 -85 33 220 28 389 -169 -107 37 -190 -106
8164 -106 105 -62 37 194 -83 -38 -166 82 37 -137 215 -142 216 -243 -122 -98 -27 -111 36 -221 17 -145
8186 -145 -168 -189 43 39 1
8191A
$$ Imaginary data points
##PAGE= N=2
##DATA TABLE= (X++(I..I)), XYDATA
0 0 0 0 0 0 8 0 8 -8 8 -16 16 -24 24 -32 40 -48 56 -64 78 -90 106 -122 144 -164 190 -218 247 -280 319
29 319 -357 404 -454 508 -568 633 -709 786 -871 967 -1073 1187 -1313 1454 -1613 1784 -1979
46 -1979 2203 -2454 2743 -3083 3481 -3965 4561 -5315 6310 -7684 9713 -13028 19373 -35943
60 -35943 168761 365164 -31041 -155335 -2915 78990 -94930 -96064 129870 230006 12671
71 12671 -155518 -88459 24850 8016 9985 58322 11716 -116341 -105671 6379 5048 -73919
83 -73919 16154 177914 103327 -131534 -130954 86811 110667 -103493 -125213 141175 255764
94 255764 26685 -152166 -25606 103335 -17786 -132308 3254 154957 55330 -123623
104 -123623 -120322 -14518 13843 19808 74192 54361 -85268 -150730 -54479 20348 -5073 42472
116 42472 180873 141027 -116062 -224300 -17623 161396 56369 -71516 34233 140028
126 140028 -11731 -185484 -69170 150883 120926 -76139 -117466 -10875 3812 -68356 -44587
137 -44587 52276 58006 -7422 -16187 -1418 -47106 -69790 11107 65467 -6989 -45875 70117
149 70117 143715 40 -151029 -59461 109077 66244 -79183 -40056 103482 55344 -128924
160 -128924 -129446 65550 143877 11886 -95135 -55927 -17211 -52719 -40806 55320 101570 44461
172 44461 -18584 -42443 -67884 -57469 42743 123669 52461 -66459 -42749 57422 34754
183 34754 -61511 -21937 106852 75764 -101071 -140626 19976 112857 11344 -75877 -1618
194 -1618 73842 5136 -82176 -42401 37600 27075 -24094 -13612 30349 39804 28586 15309
206 15309 -22910 -56053 -10961 68838 56288 -29491 -38297 36888 36703 -56112 -59453 66844 111731
219 111731 -25513 -140185 -61959 66206 53526 -24597 -4972 59623 20806 -78202 -80677
230 -80677 16138 74764 42883 -6640 -25082 -21329 301 29346 28130 -4863 -10785 14244 494
243 494 -53214 -42279 50504 83798 -10533 -89653 -30447 59167 26981 -61110 -46787 37606
255 37606 40973 -35933 -47496 32400 69252 2213 -65759 -43833 18671 40027 18749 -4753
267 -4753 -12314 -6539 2039 -2411 -12380 3356 35492 19246 -52122 -78423 -996 77935 45529
280 45529 -39797 -45561 13810 16343 -41540 -40473 40269 73884 -999 -72601 -38511 40857 52612
293 52612 1607 -27257 -9578 8526 -2890 -17404 -3209 28774 36886 -1360 -48319 -40689
305 -40689 20766 53579 9355 -46013 -29773 26013 27882 -18054 -20947 31023 42574 -22046
317 -22046 -66707 -15372 60929 54553 -15060 -43636 -5705 26128 8511 -14628 1623 29707
329 29707 16063 -29887 -44796 -389 52445 44668 -14503 -48814 -18411 23880 18230 -12743
341 -12743 -6341 29219 22939 -30006 -48515 7803 62368 34947 -35154 -49484 1993 35668
353 35668 11092 -16520 1559 27823 6744 -38527 -36132 19521 54077 17580 -40334 -42829
365 -42829 6521 35371 10754 -18487 -5590 18906 2461 -35539 -28313 27570 54302 8279
377 8279 -49868 -40541 16557 38663 4261 -23674 -5026 17894 -2986 -35189 -17966 34507
389 34507 45467 -8030 -54702 -32390 24673 37200 -657 -24787 -4359 14764 -5926 -30817
401 -30817 -8850 36841 36426 -18216 -54195 -21446 33116 36686 -5770 -27282 -3842 14194 -6132
414 -6132 -26012 -1589 38304 27741 -27337 -51753 -9224 41161 32898 -13450 -28674 -345
426 -345 15216 -5851 -21295 5150 37492 18570 -32862 -45424 2607 46273 28163 -20677
438 -20677 -30271 2487 18504 -4296 -18007 10175 36879 10476 -38999 -37956 16818 49647
450 49647 17696 -28397 -26119 8527 18861 -3326 -10993 14203 28897 -769 -38038 -27605
462 -27605 22876 46874 12542 -32132 -28193 11059 23683 -1561 -13776 11478 26961 -5352
474 -5352 -42155 -20257 36663 48224 -2055 -39858 -18713 19123 16193 -8870 -6990 16792 16854
487 16854 -15766 -32961 -5989 32415 32206 -7311 -36511 -19646 16687 22462 -3662 -15087 6560
500 6560 19058 -9149 -35883 -8384 40514 32684 -25467 -47611 -3115 36693 16556 -19125
512 -19125 -11689 15293 5180 -27084 -23426 16898 37421 9101 -29192 -32682 -3433 23257 19488
525 19488 -4554 -16905 -4400 5520 -9829 -21861 6552 42700 22988 -37652 -51413 4344
537 4344 43026 12345 -27057 -9036 24150 5643 -33706 -20146 29198 35631 -9715 -37565
549 -37565 -14681 16542 17864 1597 -7492 -5512 1165 4033 -2720 -10504 1561 20683 8399
562 8399 -27656 -26900 23707 48087 2548 -45063 -20962 27099 17564 -21662 -9314 36513 27417
575 27417 -32463 -47874 5662 45334 21376 -15615 -16440 -2843 -3573 -4931 8200 18557 14912
588 14912 4504 -11242 -29029 -21490 21636 46810 10600 -33799 -17618 25062 14004 -28975
600 -28975 -16333 38265 34213 -30289 -48004 12079 48889 6953 -35081 -10642 25912 10654
612 10654 -19738 -10930 13334 8072 -8685 -5323 6396 7728 8845 8408 -13760 -35456 -11565
625 -11565 36850 34477 -14863 -26792 10799 16156 -29870 -35921 29085 60813 -1655 -62076 -29798
638 -29798 30784 24402 -13340 -2826 27428 6681 -39508 -36164 8893 29770 16513 4765
650 4765 -3544 -19994 -20566 6331 18392 -5072 -14975 13445 21650 -20139 -39071 10852 48700
663 48700 2602 -49689 -16397 42363 20599 -41195 -31604 29157 33081 -17045 -24038 19545 26400
676 26400 -19681 -39384 -6084 21351 16495 11520 10859 -10336 -31388 -12612 18306 10971 -8037
689 -8037 10003 27151 -13277 -56185 -15860 57052 46907 -25187 -39058 10831 17192 -31949
701 -31949 -30698 37673 61647 -329 -47870 -19153 18762 5412 -12064 6934 20890 366
713 366 -14694 -70 6392 -5911 -568 20326 7068 -26995 -16603 27910 23311 -28367 -30276
726 -30276 30968 48060 -11654 -44167 1265 31743 -11816 -42830 8902 60754 26223 -35458
738 -35458 -33397 5341 6928 -9218 6593 27694 8802 -21860 -18400 -525 499 7719 30586
751 30586 20587 -31479 -49900 -1164 35248 6746 -17079 18265 40116 -14382 -63722 -20682
763 -20682 46585 30880 -27184 -22593 24747 20520 -24803 -25328 17208 24074 -10334 -20988 1248
776 1248 7359 -6669 -2706 9986 386 -10611 8908 22484 -10044 -41617 -13202 29006 14642
789 14642 -19736 1283 40522 11054 -53049 -45025 24923 45225 -2753 -25451 6232 17507
801 17507 -18553 -30246 12131 39699 11269 -22962 -21881 -10272 -7807 6461 28599 20570 -9632
814 -9632 -15016 1527 -5834 -25501 -4431 38087 27245 -26507 -32692 18328 34093 -12046 -33578
827 -33578 8204 33618 -4696 -35935 -4023 33220 13231 -21340 -9593 19523 13456 -11095
839 -11095 -13509 -3507 -5040 -2168 16288 21097 205 -9416 2452 -1177 -24327 -16544 28120
852 28120 40549 -6710 -38806 -6814 28454 7763 -20536 2456 31494 3459 -42191 -28809
864 -28809 22889 36023 6567 -8695 1395 -51 -15711 -13804 5325 11897 5943 4221 2058
877 2058 -10389 -10622 11595 19897 -7145 -26864 -3666 22918 4703 -22802 -5295 28202 15226
890 15226 -24211 -20766 17683 21785 -16652 -30757 171 24264 10496 -6177 747 6263 -7023
903 -7023 -17535 -8679 4779 9786 10823 4660 -11838 -19315 632 21754 9370 -15709 -12126
916 -12126 8007 1586 -22044 -10036 28902 32380 -9884 -33992 -9018 16511 3518 -14627
928 -14627 -1139 17477 6811 -14227 -10958 7943 13094 1065 -9358 -10742 -5635 4566 12001
941 12001 4552 -7274 -2889 9384 3806 -13797 -9988 12690 13596 -13524 -22109 7024 29928
954 29928 10941 -17395 -12674 7440 4194 -12795 -7638 15087 18947 -2072 -16653 -7586 8802
967 8802 12504 4056 -5953 -9028 -3520 3432 2736 -202 5849 14366 5485 -17412 -20572 5026 22332
982 22332 6339 -15126 -7316 12787 9505 -8757 -7849 11290 13389 -8546 -21098 -4276 16713
995 16713 14842 -1595 -8883 -2100 4281 1799 -3936 -3131 3825 5961 -2428 -11402 -3954 14123 16889
1010 16889 -3369 -19224 -9520 9123 7760 -5998 -4534 10423 9539 -8962 -16619 888 17915
1023 17915 8540 -12367 -15938 -339 9301 3936 -2814 315 6093 975 -10787 -12370 1649 14551
1037 14551 8336 -8971 -14245 -556 11538 5320 -7026 -5244 4888 2684 -10693 -11361 7192
1050 7192 18546 4695 -14842 -13609 3886 11263 578 -7868 -1736 5757 627 -9015 -5367 9694
1064 9694 14248 -56 -15820 -11400 5985 12292 2015 -7016 -1934 5691 1001 -8713 -5002 9872
1078 9872 12903 -3496 -16586 -7361 11143 13537 -280 -8663 -1532 5435 -455 -7947 -1544 11803
1092 11803 10524 -5686 -14933 -3619 12094 11774 -2661 -9262 -1320 5786 -75 -6188 144 11202
1106 11202 8035 -8308 -14342 -1002 14123 10082 -5525 -9266 534 6478 -86 -5667 1660 10775
1120 10775 4365 -10390 -12462 3114 14667 7025 -7962 -9392 1376 6408 32 -5057 2187
1133 2187 9117 1821 -11562 -10440 5586 15235 4388 -10938 -9412 3435 7843 -1286 -5418 2382
1147 2382 8018 -1541 -12930 -7556 9166 13813 519 -11913 -7751 4352 5850 -1879 -4712 2258
1161 2258 5191 -2625 -10688 -4929 9472 12074 -1576 -13587 -8042 5696 7678 -2485 -6168 2820
1175 2820 6735 -3596 -11617 -2545 12021 9802 -7214 -13977 -2602 8536 5344 -3176 -3021 3082
1189 3082 2642 -5264 -7726 846 10096 6932 -5933 -11923 -2488 9891 8296 -3896 -7435 928
1203 928 5033 -3524 -8989 2571 14426 6909 -11803 -13312 3378 12496 2847 -7490 -2758 5091
1217 5091 1505 -5931 -2776 7393 9670 -218 -9606 -7957 2016 9316 5621 -2943 -5207 1914 5339
1232 5339 -2020 -6687 1986 11471 2760 -12756 -10250 9145 14955 -417 -11233 -2377 8104 1237
1246 1237 -8045 -2087 9627 6793 -6212 -9201 229 8283 6177 -1389 -5950 -4772 245 4195
1260 4195 2214 -1703 1494 6121 -812 -11869 -7198 10852 14477 -3610 -15161 -3075 10281
1273 10281 3019 -8642 -1008 11341 4119 -12962 -12177 4524 11990 2681 -5771 -3301 410 -380
1287 -380 -1431 122 -2 538 1914 -432 -6507 -3856 7796 10065 -5414 -14628 -1145 12715 3705
1302 3705 -11579 -5177 10353 5668 -11778 -9400 10077 13538 -5382 -15111 -2687 8492 3473
1315 3473 -2252 903 3090 -2749 -6220 -2467 1198 2439 5183 4668 -5844 -12519 -1132 12979
1329 12979 6963 -8868 -6471 7409 4274 -12103 -9032 12996 17369 -5125 -16846 -2129 11699
1342 11699 2311 -8630 -836 9136 2865 -6929 -3341 4910 3916 -1117 -1269 -943 -3199 722 8226
1357 8226 4592 -7714 -7204 7590 8932 -5905 -8804 7339 11676 -7181 -16888 2932 20050
1370 20050 6329 -13558 -7834 7565 3088 -9023 -2690 12157 9333 -6071 -9584 -819 3208
1383 3208 2088 4385 3953 -4375 -8659 1001 6828 -1024 -4715 6247 10385 -5970 -17366 -827
1397 -827 17033 6137 -13588 -6665 12289 7341 -11345 -9348 9174 9664 -7420 -11383 3616
1410 3616 10371 -250 -6020 -787 1362 -2685 -739 5043 822 -6317 -2165 5044 -394 -7723 1804
1425 1804 13863 2329 -17349 -12223 10590 12027 -6081 -8765 8378 9780 -9815 -15963 4066
1438 4066 15921 1965 -11334 -4232 4619 101 -3758 2382 6719 -574 -5472 -1058 16 -4203
1452 -4203 -60 9436 4889 -9665 -8077 8293 10113 -7765 -12070 5704 12427 -4449 -13342 3986
1466 3986 16226 551 -15614 -5356 11048 6628 -6697 -4347 5337 2343 -5671 -1644 6107
1479 6107 3750 -1948 -546 -520 -6136 -4195 8508 11878 -2583 -10624 1079 9219 -2646 -10815
1493 -10815 3010 15305 1731 -15769 -6626 12995 10000 -6971 -7564 5632 5413 -6732 -7230
1506 -7230 5473 8936 -93 -4395 -614 507 -1758 1358 4381 -1939 -7181 527 8280 1331 -7365
1521 -7365 -227 9255 433 -13566 -5673 12682 10374 -8772 -10930 5179 9752 -3590 -8414 3574
1535 3574 8266 -3282 -10435 -1860 7145 4223 -569 -303 -1103 -4731 -2566 3563 2338 -3775 -1076
1550 -1076 5431 704 -8634 -3708 9947 8000 -8961 -12232 3092 9891 -2058 -8463 2668 10337
1564 10337 -969 -11570 -3740 7941 4828 -5317 -5160 1234 2079 -533 864 2305 -1313 -3015
1578 -3015 -409 -243 -3222 -501 6994 5032 -6525 -8557 3650 9661 -1056 -9000 -703 7706
1592 7706 212 -9108 -1529 11096 6955 -7116 -8794 1723 5338 -7 -2406 1987 2811 -620
1606 -620 -1934 117 1345 1178 2079 61 -5282 -4460 4488 8822 444 -6552 -722 5961 338 -7905
1622 -7905 -1767 8694 5320 -7183 -7267 4693 8911 343 -5809 -1189 3207 -457 -3861 -120 4160
1637 4160 3493 25 -2444 -2889 -478 3581 3229 -2280 -5212 -342 5038 1540 -3759 -66 6275 2175
1653 2175 -7644 -7283 4306 8559 15 -6547 -1379 4989 1719 -4276 -1799 3641 2314 -3630 -5221
1668 -5221 -638 4155 3931 405 -3403 -3450 -22 2037 -854 -2914 82 4113 763 -5452 -3218 5195
1684 5195 6163 -3172 -8431 -2190 4865 1948 -3719 -1337 4538 3044 -4207 -5745 918 5210 1991
1699 1991 -3458 -3867 23 3329 2175 -708 -1139 641 1001 -2288 -4351 -15 5515 4390 -3159 -5652
1715 -5652 248 5462 1630 -3957 -2111 2862 1685 -3335 -3230 3483 6252 774 -5290 -4090 1851
1730 1851 3493 384 -2134 -541 2302 1180 -2068 -1582 2112 4352 294 -4883 -4122 2968 5471
1745 5471 984 -2964 -865 2795 1131 -3343 -2368 3418 4731 -696 -5388 -1757 4702 4388 -1039
1760 -1039 -3387 -641 1848 84 -2596 -600 3899 3601 -1701 -4952 -1255 4179 3725 -1562 -3971
1775 -3971 -579 2578 830 -2107 -514 3940 2848 -2743 -5348 -164 4967 3203 -2589 -3826 476
1790 476 2594 86 -2358 -288 3170 1261 -3406 -4437 1142 5187 1988 -3201 -3527 606 2538
1805 2538 -403 -2524 78 2751 760 -3812 -3778 1953 4721 969 -4022 -3381 1203 2646 -523 -2475
1821 -2475 622 2831 8 -3884 -2659 2802 4426 80 -4410 -2738 2094 2592 -600 -2006 484
1836 484 2300 -280 -3794 -1429 3248 3670 -672 -4749 -1920 3067 2947 -1414 -2333 1253 2341 -978
1852 -978 -3627 -491 4406 3186 -2456 -4467 -577 3432 2267 -1006 -1612 787 1719 -1189 -2611 -27
1868 -27 3857 2968 -1990 -4179 244 4438 2934 -2258 -2690 1194 2259 -1420 -2791 1386 4885 1583
1884 1583 -3723 -3732 1508 3836 749 -2022 -1116 1533 1082 -934 -1242 1246 2922 747 -3448 -3505 839
1901 839 4284 1647 -2413 -2095 1648 2089 -1654 -2873 1457 3803 -109 -4572 -2299 3814 4335 -1345
1917 -1345 -3562 -714 1935 -227 -2013 -311 2231 1517 -998 -2679 -1014 1933 2621 -348 -3730
1932 -3730 -2584 1363 2861 -648 -1889 1471 3190 -1692 -5646 -1529 4704 3317 -2997 -3822 1003
1947 1003 3362 -52 -2470 361 2423 -43 -3294 -1895 1342 2761 1344 -635 -1548 -1131 1195
1962 1195 1323 -1233 -2371 353 2617 -4 -3382 -347 4897 2361 -4088 -5008 1710 4032 -818
1977 -818 -3741 671 3981 236 -3576 -1125 3392 2374 -2328 -2878 -591 1103 1786 1945 766 -1147
1993 -1147 -395 626 -719 -2504 358 4104 2387 -3904 -4068 2706 5309 -597 -4440 107 3724
2008 3724 -471 -5165 -726 5590 3405 -2813 -3350 1561 2250 -844 -1677 455 576 38 688 923 -81
2025 -81 -521 1232 797 -2494 -2950 2813 4721 -1118 -4962 -160 4762 1168 -4293 -1276 4345 1732
2041 1732 -5482 -4045 3624 5368 -255 -2944 -78 1170 -1839 -2432 1206 2467 396 -365 -300 -1266
2057 -1266 -1838 1518 3333 -320 -4364 -1653 3398 932 -3739 -1144 5066 2807 -4994 -4697 2711
2072 2711 4210 -2279 -4787 1285 4309 192 -3443 -377 2611 -59 -3095 -626 1372 473 -241
2087 -241 745 -427 -2448 -421 3535 2296 -3257 -2939 2537 1911 -3487 -2640 4780 6011 -2535 -6517
2103 -6517 -570 4824 491 -3760 310 4657 969 -4334 -1714 3202 2261 -1095 -913 108 -824 -1293
2119 -1293 1677 2215 -656 -1646 1467 1953 -2638 -3456 2172 4684 -1132 -4687 723 5564 913 -5356
2135 -5356 -2196 4312 2440 -3960 -1833 4017 3195 -2666 -3646 1282 2600 -150 -823 924 -207 -2269
2151 -2269 -140 2449 1050 -1048 882 2399 -1722 -4929 -244 5548 2267 -4184 -2295 3651 2238
2166 2238 -4264 -2762 3976 4215 -2994 -4750 986 3743 -516 -2310 519 1817 -815 -1935 153
2181 153 774 -1019 -277 1627 289 -2105 -599 2923 509 -4371 -2594 3797 3383 -2821 -3674 2304
2197 2304 3153 -2629 -4799 1711 5301 -381 -4643 -1527 2516 797 -1698 105 2452 181 -2591
2212 -2591 -1261 308 52 464 2161 983 -2730 -2855 1758 2427 -1659 -2467 2314 3345 -2271 -4563
2228 -4563 1075 5267 727 -4402 -1237 3675 1322 -3058 -1882 2502 2166 -1795 -1472 1013 1421 -788
2244 -788 -981 -131 -259 -88 1877 1896 -1127 -2647 425 2384 -625 -2570 1074 3813 -225 -4889 -1587
2261 -1587 4418 2940 -2473 -2528 1969 1858 -2074 -2328 2060 3653 293 -2371 -874 398 410 377 1142
2278 1142 426 -620 0 920 -518 -1382 374 2791 299 -3250 -1353 3081 2179 -2626 -2348 2159
2294 2159 2989 -1650 -3059 1009 2713 -260 -2884 -565 2713 1467 -1406 -1411 -83 -231 -159 741 228
2311 228 -243 -95 394 -829 -1821 -179 2545 1395 -2838 -3037 956 2464 -968 -1895 1176 2847 -666
2328 -666 -3931 -1457 2581 1587 -1553 -1701 982 1025 -406 -840 -25 449 233 -409 -640 -306 865 1382
2346 1382 212 -1698 -1305 1374 1838 -907 -2180 495 1875 8 -2449 -29 3017 1311 -2200
2361 -2200 -2574 687 2127 -147 -945 -65 947 68 -1152 -791 791 1353 501 -908 -1183 -296 1814
2378 1814 1474 -673 -1186 328 1182 -478 -1739 427 2620 1302 -2029 -2055 1644 1962 -365 -1680
2394 -1680 -247 1482 312 -1128 -384 1359 1607 -52 -1570 -554 777 1078 213 -1288 -500 1106
2410 1106 942 -756 -1089 369 1525 -61 -2079 -916 1450 2314 -615 -1945 -57 1560 360 -1333
2426 -1333 -798 1418 774 -1011 -1970 -198 2008 1123 -871 -1588 -377 859 74 -749 -526 1014 1058
2443 1058 -725 -1754 -60 1595 1168 -1303 -2081 -8 1450 130 -1104 -195 1326 488 -1515 -1999
2459 -1999 201 1822 312 -1591 -1382 258 1103 -109 -942 -319 631 494 -1380 -1152 876 2046 295
2476 295 -1287 -1108 628 1229 -303 -1313 110 1129 364 -1395 -678 960 1758 -243 -1664 -867 1174
2493 1174 1386 -146 -1032 381 1050 -120 -1181 -319 1259 1335 -430 -1845 -610 1598 1321 -398 -1016
2510 -1016 425 1030 -53 -1013 -180 1218 1337 -770 -1715 -16 1537 938 -708 -943 474 883 -263
2527 -263 -983 78 1558 945 -1212 -1276 363 1721 879 -1048 -1212 742 1206 -511 -868 482 1406
2544 1406 365 -1570 -1412 355 1674 595 -1054 -906 781 513 -608 -1140 451 1257 -67 -1559
2560 -1559 -982 948 1306 -62 -1445 -635 220 693 -218 -714 170 1204 -69 -1636 -945 856 1745
2577 1745 -462 -1842 -975 789 352 -1162 -869 786 983 -372 -1417 -21 1115 1067 -823 -1363 -203
2594 -203 580 270 -569 -184 174 525 -381 -1197 -754 945 1000 -683 -1628 -95 1573 911 -949 -956 743
2613 743 716 -1137 -1573 461 1825 423 -1482 -976 626 1157 -50 -451 -143 384 170 -239 -489 478
2631 478 1298 1062 -742 -1297 -8 1480 516 -1130 -768 1179 1261 -749 -1436 909 1836 -307 -2053
2648 -2053 -572 1572 868 -680 -677 583 1130 263 -591 236 417 -114 -409 -269 -348 942 1497 395 -1355
2667 -1355 -865 637 941 -340 -992 907 1731 -501 -2320 -352 2202 885 -1909 -1290 910 878 -920
2684 -920 -865 868 1452 263 -930 -918 -439 72 208 7 -295 -386 854 743 -558 -1378 347 1432 -489
2703 -489 -1843 -347 1961 899 -1771 -1139 1174 1686 -1241 -1818 349 1374 -590 -1229 445 1819
2719 1819 687 -975 -1000 -616 -196 293 846 405 -543 -79 911 -20 -1286 -21 1995 592 -2124 -2184
2737 -2184 1197 1677 -618 -1193 1241 2023 -1159 -3012 -604 1690 611 -1033 -167 1312 363 -590
2753 -590 -269 162 -132 -611 439 292 -603 -358 1086 1172 -819 -716 1382 1677 -1409 -2618 321 2630
2771 2630 619 -1152 653 2097 14 -3014 -1720 1556 1608 -363 -537 896 146 -1103 -398 961
2787 961 674 -35 -18 -226 -1284 -1153 963 2187 39 -1599 -49 1100 -950 -2485 -363 2742 1270
2804 1270 -1785 -1206 1685 1150 -1514 -1827 1010 1974 -307 -1434 -17 922 -153 -475 496 461 -613
2821 -613 -459 -145 -785 -1577 393 2373 1275 -1463 -1375 1110 150 -2263 -1191 2464 2485 -1243 -2491
2838 -2491 105 2006 -439 -1479 400 1847 -887 -2446 -741 1131 1026 266 505 71 -983 -1561
2854 -1561 101 505 -367 -187 1807 1257 -1403 -1551 730 1446 -923 -1977 875 2250 -339 -2214
2870 -2214 -105 2420 638 -1471 -610 1114 90 -1927 -1111 1165 1164 339 370 674 -898 -1203 -230 622
2888 622 16 -337 1339 1187 -886 -2209 364 2663 685 -1715 -757 1185 147 -1953 -463 2806
2904 2806 2041 -1078 -1711 -18 675 -788 -387 1212 1113 -193 -335 48 -145 -638 271 952 39 -802
2922 -802 60 1246 -118 -1730 -202 1935 1103 -1576 -1537 1077 958 -1094 -1186 1554 2111 -430 -1872
2939 -1872 -476 669 71 -573 609 1058 109 -764 -416 -57 -290 286 666 372 -1710 -1032 1082 1115
2957 1115 -747 -526 1497 1098 -1673 -2289 522 1607 -91 -1289 57 1345 143 -1621 -767 992
2973 992 494 -499 -447 638 238 -5 -48 -28 -178 -113 804 119 -1234 -1303 378 1235 -263 -733 677 1506
2993 1506 -882 -2442 -589 1804 849 -931 -651 1171 453 -819 -896 809 1189 60 -1000 -513 -25
3010 -25 88 659 643 -171 -454 259 289 -595 -560 448 1409 -199 -1351 -510 1650 481 -1438 -776 895
3029 895 1080 -543 -852 621 1269 -16 -946 -104 779 278 -254 -562 -169 41 361 389 -133 -188 193 130
3049 130 -515 -828 169 1442 413 -1016 -856 670 1071 -762 -707 439 1128 -373 -981 -203 1061 947
3067 947 -720 -597 -195 58 -274 -210 -307 365 203 -94 -775 -477 319 730 -280 -1177 -352 920 876 -632
3087 -632 -853 445 598 -495 -1109 -54 605 482 -857 -1110 220 905 -152 -824 -64 315 -205 -615
3105 -615 -919 -22 743 248 -748 -1056 -81 611 467 -602 -477 394 595 -510 -774 283 1083 266 -1171
3124 -1171 -736 455 1089 -179 -1025 -11 471 384 -558 -274 602 595 154 -556 -347 413 1121 -121 -529
3143 -529 -177 367 226 -242 -391 322 1018 -335 -1046 -283 696 770 -380 -563 -159 555 180 -598 -126 757
3163 757 439 -763 -810 22 1130 758 -331 -518 -100 270 175 -381 -389 419 248 -599 -538 -102 1335 719
3183 719 -371 -915 -256 415 -99 -556 -109 598 582 -646 -753 377 728 165 -710 -640 -91 664 -163 -293
3203 -293 -136 691 171 -674 -499 353 602 120 -1056 -796 427 942 9 -444 258 138 -72 -722 -494
3222 -494 183 920 -374 -1147 -143 482 488 -336 -526 390 598 -154 -692 -294 448 648 -236 -932 -119 504
3242 504 620 -328 -215 -84 339 -203 -517 -11 939 616 -494 -622 -223 849 419 -294 -284 198 555 -275
3262 -275 -38 129 908 110 -675 -652 237 831 226 -217 -468 125 499 45 -262 250 732 603 -662 -553
3282 -553 312 819 249 -928 -198 361 513 -432 15 648 360 226 -720 -152 738 970 202 -465 -216 12
3302 12 551 28 -452 -2 548 -247 -835 -480 489 971 -4 -1076 -149 671 225 -63 -337 587 370 -759
3322 -759 -630 83 973 431 -156 -438 -195 82 237 -114 -410 153 -144 25 -651 -247 612 695 -565 -969
3342 -969 -25 613 530 -585 -438 738 570 -679 -639 738 970 -96 -1054 -464 304 79 65 -8 -158 305
3362 305 -162 -111 -138 439 379 838 -283 -804 -187 847 267 -803 -303 554 736 -820 -961 768 1392
3381 1392 -506 -1081 -174 672 281 -661 -254 411 37 -267 -237 267 314 222 -100 -109 -255 40 860 722 -653
3402 -653 -883 564 769 -310 -541 661 685 -621 -1464 -191 1162 1008 -816 -474 479 180 -354 -192
3420 -192 1191 693 -296 -463 30 356 201 169 234 -511 -929 348 1040 -298 -425 245 1379 -219 -1312
3439 -1312 -3 1306 122 -1276 -871 771 1174 -354 -655 382 487 -663 -790 286 869 164 -420
3456 -420 -358 -224 -244 96 495 19 -682 -485 403 -75 -829 851 1572 227 -1121 -1145 524 1036 -554
3475 -554 -609 983 861 -753 -1306 -144 1390 214 -1026 -429 316 -573 -357 125 314 -92 -111 298 51
3494 51 -843 -76 850 410 -784 -649 1005 1128 -638 -1016 144 1106 -386 -1115 447 1381 3 -1356
3512 -1356 -508 1069 615 -473 -333 129 -424 -463 195 926 370 -102 409 17 -958 -684 910 1168 112
3531 112 -992 206 907 -313 -711 207 1587 380 -1261 -614 1011 1117 -557 -255 788 885 -896
3548 -896 -806 242 547 -179 -178 310 116 -222 485 392 -626 -1063 132 1194 208 -799 -35 1321 -120
3567 -120 -1421 -534 1434 1025 -989 -1684 108 948 -219 -468 450 786 -505 -1300 -90 483 99 211
3585 211 625 214 -812 -285 560 449 -895 -3 876 0 -1111 -514 1293 1187 -496 -1172 401 734
3603 734 -542 -1066 268 837 89 -718 71 469 238 -1151 -523 -48 150 -124 370 229 -611 -492 544
3622 544 458 -95 -382 449 528 -1288 -1154 574 1362 215 -958 -294 546 -643 -1311 -101 1506 676
3640 676 -446 -906 -140 515 -322 -67 303 -103 -318 -225 207 196 153 829 872 -189 -810 130 676 -39 -1040
3661 -1040 -10 1210 368 -723 -212 690 398 -1020 -1133 793 803 80 -437 291 597 -307 -297 77 64
3680 64 -174 -255 -159 15 40 601 987 -70 -1381 -642 557 410 -686 180 1290 535 -925 -999 480
3699 480 1217 -64 -835 -157 458 21 -188 183 1000 203 -288 -394 -49 -41 186 211 -435 -251 -3 610 276
3720 276 -473 -466 524 -1 -777 -297 894 1114 -157 -1132 -621 600 433 -653 -344 276 15 -534 -559 465
3740 465 798 187 -480 -679 -508 53 296 258 -245 -198 -65 76 -444 -372 493 661 -326 -865 0 536 379
3761 379 -245 -93 430 164 -659 -864 377 572 214 -671 -398 -34 307 -12 -12 -253 -246 106 127 -201 -82
3782 -82 649 275 -358 -529 150 715 311 -619 -420 639 147 -131 -73 397 556 -423 -849 -199 682 558
3802 558 287 -342 -110 246 -245 118 328 191 241 -218 -522 -484 391 708 123 -440 -583 272 -73 -296 136
3823 136 622 189 -591 -617 183 512 368 -343 -689 43 46 -125 42 -157 379 44 -402 -605 219 521 330
3844 330 -367 -635 -198 176 494 -317 -64 341 22 -578 -208 248 892 128 -479 -711 22 496 72 -209
3864 -209 -40 344 -208 -694 -266 109 831 151 -696 -345 -11 479 321 -284 112 383 102 -227 -333 556
3884 556 521 -226 -819 -347 625 700 333 -489 -156 418 -97 -320 -242 927 509 -420 -764 -254 433 403 64
3905 64 -356 179 254 107 110 -92 683 206 -186 -703 -19 697 516 -46 -371 -345 -120 -82 -308 307 565 125
3927 125 -389 -505 56 525 435 36 -271 -202 207 -309 39 140 579 316 -462 -478 65 838 387 -508 -425
3948 -425 255 117 152 130 177 425 194 -638 -520 853 498 23 -644 -434 -56 148 176 -134 -8 95 -430
3969 -430 -733 -220 468 658 297 -847 -222 -56 578 -126 -281 295 245 -338 -880 -81 732 413 -315 -593
3989 -593 -149 98 55 -365 -97 263 216 -81 -451 356 493 291 124 -242 -267 183 424 21 -381 -319 -29
4010 -29 48 -450 105 933 479 -592 -727 60 464 -26 -229 100 313 35 -510 -297 495 39 -6 -616 -518
4031 -518 27 344 305 -101 -332 -86 174 112 -47 320 688 -23 -520 -469 364 822 326 -466 -42 404 17
4052 17 -470 -75 766 346 -333 -679 174 617 381 12 -264 -344 -243 233 83 27 -242 208 -342 -724 -599
4073 -599 513 924 -21 -535 -282 696 157 -278 63 403 -33 -467 -605 407 359 216 -281 -189 190 -66
4093 -66 310 123 261 12 -244 -174 -305 -266 923 548 -301 -838 -239 471 207 -324 74 471 -140 -993 -626
4114 -626 673 709 -62 -606 -165 55 170 -69 270 340 -247 -497 -170 20 63 23 85 -178 -679 -57 374
4135 374 326 -441 -299 371 451 -380 -430 611 869 -306 -1058 199 896 381 -179 142 290 -174 -541 -134
4155 -134 528 480 -3 -478 -297 -323 -19 660 552 -161 -585 62 159 -69 -175 726 736 -497 -1147 -75 847
4176 847 634 -389 -159 793 195 -640 -430 809 549 -377 -649 170 344 -270 165 369 -138 -96 92 568
4196 568 -40 -255 388 551 -301 -959 219 996 318 -732 -382 240 290 -597 -259 800 321 -680 -669
4215 -669 179 689 229 189 -215 107 -273 -292 316 526 -315 -138 226 -202 -769 165 758 585 -924 -826 439
4236 439 427 -213 -370 675 803 -511 -899 50 829 -78 -637 -120 442 -365 -376 455 182 -39 -547 -20
4256 -20 43 -89 65 280 106 -669 -297 811 673 -210 -857 458 101 -320 -414 554 1080 63 -1103 -493
4276 -493 180 251 -216 397 310 -111 -330 -310 572 444 208 154 127 -503 -819 441 1057 121 -344 228 658
4297 658 -399 -729 249 914 423 -701 -370 638 478 -458 -327 852 139 -571 -352 408 346 -318 -118
4316 -118 -29 232 61 203 351 -262 -428 -446 857 493 370 236 465 -548 -947 -283 946 955 -201 -468
4336 -468 560 321 -414 8 732 1006 -320 -741 -323 196 281 237 239 151 -320 -130 14 113 -169 209 338
4357 338 -112 -517 -29 472 488 124 -493 253 295 -371 -134 337 752 -108 -964 -9 654 212 -356 -406 -105
4378 -105 -172 -149 265 522 -8 -245 -350 -199 -25 157 654 654 -429 -807 -3 972 359 -195 225 -107 -309
4399 -309 -434 147 717 916 -262 -400 -170 127 96 38 359 275 -310 -255 208 155 279 71 -162 -512 -1
4420 -1 537 871 111 -289 74 -197 41 -410 137 828 152 -547 -305 74 535 63 -43 99 -146 -397 -238
4441 -238 -52 309 399 -75 -346 -464 -4 55 282 107 -364 -121 -6 37 147 129 778 -169 -484 -505 464 522
4463 522 -117 -260 63 193 -197 -125 389 414 328 -458 -339 -173 28 184 222 -282 -390 54 -17 -44 -218 -19
4485 -19 -35 -595 -549 -214 367 380 -170 -669 -221 -36 -113 83 552 514 -4 -238 -645 169 333 87 -136 -140 -291
4508 -291 114 341 98 115 -188 84 -336 -417 -112 362 188 -279 -312 -32 158 -48 -317 215 387 -359 -164
4529 -164 -224 601 674 57 -399 -506 146 -79 124 -112 137 49 -341 -99 110 353 406 -257 -269 -338 58 411
4551 411 298 122 -139 74 35 -136 -226 302 279 -203 -629 -407 267 181 182 -44 -16 -132 -378 -171 426 399 350
4574 350 -232 -363 282 448 373 -180 -99 -221 45 -23 252 152 738 72 -324 -633 -19 235 377 18 -198
4595 -198 -248 157 -205 -164 40 6 -217 -522 -134 261 429 249 155 -399 -230 -145 199 422 298 178 -301 -353
4617 -353 -337 17 546 130 -329 -383 -40 -82 78 -37 -13 7 -304 -265 -97 216 181 115 -523 115 105 -21 -137
4640 -137 53 146 8 -338 -495 90 445 581 -53 -233 -423 -214 293 184 -69 135 -230 -145 -308 -91 474
4661 474 328 -231 -252 -239 193 245 13 215 54 20 -144 -129 -83 177 297 -237 -558 -173 91 365 155 -223
4683 -223 -146 -44 -317 -186 388 700 193 -643 -415 -54 253 278 156 -123 -42 -116 -158 -84 483 415 -175 -258 -602
4706 -602 -204 298 37 -22 -41 198 -183 -182 70 363 582 -49 -313 -133 529 85 -13 -24 38 -48 -145 -315 118
4729 118 313 60 -79 -352 113 387 303 73 -274 -353 42 85 109 -325 251 246 -343 -150 -137 243 222 -51 -228
4752 -228 -537 181 16 237 -93 74 -197 -513 -262 415 101 316 215 -109 -417 -200 -181 44 -37 -60 125
4773 125 -165 -415 35 623 458 -63 -564 204 262 51 -124 -18 312 -219 -560 -61 236 569 -345 -145
4793 -145 -117 206 199 93 358 -153 -332 239 -147 -99 371 276 294 -632 -436 -171 284 86 -33 406 338 -158
4815 -158 -485 276 656 431 -339 -200 88 146 102 303 147 323 -146 -12 88 -91 -202 232 153 -238 -176
4836 -176 -115 732 -173 -200 -159 465 -55 24 145 483 113 -400 -520 355 520 171 182 -163 -333 -391 -274 205
4858 205 354 56 48 -422 -367 -148 340 812 99 -593 -420 -233 171 110 317 600 -60 -713 -615 221 347 -142
4880 -142 -141 242 44 -753 -308 169 465 55 -403 6 249 -218 13 103 -35 -177 -146 242 268 -479 -337 253
4902 253 -354 -394 -238 579 710 -458 -796 -151 214 138 158 368 160 -375 -720 -211 478 446 118 37 -141
4923 -141 -258 -469 213 598 250 -47 302 207 -249 -243 426 712 56 -415 222 115 -32 -150 24 421 -51
4944 -51 -348 -248 519 232 -244 -252 195 108 64 -30 272 -51 -339 -399 226 349 356 202 -399 -405 -716 171 711 308
4968 308 -151 -316 103 109 -443 -34 894 368 -593 -531 -148 248 93 238 366 -191 -542 -265 -261 59 -172 206
4990 206 -41 -35 -305 -173 458 11 -279 24 164 -239 -371 17 -84 304 -236 -258 -63 460 -131 -260 -330
5011 -330 -47 46 10 567 439 -254 -362 -254 -279 34 119 591 118 -642 -500 61 286 141 4 575 129
5032 129 -480 -676 244 551 195 -288 -311 -247 -163 -358 194 749 505 -361 -414 189 84 191 -106 219 -330
5053 -330 153 93 523 23 -171 137 342 95 -384 326 337 115 -399 -436 324 364 -22 35 37 -231 -354 13
5075 13 53 787 -77 -400 -407 -278 -189 233 84 455 90 -126 -348 -71 158 413 521 232 -412 -389 148 469
5097 469 107 188 -12 161 -549 -550 281 342 -193 -183 244 172 -48 79 329 -104 -210 72 50 228 -40 120
5119 120 16 -173 -222 197 294 468 -91 -494 60 -68 88 173 371 111 -367 -598 -174 189 481 -304 -130
5140 -130 -102 -175 -40 9 341 240 181 -469 -201 -262 -7 173 165 183 -264 37 76 188 -73 157 -55 -51 -555 -214
5164 -214 187 112 -200 -181 -142 -236 27 -298 122 188 -284 3 -242 18 167 42 129 -310 -150 -20 85 331
5186 331 -189 136 39 -99 -90 74 732 443 -190 -246 -108 290 -137 125 13 -17 -115 -167 115 185 -10 -95 -116
5209 -116 -402 163 92 209 58 66 128 -78 -94 -80 216 429 98 -216 -184 -157 113 259 -36 137 137 -326 -153
5232 -153 63 262 174 -246 -232 30 229 366 -248 96 -43 -227 -108 -25 39 97 44 -258 -301 6 374 569
5254 569 54 -86 -29 -50 -156 69 319 355 -168 -46 -393 -102 -21 314 -94 -327 -185 -103 117 99 262 143
5276 143 153 -171 -312 -4 133 233 106 -271 10 242 -273 3 175 -57 151 -150 -158 -44 495 100 26
5297 26 -344 30 163 114 96 313 -17 19 -109 -157 123 38 289 81 -120 -264 -139 124 362 154 -310 -273
5319 -273 -427 -168 147 309 66 -246 -154 283 -143 -271 150 96 -62 -330 273 -180 -155 34 -33 -108 22 -126
5341 -126 172 304 -78 -160 -156 22 -173 165 228 -34 -325 -267 98 55 251 -86 14 -85 -202 -131 73 248 385
5364 385 126 32 64 157 122 229 -185 -176 -83 -213 103 -132 144 182 -192 -233 -349 -346 416 327 -166 3 60 92 -87
5389 -87 266 235 160 -19 -414 -205 12 267 -34 84 -468 -263 -101 -189 103 74 69 -132 117 -352 101 200 281
5412 281 -317 -94 34 -239 -133 222 233 -57 -360 -261 21 344 190 -292 -27 -66 -94 -26 256 77 -88 -446
5434 -446 -345 -342 -199 154 372 59 -178 -19 296 175 316 -83 247 -132 -114 -275 146 427 26 -116 -304
5455 -304 -208 -188 -84 -284 376 227 -173 -106 26 264 -135 -188 -151 -179 -138 170 507 -95 -94 32 188 3 -99
5478 -99 224 287 -71 -44 -320 393 141 37 58 30 -432 -256 -74 208 250 -168 124 -476 -233 -73 148 471
5500 471 210 -174 126 48 286 -185 382 321 -34 -452 -281 88 255 176 40 -141 53 -327 12 331 222
5521 222 279 -308 27 194 27 128 107 6 -245 -5 365 16 -33 -113 -133 -295 -191 60 372 462 -349 -182
5543 -182 132 30 335 -135 329 176 -75 -399 -33 340 359 25 -8 -70 -356 -448 235 339 92 -111 66
5564 66 -284 -151 -112 324 341 -63 19 107 58 -289 58 26 134 152 -140 -100 346 -139 62 -1 91 93 148 -142 164
5589 164 98 -11 -274 137 132 -118 -52 -188 -212 -336 -121 602 8 -4 -21 -213 -394 77 -367 501 312 -467
5611 -467 -163 71 57 -239 196 169 179 -223 115 167 53 156 284 -93 91 -268 44 36 99 -17 80 191 -112
5634 -112 -344 -108 181 -157 -364 -7 103 206 -261 -64 -29 137 15 -210 431 232 -191 -305 -409 38
5654 38 -85 132 232 252 -107 -176 16 275 -257 40 143 -25 -366 -130 317 285 -36 -43 -302 26 -286 -315
5676 -315 145 373 -275 -185 -23 239 272 -275 92 -47 46 -230 216 79 20 -34 133 3 -95 -132 115 479
5698 479 50 -262 200 274 238 73 82 57 166 66 -148 255 86 -208 -3 -152 82 -409 389 430 444 -6
5720 -6 103 -122 -133 258 123 -13 -19 -435 25 159 138 124 7 107 -350 -209 -57 428 57 -243 -141 -116 357
5743 357 -82 125 418 -93 37 37 355 76 173 -272 21 6 55 -38 271 -29 -405 144 -130 -13 -153 337
5765 337 588 194 -538 -526 140 115 194 -267 34 152 -163 -77 -271 458 267 -230 -78 28 -93 194 260 32
5787 32 54 -120 -176 155 81 -24 72 -40 172 -435 -45 -1 -177 -182 -32 2 -108 -171 -49 185 -193 -196 -285 25
5811 25 248 17 -119 360 -128 -270 -142 318 361 -6 108 -153 -176 -67 437 110 182 209 21 50 150 266
5833 266 55 -11 189 -78 -276 8 229 82 -114 -32 -119 -205 167 179 105 75 -382 -153 -106 89 -205 229 -110
5856 -110 83 -172 60 221 82 -27 124 -121 -67 -141 0 317 -418 -61 -266 22 -3 -225 41 -321 -282
5877 -282 22 -300 -14 -217 293 -216 70 -133 -302 209 112 33 -226 213 -310 -286 52 390 -34 -66 -120 -12
5899 -12 283 111 73 112 292 11 -201 -129 -36 20 -50 121 146 96 -196 97 -120 -111 86 -109 138 -96 94 35
5923 35 -33 -46 -84 -45 124 -11 136 -177 -37 71 -165 -49 158 176 -173 83 -123 -228 149 280 -73 132
5945 132 -3 107 16 68 312 163 -62 -26 -246 -23 40 237 180 -229 -14 -115 37 -192 -225 280 -130 -212
5967 -212 -97 86 262 57 -68 256 -10 74 0 -300 188 44 128 90 16 164 160 -107 -190 -45 -180 19 96
5990 96 219 -47 -158 -375 -192 -139 60 194 -99 50 -226 10 362 213 205 31 -25 -138 120 165 204 -68
6012 -68 -112 -175 25 -77 86 -124 236 -120 -53 -174 257 -14 -92 -187 -514 -261 -10 78 -69 -81 88 222 80
6035 80 -151 100 275 132 -122 147 -30 -182 -48 158 -144 -174 110 -420 -73 310 28 20 -12 -190 -46 62
6057 62 47 -152 73 167 -163 -141 57 223 61 -95 -108 -36 -59 -8 281 -1 -110 -306 -76 120 169 190 90
6080 90 -20 -170 -224 -139 185 200 239 -66 91 -34 -242 151 85 59 159 -129 146 347 -107 129 76 -40 -65
6103 -65 -239 -206 -27 -50 235 70 233 -40 394 337 284 -77 -99 70 130 117 23 100 -149 22 108 -68 265 114
6127 114 -43 -25 -13 190 219 -151 308 113 -89 -225 323 368 163 230 122 239 33 127 114 294 -312 52
6149 52 120 -236 48 -156 155 106 120 -126 -241 73 89 -87 145 97 -115 -142 82 197 232 -97 -69 263 26
6172 26 -47 -17 275 -207 -257 -11 16 68 37 -56 -128 -177 -142 90 -76 85 -9 -145 345 11 -129 138 356 191
6196 191 -286 -93 130 125 -153 -248 -104 164 -60 50 39 -167 -239 288 -1 -39 38 -34 -80 -170 177 -164 167
6219 167 34 -164 71 201 -200 -371 -27 165 438 -55 -296 -122 -219 -128 292 287 47 160 40 -226 -282 -344
6241 -344 351 208 298 -2 -12 133 -179 -37 55 380 139 -545 24 196 92 209 -172 32 -93 -32 -57 5
6263 5 50 -137 -9 103 56 2 -126 98 -57 -173 -110 264 338 -212 -179 273 137 -203 -151 -7 265 -242 -172
6286 -172 55 75 -392 -95 112 332 8 -242 336 -6 27 61 361 60 -238 -106 -1 -91 -18 -81 39 -160
6308 -160 44 189 -27 233 23 -299 296 -126 -64 70 136 520 -394 -118 -72 213 -148 -46 -53 -1 -61 145
6330 145 203 139 -78 -235 -116 36 -38 0 136 -400 -180 -381 110 104 63 -83 141 129 -126 122 -186 238 312
6353 312 -265 -42 114 198 -322 180 370 -40 -328 58 -153 -47 -234 -159 217 -127 -113 151 -5 110 -104
6374 -104 3 11 124 28 22 401 248 168 -56 180 59 -7 -176 30 58 -64 217 -1 -153 -76 141 -181 -232
6397 -232 75 81 416 155 -273 -178 31 376 208 -23 58 39 -348 182 372 205 66 -264 -52 172 160 81
6419 81 -21 103 -160 -281 5 -23 -427 57 278 140 -375 -14 199 410 -170 122 125 -262 -125 -113 -94 170
6441 170 7 108 -50 200 118 -147 270 -37 -303 -125 399 462 243 -235 17 67 -222 -154 67 217 26
6462 26 -137 -273 43 -2 -179 80 239 271 -160 66 -41 159 58 -49 -24 -418 -97 -159 166 297 -49 -227
6484 -227 -135 136 -99 7 -242 -36 -99 -35 -114 64 -336 -21 -34 5 -123 133 87 23 -285 -209 69 22 8 218
6508 218 146 323 31 -245 339 332 -87 29 125 -162 -92 -74 56 229 148 -156 -150 -299 -160 268 -5 -11 28 40
6532 40 -136 26 185 286 161 -136 170 -75 -8 65 108 -35 -148 62 -331 -74 82 66 -8 -70 267 83
6554 83 -48 -150 35 309 -257 -123 106 351 5 -36 -84 330 -17 -32 190 215 -45 -7 123 -144 -189 142
6576 142 -165 85 149 -80 149 -5 206 267 195 -225 -70 -147 106 185 25 -110 -269 93 17 -162 199 203 19
6599 19 -51 -385 -1 39 -49 197 -132 31 -454 105 66 -108 -151 -19 -106 -16 -201 -30 61 258 -3 3 -36 39
6623 39 96 272 207 307 52 88 7 172 417 156 132 264 200 -40 129 19 91 32 189 -321 120 3 8 -361
6647 -361 -121 -205 138 55 110 94 -2 -46 29 -161 203 -172 -82 16 -66 156 -122 110 -234 39 -28 15 -170 263
6671 263 244 140 -17 7 -27 225 455 -8 35 241 -49 8 28 -182 283 135 -100 389 -164 -68 -185 -318
6693 -318 260 40 5 230 108 218 240 68 127 83 4 278 125 -112 68 -1 21 39 -161 -63 -186 -107 -165 -93
6717 -93 131 274 -87 -342 -88 47 155 100 215 148 232 -204 -250 -110 -1 80 97 -88 -272 142 -135 96
6739 96 -19 89 -181 -44 -233 8 52 62 -138 146 -207 -100 114 75 218 -27 74 -294 63 292 342 52
6761 52 6 -170 -30 189 -111 209 180 -68 86 50 -169 159 268 24 23 165 -181 171 295 -92 247 53
6783 53 1 -116 -23 55 293 81 -51 -116 -231 59 -49 -294 353 11 66 44 109 206 -70 132 -17 -233 -340
6806 -340 -98 -215 222 -157 -122 -209 337 -184 19 -34 84 25 13 -63 267 -99 -208 223 -127 -317 178 49
6828 49 9 80 -96 191 -142 12 -115 -145 -273 1 31 46 16 -337 24 59 -25 108 -261 9 189 73 -52
6851 -52 -42 38 -112 63 94 240 -41 56 45 27 352 184 -7 99 -311 92 254 -104 222 167 135 178 -90
6874 -90 -148 123 221 9 -12 234 -157 99 97 72 364 -61 -49 -372 49 -82 227 -192 41 -53 -40 135 -96
6897 -96 -86 -292 -3 324 82 -8 -242 148 1 80 152 85 -31 -275 -127 102 202 -57 31 137 272 135
6919 135 36 160 19 212 -167 406 42 -126 -26 -133 -156 207 128 73 -230 -317 39 14 -64 -295 -71 16 -16
6942 -16 461 74 254 50 -128 174 -182 247 -152 -256 90 248 -128 -288 81 48 194 -83 97 -92 155
6963 155 203 233 372 -311 72 -19 -120 95 -136 -77 47 97 -89 -124 404 188 -298 -115 100 -455 -1 -3 20
6986 20 169 -179 31 16 398 116 -82 192 -148 -159 -40 202 31 -262 -145 -11 -226 -170 95 -186 -70
7007 -70 65 138 156 -33 -8 58 75 -1 -14 -234 130 -335 -15 -163 110 2 -245 252 112 -38 -221 -29 247
7030 247 -290 -231 -261 108 -10 -403 90 169 264 -44 164 340 369 -270 72 210 64 193 101 -125 -55 -226
7052 -226 4 94 -14 -39 143 -187 -91 -254 -114 139 -376 -229 -273 -16 9 -70 -266 -73 45 -188 -275 87
7074 87 54 -297 -346 130 -7 -111 23 162 252 12 114 299 73 -5 -83 234 209 54 -180 182 -73 -16 -3
7097 -3 114 -146 116 -47 329 150 -17 164 -155 -18 -4 239 19 266 -291 -159 109 347 31 17 -427
7118 -427 -130 25 -25 43 -279 108 -107 -78 36 -47 -131 223 89 -78 -35 -426 -12 274 -15 172 177 -50 -48
7141 -48 197 389 -69 382 89 198 55 -6 -268 -18 11 -89 -2 -18 284 57 -221 194 -19 -136 -113 450
7163 450 24 -17 -144 272 -64 -380 -178 -69 23 -157 -342 14 -9 -225 361 85 153 -176 -116 -35 82 -276
7185 -276 -19 438 -23 71 11 -46 -24 -187 11 -219 -7 36 -79 129 200 239 -61 250 156 -272 -480 40 264
7208 264 135 -46 -238 247 25 -267 -239 34 -21 46 -12 145 137 231 -85 25 -72 -69 184 102 82 1 -12 216 86
7233 86 -98 -235 222 38 -125 -124 -15 -202 -416 353 126 -55 126 193 30 -359 -281 -26 68 -64 82 85 -160
7256 -160 197 1 101 98 175 -150 -186 -30 150 -276 -67 -170 23 -91 -108 120 51 87 -192 -90 21 154
7278 154 -12 293 -221 -219 173 -52 70 -254 -31 -50 264 177 19 -81 226 -71 -136 263 311 48 174 -96
7300 -96 -268 48 -186 -168 -262 -208 -29 -93 68 51 -37 -71 -46 218 3 62 -1 11 39 -182 145 -245 -131 -175 146
7325 146 -33 -12 198 272 -24 -329 55 -57 -108 -129 -131 107 -157 112 13 -125 347 -86 -217 452 -463 -62
7347 -62 -180 -169 -213 -53 82 75 262 348 -12 -75 202 -15 66 235 -186 -133 45 182 -191 129 -328 -203 -6
7370 -6 -169 216 -24 70 185 -160 -259 -169 238 -21 -16 293 52 75 42 -42 31 140 126 -150 61 -9 77 179 15
7395 15 243 195 -45 7 326 288 -74 26 290 226 153 109 258 -83 146 -133 -410 -90 -34 -131 -16 -90 198
7418 198 -44 88 284 -64 -41 139 -11 -277 -154 5 61 79 -166 -14 180 -143 -36 -38 279 -107 -91 42
7440 42 235 24 -74 37 -169 -24 264 99 -97 -45 200 77 -169 174 -124 174 58 -3 26 23 -214 -197 116
7463 116 -19 -17 20 -115 -152 123 49 -57 245 157 101 228 -202 -127 170 -40 -96 109 -152 -73 -85 -13 91 15
7487 15 42 -72 -11 77 -162 -321 163 86 -26 134 -213 -10 59 263 -50 96 100 -198 63 224 196 -52 -158
7510 -158 -4 -47 -109 -14 115 165 -97 429 35 -149 147 33 415 308 -132 36 -130 -3 25 279 273 81
7532 81 170 -70 20 49 5 -93 120 238 -90 59 233 34 -18 256 -149 -140 41 -127 -147 19 129 132 -222 -256
7556 -256 -258 167 168 157 -150 182 -198 43 -26 75 24 203 -204 -264 89 54 -14 -332 -168 181 -114 130 -130
7579 -130 -125 108 -448 -169 174 59 -97 177 169 -253 -148 60 -160 236 -137 -427 8 -281 -68 39 -94
7600 -94 33 -129 158 197 -171 -173 91 119 112 -93 -166 41 101 -107 -100 90 -168 -11 96 -65 42 -165 73 215
7624 215 -121 -8 -127 335 -85 -40 -70 57 -209 181 112 106 -98 160 -125 287 125 -227 57 94 286 -93
7646 -93 -148 45 128 -121 -323 -203 -5 37 0 32 129 -12 -138 -162 -34 -82 -227 215 -223 77 -19 126 20
7669 20 -168 -43 196 129 141 384 -79 -331 101 -44 307 102 -39 -305 -41 145 53 -21 140 173 -49 21
7691 21 397 -24 -148 -148 278 202 -361 26 -48 -104 -203 -198 -223 95 -32 -321 11 185 -89 -370 -95 174 13
7714 13 -19 159 175 121 -174 58 227 276 89 -370 -126 -125 26 24 172 -218 270 -51 556 161 -236 155 -3
7737 -3 69 -35 -58 -76 156 -42 -222 152 106 -84 193 -108 -74 -231 -81 -50 -141 -25 -299 282 -178 -55 -62 -31
7761 -31 343 -169 266 -102 277 -40 106 265 36 -307 -161 274 70 -1 493 3 -49 -197 48 169 242
7782 242 -240 114 -167 150 -48 -83 6 -165 -19 -235 34 -207 156 4 218 -66 68 79 86 -127 -295 -201
7804 -201 183 40 -247 -202 -272 29 -93 -319 -313 -100 40 -96 -11 -261 -172 -160 216 156 -53 -207 28 -13 -22 -28
7828 -28 212 -51 131 -166 -63 308 -2 250 42 114 156 34 146 147 86 -34 -326 132 160 170 143 268 -231
7851 -231 112 188 -20 96 -112 -151 -147 6 -76 60 190 90 77 -115 -161 -15 24 198 -68 -114 -249 -124 204
7874 204 180 -291 -73 67 144 -154 -59 590 -62 61 251 -94 414 109 -318 -26 -126 -54 -69 212 142 -213
7896 -213 -27 114 -3 28 -35 212 -4 85 75 7 265 1 -286 217 -92 357 -262 188 289 -136 9 -247
7918 -247 456 -98 119 123 -121 113 -175 218 54 135 -87 91 198 227 166 -56 53 -200 -87 146 151 -389
7940 -389 -216 -23 -121 49 -24 202 257 211 29 -74 106 110 -28 145 -59 31 -2 248 -171 -20 116 -283 277
7963 277 125 -9 -36 320 -274 -102 193 -37 -392 35 46 297 -24 -106 1 -48 -52 28 461 165 77 -176 -183
7986 -183 -43 169 -102 -283 -97 -220 -55 -11 -242 138 -91 229 81 -117 158 41 21 -235 -152 -184 157
8007 157 -280 -111 196 -89 -206 65 191 -290 -387 -94 124 137 172 7 -72 290 -102 -130 139 -81 149 -119
8029 -119 195 119 278 -63 -6 2 -65 116 -184 -177 -81 -376 -12 -309 12 79 54 -190 246 -33 -202 107 307
8052 307 120 143 -53 82 57 -53 -239 348 -171 -144 -17 -209 -283 -78 52 78 204 42 37 113 -10 -130 210
8075 210 -47 127 18 49 80 189 -266 -172 -5 56 -6 -238 -188 200 -126 -77 29 -20 39 -36 -49 219 9 -124
8099 -124 165 -31 -93 99 -7 211 29 -174 -149 -74 5 -402 227 77 293 34 -33 -86 -317 114 -122 6
8121 6 -298 122 95 146 37 301 31 39 -55 -70 -38 -72 -2 -265 -43 -227 132 59 -73 325 401 -73 62 -112
8145 -112 99 80 -92 -7 36 10 29 -201 -25 334 252 41 -29 105 44 123 436 33 27 -222 -37 46 150 -91
8169 -91 -318 133 -292 -69 67 -248 10 -119 -75 78 29 -241 -44 -78 249 -121 48 64 187 10 157 30
8191C0
##END NTUPLES=NMR FID
##END=
