##TITLE=1H_LR-707-K-Et2O-A
 CDCl3, 8 sc, 
 5.3.2020
##JCAMPDX= 6.0         $$ Bruker NMR JCAMP-DX V2.0
##DATA TYPE= NMR FID
##DATA CLASS= NTUPLES
##ORIGIN= UXNMR, Bruker Analytische Messtechnik GmbH
##OWNER= root
$$ XWIN-NMR		Version 3.5
$$ Thu Mar  5 14:39:43 2020 Russian Standard Time (UT+4h)  she@DPX200
##.OBSERVE FREQUENCY= 200.1315
##.OBSERVE NUCLEUS= ^1H
##.DELAY= (6, 6)
##.ACQUISITION MODE= SIMULTANEOUS
##.ACQUISITION SCHEME= undefined
##.AVERAGES= 8
##.DIGITISER RES= 18
##SPECTROMETER/DATA SYSTEM= spect
##.PULSE SEQUENCE= zg30
##.SOLVENT NAME= D2O
##.SHIFT REFERENCE= (INTERNAL, D2O, 0, 15.7039)
##AUDIT TRAIL= $$ (NUMBER, WHEN, WHO, WHERE, WHAT)
$$ ##TITLE= Audit trail, XWIN-NMR		Version 3.5
$$ ##JCAMPDX= 5.01
$$ ##ORIGIN= Bruker BioSpin GmbH
$$ ##OWNER= she
$$ F:/spectra/data/she/nmr/H-F/1/audita.txt
$$ ##AUDIT TRAIL=  $$ (NUMBER, WHEN, WHO, WHERE, WHAT)
(   1,<2020-03-05 14:38:28.68 +0400>,<she>,<DPX200>,
      <created by zg, POWCHK disabled, PULCHK disabled
       configuration hash MD5:
       00 E9 B6 7A A2 85 ED C7 34 08 36 98 17 FE 4E 26
       data hash MD5: 16K
       AE 7A 1A B0 90 2E E3 61 1B 7C 30 55 1B 44 E2 48>)
$$ ##END=
$$ 
$$ hash MD5
$$ 4D 65 EF A2 30 33 5F 0F 27 43 57 9A 37 21 F3 9B
##$RELAX= 
##$RELAX= 
##$RELAX= 
##$RELAX= 
##$RELAX= 
##$RELAX= 
$$ Bruker specific parameters
$$ --------------------------
##$DU= <F:/spectra>
##$EXPNO= 1
##$NAME= <H-F>
##$PROCNO= 1
##$TYPE= <nmr>
##$USER= <she>
##$AMP= (0..31)
100 100 100 100 100 100 100 100 100 100 100 100 100 100 100 100 100 100 
100 100 100 100 100 100 100 100 100 100 100 100 100 100 
##$AQSEQ= 0
##$AQ_mod= 1
##$AUNM= <au_zg>
##$AUTOPOS= <>
##$BF1= 200.13
##$BF2= 200.13
##$BF3= 200.13
##$BF4= 200.13
##$BF5= 200.13
##$BF6= 200.13
##$BF7= 200.13
##$BF8= 200.13
##$BYTORDA= 1
##$CFDGTYP= 0
##$CFRGTYP= 5
##$CHEMSTR= <none>
##$CNST= (0..31)
1 1 145 1 1 1 1 1 1 1 1 1 1 1 1 1 1 1 1 1 1 1 1 1 1 1 1 1 1 1 1 1 
##$CPDPRG= <>
##$CPDPRG1= <>
##$CPDPRG2= <>
##$CPDPRG3= <>
##$CPDPRG4= <mlev>
##$CPDPRG5= <mlev>
##$CPDPRG6= <mlev>
##$CPDPRG7= <mlev>
##$CPDPRG8= <mlev>
##$CPDPRGB= <>
##$CPDPRGT= <>
##$D= (0..31)
0 1.2 0 0 0 0 0 0 0 0.06 0 0.03 0 0 0 0 0.0002 0 0 0 0 0 0 0 0 0 0 0 0 
0 0 0 
##$DATE= 1583404708
##$DBL= (0..7)
120 120 120 120 120 120 120 120 
##$DBP= (0..7)
150 150 150 150 150 150 150 150 
##$DBP07= 0
##$DBPNAM0= <>
##$DBPNAM1= <>
##$DBPNAM2= <>
##$DBPNAM3= <>
##$DBPNAM4= <>
##$DBPNAM5= <>
##$DBPNAM6= <>
##$DBPNAM7= <>
##$DBPOAL= (0..7)
0.5 0.5 0.5 0.5 0.5 0.5 0.5 0.5 
##$DBPOFFS= (0..7)
0 0 0 0 0 0 0 0 
##$DE= 6
##$DECBNUC= <off>
##$DECIM= 24
##$DECNUC= <off>
##$DECSTAT= 4
##$DIGMOD= 1
##$DIGTYP= 9
##$DL= (0..7)
0 120 120 120 120 120 120 120 
##$DP= (0..7)
150 150 150 150 150 150 150 150 
##$DP07= 0
##$DPNAME0= <>
##$DPNAME1= <>
##$DPNAME2= <>
##$DPNAME3= <>
##$DPNAME4= <>
##$DPNAME5= <>
##$DPNAME6= <>
##$DPNAME7= <>
##$DPOAL= (0..7)
0.5 0.5 0.5 0.5 0.5 0.5 0.5 0.5 
##$DPOFFS= (0..7)
0 0 0 0 0 0 0 0 
##$DQDMODE= 0
##$DR= 18
##$DS= 0
##$DSLIST= <SSSSSSSSSSSSSSS>
$$ [...]
##$SUBNAM2= <"">
##$SUBNAM3= <"">
##$SUBNAM4= <"">
##$SUBNAM5= <"">
##$SUBNAM6= <"">
##$SUBNAM7= <"">
##$SUBNAM8= <"">
##$SUBNAM9= <"">
##$SW= 24.9337058887773
##$SWIBOX= (0..15)
0 0 2 0 0 0 0 0 0 0 0 0 0 0 0 0 
##$SW_h= 4990.01996007984
##$TD= 16384
##$TD0= 1
##$TE= 0
##$TE2= 300
##$TE3= 300
##$TEG= 300
##$TL= (0..7)
0 120 120 120 120 120 120 120 
##$TP= (0..7)
150 150 150 150 150 150 150 150 
##$TP07= 0
##$TPNAME0= <>
##$TPNAME1= <>
##$TPNAME2= <>
##$TPNAME3= <>
##$TPNAME4= <>
##$TPNAME5= <>
##$TPNAME6= <>
##$TPNAME7= <>
##$TPOAL= (0..7)
0.5 0.5 0.5 0.5 0.5 0.5 0.5 0.5 
##$TPOFFS= (0..7)
0 0 0 0 0 0 0 0 
##$TUNHIN= 0
##$TUNHOUT= 0
##$TUNXOUT= 0
##$USERA1= <user>
##$USERA2= <user>
##$USERA3= <user>
##$USERA4= <user>
##$USERA5= <user>
##$V9= 5
##$VALIST= <valist>
##$VCLIST= <CCCCCCCCCCCCCCC>
##$VD= 0
##$VDLIST= <DDDDDDDDDDDDDDD>
##$VPLIST= <PPPPPPPPPPPPPPP>
##$VTLIST= <TTTTTTTTTTTTTTT>
##$WBST= 1024
##$WBSW= 4
##$XGAIN= (0..3)
0 0 0 0 
##$XL= 0
##$YL= 0
##$YMAX_a= 368134
##$YMIN_a= -242449
##$ZGOPTNS= <>
##$ZL1= 120
##$ZL2= 120
##$ZL3= 120
##$ZL4= 120
##$ABSF1= 10
##$ABSF2= 0
##$ABSG= 5
##$ABSL= 3
##$ALPHA= 0
##$AQORDER= 0
##$ASSFAC= 0
##$ASSFACI= 0
##$ASSFACX= 0
##$ASSWID= 0
##$AUNMP= <proc_1d>
##$AZFE= 0.1
##$AZFW= 0.1
##$BCFW= 1
##$BC_mod= 2
##$BYTORDP= 1
##$COROFFS= 0
##$CY= 11.3945322036743
##$DATMOD= 1
##$DC= 2
##$DFILT= <>
##$DTYPP= 0
##$F1P= 16.9975609425685
##$F2P= -3.02152046262296
##$FCOR= 0.5
##$FTSIZE= 0
##$FT_mod= 4
##$GAMMA= 1
##$GB= 0.15
##$INTBC= 1
##$INTSCL= 1
##$ISEN= 128
##$LB= 0.24
##$LEV0= 0
##$LPBIN= 0
##$MAXI= 10000
##$MC2= 0
##$MEAN= 0
##$ME_mod= 0
##$MI= 1.114404
##$NCOEF= 0
##$NC_proc= 0
##$NLEV= 6
##$NOISF1= 3.799351
##$NOISF2= 2.8
##$NSP= 1
##$NTH_PI= 0
##$NZP= 0
##$OFFSET= 15.70392
##$PC= 1
##$PHC0= -9786.562
##$PHC1= 13.60082
##$PH_mod= 1
##$PKNL= yes
##$PPARMOD= 0
##$PSCAL= 0
##$PSIGN= 0
##$REVERSE= no
##$SF= 200.130013532006
##$SI= 16384
##$SIGF1= 3
##$SIGF2= 2
##$SINO= 400
##$SIOLD= 16384
##$SREGLST= <1H.CDCl3>
##$SSB= 0
##$STSI= 0
##$STSR= 0
##$SW_p= 3612.71676300578
##$SYMM= 0
##$S_DEV= 0
##$TDeff= 0
##$TDoff= 0
##$TI= <>
##$TILT= no
##$TM1= 0
##$TM2= 0
##$TOPLEV= 0
##$USERP1= <user>
##$USERP2= <user>
##$USERP3= <user>
##$USERP4= <user>
##$USERP5= <user>
##$WDW= 1
##$XDIM= 8192
##$YMAX_p= 0
##$YMIN_p= 0
$$ End of Bruker specific parameters
$$ ---------------------------------
##NTUPLES= NMR FID
##VAR_NAME=  TIME,          FID/REAL,        FID/IMAG
##SYMBOL=    X,             R,               I
##VAR_TYPE=  INDEPENDENT,   DEPENDENT,       DEPENDENT
##VAR_FORM=  AFFN,          ASDF,            ASDF
##VAR_DIM=   8192,          8192,            8192
##UNITS=     SECONDS,       ARBITRARY UNITS, ARBITRARY UNITS
##FACTOR=    0.0002004,     1,               1
##FIRST=     0,             0,               0
##LAST=      1.6414764,     0,               0
##MIN=       0,             -242449,         0
##MAX=       1.6414764,     368134,          0
$$ Real data points
##PAGE= N=1
##DATA TABLE= (X++(R..R)), XYDATA
$$ [...]
2159c338K052N312k070n146P34O514r83p510q69P808L814n298m819L063K790k703
2175f49k542L625L418k469k757L32O94q16J056L826r47n671j399N094K614m935
2191a526q22N118K364o376n302M914O327k096n727P52M821o17l656J85L082P1
2207A512k984M49J456q04p57K470Q07l437k413M348L723l700n036K345N616k036
2223A559n463J867O319k87o597k225M212L250j998j548J856M62k470r08K124L20
2239D73n81N91J426k879l290K562N388j17n755n87M246Q29m742j413N357K775
2255D283l698m282K201L753o68k686j5J652p02p89J478N27j489l3J783m84k903
2272b072J77M029J099m933k691M424L714k377l522J541L143j531m147Q51M303
$$ y = [-3338, -1286, 4026, 1956, -3190, -2456, 4058, 3075, -4435, -5304, 2504, 6318, 1020, -3799, -736, 2054, -649, -3191, 434, 3852, 1383, -1374, -1042, -348, -1164, -108, 3718, 2771, -2900, -4299, 795, 3409, -1526, -2348, 2770, 5134, -1242, -6544, -1630, 4697, 2601, -3126, -2374, 2447, 1830, -1826, -1641, 1441, 1512, -1472, -1023, 433, -371, -1128, 1342, 2149, -1288, -3701, 647, 4370, 670, -4366, -2021, 3595, 1559, -3904, -2037, 4282, 3995, -2602, -4827, -615, 2635, 637, -911, 945, 1407, -1063, -1971, 153, 473, -108, 483, 1909, -970, -4260, -1698, 3690, 3573, -2182, -2769, 1477, 2306, -2436, -3849, 1508, 4283, 585, -3697, -1496, 2257, 1589, -1097, -1112, 540, -162, -951, 527, 1054, -435, -468, 1315, 831, -2072, -1895, 2134, 3233, -1700, -4391, 33, 3747, 1370, -2152, -611, 2532, 1001, -3146, -2295, 2008]
2287B008J257k836j567K84N71P5J007P06j286j304J218Q78k300m02L270K311l363
2304E27m348J593M671K74l726p01L157O92l327j377K675K357j363k423O5J291
2320C7N08K18K30j238j346J418J270l55k528J212K825j040m076L41L982J955l556
2337a43k591J565K674o78j899R24J815o31k209r17J403J023P63j82j592r90O80
2354i85K117M4j992j39J839L15k675j416K801L180j472l456m49K661J003j663
2370b87n83Q97J232j149j213J42J267P07J84j806j106L63K369M39j433j586J589
2387B6J282j268j594P68K642q8l131j226K210K203j38k279k17O54O04n76n32P65
2405A05O28K2j194j276L62K478R12j445k143K37K368P3j557l89J622J190k227
$$ y = [2008, 3265, 429, -1138, -854, -283, -208, 799, 1505, 219, -1085, 133, 1011, -1289, -1691, 1579, 3890, 527, -3821, -2228, 2443, 2717, -1009, -1710, 1447, 2139, -1188, -2565, 110, 2467, 1104, -1319, -1254, 37, 545, 763, 993, -245, -1591, -173, 1097, 742, -1786, -574, 2251, 1211, -2865, -2524, 1458, 3413, -143, -2734, -1169, 1505, 827, -1072, -148, 1667, 1036, -1173, -2090, -687, 336, 1099, 917, -675, -1665, -985, 1132, 1176, -816, -955, 884, 1199, -1476, -2892, -91, 3089, 1617, -1839, -2288, 373, 1376, -287, -870, 27, 1259, 110, -1103, -961, 306, 1013, 1197, -609, -1715, -1352, 1017, 1456, 23, -1563, 26, 1308, 40, -1554, -786, 1856, 1768, -1363, -2589, -379, 1824, 1686, -593, -810, -156, 448, -128, -660, 105, 733, 755, -439, -1715, -1353, 1125, 2037, 592, -1551, -1314, 1054, 1127, -430, -819, 803, 1993, -234]
2422b34j945J179K470M04j896j271N37J381L40j359L3L16R70r10j264J54J793
2439F98J313j138j990l08J698J280j254j308N85J345m28j563k30K262R66j459
2455D69k010o8J784J128o73j151k34J245M4j138n82J387J183o14j785q50J823
2472d2J926p22j891k97Q92P18q12p95Q27J502n25j578r86J602J532j81j901m05
2490a136K71J629j46j391N54R03L74j789j055J049K335J9j987j067R07J359j04
2507G25q64n07R26M12j111r73O32K210n6j297j466M55J569L86j005n67M82O16
2525E67l21j213K87J383Q73j530j694L57K156O83j229j168O19J060l91j386L8
2542i09J551O76r64j474j90K105N08p70j233j38R56M20q08n04J030J125o87k075
$$ y = [-234, -2179, -1000, 1470, 1874, -22, -1293, -756, 625, 965, -394, -361, -45, 925, 15, -1249, -1095, 698, 2011, 873, -1117, -1425, 273, 1553, 299, -1009, -424, 921, 493, -1070, -1300, 962, 1928, 469, -1541, -1609, 175, 1303, 630, -521, -755, 490, 534, -604, -1186, 201, 1384, 770, -1015, -1865, -42, 1884, 1162, -729, -1026, -134, 584, -228, -1023, -196, 1306, 781, -797, -1783, -181, 1351, 1170, -731, -1136, -865, 764, 618, -773, -219, 684, 1058, -731, -1786, -737, 1598, 1617, -370, -1437, -530, 829, 725, -139, -646, 280, 692, -419, -1392, -760, 1450, 1394, 97, -1369, -914, 655, 1041, 36, -531, -49, 567, 246, -967, -680, 703, 1576, 46, -1648, -1291, 865, 1548, 319, -849, -230, 830, 439, -947, -909, 642, 1318, 354, -1120, -1310, 795, 1303, 533, -700, -838, 118, 538, -270, -774, 256, 1381, 694, -1381]
2560a381o9K037J457j104j896q2J319N56r31m57R39M26m82j279p7Q51J533l00
2578A060j365j095P74J439J57j765K70J039L12j447q98J264K009n37k293k92J188
2595a80J409q25p34j43O16M5m75m51L78J525J7j353j122L66J375Q71j063j310
2613a054M98J369n41j401K47K093j16j473j522J392J545k38j026m41N42K34L7
2630A45l87l2L98L00j80j046o87J711J633j150k067k51K493K37j407m48J401Q44
2648A507j489j532P81J456O54j087j139K17M97K04N2k68kN40R1o06j044P20K061
2667A613n06j719j340K322J249j243j481P78J097k47j636J04K243j05r75j117
2683i63J12P75P07k06Q2r84l62J177J26p29l45J249Q84j668j661Q16K514k25k159
$$ y = [-1381, -1450, 587, 2044, 940, -956, -1038, 281, 837, -94, -551, 388, 814, 332, -947, -1024, -173, 1360, 1060, -305, -1400, -626, 813, 970, -795, -525, 514, 826, -621, -1519, -255, 1754, 1217, -1076, -1368, -180, 1229, 404, -330, -473, 143, 188, -287, -738, -360, 1165, 1182, -171, -1293, -927, 448, 1319, 256, -1054, -556, 813, 272, -1129, -882, 1211, 1095, -378, -1900, -508, 1037, 799, -227, -668, -126, 108, 145, -242, -274, 124, 424, 244, -802, -1489, 222, 1855, 705, -1362, -1613, 880, 1117, -290, -738, 663, 1507, 18, -1514, -733, 723, 1377, 290, -849, -632, -135, 69, 121, -147, -149, 391, 482, -124, -1168, -448, 1613, 1107, -612, -1952, 370, 1619, 376, -1105, -327, 770, 523, -1113, -1009, 1234, 1129, 154, -963, -851, -76, 631, 425, 507, -477, -839, 338, 464, -265, -610, 639, 1523, -145, -1806, -990, 1524, 1299, -860]
2702h60m55J672P52j769j96J743N42j774q82L90J013P7O2m4l04r54Q52R16n99
2721A82j270N44J643n91j870j64K656P75k184j654J454J441q31j150Q24J140m95
2738D50j337K90J313k80l21j4j36j112M35J696J92j830m09J367P85j780q93J913
2756C29J675j606k265N66K452J85j946l23J399q1j161n6R95L03m38K87m9r34k77
2775i45J213J125j531j666J251K223q05k198O29K461n91k751j14K165J658k116
2791Hj361J483J056r67p99J056K01p76m11Q02m36o16P81J535o70k286k80K623
2809I43M79k214o79K141J054k195j171J869J654j373j763m1J848o3q01K62O28
2826E78l85r14O02K49p07K24J134L63j908q95K252J757k038j878R20K042j010
$$ y = [-860, -1315, 357, 1109, -660, -856, 887, 1429, -345, -1227, -837, 176, 253, 315, 271, -33, -987, -135, 781, 182, -1088, -544, 1099, 508, -1362, -1526, 1130, 1905, -279, -1933, -479, 962, 131, -1019, -195, 945, 450, -887, -597, 716, 436, 115, 101, -35, -1147, -712, 984, 1176, -654, -1063, 304, 1089, -691, -1584, 329, 2004, 398, -1867, -1301, 1151, 1336, -610, -933, 466, 385, -776, -832, 163, 466, 28, 315, 266, -668, -945, 268, 1393, -138, -1804, -553, 1670, 865, -1333, -704, 1757, 1166, -1585, -1699, 466, 2124, 8, -1353, 130, 1186, 219, -580, 476, 677, -99, -510, 292, -144, -760, 21, 1556, 886, -1400, -1680, 943, 1422, -792, -1471, 670, 1724, -471, -1642, 227, 1881, 508, -1255, -1296, 552, 489, -312, -50, 578, 193, -721, -119, 130, -577, -353, 781, 1144, -764, -1659, 593, 2350, 312, -1566, -646, 1396, 386]
2843C86k077Q12K436l49k047l72J325N33p37k47P31m16n65N07O90n66p70J058
2861C32J006j396j664J198K434o35k607j97K289Q49j989o64J528N03j593j164
2877a770J533J168m03q22L33j13n63K45J366n93j796O14K651o94j953O06J840
2894A649K12k809j196J896J700j419q70O23J499r12j217M34J245k16r18l18J012
2911C95m01k00P33L75j345n66J270P33j658m40J662J426j684k595J757K028l94
2928A096k106MJ359J48r33k11J006M55p54p53M23J65k27Q74J36n82q58M77J256
2947I75m33j484P12J225m55j850k12K248Q42j506j256J106R10p39m64M25M74j78
2965C40n00J8N4L4K47N22o02p15R5J213j52j359L2J267Q37j561q88J110J217r64
$$ y = [386, -1691, -879, 1557, 1208, -839, -1211, 114, 647, -90, -337, 394, -22, -587, -80, 610, 44, -726, 332, 1338, -58, -1722, -524, 1910, 1275, -1332, -1529, 760, 1609, -380, -1044, 484, 987, -606, -1770, -237, 931, 528, -294, 39, -74, -637, -392, 974, 381, -1415, -801, 1850, 1156, -797, -191, 1649, 1861, -948, -2144, -248, 1452, 33, -837, -214, 1285, 373, -844, -410, 835, 619, -299, -617, 395, -6, -206, 527, 902, -443, -1009, 261, 994, -664, -1104, 558, 1984, 300, -2295, -538, 1490, 1096, -1010, -1006, 353, 501, -432, -643, 363, 818, 64, -689, -266, -101, -328, 546, 682, 100, -758, -281, 975, 542, -942, -230, 995, 540, -1310, -1522, 726, 1568, 62, -1194, -88, 822, 83, -381, 44, 518, 340, -160, -142, -88, -54, 193, 715, 113, -602, -507, 706, 554, -805, -773, 494, 1331, -230, -1118, -8, 1209, 245]
2985B45j601P78J194K13n79o40N28l21l23L45m7K14K59O8l84n49m1J225M97j126
3005d5j120N42J405l56j268N71J064J24j434q05J261P87n74p77L10L78M2K93j85
3024B13K0m19J87q9n27J76N65R06n25j384K93J240N7j122k76O53O85q44m85P97
3044A21N85P1j223l47O32K78K56j18k34J39j59M11m17n33N55K42J38r45n21J193
3064A24J135j282r19R47O47k8j195j01O98Q68p56o33J64Q26J30j58q66m5M14K45
3084B15j20m28o4R02K78j003m41M46J121m63r46k50R01P83J57j963J882r58K9
3103G8p98o2R60J288j276K98j067m03J474n46o52r2N63P68k02j054M18R46q06
3122a65R1n49J321M00q90K06j033M42K1J08m70L81P65J8j187m56Q48M18N28r56
$$ y = [245, -1356, -578, 616, 829, 250, -390, 138, -183, -506, -161, -208, 6, 265, 333, -51, -600, -641, 584, 1081, -45, -1165, -623, 782, 426, -842, -271, 793, 917, -517, -1322, -61, 726, 152, -625, -315, 63, 105, 398, 213, 233, -186, 1, -88, -615, -439, 126, 1032, 507, -877, -584, 656, 713, -409, -685, -32, 653, -191, -676, 121, 706, 777, -446, -793, -161, 117, 373, 255, 21, 160, 1, 412, -5, -538, 17, 259, 397, -548, -1069, 124, 1259, -23, -942, 5, 652, 624, -571, -672, 26, 894, 138, -495, -331, 495, 625, 467, -399, -444, -30, 215, 95, -333, -397, 505, 783, -220, -661, -215, 906, 443, -503, -753, 148, 931, 1088, -875, 1007, 49, 78, -720, -782, 178, 1466, 190, 488, -579, -982, 492, -54, -706, -798, -235, 533, 331, -723, -305, 641, -165, -74, -623, 698, 1098, 208, 414, -619, -177, -156, -48, -518, -137, 628, 646, -541, -997, -149, 269, 797, -159]
3142a59j17J32O49j130K37k97J450k37p88J28l29P16M12p18q02N33P60L94j284
3161d50J26k18J209j83j629Q41K97N13P1q10m66j81J576m62m20k19K43L52o79
3180d89K09M07M13m58o19M4M07N49n49k12L25j9K58m72j88M90M72Qj069L2J50
3201c11R02k43n46j93N39M62o39n23M99M96n7m61l97K34P69l78k34l40N94p9J12
3222B06o87J50O52k26j00m02j7R20m60k81j01Q3Q32l39m68K42J17q4j44k76J40
3243b43J32P84q03l85K73K97J86l90k20J95M21k87n17j1Q34N07p12n08K13L60
3263A26N35m93p09K53O81m02l65K54N68M06n52n26k77L68P1M19o16J27J77K72
3283C17m53m28M39L18p5n56k40O37N53l14o80R2P79r3o51p3L18M60k26l15j83
$$ y = [-159, -276, -144, 505, -625, -388, -685, 765, 528, -260, -132, -461, 255, 667, -51, -853, -320, 440, 834, -450, -324, -542, 667, 484, -1145, -304, -7, 506, 577, -233, -699, -880, 696, 234, -186, -405, -162, 190, -489, -280, 127, 540, 82, -537, -493, -86, 463, -86, -298, 27, 8, 266, -206, -394, 96, 568, 576, -493, -461, -311, 591, 348, -198, -391, 148, 610, -29, -552, -53, 443, 386, -75, -472, -238, 531, 153, -81, -421, 173, 94, 206, -481, -331, 321, 95, -5, -407, -424, 496, 36, -245, -346, -263, 569, 230, -238, 4, 121, 37, -107, -383, -243, -111, 673, -130, -515, -242, 55, 241, -149, -369, -174, 247, -40, -557, -568, 266, 773, 61, -447, -234, 126, 661, 168, -541, -288, 393, -9, -374, -120, 448, 854, 302, -224, -501, -133, -62, 357, -259, -132, 45, 317, -136, -564, -125, 193, 118, -438, -678, -41, 512, 198, -482, -390, 389, 296, -355, -428, -110, 350, 124, -191, -374]
3304c74J48N57j27k52n49L60M59l1m72K28N02L02p06o72M78Q38k03q32J7L96P58
3325H25o78l74Q1L38Km48j12M76J30m1o2n94J04O48J04j59p83M26Q46o06p12P5
3347e14R33j17m99l51M51O01r0m98j4K65o3k35J28Qo9K68j45k84k74L71P09k79
3369C02n86QK32K87n69j73R78J54o83p57N49L94J36k12l23M2K92j62p0J52j72
3390a81K79M6P0o45J95M42L61j020j20O60K40j49m75j19P46p8p13L9O30K92n62
3411f2k00M3M12j62n5L11k64l19M63j34j55k30N03O06p82p61M97J149k98o47l14
3432c99M46L71q42n21R23N92l49m96J43N21m90j86K69J17l12L35K75j27o25L42
3452a3M80k80p04N6P64M28p11p66N78N74o6l06k74J020p67n86L5P74n0M8q2j74
$$ y = [-374, -226, 331, 204, -48, -597, -237, 222, 191, -281, -53, 449, 751, 45, -627, -149, 689, 486, -346, -329, 67, 825, 147, -227, -146, 192, 194, -254, -366, 110, 240, 199, 137, -457, -353, 295, 399, 240, -543, -117, 729, 123, -589, -514, 419, 302, -197, -548, -97, 504, 414, -84, -98, 167, 104, -131, -3, 5, -64, 204, 59, -225, -499, -128, 581, 302, -284, -276, -44, 243, -326, -499, 479, 633, -50, -807, -258, 136, 272, 60, -263, -221, 71, -91, -161, -9, -181, 98, 144, 214, -431, -236, 206, 567, -453, -573, 87, 327, 178, -297, -416, 330, 252, -461, -422, 208, 500, -62, -262, -219, 193, 31, -24, 287, 23, -296, 167, 33, -122, -352, 151, 757, -25, -786, -289, 860, 562, -85, -399, 47, 418, -424, -945, -22, 570, 221, -275, -132, 389, -101, -287, -18, 99, -213, 122, 397, 270, -355, -13, 467, 187, -517, -461, 303, 731, 20, -746, -168, 406, 340, 34, -240, 780, 13, -573, -538, 236, 186, 234, 152, -22]
3474b2l65J90M52K18o07j12N68J85n32o97O61Q12k41r13R7Q28r1q02l0P92Q2l72
3496A01m26L85m9K7p7J12j95J31M55p9m69n27J15Q40j7q21J21R39P7j159k71Q74
3518H7Q27r35l22N4P78m79l35J29O52n47j76L93l18k57N24K54K46j089j94P81
3538G3O26j035j43Q20J96o24o19P25O51n06k83q1L41mm09Q3J00M08o86K02N46
3559C81l53j2J13l0k64l24Q30M42n94o90o6J339l98q76L10Q0P66r75j47K03O85
3580D20m09j46L75k45q8J09J38l66L77k30O06o07l21K8Q46R4p63j75N98L60o83
3601h2m52O82O12n55n43R8M76rm97P3J40J39j64L62o5o68m7M95J38l10k47R97
3623E73k5n95p53N85P52m17n17J23M89l02j40j15P23J22n42j53J09k09J43K60
$$ y = [-22, -387, -197, 255, 473, -134, -246, 322, 507, -25, -722, -61, 751, 510, -403, -306, 522, 431, -371, -401, 391, 473, 101, -325, 60, 11, 38, -39, 73, -122, 9, 464, 385, -84, -611, -496, 344, 327, -494, -373, 566, 643, -516, -787, 87, 914, -21, -343, -289, 489, 10, -325, -196, 456, -91, -267, 126, -192, -449, 75, 329, 575, -514, -708, 73, 699, -336, -479, 341, 537, -87, -706, 19, 670, 164, -119, -200, 141, 137, -272, -189, -89, 319, -367, -165, 381, 28, 16, 129, 99, -165, -489, 341, 783, 189, -501, -567, 772, 374, -502, -192, -112, 654, -321, -468, -265, 420, 11, -135, 240, -5, -93, 16, 154, -212, 165, -65, 541, -66, -387, -359, 487, 581, -182, -357, 241, 601, -82, -534, 148, 760, 205, -338, -240, 236, 227, -270, -197, -57, 82, -82, 280, 215, -453, -500, -5, 133, -177, -424, 573, 548, -47, -800, -215, 537, 120, -397, -274, 215, -87, -227, -342, 381, 503, -39, -192, -83, -292, -149, 111]
3643A11K80l51j22J22L09n06j91J94M14n2p11J54Q17k55j70l44M55J78m53k2p8
3664b21M81n5n33J19K76k04K26j4j71m34N73K84j60l65K5P95l02p60J95L57O52
3685G64q33k25R0M24P0l40M2K60j56o2k62K04J55J45J17l33k39O2L25k14j9l08
3707c33K57N14l73m44M85L24j52n42l0N63J7l00l54P45k44q2l88L95k74R8K31
3728A13m7k84m41P02K70j8n57k1M22j76j01l18M41L22n40r8M56K30n6l40k23J31
3750a33J20J64j89j08M97Kl20l26J98L25l6o2m24J64M8O21n84k0J10L78o04l07
3772d86K97k14M29l16K75k42L44l93r3K15j14K68K27o8j33m4M47l30l83J50O5
3793i9K19m1l37L60J50O5m40q0M69k16j39k65j35L53L36J40l60m53O90j37m18
$$ y = [111, 391, 40, -82, 40, 349, -157, -348, -154, 260, 208, -503, -349, 468, 213, 43, -301, 154, 332, -121, -143, -221, 260, 205, -328, -209, 67, -137, 89, 75, -96, -530, 43, 327, 167, -198, -173, 622, 320, -440, -245, 112, 764, -69, -294, -204, 220, 290, -50, -8, 252, 96, 34, -228, -24, 131, 276, 393, 60, -179, -117, 208, -6, -25, -333, -76, 438, 65, -379, 106, 430, 278, -264, -294, 269, 286, -14, -368, 377, 133, 51, -337, 58, -216, -118, 113, 66, -218, -659, 43, 313, 295, -262, -283, 139, -37, -138, -456, -15, 307, -233, -331, 125, 355, 299, -41, -264, -133, -13, 151, -38, -146, 351, 353, 33, -293, -95, 230, 194, 132, -292, -128, -80, 541, -43, -63, 47, 425, -179, -486, -189, -403, 26, -290, -15, -257, 87, -306, -399, -184, -298, -30, 197, 129, -4, -48, 399, 69, -314, -164, -99, 120, 79, -258, 102, 252, 317, -123, -203, 266, 50, -89, -354, -489, -136, 200, 340, -20, -473, 217, 80, -338]
3814c38M3k7P11j10m97K00j05L85R2m18j6k2N35m36q4K7L76L47q06j21J01K39
3836G6M09o18m0J67J25J86k50P4Q2k60k20QK75K59n5j50k12L04K41j95j22j95
3858a11J26R1k5m16Q5M17L66p30j65M61l11K63k10r2K6K38j26l25L76Q6L11l60
3880b5m72L01J97M02m54l83N40R7n4l28J36N9P1M9k3j52K52R4j31l94R8K52m6
3903H6k78N5M2K96L1l37M3J58J94k20l50m3M60j18j51L71q8j07N06n40l46L51
3925A5j5kk0j38M46P2J70n82j61J48K87k46k88L49M25k56j24l73J17L45n1l48
3947b30p1K97M6N7p7k36J26M46o57P9J63J71L40n20J99r6Q3Q1o04L54K30n7k04
3970h0j61J24K15O3j29j77l0K20l46K54k46J44J6j38K9j62N11j19M9k54n0O4N33
$$ y = [-338, -295, -322, 389, 279, -218, -18, -123, 262, 354, -64, -80, -102, 433, -3, -87, -60, 316, 663, -143, -264, -163, 76, 485, -133, -173, -6, 119, 305, 55, 129, 211, -49, -269, -261, 14, 273, 218, 68, -144, 160, 401, 206, 84, -111, 15, 106, 81, -335, -250, 167, 533, -197, -362, 99, -212, 51, -159, -251, -225, 13, -113, -438, -62, 24, 335, -25, -497, -196, 1, 403, -51, -434, 106, 203, 149, -179, -43, 16, 87, 136, 113, -39, 213, 307, 176, -218, -120, 132, 86, -192, -137, -95, 201, 232, -105, -62, 96, 290, 70, -280, -323, 137, 19, -132, 239, 151, 44, 550, 10, -336, 15, 0, -2, -22, -160, 286, 358, 528, -54, -215, -67, 220, -26, -314, 35, 460, 204, 80, -293, -176, 169, 118, -230, -301, -4, 42, 99, 22, -214, -88, 358, -299, -220, -57, 114, 454, -66, 133, 37, 120, 201, -403, -49, 181, 124, -80, -241, -117, 98, 161, 32, -145, -175, 45, -301, -47, -293, -149, -133, -271, -242, -404, 107, -12, 37, -217, -267, -203, 330]
3993C30r0l12J49K58l20l08L15K91p6k80j63J32R5L10l52n7k99N71k31k09K01
4014d5M6J56q0j96m73N19J31K12k56j93K07L00l15p7N56n21J9j15J02nQ33q80
4036g5m32K90p10J628j208K11M12K14r8k02q29P94j68l68L89P9r8J00n5J61J12
4057A47R4K54k80n57j146J551J54N89o16k95j86J001n44o87J236j044L65J43p91
4076f12q9J280j81q63N37K41n79O42r51J179q04K36n61J029j24o08K19k43K05
4095d7P3J60O19q09j31M38l25r4k03J89J60L18r99K88K11O64m86q67R58o3k3L3
4117F4j96J07j19J62K22n19K1L5O4J8j37M03K9j32l80L38Q8j82Q6m11O17K44o3
4140C59m75OP8K05k48L44l62J18m8K20j18o12M66K76r7k06k35Q07k44k69o2K47
$$ y = [330, 240, -72, 77, 335, 15, -293, 22, 313, 237, -43, -206, -74, 21, 331, -21, -78, -377, 194, -37, -246, -45, 1, 157, 77, -119, -592, -73, 58, 270, 14, -179, 28, 328, 13, -64, 492, -29, -10, -125, -23, -28, 805, -75, -507, -217, -927, 701, -507, -296, 116, 330, 232, 30, -799, -5, -173, -541, -152, -73, -171, -71, -126, 35, 147, 241, 495, 215, -342, -1488, 63, 217, 806, 190, -105, -291, 710, 166, -521, 715, -329, 36, 179, -612, -701, 579, 398, -465, 72, 313, -266, 376, -575, 604, -200, 36, -525, 504, 380, -228, -9, -252, -47, 26, 186, 805, -4, -135, 303, -22, -116, -319, -130, 30, 348, -651, -363, -152, 512, 26, -841, 117, 54, 31, 64, -132, -25, -144, 18, 240, -279, -258, -223, -159, -141, -278, 125, 154, 22, -358, -20, 68, -114, -28, -439, 178, 422, 359, -116, -110, -32, 173, -75, 269, -93, 25, -23, 197, 79, -533, -67, 209, 112, -94, -329, 478, 234, -35, -97, 150]
4162A50J03J0l19j47J74M7J83m77O88j52j05m02K02k80M38k0j22j01P9L57m03
4183i7j2J4j32L59j70k33J95L57j67k8J11o6n0l75o4K65pM01j19Q3j29j53k9J73
4207A27j11P0j07L71n20j8j55N04j80m7l43K95N03k32r6J06K25l64Oj66M07l31
4229e6M7K96j27K42k96l9J64n16K57j21k77L65m48J146j73o58n3J02M02j70l58
4250b71J51J63o9m5R6J36J28n05J7K12j8j52K43R9k79p4J13K74j89l21K11J85
4272A05L1m63L50J15j10j80L16LQk16l28L46N4n9J58J26k71kK11L3k43l17K96
4295c7R1J08p86N94K83m30j70J80K91K5j81j54M27qr1k45O39q16J09o9K70n9L7
4318HJ64r8k5k56K18J70k8j11M3n0J54j02m28L06N21k91l06R0k1J94j17K30k16
$$ y = [150, 253, 263, -56, -203, -29, 18, 201, -276, 412, 260, 155, -247, -45, -325, 113, 93, -29, -130, -51, 306, -97, -109, -95, -227, 132, -38, -271, -76, 281, 114, 86, 197, 131, 81, -294, -358, -93, -100, 301, 182, 265, 136, -17, -46, 127, 16, 86, -21, 350, -170, -188, -343, 161, -19, -66, -409, -114, 389, 157, 61, 167, 392, 28, 34, -132, 275, -56, -9, 287, 160, 402, 106, 67, 231, -285, -28, -149, -426, -61, -509, 637, 464, -194, -247, -145, 257, 87, -271, -120, 43, -26, -71, 25, 161, 289, -216, -199, 13, -5, -157, 86, 185, -94, -168, -55, 219, 30, -291, -80, 105, 136, -327, 23, 138, 28, -152, 164, 167, 175, -41, -369, -23, 31, -28, 130, 256, -15, -17, 194, 227, -16, -333, -37, 54, 162, -624, -30, 253, -177, -347, -167, 124, 149, -32, -186, 241, 233, 142, -103, 536, -280, -171, -240, 30, -29, 8, 172, 74, 49, -207, 11, 181, 153, 42, 85, 35, 189, 87, -341, -35, 486, 195, -111, -21, -42, 152, 35, 265, 49]
4341D9n8j46J15j2M7k9J56N4j70m46L66J96j88j72J55kJ01k64L82M38j150J35
4363d43K08P0M65m27j7L06l06K06J54j67j33k54N61k11n1q6j2J65Ql46J40L25
4385A55j92J67k81K88o4n7k68J79l9J37J41l64J32P5J38l10M2J94j26%K86n05
4407b72J74J54k56J0N4K01J76k53k73K47R7j57J68l63L58J7M7k59j42M27K67j94
4429B28k65J4L4J98k36l8j11K19r8J40j07J78j4p0j32k04K2j13M66r2l7K00k41
4452e9J5l8N1J18k84J66j2L65j06j65k88J23Q4L36k30l30K45n7J46J48m77J87
4474f2J19r8l25M36j53L14k29p4l6L3P6l70K91m2K19n7q6J5P8J30j1m68L45p2
4498b7J27r6k17L2J20j10J45J04k53PK25j01k63L78j51L19m40n6J82K76J10l44
$$ y = [49, -9, -155, -40, -52, -5, -34, 122, 176, 6, -440, -74, 122, -66, -238, -83, -85, 16, -248, 134, 572, -578, -443, -235, -165, 300, -127, -144, 162, -144, 62, 216, 49, -84, -338, 223, 12, -39, -125, -137, 28, 36, -310, -170, 155, -37, 130, -151, 137, 73, 16, -252, -73, -112, 25, 166, -198, -66, 9, 147, -163, -121, 73, -53, -53, 233, -272, -98, 56, -200, -190, -136, 65, 241, -12, -285, -38, 59, -98, 70, -293, 65, 82, 129, -130, -272, 155, 422, 228, -37, -23, 11, 209, -27, -65, -176, 43, -55, 85, -22, 156, 142, 72, -60, -264, -242, -355, 111, 19, -18, 182, -59, -44, -82, -31, 87, -197, -31, -43, 322, 216, 51, -237, -114, -30, 306, 76, -254, -9, -66, 80, 228, -249, -62, 57, -41, -366, 70, -83, 231, 2, -72, -108, -75, 1, -369, -78, -120, 99, 42, -44, -29, 49, 179, 168, -300, 45, -27, 100, 4, -213, -181, -61, -171, -26, 78, -175, -168, 57, -44, -307, 71, -80, 239, -201, -257, -75, 201, 311, -33]
4520c3j05j7J45l3J79m49K09L09j77l28L50K08l0l89JJ31O3J3j71R2j07K19k00
4543a20J64j49J61J24k63k34L38K22k2k52NQ4J30j85j72J04j9K7R9l38K25j05
4565a76M14m42K05O9r0j96J45m6j5J46j21l1J52j98L80m69L16J13n22M38j02j11
4587a41L12j00l64M05l24K36K18j65k17K52k14J9J24j13J67P2j08j92J56K47j99
4608G1r1J70n32L88l1R6Ll84O09l76N2J95n15L10L20l39n5j08O7K80k19K66J29
4631C06l49kp3K46k21J21M1Q3r6J7J76l39P4j67M19j92J76k45j85l7J78J97r8
4654C0n7Q9J27m90L80j02n8j00J18K17J0j0k31l4M6K24n09J80L38R2o4k14J02
4677H4k82O4k8J65O0m2rl9k26P7J97K22k51J06R3P5j96j59j89K76J58j05j23M8
$$ y = [-33, -138, -155, -10, -43, 136, -313, -104, 205, 28, -300, 50, 258, 228, -161, -160, -29, 34, 47, -124, -32, -139, 80, -120, 44, -105, 56, 180, -83, -317, 21, 243, 221, -31, -26, 58, 188, 3, -169, -65, -84, -57, 42, -296, -71, -176, 238, -204, 1, 70, -20, -216, -71, -117, -132, 14, -107, -138, 14, -184, 196, -273, 43, 156, -366, 72, -30, -141, 171, 71, -293, 112, -212, 24, 242, 77, -140, 112, -102, -83, 41, -72, 95, 167, 59, -133, 23, 270, 71, -20, 150, -382, 6, -25, 71, 74, -310, 299, -77, -25, 170, -345, -35, 285, -54, -109, -217, -150, 130, -89, 177, 306, -43, -45, -118, 128, -93, 28, 69, 152, 56, 73, 249, -90, -16, -183, 236, 44, 220, -25, -210, -247, -69, 128, 30, -27, 62, 189, -301, 79, -23, -81, -181, -63, 154, 164, 154, -77, -111, -65, 159, -350, -170, 168, 260, 196, -18, 84, -198, -134, -162, 3, 63, 21, 12, -27, -253, -176, 21, 243, -8, 98, 191, 266, 70, -89, -278, -2, 156, 51, -72, -24]
4701b4K29l48K77l25M06m5l38l9M58j97O0p1k02j5K14n6Q3P0m8J18j0j21J3l53
4725b64L56J58o69L54L23k02J03k37J33j85L49j17k62J17L0L04m60l07M93k15
4745a98N21n53N3L10j11j81K39p0k28L26j63p3J7k6K30J2m53N01K20m81J18m9
4767c9j35K86L8k84k4J15j33Q6n3J61Q0P7n57L24r1r7K68q0K03k21j01N39k50
4790A12k30K95J18k51j39r9L86k24O9k23P7L48k77q4N3K25j92j7j34N4j01K20
4812a4k87K31J04o4J12j54k68K87l3L9J8J91l36K74M1n31K59J97j35J34j12K47
4834B00j64J9J63k49J6R0j42O4j88L02K62k15J36j97O9l09J43j60pK89j41j88
4856b07J95L37l18J02j16M3L46n26M19j20m35N63j75j31n1j8J56q7K1L1l4J56
$$ y = [-24, 205, -143, 134, -191, 215, 170, -168, -207, 251, 54, 114, 43, -159, -174, 40, -16, 67, 137, 89, 207, 197, 76, 89, -264, 92, 250, -419, -65, 258, 56, 159, -78, 55, -130, 219, 102, -160, -43, -13, 291, -169, -476, 17, -198, 323, -230, -177, 133, 22, -159, 80, 10, -218, 108, -55, -128, -111, -137, 93, 105, -348, 153, 373, -108, 10, -39, -174, 112, 150, -134, -158, -43, -176, -90, -143, 18, 98, 175, -382, -58, -149, -246, 22, -58, 145, -76, -177, 362, 112, -118, 177, 295, 44, -95, -194, 192, -32, 37, -186, -109, 239, -38, -122, -69, 156, -36, -53, -187, -133, -234, -14, -301, -70, 34, -30, 82, -72, -340, -53, -86, -47, -29, 162, -174, 100, 141, -390, -131, 66, -69, 65, -47, 200, 36, 55, 218, -31, -15, 75, -67, -3, -191, 111, 373, 158, 294, 97, 166, -143, 0, -160, -167, 122, -19, -207, -12, 325, 7, 109, -7, 36, 382, -144, 275, 155, -280, 283, 108, -23, -74, -92, 64, -23, -2, 29, -5, 151]
4878A51k19J86k2o6K6j41Q5l3O1rJ52n28L23j36N4L93k30p8K05k29j07J41N2j3
4902A8n0k2j51K02K04j37l21K16r0J00Q1M9K01k12k30J56j17O6KK9l8L0P3r1m1
4927g3J71n8k5j00j09p6J03K39j45o3N5P8k34J33q7P1M44m76K7o2J33j15J6J30
4951b3j14J89J23K10m56K77j59j15mN6o1R1J16k39M2J34o4k23K29J09k33K7%L11
4975B23j29q6k46K44L25l41K82l11R9j86L05m8l68K23J69j84k3M6j19K76Pj36
4997B2j01J4L93k36o4l7K56o7m5q3r8J37j81J58j43J03j43K07L9r8j29M4M6on4
5022f6L23k56K1J79l16MJ8m16O30Q4l15J8J46j12q4M82m77J73j00L00L3j04k2
5045A43q6n3M4J74m94Q6K18J6J69j50L0p7j66J79K85l53L1K77j41J73m07K27k40
$$ y = [151, -68, 118, 96, 30, 56, -85, 0, -33, 28, 19, 171, -357, -34, -170, -116, 277, 47, -31, 174, -55, -162, -21, 31, 18, -32, -54, -205, -3, 201, 64, -257, -41, -131, -31, 50, 99, 300, 88, -142, 14, -103, -37, -35, -6, -44, -14, 59, -32, -73, 98, 40, 15, -85, -194, -270, -167, 72, -73, -136, -81, -3, -237, -104, -191, -120, 324, -152, -125, -187, -54, -169, -153, -23, -137, 52, 175, 385, -71, 206, 47, -68, -72, -16, -77, 14, 130, -109, -67, 67, 3, -220, 9, 118, -115, -88, -88, 223, 94, 8, -238, 6, 331, -10, 272, -39, 60, -126, 179, 131, -237, -14, 155, -29, -52, -6, -125, 151, 158, 22, -79, -65, 328, 92, 28, -9, 247, 180, 135, 52, -46, 91, -90, 68, -75, 28, -115, 92, 131, 33, -96, -52, -6, -12, -66, 257, 1, 22, 201, -115, -111, -93, -509, 121, 205, -110, -92, 54, -58, -142, 340, -137, 36, -64, 236, 269, 165, 143, 57, 4, 48, 222, -272, -186, 32, 48, 217, 67, 97, 20, -146, 33, 318, -35, -4, 273, 132, 305, -102, 125, -115]
5068a15m2K06J55j08k44J28o2N8r2o3L85l1j73J6Rj40J59l5j17J8K62k65K21j72
5092d2K10j24j56K16j37mJ00j23J22l55K98j0M7J77k58J51k94j2J02J48n6J4K41
5115B55j61j22j1QQJ14q6N3O3j0j56j58K02L0P6j07j26j16N24j73j42p6K83J19
5139B91m71M20k4k31J29j0j05MK10J38m29K45j6j92K39l42M1K66j64j56K65q1
5161B7j03k3K46j48j61L58L8Mk80O8K26k97J26k3j7K62k39j92k5n8J76m0l29M12
5185HJ16k35J54j43K07p8o0km4k7K04P7p9j66M3K27m7j49M2O8n39N20m3j10M0
5210a6j67L18j63J15k36k84J66L28l29M95m0j98n1J1J59O7j83o7K10j30o7n6J27
5233Io9p1o8J8L11m05J93J04L44m51J81k94J47j84R5J22rJ86j33j59K07j40J07
$$ y = [-115, -157, 49, 204, 96, -148, -20, -82, -24, -116, -179, 206, 175, 2, 18, 27, -113, 46, 11, -106, -88, 174, -91, 130, -42, 168, 44, -112, 104, -33, -37, 63, -60, 62, -293, 5, -5, 42, 219, -39, 112, -182, -194, -92, 56, 0, 14, 255, 94, -28, -39, -31, -23, 91, 5, 58, 121, 111, -45, -203, -1, 29, 105, -2, -128, -244, 280, 107, -35, -111, 172, 291, -180, 240, 216, -15, 114, 104, -1, 3, 213, 351, -78, 167, 151, -41, 198, -144, -103, 163, -1, -157, 108, 27, -76, -99, 147, -1, -162, 196, 234, 238, -42, 26, 252, -45, 81, 58, 41, 303, 64, -128, -153, -211, -35, -75, -404, 8, 124, -111, 43, -100, 107, 29, -31, -33, -77, -104, 100, 177, 98, -68, -25, 202, 155, 6, 48, 116, -423, 97, 54, -56, -16, -183, 135, -28, 87, -149, -433, -267, 61, -268, 227, 187, -11, -62, -51, 108, 175, -8, -75, 135, 5, -62, -118, 9, -60, -131, -199, -181, 130, -275, -82, 22, 366, -85, 96, -198, -51, -235, -140, -18, -27, 159, 26, -133, 74, -66, 41]
5256D1j43j66pJ67R3k10oK00K25j56K25n13J1L80j98J22R8r0m3N6P9j83M4P4k50
5281a50j1J24j99K83p9l14O8J83J01r9j18k4K97J1MJ0j42k12K67l03L1J53L23
5304B04k16l20J76L29l05K4J72K17q0k27l5J34n0n9M0K28k16Q0k23K46J32O5j99
5327A17Q6l94J47N3k2j35J19l11K72K49l5l17K42M4j56k4J41k85n4K78k35K62
5349D2k36L75l97L41q3k27L40k53K04k66K49l29j46M42j19J86n36N11l37K69M3
5370G3l2J18p9p4J2k7m20K52J39J51J88k47j73N2N3R8k19j11L59j2k25J08m2q7
5394a45J56k55J10J31Q3m62L16J50m36L42J50j74L2P4r0K49j03k8q1k29J88l2
5416e4J3p2J25j41j05K90l23K69l93K47l2J32K98l04Q1K34n20P4J18P8k07j24
$$ y = [41, -102, -268, -275, -108, -15, -225, -231, -31, 194, 38, 263, -250, -239, 141, -57, 65, 163, 73, 30, 86, 165, -18, 26, 100, -150, -161, -37, -236, 47, -32, -346, -278, -95, 6, -93, -211, -235, 62, 73, 77, 87, -55, -267, 0, -303, -272, -119, 204, -12, -332, -156, 173, -132, -108, 64, 281, 201, -26, -61, 73, 23, -36, 4, 232, 16, 96, -127, 119, 251, 316, 117, 203, -191, -44, 9, -13, -148, -29, -340, -68, 181, 146, -171, 71, 115, -41, -65, 76, -209, -263, 15, -220, 42, -194, 181, -216, 125, 42, -185, 155, -98, 106, -160, 89, -240, -386, 56, -63, 123, -413, 98, -239, 30, 73, 41, 159, 80, 6, 18, -9, -429, -177, -38, 113, 301, 54, -119, -67, -14, 84, -135, -246, 113, 101, -124, -16, -58, -145, 11, -244, -134, -3, 80, -382, -66, 84, -352, -10, 140, -34, -2, 72, -18, 231, 128, 100, 19, -210, -22, -54, -41, -113, 12, -129, -234, 56, -267, 2, -391, -144, -176, -44, 254, -50, 31, 265, -255, -181, -63, 15, -192, -316]
5438c16M73m7p7J01l05LL49k55l8R8M3k36P66l27o63M81n1k79L07j05L87m14K50
5461A45k6J20j31j17k62L07J5j23L30J41m24J58o48Q77q47M72j08J98K67m01l74
5482d31k16R78l01L67m5m75n25L76K7P69o71J59j45O8K14l30j87J14K26J40j51
5503c9K69j72j19K83k99j62J62J18j6j54J87k52M90k47k71M3p3L81J40l41k38
5524c10O70l28m75Q10m91j05K24Mj38K06k23O2j82M62j24j37J47j77j03M59j11
5545A40q1r3j30J08N5q7m5K3O9MM4k15J43k40Q8M27k46K55j99N7k07K51k13K36
5569A44P9k82nJ88k48k3J41O4J23o2k54K67j15j16o0K32k4n5M00n27J52k46P9
5592a48K73k30L14n8l91J03%k1Q3O40l36K7o12M92q5k05M8r8L50m20O4L18j97
$$ y = [-316, 157, 110, 33, 134, -171, -168, 181, -74, -112, -14, 29, -207, 559, 232, -431, 50, -1, -280, 27, -78, 309, -105, 145, 119, 239, 108, -9, -271, 36, 51, -72, 258, 399, -25, 133, -515, 362, -485, -13, -121, 77, 344, -57, -431, -647, 331, 30, 397, 352, -123, -648, -272, -245, 524, -147, 12, -133, -65, 149, -181, -368, -254, -28, 112, -39, 230, 58, -61, 222, -77, -239, -77, 41, 25, -129, 58, -194, 296, 49, -222, -179, -252, 129, 269, -72, -310, 360, 32, -443, 367, -124, -229, -5, -1, -139, 67, -156, -94, -276, 186, 62, -75, 72, -105, -208, 251, 140, 59, -34, -164, -56, -1, -88, -133, -110, -41, -37, 7, -208, -65, -305, -217, 210, -36, 219, 20, 77, -130, 121, -92, 144, 223, -59, -64, 124, -124, -147, -6, 58, 181, 119, -135, 132, 17, -99, -159, 73, 49, -6, 394, -133, 19, -227, -148, 125, -105, 209, 151, -240, -137, -137, -158, -75, 565, 229, 256, -356, 136, 51, -154, -106, -204, 146, -274, -210, 108, -89]
5615h9K3K76o3j92J63k0k55J91j49L79m17K38J0qn8J53j95k25J13o8j42K11N1
5638g3L2j33J09J76k9N3n2m58K80QK56R8m72N45l68L00rk78J31k4Q4m1j28o9n
5663f7Kj61O9L8K44kj61j75J29R4M5j81J23K88k96j6k27M9K5J12j74L46J19k99
5687g6Kk9R5j87J92K01k52J83l35K84l29Q4K5K23k14J69K47l67K80k6l2k44K59
5710A53j20Q5l17K62N1J32k05j99K80j96K9J48j35L37j45J15l94j13L13oj09P3
5732C9q9o8J67j42K3L11l46j2j44K36k07L72k31J31L9m2p4J45k60Pj02K84J39
5755A76m65J86K36j07j19K50p4N5j88J94j83J03O8l23Q9K28p7k8M9j00N6K38k23
5778D1j03O2Nn1m4L98j61j53oM3j55K48l18L39p1k32p5M66j35j02o5J42n2k2j39
$$ y = [-89, -66, 210, 147, -45, 118, 98, -157, 34, -115, 264, -153, 85, 95, 87, 29, 182, -13, -238, -125, -193, -335, -124, -73, -41, -174, -65, 111, 82, 135, 83, -375, -95, -87, 169, 267, -205, 340, -28, 272, 263, -15, 116, 92, 176, 135, 7, -62, -67, -65, -226, -157, -119, 125, 123, -38, -213, -84, 10, 55, -126, -3, 285, -11, -27, -254, -205, -180, -68, -242, 104, 223, -76, -74, -103, -8, -195, -3, 198, -54, 129, -206, 78, -251, -167, -142, 81, -133, 36, 283, -84, 196, 170, 138, -106, 153, 33, 118, -199, 63, 114, 246, 41, -158, 122, -74, -45, 103, -32, 305, 160, 275, -119, -232, 81, 75, -34, 39, -50, -118, 49, -93, -70, 241, -105, -117, -261, -25, -232, 140, -91, 40, 79, 37, -37, 108, -152, -145, -247, 37, 176, -289, -103, 133, 26, -93, 157, 83, 138, -50, 144, -39, 64, 132, -191, -102, 126, 49, 21, 70, -30, 26, 264, 41, -62, 0, 5, -46, -90, 308, 147, -6, -12, 31, -124, 124, -194, 145, 74, -158, -233, 233, 98, -4, -69, 73, 21, -1, -140]
5803a40k99L35J26O5m6k8l35L23m39L48Q3j80L24j85J37k73J17K00K22l03j72
5824a20J50Omk95L71j96N2J04o6K55l6k71J04l8q9K81l56O5K62k97L25l30K00
5847G7l93L86J97l63J52k14OM17l20J42o6m28M26q9pK9K26k87j7RJ71J05Nj38
5871B6J34j14q8j4N0l9J12j75L00j19m2P7j86J66j83K50m08J04l28L00R0j77L40
5894G6M5l49p9J61J74J2J34O0j75q7j5m1k0L5kJ90O9j95M3p1K76m46K59k15L70
5919B09J16l50J65j16j13K55l91P7J19K29l05k95L75k6pJ20P7j66K05k02k30N2
5941b02M03n42L29l26K13J77k16L98j16l58N7J95m6K56j55k80L82l58J65J19m1
5962E4j32K0r1K83j46L20k15P6n9J41j63j16p4oJ94j68K20Nj19j2K56j48j54m7
$$ y = [-140, -439, -104, 22, 87, 41, 13, -322, 1, -438, -90, -7, -187, 137, -48, 89, -184, -67, 133, 355, 52, -120, 30, 36, 32, -263, 108, -88, -36, 68, 2, 257, 221, -50, 54, 16, -73, 208, -148, -83, 179, -118, 207, -123, 77, -316, 70, 267, -96, 56, -158, -152, 265, -55, 87, 21, -407, 19, -70, -77, -48, 178, -109, -126, -117, 54, 159, 164, 26, 160, 46, -42, -56, -6, -45, 67, -108, 192, 73, 31, 108, -78, 88, -95, 155, -253, -149, -477, -177, -87, -264, 76, 121, -228, -307, -146, 28, 40, 174, 234, 59, -28, -43, -84, -104, -69, -71, 119, 188, -7, 36, -35, 241, -205, 54, -161, 209, 325, -25, 140, 24, -89, 166, -225, -148, -29, 200, -105, -400, -25, -51, -58, 62, 139, -27, 178, -24, -254, -202, 201, -341, -12, -338, -125, 52, -164, 234, 118, -240, -183, 12, -34, 222, 67, -213, 169, -189, -24, 95, 54, -78, -58, -149, 134, -12, 308, 93, 169, 110, 251, 88, -28, -102, -108, 86, -82, 138, 143, 24, 12, 268, 120, -34, -81]
5986h1P3k1N1Q2q7k03L45k73J6O2M4J06k99k3K49K0j24J32J02p7j30K50j84j44
6010a14j06M91K37l44J58m30j5J18K17k1l35P1p1j62J18o9r7N02j10r6J45o1J22
6033A48j31l0P7J51k32r6k14K80P9K30l77J12p5P0j82q4L87M5k17k5RL04j79L6
6057H6l01O0O6M12j83k28j53M37k65kK1J57j29J97J5k16O8L7m21K3Q3L97M7m08
6081b00K13J43j27J83K0k52j29K6L18k33O6Q6q4j86M58l74K07k01L4n4k29K21
6103i4j85K47k2j67K13j01J19J00N1Kj83l1p9K21nj57K60j69N3l96K78L08l13
6126e0K9j04K31j85K9R2l29M19j85O2r5L69j09l21K11Q0K5j22j36K15k37K26J75
6149B90l63J77k56J72l6M2L5j4l52L16q9r8K35k5l0O4K58j36m9m14N45k03l37
$$ y = [-81, -8, -29, 22, 104, 17, -186, 159, -114, -98, -36, 8, 114, -185, -208, 41, 61, -63, 69, 171, 94, -36, 214, 30, -114, -220, 271, 508, 164, 322, -108, -123, -5, 212, 191, -144, -73, -144, -306, -188, -257, -354, 148, 38, -58, 87, 26, 148, 17, -13, 64, 215, -17, -113, -327, -47, 32, 262, -115, -3, -78, -8, -190, -274, 113, 158, -59, -84, -75, 229, 50, 86, -215, -155, -89, 323, 140, -88, -241, 196, -69, -71, -50, 107, -22, 175, 190, -26, 42, 79, -342, -319, -236, 161, 208, -200, 13, 156, 29, 212, 232, -20, -149, -123, 195, -38, 28, 114, 30, -156, 302, -72, 135, -66, -32, -86, -315, -94, -279, -32, -54, -221, -8, -109, 10, 110, 161, 163, -20, -51, -130, 91, 86, -71, 189, 20, 73, -323, -45, 263, -50, -21, -125, 106, -79, -50, 42, -287, 132, -53, 9, -86, 283, 174, -147, 64, 144, 169, 47, -89, 126, -111, 115, 290, -73, 104, -152, 20, -16, 26, 61, 47, -305, 11, -78, -176, 59, 34, 4, 68, 326, 190, 141, -273, 272, 69, -268]
6172b68K00J53j32N5j26R8P1R3m46K99j88Q3l5N6J07O8J00m54PK33J56q2j42L02
6196B08j87j23L75l01J07P9j32%r4j45K71j96Q5j17j24J71j0J32m55O15o8k69
6218a78K41k13J78j00L30m12j18J01P9K42l53M8M2L60n83j12N16k79J77k09L45
6239A02k72K40r7l91M78j61L93m00J1k90K17PM21l94J63mm8j05M00j96j08J92
6261A58J25k82J0j87J77M20n16n0L83j18j30k5j52J5kN03k76N0j17J76j84J13
6283I1L5q7l58N2J33p3K49j19PJ7p8J13L01k28m08M64j22o1o8j0L24j54N27l42
6307B05j3rL6k55KJ05mn7j61k18J95M2M21j53J05l83K71k65O7n8K61J34k55K4
6331C7K19l38r2K80R3K06o01J79R4nk66K2O7L0K99j02j17J72j38k5l3J02J69o39
$$ y = [-268, -68, 85, -47, 8, -118, -20, 51, 144, -302, -3, -191, -108, -143, -87, 20, 88, 188, -266, -259, -26, 130, 48, -94, 208, 21, -102, 273, -28, 79, 158, 26, 26, -68, -213, 58, -138, -53, -170, -294, -123, -133, -1, -456, 159, 91, -178, 63, -150, 28, -72, 258, -154, -272, -171, -92, 150, -203, -155, -113, 247, -336, -448, 68, -211, -34, -243, 102, -170, 70, -27, -418, 60, -101, 292, -108, -97, -387, -170, -163, 258, -136, 27, 23, -25, -130, 270, 74, -34, 158, 283, 1, 11, -176, 1, 421, -95, -145, 238, 120, -10, -35, -187, -172, -174, 329, 53, 103, -14, 162, -22, 91, 126, 39, -319, -267, -134, -207, 42, -77, -70, -53, -131, -18, 283, 55, -353, 111, -11, -72, -140, -150, 174, 20, 547, 205, 192, 183, 219, -36, -34, 71, 67, 10, -151, -369, -174, -132, 289, 136, 241, -142, 129, -136, -69, -127, 134, 268, 13, 37, 256, -82, -174, 106, 199, 405, -196, -17, 77, 72, -194, -172, -105, -75, 224, 122, 5, 177, 39, 14, -19, 83, 252, -387]
6355c87K72m8J16k83K68K4k5K83K12m40n3PK64j24j21n0j74K49M7j13R8R0P9j94
6379co5j52L09k53N2j1N2J25Kj33o1l6L19o7o7n9K96m30q5L43j1k59L7K39j15
6404c3L7L46l08l32K48K42l6l05J9J98n2J0J05K0j09KQ3l7J19n4P4m52K02p0J04
6429B1j88J7J97k0J5J15j02n4k45L17j76J50R7j52o5j08J41n9J54nOJ77j02j27
6453Dn9J80j17K9j60K32r5J00l15J68k48L16j91R0j2K14l42K03j99M74j95o0k36
6476b19L26R5j08O9rj33r3J47J91m85K76J30j18k33q3K74J58j45Pl2k8J53m8n
6500H7N5m12N86m74K76m9J20j33J07QL8M0j43j1k32J58j16J84o3NJ21l6P9k44
6524d9J24j74J95q2Q9R9l61K45l10K13l0n9J70J57k91K70j89o7P5q8j19l0J80
$$ y = [-387, -115, -163, -47, -330, -62, -38, -63, 220, 432, -8, -61, -54, 210, 86, -35, -85, -259, -10, 37, -76, 22, 112, 191, -3, -68, -220, 89, -164, -112, -123, -71, 54, 56, -77, -138, -174, 145, 78, 11, -48, 248, -182, -267, 76, 65, -194, -157, 82, -33, 4, 350, 42, -290, -42, 200, 164, -141, -122, 76, 24, 34, 139, 159, 50, 52, 135, 98, 217, 163, 237, -215, -13, -83, 21, -167, -150, 47, 27, 42, 157, 55, 1, -244, 73, -103, 47, 144, -8, -73, -181, -40, -99, 55, 50, 56, 233, 131, 4, -55, 125, 8, 37, -123, 109, 14, 114, -201, -33, -281, 35, -156, -66, -78, 136, -206, -3, -202, 272, 77, 17, -219, 107, 202, 94, 163, 154, 21, -72, 75, 266, -219, 57, 187, 69, -164, -247, 27, 185, 40, 47, 15, -13, 140, 92, 87, 142, -270, 316, -158, 118, 69, 189, 56, 163, 171, 209, 249, 106, 95, -137, 21, -95, 89, 26, 31, 152, 116, 195, -49, 75, -99, 96, 14, 103, 202, -159, 86, -224, -11, -41, -100, 70, 227, -64, 206, 17, -50, 25, -63, -182, -212, -32]
6547c2P8j73J3M4J81R5j56R8k60K49k61J44j26j62L39j62J88l34L37q5p7J2j42
6570a92K96j31Q9K6jN1K0k19p8L16j88p0L03j73k41J42Q7J15lJ49m88L48J65k18
6594A05M7K2k85J06o6J06L55n09K59j07j36M69n92J1J04j05R9P9J56j91J21j93
6616a45K41l41L66k26J96l08J67L9N2L9N1m6M7p7o1j94J47J9L4J07l3J89K9k23
6640F9J0j82R3l1J62k93L34m14L67k89p1M18j36l7O2j01J35j14K5j79N2r0J82
6663b8j37L7L8j36J94k31l4L52O3j47j20J96q6J78k07J50j01J76j15K66j28l84
6685b04J12RJ84k40K57j27j26J01j41oP1L68j54mP9p1r9n6J8lJ5j11L68l18n4
6710a32Q3p4Q1j7N9J57l47N5M6J80l4m9j74K10K1o5k99J71K72O7k56JP5n9j94
$$ y = [-32, 46, -127, -114, -70, 111, 206, 50, 148, -112, 137, -124, 20, -106, -268, 71, -91, 97, -237, 100, 15, -62, -50, -192, 104, -27, 62, 88, 87, 138, 158, -61, -139, 177, -11, -81, 222, 49, -192, -50, 37, 152, 149, 298, -190, 158, 323, 105, 152, 174, -111, -5, -71, 35, 390, -119, 140, 33, -103, 366, -226, -215, -111, -216, -117, -38, 118, -73, 48, -145, 96, -245, 121, -105, 91, -217, -50, -11, 41, 80, 131, 85, 132, 55, -6, -200, -53, -34, 0, 107, 74, 263, 292, 69, 79, -103, -10, -41, 121, -172, 162, -252, 115, -174, -245, 173, 37, 0, 62, -39, 96, -18, 7, -172, -120, -210, -28, -165, -128, -90, -226, -32, -263, -297, 55, 118, -29, -149, 47, -39, 139, -68, 82, -19, 157, 42, 308, 180, -204, -92, -83, 101, -139, 118, -9, -135, -34, -175, -181, -110, 258, 104, 100, 179, 108, 9, -47, -29, -32, -17, -128, 240, -78, -132, -49, -123, -42, -59, 0, 157, -190, -135, -89, 91, 57, 8, -166, 44, 65, 0, -299, -128, 144, 211, -45, -44, 31, -28, -222]
6735b22j8N43n65J9l59O24n6J24Q2n00M23Q8l92J02rK60q0j92K52l00n1R1J76
6758D0L7l48K91l05K99M04n99J90M3J87k72L92n58N41j85k40J72n7k29M70l85
6779a12N2J79j36P5l29K00j95M18l00J87j75L6L77r3k96J00o7J94j40O9L37o23
6801b42K61M2j89j0J31J24j81J25o3K35k77l6OK61K38l75%J81j52L1LJ8K95o72
6825b46L85l8k32P4k35Q6J24J84k83L5J00q1N0J14L4j45K10k7n5L68l93J17k78
6848a32L73l63N9j61j84O54l77K94k27R1p2L66m91P8o4J24M25k25J03j66N6l6
6870A25r7k8j67K69l3j22K48%k25K0J44J28j63k38nJ83Pk79K02M9M4M6k94L29
6894A43j95N49r9n30k53L35j47P6L11r2j04J28k35K79k33k41L20R0L0J10k55j49
$$ y = [-222, -240, 303, -262, -243, -602, 22, -34, 90, 172, -328, 95, 183, -209, -107, -116, 144, 64, -128, 124, -176, -227, -136, 40, 77, -271, 20, -285, 14, 418, -181, 9, 52, 239, -33, 359, -199, 342, 157, -83, 89, 32, -197, 273, -112, -60, 119, -17, 58, -271, -71, -266, 152, -148, 39, -136, -100, 277, 184, -112, -12, -79, 115, -25, 44, 381, -242, 19, 61, -128, -138, -7, 117, -64, 61, -2, 233, -44, -80, -74, 187, 425, 50, 50, 231, 79, 110, 113, 131, 426, -246, 139, 101, -131, -57, -292, -206, -82, 102, -181, -146, -46, -127, -77, 37, 71, -74, 136, 109, 54, 422, 29, 146, -132, 241, -122, -63, -224, -408, 246, -131, 163, -64, 27, -45, 321, -170, -92, -156, -32, 393, 168, 271, 105, 161, 125, 28, 0, -167, 102, 69, -53, 195, 195, -30, -10, 134, 262, 99, -139, -144, 39, 46, -233, -31, 18, 62, 108, -186, 143, -52, 497, 398, -132, -385, -50, -197, -121, 190, 98, -6, 122, -113, 166, -67, -308, 12, 102, 132, 242, -13, -162]
6916a62J01L03r7nj14m25K47n6K47l93L18k62J17M16k94p5K67j85%J40k66K81
6938A03l77K30l7J22J71m90K51O2m18M20K28j38j62J31n2l62M48J75k32M1J29
6959B43j14J47k67j04J01O9k39k50L44R7j70M5J76O8l63M04k38j89L38k6R9k93
6981a22J57j23j27M6M7J01k00J40o6L94m27M72j89n7j99L09o0p1M09j64P4n96
7003b52J70K48j67j47R8k12M8OK20K1Mk5l8Nj5o3N2k7L02o6l83K96j98LJ71m95
7029d44O99k47O7l0r4J4L90j30n46K37L3m3O1M5k96L47q4j96J83j08M17k73J5
7052A7k86L07M22o03J49p6j52P7K43O0k01j55K92j05J17j31o5N8p8L4q6J96j06
7075g2K55j10k26K59n15M07L23l10j69L49j96q9J40k2L24l12k33J18K12k00J95
$$ y = [-162, -61, 242, 145, 140, 26, -399, -152, -208, 39, -354, -36, -298, -181, 235, -59, -134, 133, -52, -52, 88, -178, 103, -274, -44, -81, 41, 212, -278, -27, 35, -383, 37, 265, 127, -35, 96, 44, -318, 130, 305, 73, 114, 243, 129, 276, 9, -95, 6, 75, -164, -414, -70, 27, -143, -98, 78, 146, -217, 187, -51, -240, 98, 72, 171, -122, 35, -88, -215, -169, -122, -21, -221, -81, -147, 247, -180, 292, 103, 46, -153, 156, 96, 25, 434, 270, 344, -252, -82, 166, -1, -148, -50, -262, -214, -208, 12, 33, 37, 12, -26, -21, -36, -99, -47, -74, 228, 162, -221, 75, -123, -120, 51, -444, 255, 8, 75, 45, -49, -35, 355, 225, -321, -84, -51, -94, -33, 12, -284, 63, -21, -217, -34, -142, 275, 2, 17, -269, 38, 460, -143, 6, -70, -222, -145, 98, 158, -43, -198, 94, -11, 106, -25, -90, -32, -110, -76, -162, 34, -72, 183, 73, -153, 106, -409, -2, 321, 11, -158, 191, -5, -94, 46, 24, 348, 36, -197, -79, 133, -67, 128]
7096A28O9l06J67j52J91r2R4J03k00K00k00M29m90j19J26q8J46J44k58O9J60o8
7118E3K5k80K57k71J15J95k47m8J06J18J3p9J73k51J43L95m47o0J34j60J01k82
7140b97J37K77j75q7k33M99j99M9l6j55M9K82J3j36j7J23k06K62j64j40K00m6
7162@l59M07k04K10p6L09k64l57M5J81Q5N1O3j8o0m53O35k28P2j19o3K97p8k28
7186a52l2J80k0R9m0l34N50j14L4Mj47p4o7k6K8M55n25J30K25k42J16j3k39K97
7210I3J2k24K90l51J5L50j80j2oK07l67K62J42l03k2p5J61J98j01J7j90K19k89
7233a54K27k99p4K17M4O3p3n4J07M15l36q3j1p4M99k37l09k1K29k2j2J79o4j9
7257A38l97K88k40J91k10L15l11J16J11N0j9j34Mp0N6J50L5M2J76m45K64k91K05
$$ y = [128, 197, -109, 58, -94, 97, 5, 99, 202, 2, 202, 2, 431, -59, -178, -52, -140, 6, 150, -108, -39, 121, 53, 78, -202, 55, -216, -101, 94, -153, -201, -95, 23, 36, -43, 130, -121, 22, 417, -30, -90, 44, -116, -15, -297, -160, 117, -58, -145, -378, 121, -78, -29, -65, -220, -171, 111, 124, -12, -29, 94, -112, 150, -14, -154, 46, 0, -359, 48, -156, 54, -22, 287, 23, -334, -289, -108, -23, 28, 91, 73, 13, -440, 195, -33, 39, -80, -143, 154, 76, -152, -184, -4, -24, 75, 35, -299, 251, 137, 171, 175, 28, -46, -113, -139, -111, 344, -181, -51, 174, -68, 48, 35, -204, 93, 105, -119, 171, -180, -165, 185, 5, -7, -13, 194, -173, 89, 231, -72, -94, -169, -8, 190, 89, 106, -84, 135, -154, 73, -226, -300, -83, -39, 24, -49, -103, 4, 419, 83, 0, -11, -85, 414, 177, -132, -153, 76, 54, 42, 221, 157, 138, -259, 29, -211, -20, -230, 85, -226, -110, 1, 51, 32, -102, -98, -168, -112, 38, 73, 115, 291, -154, 110, -181, 24]
7280B4k94J01K83j62K10k64J15Q7j27n3J34J78k54j41L23l30k25M48J27l2k03
7301e5K85k99jR8j1O3O8pj81r1M47k39N2o6m39L5L03J02R5l18J76N7k91O7J14
7326c6Q4j82P9j57K97Jk92K02m2J83o1K0M6l74L83k60Q8l19M60o0N8L0j14k10
7350a76K74o2J72m48K63L9qj69L14j85p4L0O2J36p3J71k08n5o7L25l93J22Q6j18
7374d2K32O2j94K0M7l24K61Q9j67k86O05l86K15m5Lk82M58k72rJ74k74K01k59
7397a73L32j43p5Q2K44j34l3j49J72Kk77J16J60R1r2j64P5p5L5P1j71P7o3K54
7421A62m9Q2l53K56m4k86J28o9J38k00N92l67M2M13m53K5j88K15J92l22j63M53
7443B04n47O52k32r8R9k72K80r4K9j94R1J29j10RN4Q1k6m11N19k59L25J65m69
$$ y = [24, -270, -169, 114, -48, 162, -102, 13, 100, -27, -80, 54, 232, -22, -163, 160, -170, -395, 53, 180, 148, -55, 230, -69, -70, 28, 17, 80, 148, 141, -40, -131, 316, 77, 129, 63, -376, -341, -38, 64, 159, -159, 17, 74, -217, -150, -36, 48, -134, -55, -212, 85, 86, -206, -4, -46, 137, 76, 96, 142, -232, 151, -109, -21, -340, 120, 60, 118, 148, 34, -176, 98, 36, 208, -240, 23, 62, 54, -115, 199, 14, -60, -30, 32, 168, 95, 266, 58, 3, -64, 261, -132, -10, 76, -42, 190, 252, 58, 78, 125, -199, 62, 151, -16, -302, 303, -83, 132, 87, 90, -192, 266, -6, -15, 159, -115, 86, -173, 159, 16, -59, 23, 267, 133, 100, -49, 123, 125, -152, -36, 124, 215, 123, -41, 34, -41, -6, 65, -106, -29, -92, 162, 113, 195, -158, 98, 54, -232, -104, -173, -35, -235, 357, -10, 32, 445, -8, 17, -171, 44, 236, -86, -249, 204, -343, 309, 77, -21, 78, -194, 86, -8, 21, -173, -82, 47, -63, -54, 0, 81, 55, -356, 163, -96, 229, 394, -75]
7466g5J40k0k47r3M70j86r9K11l3j85J92j02P7o5j10K47j82j87J00R5K5p6NJ88
7490I0J73l04K2J78J0r2j57J09j38p4J51K47j06J17k81O1J08N9j91J10Jj8k0J10
7514A65j44J34L0k97J72M5m31K19K59k57R7K21j1k31j07J10J58J21l21K02j28
7535FJ49%k74K62l4j18r3q9K06K12j79N1o2N3k59J20K05m36j05O52l71L76r5l41
7559a64Q8L0k4J24k12K55k44J30L11k72p4L60l43K34j37j09P9J26o4j36K71J1
7581B40k53l21K97L09k80J0J9r7k53N20P9k14q9J88j19k36M45m4k57K36r8k37
7603a55K44K03j91l23j01Q1J49L12j45k41J69o8P4j77J76q8K05p8J50m7n6J98
7625B91l64K38O6k98J11Q2j11RL9j2K70l09jJ97k01K55k09r2m3J35n2L44m93K25
$$ y = [-75, 65, 45, -202, -295, 175, -11, -110, 101, 68, -117, 75, -27, 50, -15, -125, 122, -60, -247, -147, -52, -27, -103, -98, 90, 263, -41, -19, 159, 169, 77, -80, 29, -109, -183, -32, 215, 109, 226, -55, 6, 114, 173, -18, 92, 93, 75, 55, 165, 21, 155, 185, -112, 60, 105, -326, -107, 152, -105, -8, 213, 202, -29, -136, -26, 132, 253, -68, 134, 6, 155, 155, -119, 143, 109, -9, -102, -191, 15, 227, 48, 99, 37, 90, -169, -49, 156, -280, -385, 267, -104, 272, 177, -164, -76, -46, -70, 54, -158, 97, -147, -17, 294, 22, -52, 308, -35, 199, 62, -47, 32, 158, 94, -42, 229, 240, -13, -334, -37, 272, -8, 2, 21, -76, -329, 191, 270, 56, -33, 155, 36, -200, 245, 201, -56, 180, 82, -155, 89, 292, 101, -222, -323, -242, -93, 219, 74, -167, 2, -66, 8, -169, 7, -81, 124, 46, 196, 149, 93, 291, -73, 165, 231, -67, 44, 126, 15, 24, 63, 51, 321, 12, 11, 208, 7, 262, 53, -39, -82, 53, 1, 345, -148, 77]
7649G7P7j12k39N0M58l81K9J21j27J20l36M14p7k63o3K04KJ60mj11o7j6J5L18
7673B49n45N39o53O22p7k19K16l64L46j59O2k12L13k10J6J22j69O0q3J80Q1l65
7695b50M03j38K14k89k21l4m9L10J24l18K87k36j50N78k02o4P5Q1r9J61J15k21
7717G7J91l16j60K69K9l8O5r1J17J6l42K13kO7j12j8k9L55l79K60j88J05q1n1
7741d3r7P1K94r5o9j47M3L15j83n1K58o33L36J19k49J83p4o3J73j09K58n07J93
7764g7PJ64j15M8j51K88k04j82N36k14l8k04M19j89n9K13j51m9J29l09J19%K19
7787B00%k54k8O6k6j69K96K36l94Q2K34l6N1j86l74L49O0k26k50K66J10j79K2
7810a50L07k67Q4K20m44M01n4o5O8j22M9l76K17K83O1j63P0K46k36k74Q8PM3k33
$$ y = [77, 154, 42, -197, -147, 311, -70, -41, 80, -47, 73, -263, 151, 74, -189, -252, -48, -46, 114, 110, -1, -68, -84, -69, 249, -296, 243, -410, 212, 135, -84, 132, -232, 114, -45, 17, -195, 118, -92, -76, 46, -123, -63, -146, 34, 115, -250, 153, 15, 229, -60, -281, -315, -364, -54, 70, -248, 39, -197, -347, 231, 29, -35, 40, 121, 22, 183, 298, 77, 268, -48, -208, 61, 90, 52, 117, 26, 143, 159, -183, 30, 28, 95, -17, -35, -64, 291, -88, 172, -16, 89, 8, -43, -140, -69, 225, 130, 61, -86, -43, 272, 89, 38, 296, -337, -1, 118, -131, 52, -22, -85, 88, -21, 237, -270, -77, -70, 94, -21, 27, -124, 164, -40, -222, 314, 100, 62, -142, 277, 88, 29, 242, 91, 42, 171, -138, -19, -19, 200, 200, -54, -82, -16, -42, -211, 85, 321, -73, 9, 243, 207, 258, 72, -302, 47, 107, -119, -369, -103, 7, -172, -150, 157, -110, -26, 194, -250, 151, 97, 32, 100, -22, 27, -349, -132, 151, 212, 49, 119, 365, 129, -145, -57, -50, -7, -240]
7834b40L90r0j18L4K79j63k70K55j29N2k84M66J56j56k02j12J87n1M9n7L8J65
7856A99q8O4o0k2k4j51q9M1K02r0k20M8o7J02J09j55J53j04K83J9O2J10l44l4
7880e6J03k50JK13k59L91k31R5j24q6J8J35L49j83k49q9K71l25L50j91J41QK48
7903B80k67l6O1m46N89r8p3N9k10q2L59k33K46j93J08J29k59N6p6P6p4L41l43
7926h6m1K2L34%o8j84m6R5j62J68J07j03q2o1J49k25J47M9k27K50P6m55N57l21
7950a07Q9j18J52l39K64Q5l5q4K6M4J15M0k05o3J7K80k63J4m04L55J85j29j91
7973b72K73j78j11K33K52nk68j6J78k89L56j55k62l9J79J44J39p4o2N0L9O1j18
7996E5K62l03Ok11J83k39L26l6J5j37J96k62J23j42k6m4M83l27K97o0J68k66J29
$$ y = [-240, 150, 60, -58, -24, 255, 92, -178, 77, -52, 0, -284, 182, 338, 182, -20, -132, 55, 4, 53, -4, 34, 199, 111, 175, 115, 93, 69, -82, -171, -130, 72, -18, -238, -190, -257, -155, -46, -201, -48, -152, 131, 150, 212, 322, -22, -56, 47, -203, -202, 11, -248, 143, -88, 7, -117, -203, -185, -50, 299, 116, -133, -222, 49, -276, 74, -117, 24, 32, 280, 13, -23, 38, -408, 181, 83, 10, 69, -141, -223, 136, -97, 149, -44, 64, 193, -66, -10, -86, -10, -84, 257, -86, -127, -105, 229, 229, 161, -23, -69, 26, -136, 32, 139, 36, -46, -107, 42, -183, -36, 13, -214, 36, 112, -343, 214, -107, -18, -136, 16, -323, -59, 26, -9, -93, -67, -23, 92, 132, -73, -136, -119, 161, -102, -88, -492, -137, 48, -81, -272, 1, -177, -288, -55, 197, 192, -76, -92, 86, -203, 153, -2, -264, -303, -124, 20, 159, 85, 23, 73, 112, 173, 55, 317, 14, 20, -191, -8, -247, 79, 43, 58, -79, 117, -145, -22, -164, -190, -234, 249, -78, 219, 159, 327, 61, 190]
8019A90r8rk58K39l82J58J76m3n3lP4j59L8K14rJ57k45R9k2j0k28P3J53R9q8r5
8045c2K98k35K97k23l50J77L31m06M51k80q1j23J22M12n93P6L48l22K60n3k96
8066b22K30K44k57k49L04J7j16J24l13L82j43m2j11K39M6m04L79l0k73K91l0j63
8088i7L3L6j57l0J14j95L66j93q0j16K07j7L8N63n92J41R6j38j30J24l6K69q1
8111A25o7q9J02k66J74J66n1k3j28L21j85n06P9N32j07l31J87k10K41K56r9K90
8133D11n06p5J51J30k26Q8L8J86K9k81J17n7k09O6r5L0R3L73l74K40m6l49M95
8156B29k70J66r1M6r0k77J21J68l8J32j75L35o2l19j67J90J91k09%L17k18rP3
8179D3j49j44M18j76j74M58j72J28k05j31k4J42
$$ y = [190, 92, 83, -175, 64, -318, -160, 16, -27, -80, -83, -9, -168, -130, 84, 75, 232, -13, 86, 64, 54, -174, -101, 52, 151, 63, -32, 266, 31, 328, 105, -245, -68, 263, -143, 308, 28, -53, -176, -54, 358, -235, -159, 189, -133, 127, 74, -222, 8, 252, -5, -254, 50, 67, -49, 75, -238, 144, 1, -41, -152, 87, 133, -271, 108, 78, -195, 96, 66, -97, -64, -28, -185, -215, -101, -296, 70, -123, -203, -319, -112, -129, -91, 472, -120, 21, 117, -21, -151, -27, -63, 206, 125, 58, -31, 71, -195, -21, 145, 94, 71, -57, 264, 79, -427, -348, 184, 77, -254, -67, -277, -36, 220, 121, 411, -95, -170, -19, 111, -115, -27, 11, 197, 226, -55, 62, 5, -204, -138, -233, -203, -110, 263, -111, 129, 83, -266, 229, -41, 125, 34, 80, -10, -287, -166, 2, -36, 96, -79, 256, 194, -125, -292, -102, 89, -120, -120, 197, -21, -30, 43, -106, -250, 168, -8, -182, 276, 104, 232, 27, -104, -128, 14]
8191A4
$$ Imaginary data points
##PAGE= N=2
##DATA TABLE= (X++(I..I)), XYDATA
0@%%%%QqQj6J6k4L2m0N1n9P2q9J08j31J55j80K12k51K91l35L88m44N04n75O55
29C48p38Q29r36J053j177J313j464J630j811K012k232K470k732L023l349L711
45A950m114M570n086N679o366P169q132R308j0775J2674j5245J8933k4705L5108
59B0968n9667K18871J87962m28916j28404J70779J27753j49694l1883J68134R7046
70A92949j52685j05585N6573N2626n3623K7665R4139l2326j50111j853J15054
81D2823k4160j32223Q4377K42310j3160l09585j32831K12206J54042j53341j27820
92a57362J57438J66297j10688j72110M1209J08853n8364r7110O9113J22489j5111
103E4654p6016j2401k2764o5896O4414K08075M6678k40464j91709J13935J75526
$$ y = [0, 0, 0, 0, 0, 8, 0, 8, -8, 8, -16, 16, -24, 27, -32, 40, -49, 59, -72, 83, -97, 115, -136, 155, -180, 208, -236, 268, -307, 348, -390, 439, -497, 556, -621, 692, -772, 858, -953, 1059, -1173, 1297, -1435, 1588, -1761, 1950, -2164, 2406, -2680, 2999, -3367, 3802, -4330, 4978, -5797, 6877, -8368, 10565, -14140, 20968, -38699, 180172, 368134, -60782, -189186, -18407, 109346, -40348, -72231, 95903, 192949, 40264, -65321, -8748, 43878, -9745, 17920, 112059, 79733, -70378, -72231, 42823, 18663, -113560, -29183, 213127, 199967, -109618, -242449, -30243, 123799, -29542, -157362, 76, 166373, 55685, -116425, -75216, 33637, -24727, -121837, -52724, 69765, 54654, -21362, -33763, -56527, -122423, -58009, 150066, 196744, -43720, -235429, -121494, 54032]
114E4032l4511o0176J43451J18243j91372k68124N1504K64636P6169j38165n4548
125c8861Q2867R748q6586o737P7530R829m3745K2279K9304p9479p3313R0909J21028
138A14773n8762j14212O6708J28021r1748k09241J9976K23779O5175j63818p6063
149i5412J31920P8382j20319j10454N5720Q1362j9614k2266M5786J0740o9154
160c3309l2398M3845J6780j9388N0836O9294q9555j85085K752K22089J27563j15299
172E8125j22640M6438M6045r9223o7992J29313J53863m8655j53001k9260Q6077
183i10M1588k2984n309L151k9111q585M3190J0933n6606o630R1086L9196r9445
196d36p5078Q0434Q3025q0633j08587O8297J46551j1349j36072l0293R7790L2225
$$ y = [54032, 19521, -40655, 102796, 221039, 29667, -238457, -186953, 77683, 153852, 15687, -38861, 44006, 53754, -32832, -39569, 37961, 47790, 4045, 26324, 55628, -23851, -97164, -6255, 114773, 56011, -58201, 8507, 136528, 44780, -164461, -144485, 79294, 144469, -19349, -95412, 36508, 114890, -5429, -115883, -60163, 21199, 1585, -20681, 25105, 35845, -33309, -65707, -21862, -5082, -24470, 26366, 95660, 6105, -178980, -176228, 45861, 173424, 58125, -64515, -18077, 27968, -71255, -139247, -9934, 143929, 95274, -57727, -86987, -910, 40678, 17694, 12385, 15536, -13575, -22160, 21030, 31963, -24643, -31273, 59813, 99009, -436, -75514, 4920, 87945, 7312, -101275, -32978, 113573, 102224, -33848, -64141, 33649, 65874]
208F5874q5270n2926N6622O3791l956k6871j6319k7254j4381M0423M3453k4812
220A8374m1536J9822K0446o1058n2707Q8387J41042k4365j70480p5497R6174Q7554
232D6156l3807m1011M4160L5756n8639o6787L0394P7953J8996m2948m4061j5193
244d9031J8480N0688L2991l6400n7837J5431O5568l466p4590j5225P8522L5948
256F1079p3214n4963O6500Q3556l3878r3630r457O6872K4035m4405k4303L5930
268D122L8949q765m1151l2111L905M3886M1698j8179o2155j9826M5735K9786l0606
281d712j7244N1466L4250p0081r2855K5301J14983M7843o9741p2453J2233M6712
293E702O797j9718K787J8974l989l1078k2446J7629N0370L2258l1410o9061k0305
$$ y = [65874, -19396, -72322, -15700, 48091, 44135, 17264, 945, -26309, -40690, -267, 43186, 18374, -23162, -3340, 17106, -43952, -96659, -8272, 132770, 108405, -62075, -137572, -41398, 46156, 12349, -28662, 15498, 51254, -7385, -74172, -43778, 34175, 53171, 10223, -33838, -49031, -30551, 20137, 53128, 16728, -41109, -25678, 39890, 36424, -38166, -53391, 25131, 61079, -12135, -67098, -598, 82958, 49080, -44550, -54007, 12865, 36900, -7505, -31808, 4122, 43071, 34306, -6845, -38956, -35051, 8835, 50533, 32354, -29801, -49627, -3892, 25894, -4712, -21956, 29510, 63760, -6321, -99176, -73875, 41108, 88951, 19210, -53243, -41010, 5702, 12499, -7219, -4432, 14542, 10553, -20525, -42971, -25342, 25028, 57286, 25876, -43185, -63490]
306f3490N9723N6878k5586o0529J219N3462J0325m9055j8398N2210M0211m0836
318A6134o5017M233O1540L1036l0015l6013Q250K9396Q17l2524j8516K9002M5229
331D3552j926n5562l8807L2712O1164P216m8329k6882K5028J8704k8123k3243
343c4496L7353N4868j2943p4634l8930M7308O9158M899n4244l8305J5502L2929
355H465K852j6172N207K3864l063m4706l1546L4883O5439J0520o0807n0781K3214
368c2631N7171R970l8537j9999K6298K0221k6748l4385J7724N2550J4476m6441
380c31m4314J4749M8212J2195l3603k1767K3587K7761j7951m1740p20N0739L3860
393E0677l2544n7036o585M6705L2027j8308k9589O502K2349j0699l4104M96M8376
$$ y = [-63490, -3767, 53111, 27525, -33004, -31785, 21677, 32002, -17053, -35451, 16759, 56970, 16134, -48883, -44650, 16890, 47926, 17911, -18102, -9852, 19544, 20361, -12163, -30679, -1677, 43552, 41626, -13936, -52743, -20031, 41133, 48349, 20, -26862, -1834, 16870, -11253, -34496, 2857, 57725, 44782, -29852, -68782, -21474, 47684, 52583, -1661, -39966, -24464, 8465, 11317, -4855, 352, 24216, 21153, -23553, -55099, -20216, 45223, 55743, -5064, -55845, -32631, 24540, 34510, -4027, -24026, 2272, 22493, -4255, -38640, -20916, 31634, 46110, -331, -44645, -29896, 18316, 30511, -3092, -24859, -1272, 26489, 8538, -33202, -33922, 16817, 50677, 18133, -38903, -45488, 1217, 33244, 14936, -14653, -8151, 14198, 3499, -30605, -30109, 18267]
406A8267L4669l3625o3592j1931N4298M8576j3931m6540j5428K3808J3695j5713
418g447q290K6593K6025k2809n2587j0833N2072M9156j6719n6852k0165L4722
430g134L1748j3467k6111Q951K9104l977l9454j8014L4800M3754o271m7644k3982
443c7697K8022L4713p912l1256o95L3325J0910l7556l4574K4301N4552R942m8260
456b185l8474J9377L9966L662k5534n770K1328N477l0217k4019K3200M8540J1677
469D7028m3643m7137O546M9150K8556k3978l2948L789K2069n696k5646P259M3954
482B9303J6408m6328m9315J5683N7349K0732l4785l2631Q672K4414L93j8276k671
495a1052K0101J4283j6553l1922n171L5086L3119j5993m4288r623L6978K2390
$$ y = [18267, 52936, 19311, -44281, -56212, -1914, 46662, 32731, -13809, -29237, -5429, 8266, -7447, -15737, 10856, 36881, 14072, -38515, -49348, 2724, 51880, 35161, -21691, -41856, -7134, 24614, 11147, -14964, -6013, 23091, 19114, -20340, -38354, -3554, 40200, 33929, -13715, -37697, -9675, 25038, 17126, -14130, -14825, 18500, 29410, -8146, -42720, -18419, 36133, 46075, -2185, -40659, -21282, 18684, 22346, -3188, -8958, 12370, 17847, -12370, -36389, -13189, 35351, 47028, 3385, -43752, -37206, 11944, 40500, 16522, -16426, -12637, 9432, 3736, -21910, -14651, 29303, 45711, -617, -49932, -34249, 23100, 43832, 9047, -23584, -14912, 9502, 9895, -8381, -11052, 9049, 23332, 6779, -25143, -30314, 4772, 37891, 21898, -22390, -32013, 4965, 27355]
507B7355k8455k7914K4826L8171j6259n1820o832N0860L3877k6495m2269l574
519b8529K4389J1951o365l618Q144P000j0355k4166j3549K4959M6034P468n1230
532g867m5021K3571N4264N108l8670q069L1797L419m3650j9062M5348M5722j8828
545B8062n0204j1673K9748K1805n520j4600o019K592J0523M099j2382r978J8500
558D953K3251j9948m2561N522N5170J9673m9846l8747L2234M2965j7751l9821
570b4906J4058M2417n086m8617j7753L2161L3051J593j4501j6439j4884N41J8903
583E38J0449r028P73K0181n559m9407k0828N6262N9520k7513o9081n408M9559
596A0458J0414l8224l233M5760J5307m4695l3447K1605L2184m41j4257n368k780
$$ y = [27355, -1100, -29014, -4188, 33983, 17724, -34096, -40928, 9932, 43809, 17314, -24955, -28529, -4140, 7811, 1446, -2172, 5972, 12972, 2617, -21549, -35098, -10139, 35895, 43363, -7867, -52888, -29317, 24947, 30055, -8615, -16684, 15113, 18532, -25118, -44180, 1168, 46890, 28062, -22142, -33815, -4067, 17738, 12218, -2382, -8401, -5809, 4714, 8813, -3569, -13547, 4953, 28204, 8256, -34305, -28783, 26387, 46060, -3786, -42533, -10299, 32666, 14915, -24906, -10848, 31569, 26483, -22134, -39887, -7726, 25325, 26918, 12417, -4022, -18906, -18365, 538, 10987, 1959, 2732, 22913, 17354, -32053, -52881, 3381, 62901, 35388, -33693, -39101, 10458, 20872, -17352, -20585, 25175, 40482, -4213, -37660, -16055, 16129, 15688, 1431, -3937, -6717]
609f717Q98J7185J1251k4376k8008J9977L7851j2751m1384J0599N0709m290o4450
622c3506j6814O4404M2644m2026m9116J7243L2784j5654k5374K1099L6944l938
634B8690l1738j7110l925L60K3319L6722k681m6052j9188L0052J3050l2242n043
647b5786N6017K6780o3323o2494L4118P1213k105m9531k248L7005n234m1574m163
660c1325L6590J4470j7730o061Q166o656p981J5979P701l1049j8447M2876M3134
673D9667l3102n7655J5247N3774r652n2259J1208O5830M306p2309l4205M8122
685a1028M3545j4559j9058J4881K260l2357j6920K1494J9791J654J3003J2882
697C5588l3886n2405J2076O4969J5081m8446j4512M3217O705o0393k2936O6448
$$ y = [-6717, -5819, 11366, 22617, -1759, -29767, -9790, 28061, 15310, -26074, -15475, 35234, 30944, -33506, -50320, 14084, 56728, 14702, -34414, -17171, 15613, -41, -25415, -4316, 32628, 28690, -3048, -20158, -24083, -23723, -404, 36318, 33637, -12415, -31603, -1551, 11499, -20743, -25786, 30231, 57011, -6312, -68806, -34688, 36525, 34420, -15111, -17359, 19646, 14412, -27162, -31325, 5265, 19735, 2005, -4056, 4110, -2546, -10527, 5452, 13153, -17896, -36343, 6533, 49667, 16565, -41090, -25843, 27931, 18279, -33980, -22772, 43058, 47364, -24945, -59150, -11028, 32517, 17958, -1100, 13781, 16041, -16316, -33236, -11742, 8049, 9703, 22706, 35588, 1702, -50703, -38627, 26342, 41423, -7023, -21535, 21682, 28387, -32006, -54942, 11506]
709A1506N3634m1049o0254J1179L9827q496k7423J4123K9476o913k0021N623N550
722F762j9532p510K6817J1522k8825p126M4506J6944n8407m5265M6028O2179k0598
735B7495n3777J1487M3879j9011n3879J1242O5853J9638m4240l1097O949J582
747a3879p540K0934L2736n871k8386j206P471k6358k0042M4558N5473k5323o9771
760c7204k404N6533Q800m7117k885N5392J2852o0296l6606L9146M0509j5152k2497
773a0929J4183J2921j7349j1474J1840j669j9759R860L6860J064l8593o445L6283
786A6793L39n0537r990O3492L7459n0686n4435K3098M4882j0530k8289K1465L3921
799C6982k0893m8592o604L0659J7518N332J2560l905l5817k1672K3888K3456j6289
$$ y = [11506, 65140, 24091, -36163, -24984, 14843, 6347, -21076, -6953, 22523, 15610, -4411, 1212, 6762, -12770, -20280, 6537, 18059, -10766, -17892, 26614, 43558, -14849, -60114, -14086, 48093, 27495, -26282, -14795, 29084, 10073, -43806, -32564, 33289, 52927, 8687, -22410, -15461, -13879, -21419, -485, 32251, 26380, -2006, -3212, 4259, -22099, -42141, 2417, 57890, 32567, -37204, -39608, 16925, 25725, -21392, -24277, 31115, 43967, -16329, -52935, -13789, 26720, 11568, -10929, 3254, 16175, -1174, -12648, -808, -2477, -22236, -12376, 24484, 25548, -13045, -19490, 16793, 17132, -33405, -43395, 20097, 57556, 6870, -47565, -24467, 20415, 9885, -18404, 3061, 36982, 16089, -32503, -39107, -8448, 9070, 14402, 26962, 23057, -12760, -34432, -10544, 12912, -3377]
812c377r951L3630J9410m6004m5688L3296N9586q416n2340l012L9453m8m1026
825b4487l739M3212J8836k7057j9045J1198M947j1483Q50J0645p226q665K2234
838A0220K4334k2644m1257P361L8649k786l5657P317M7072J342n6770k4149M6232
851g36M0506j9748l2099N332J1406j6621j2640K1505K6837n25j2586q187j5628
864a3184j7423J4424L7857N897l2764j2549K7055R147l2477j4421L8892K9314
876C9768l3081m3670J3819M0619J571k6586j098K2188O56k0424o912R438L040
889f72k900N008L422p893J016J8794J931l3344k1387K7484L5097j2248l1525P784
903i433K8085q553l4358K725M0529J3570l3661k8372R845K1480M400M51N135k418
$$ y = [-3377, -13328, 20302, 39712, -6292, -51980, -18684, 40902, 32486, -19854, -22866, 16587, 16539, -24487, -28226, 14986, 33822, 6765, -12280, -1082, 3865, -7618, -6768, 3877, -3349, -12014, 10220, 34554, 11910, -29347, -21986, 16663, 13877, -21780, -14463, 32609, 33951, -22819, -46968, -736, 39770, 20022, -12077, -6745, 4661, -11960, -24600, -3095, 23742, 23217, 10631, 2444, -13184, -30607, -16183, 21674, 27571, -5193, -17742, 9313, 18460, -14017, -28438, 10454, 39768, 6687, -36983, -23164, 17455, 19026, -7560, -8658, 13530, 14186, -6238, -13150, -3712, -672, -3572, 1436, 4858, -3035, -2019, 16775, 18706, -14638, -36025, -8541, 26556, 14308, -17217, -9433, 18652, 10099, -24259, -21534, 18995, 32565, -1096, -29468, -19623, 1857, 6257, 6708, 11843, 9425]
917I425j2564o983K96k527L466K0434J3472k0129k9646P853L3506L554k9399r814
931a9056K4292J0341k5041j6069K4900K7648j0501k7601m397J6152N683o617m802
944e068R63J504N060O040l653q106M244R190r890k1929K738L2840J5609k4428
958E114k5799J0776K3685m219j9279K906J8859r21k3184q906J8304K1695R14j4595
972E350j3969m743P023R381J808o423J534J0557j443j8084p512K0440J9692j4493
986I118k8451p81K5267J1330j4374r570J1183R544j1508j6366K701J7073Q188
999A3354q622j3472k208J1399J2755j857j4395p308P311P155p324q072J1942J8555
1013A9213m397k5396j0951J8551K0080o787j9070l229J2178N162p324l036R545
$$ y = [9425, -3139, -10122, -9826, -12353, -8887, 11547, 25019, 4890, -24756, -16903, 16603, 20157, -9242, -19056, 5236, 15577, -9464, -25533, -633, 27015, 16514, -11087, -15484, 668, 6351, -266, -5068, -4105, -2601, 2459, 8499, 4846, -3260, 984, 10174, 284, -21645, -18907, 13933, 29542, 5114, -20685, -9909, 13776, 9557, -9722, -6816, 12043, 11122, -12062, -20968, -2664, 19031, 19945, 5350, -8619, -13362, -6339, 3042, 4850, -1573, -39, 10518, 9075, -9009, -16521, 3919, 23611, 9118, -19333, -20114, 5153, 16483, 2109, -7461, 3722, 13266, 1758, -14608, -11907, 5166, 13354, 4732, -8740, -10948, 451, 13206, 11349, -3046, -10354, -3043, 4112, -3212, -11284, 658, 19213, 14816, -10580, -21531, -2980, 17100, 10313, -8757, -11986, 192, 5354, -1970, -5006, 4539]
1026D539R051o905j7854p839J1467J8523L500j3783j2008N636J2419j393j1321
1039e968o14J2473L176j5414j2303J1733K2403K668j9513j3682O962J2868n40
1052D249r331m48R619M440j0218j0549O000J6868N362j5277j6876K627J6773P973
1066A1212q635p896O051P524p436j3003K428J7676Q555j4014j7725K215J8409
1079E361R245q681j1666J262P564j656r214L77J3813R393r778j7840k247J6637
1093B570J2483p064j4987j948J0307M361p277l878R099R864p154j7597m239J5819
1107C59J4641m477j5706n099J0255P404n119p289M680R195k364j4877n866J2949
1121a314J6219j711j6799r155Q400J1530k131r124J028Q892J020j2466p431J0565
$$ y = [4539, 13590, 6685, -11169, -19008, -7541, 10982, 14482, 699, -11309, -5673, 6746, 5353, -5968, -6582, 5891, 9067, -6347, -18650, -6917, 15486, 18154, -1359, -15041, -8079, 4789, 4249, -5082, -5530, 4089, 8529, -1689, -12238, -6238, 10630, 15992, 715, -16161, -13534, 3239, 11212, 2577, -5319, 732, 8256, 820, -12183, -9755, 7921, 16476, 2462, -15263, -13048, 5361, 14606, 5925, -5741, -4479, 3085, 1429, -7785, -7408, 6405, 15798, 6020, -11820, -14067, 2570, 15053, 7989, -6998, -8946, 1361, 5722, -1555, -5433, 3666, 13530, 6376, -11221, -15460, 359, 15000, 10523, -5183, -10282, -27, 7377, 2258, -5031, -351, 8844, 6480, -8397, -14263, -1314, 14905, 13194, -3605, -12760, -4360, 7170, 5039, -4085, -3057, 5835, 6855, -5611, -13042, -2477]
1135b477J6333l41j6789j1752P813J3621J901q854m386O451L818p312q794O239
1149d529J4965L056j5313j4097N980J6680M992j0868q505N428P202n393q263L577
1163e088J3226L530j2751j2745L611J4852P073q071j0193L84P887J469p000k325
1177f141R181P908p801j5508j248J7553J1045r238j5009M51J1537K608q190k884
1191e736Q985O026q348j1210J071J2010R200m986j2916n802Q172J0264p84q479
1205b533l19P895P75j2694o596J3414J6128n029k0034n716J4109J1036n898q170
1219c632K919O085l820q841J0R296Q442j154j0531q707K703J2010N343q544q818
1234g239N224R565m644j2342L641J6923K891j8318j1763J1865J5696k960j2629
$$ y = [-2477, 13856, 13515, -3274, -15026, -7213, 6408, 8309, -545, -4931, 1520, 5338, -1974, -10768, -4529, 10436, 13492, -1821, -15918, -9938, 6742, 11734, 866, -7639, -2211, 4991, -402, -8665, -5088, 8138, 11668, -1083, -13828, -10217, 4635, 11708, 3637, -6556, -6172, 1715, 3184, -3816, -6141, 3040, 10948, 3147, -12361, -13609, 3944, 14989, 5751, -9258, -8807, 2730, 5338, -2852, -5736, 3249, 9275, 927, -10283, -9212, 2798, 11998, 7012, -5904, -11706, -3534, 6730, 5946, -2533, -2852, 5043, 5818, -6876, -13472, -58, 16070, 11041, -8993, -14709, -600, 10436, 4538, -3632, -713, 5372, 1552, -7289, -7279, 2017, 10459, 9305, -1226, -9933, -7230, 4780, 10123, 1579, -7239, -2015, 7550, 2906, -9436, -5795, 11128, 14019, -4299, -16062, -4197, 11499, 8539, -4090]
1247d090k029Q371J787n343j773M142L308j184n268m901J62J0583J0444o877j7013
1262i681l289J4625P635r958o972J1603Q726j3436j6496Q098K1051L481j6238
1275h51r593N779N645j819n08M535J960k841l361l690l883M640J2483L016j4641
1290c129j0787J1006J4997p284j5974M236J7083j882j8718k510J8244Q824j4169
1303f3j1878P124J0868j244n655o33m01k894K550N813j044m176M133N557j0498
1318b441j4934P867K3525L697k1507j0291J3555R235j1656p743J4814J2336j1087
1331E370j9861J509J4074N799l608P09k89p173l236N956L137m856J429J0875n93
1346I242j7244o995J7908J3549j4713j6760J0381J9048o406j9005K187J7243J080
$$ y = [-4090, -6119, 2252, 4039, -1304, -3077, 1065, 4373, 3189, -2079, -6980, -6818, 3765, 14209, 7332, -9681, -12970, 1655, 9290, -668, -7640, 3963, 12689, -747, -17243, -9145, 11906, 15387, -851, -10444, -4665, 980, -839, -1347, 3188, 5148, 2307, -1054, -4744, -8627, -3987, 8496, 11512, -3129, -13916, -2910, 12087, 4803, -11171, -6935, 10148, 8266, -10452, -12962, 5282, 14106, -63, -11941, -4817, 6051, 4807, -848, -1481, -1882, -4776, -2226, 3587, 2543, -1633, 2500, 8057, -2441, -17375, -9508, 14017, 17714, -3793, -14084, -529, 8706, -2950, -10693, 4121, 16457, 5370, -14491, -12982, 1092, 6891, 3283, 3992, 3703, -3470, -6706, -750, 2387, -2469, -1040, 9835, 9242, -8002, -14997, 2911, 16460, 1747, -15013, -4632, 14416, 8010, -10995, -8808, 8435, 9515]
1359I515j5198k748J2876M871r310n896L046R16P38P547M903r940j1979N817J0925
1374F083o154r012J1904J7179j1119k7549n82K5331J0850j6214q338J1542M366
1387H287j5033q190J4089J3883m571r500j142j790m679N185J2246j174j2316l91
1401e096J2667k276j7309o76K1970O536k0413j1685J7192J4842j4081j7043Q834
1414f538J6975l622j3030J887R774m444q474K973Q165p07j857M363k354j4572
1428a1461m029J8244J3573j1351j4093Q377J0543j3782j6094J3963K5452k909
1440A6433k4630o927J4851N263q667M9J1460J260j2378n524N393K211q84P562
1454E472N788j0695j3113O817J5315n031j5959M408K0095j197k1309m249J9718
$$ y = [9515, -5683, -8431, 4445, 9316, 6, -5890, -2844, -1928, -1190, 6357, 11260, 1320, -10659, -4842, 6083, -71, -9083, 2821, 20000, 8881, -18668, -19250, 6081, 16931, 717, -7621, 3921, 8287, -6746, -14936, -847, 13036, 8465, -1035, -2177, -3967, -8646, -3461, 8785, 7611, -4705, -5096, 7571, 5295, -12014, -12690, 9280, 15816, -4597, -16282, 910, 15752, 1671, -15372, -6538, 10437, 6815, -6215, -4328, 5446, 1002, -7472, -4499, 3666, 2959, 1102, 5465, 3111, -11461, -15490, 2754, 16327, 4976, -9117, -740, 9803, -3979, -20073, -6110, 19342, 16433, -8197, -15124, -273, 4990, -3677, -3628, 7832, 9092, -3286, -8810, -3417, -1206, -2090, 5472, 11260, 565, -12548, -5731, 9584, 4553, -11406, -6998, 13097, 11900, -9409, -13658, 6060]
1467F060P060j7335r830J4841J2873r338j1727L635O260l512j685P508K366p887
1481g11l854N430j561p925N549J7798J117k1795j1312J4912J2452r784q986J3239
1495D569J1949j3678j9304N567J8835L073j0966k117M250l029n352M323P157k212
1509C065l674M253N97j0804m591J3412J0993j1295j4038Q995J5826o231j7702
1522a1194J821J6811J273j4692k955J3742N697j1929p741O226O281j853K29K018
1536C734m705p086L665R394j390p253M248R061p602j7507K518K0577P773j5179
1550B48r754Q810O322q610q443J0823J1776n434j1835j135O375J342O47L049j087
1565C094o976j126O683O98p315J62J1338K459j2965p454J2512J0626r791j3783
$$ y = [6060, 13120, -4215, -14045, 796, 13669, 4331, -7396, -3761, 2499, -1013, -2698, 4810, 7176, -711, -4565, 865, -696, -8621, -3072, 14726, 15843, -5952, -17264, -2352, 10100, 316, -8670, 4569, 16518, 2840, -16464, -10897, 7938, 11011, 45, -2072, 2178, -851, -6203, -1880, 5277, 3065, -609, 3644, 4241, -6563, -11154, 2258, 13251, 1956, -12082, -3087, 12739, 6508, -11194, -9373, 7438, 8711, -5981, -8936, 4806, 10503, -1426, -9167, -2941, 3340, 1487, 1716, 3734, -971, -8057, -4392, 5002, 3612, -3641, 607, 9668, 2066, -15441, -12923, 7654, 15427, 248, -9506, -696, 5626, -2984, -11427, -604, 11172, 5738, -6097, -7232, -857, 485, 1132, 4181, 3094, -3882, -5008, 1675, 2373, -4942, -4780, 6558, 9017, -3948, -11402, 1110, 11736, 1945, -11838]
1579a1838N620J3787p97j0828q09Q866K62q159j675O047L959j899k007j909l873
1594e253O99Q634M644p365p819M569O452n818p111P798J3485l575j6626m086J1884
1609E12P053o300m964M584L961n043m685K771N296J222j993k253m143j387O129
1624G60O247l726q022J899Q332j201r625p36J0218L887j0368o948Q188R887k752
1639F040r837q04M780J669k817k28K719P58j321j551k075k54M550N065l198r274
1655e778k350Q785N785n104n287M683N407n900r033K869J0974L346q368n953K820
1670c104N064K48k290m35N74J52j232j674p43L690N525j193p851m147N667P452
1686E703k751p736O45O707J145o321j896O651M822n649p349R0O468L804j795l790
$$ y = [-11838, -6218, 7569, 6772, -4056, -4865, 4001, 4263, -3896, -5571, 476, 4435, 2536, 529, -1380, -5253, -4554, 4080, 8724, 1359, -6460, -1891, 4561, -1257, -8368, -570, 12915, 9340, -7286, -11372, 512, 7565, 1265, -3699, 885, 4846, -197, -4882, -2111, 3185, 4407, 2414, 161, -3982, -5369, 760, 7007, 3281, -4741, -2842, 5490, 4289, -5336, -6072, 4146, 8033, -2335, -9283, -1095, 8792, 6040, -3797, -4601, 179, 1848, -969, -1197, 1522, 2280, 959, -592, -2667, -2921, 1629, 6694, 3496, -5778, -8128, 657, 6442, 1338, -3949, 734, 6141, 241, -8792, -5923, 5051, 8397, 29, -5924, -3104, 1960, 2208, -82, -517, 57, 209, -1023, -2697, -3440, 250, 5775, 4582, -3269, -7416, -1749, 5703, 2952, -4784, -4139, 2568, 3713, -2608, -4504, 2147, 6969, 1320, -6029, -5939, 529, 4333, 2538, -1252]
1702a252j044J868J629j239j956J152L270O92n399m460M792Q200M48p918m594
1717e811M097M518k490l516K279N251m80o401l405N460N800o03n852l670K259
1732b564M153J413l302p77K486J872l710n009K080O227L874o494n939K684O143
1747C137J613m032k952K085L677l747m108K195O773J316n196n255P12N337K666
1762D221k934m058J128L373j52l333m36M881L269m645o625l15O768M175k788m778
1778b249j11L749Q95l008j831L909J658j575n241j212O328M766m011l685k199
1793c817L539L165l039k459K810K931o97n396j597M925M905j101p317k001K962
1808b187M832j397k628M67L138j72m313k614L949N145m02n307m021L141N163Q2
$$ y = [-1252, -2296, -428, 1201, -38, -1994, -842, 2428, 3120, -2279, -6739, -1947, 6253, 6701, -1217, -5811, -1714, 2804, 314, -3202, -923, 4328, 3848, -2553, -5958, -498, 5302, 4699, -1153, -4823, -2564, 1589, 3002, -300, -1077, 1409, 3281, -429, -5438, -3358, 2869, 6743, 249, -5690, -3006, 3137, 4750, 718, -2234, -149, 3528, -219, -4327, -2132, 4641, 5957, 761, -4494, -3782, 1555, 4221, 1287, -2771, -1643, 1730, 1578, -1755, -2191, 2690, 5959, 1314, -5311, -5626, 1142, 5317, 2529, -2249, -2360, 1389, 2284, -724, -2555, 1354, 3012, 1437, -3804, -5016, 1312, 6078, 2067, -1618, -3817, -278, 2887, -152, -2611, 199, 3130, 2433, -2963, -4560, 365, 5270, 4169, -3148, -5149, -2187, 2645, 1248, -1380, -913, 2225, 2053, -2260, -4874, -925, 4220, 3818, -1489, -5510, -2369, 2794, 2876]
1824B876l299j255K271J180k859l288K630N757R14n696m183K417N513O40l508
1839A10k737K159J871j220k815J557M258J067m561m673J324N604K844l507m343
1854c062R63M186k52l500n44M577J998m487n205K003N632K816l625l842m16L422
1870F64J036k175p32J880K412k085m069l19M717M162k487o089j353M721L065k299
1886A049k960J592L699j889m751m87N445L416k777n019r43L203K815l19k371p63
1902a060J358P01k180j764K085M880L49n731m236L356O329m73n255p05L498J154
1918B306l950j917M097L301j718m705q43K337L217L98j433l104n2K680p84j151
1934a321q66L504K405l477n282J733O532K124o064m228L111M339j723k983J580
$$ y = [2876, -423, -1678, 593, 1773, -1086, -4374, -1744, 4013, 4927, -769, -4952, -2535, 2978, 3618, 110, -2627, -468, 1403, 183, -2632, -1075, 3183, 4250, -311, -4984, -3660, 1944, 4788, 1281, -3062, -2099, 2087, 1835, -1665, -2209, 2368, 4366, -121, -5326, -3323, 2309, 5125, 1500, -2342, -2758, 664, 1700, -475, -1207, 673, 3085, 1000, -3069, -3388, 1329, 5491, 3004, -3085, -4438, 283, 3348, 1049, -1911, -319, 3380, 1491, -3260, -3747, 1698, 5114, 2337, -2682, -3625, -422, 2393, 2074, -297, -1060, 298, 999, -1181, -2945, -860, 4020, 4369, -1362, -5598, -2242, 4087, 3614, -1641, -2346, 1152, 2306, -1644, -3561, 536, 3837, 2119, -2586, -3429, -1092, 2125, 2523, 1090, -2014, -2066, 614, -170, -1321, -2187, 1317, 3722, 245, -5037, -3304, 3228, 5352, -712, -4940, -1829, 2510, 787, -2196, -616]
1949f16L341q23m208j534K825L126Q59j779l015j617K391L050J60l408R1L300
1965B143l87n140j961O753N250m171p339J259O065O03m511j245M240J124l598
1980i15j818K237K306J28j139j652j880J014L722J589l610l395L207L747k557
1995I84m997K622O391k082p468q36P343M078m358m523K282K183k169j524J878
2010a96K494q80j306p27q24o46L331L899k894o552K18N738J684n087j090O327
2026C489K199p333n098N773O006k171o023J071L745O4k924P33K133r80j451N24
2042b43L60j794Q97L775K9n688k341O595L877n031n960L410O180l023n831K915
2058a873P489q61p977k228N083K551j897o55J633r59k589N23K640p91q92K037
$$ y = [-616, 2725, 1902, -2306, -3840, -1015, 2111, 2970, 1191, -1824, -3441, -1050, 2000, 2160, -1248, -1157, 2143, 1756, -3384, -5345, 1408, 6658, 2487, -4852, -3593, 2472, 3075, -1436, -2681, 1559, 2683, -915, -2733, -496, 1810, 1938, 799, -853, -2733, -1719, 2003, 3592, -18, -3413, -206, 3541, 984, -4013, -1391, 5000, 2918, -4550, -5386, 1957, 6035, 1677, -2846, -564, 1619, -550, -2074, -196, 2298, 1418, 112, -615, -1439, -2085, 1246, 5145, 2251, -4301, -4083, 1655, 3339, -1748, -2838, 3489, 5688, -1645, -6743, -970, 5036, 2865, -3158, -2087, 1658, 1722, -1202, -469, 1664, 684, -767, -243, 117, -1677, -780, 2995, 3024, -2664, -5005, 1590, 5467, 436, -5524, -2114, 4066, 1043, -4788, -1873, 5616, 4755, -3222, -5450, -367, 2184, 287, -368, 1265, 306, -2283, -1760, 880, 89, -803, 1234]
2074A234J777m590m813M202Q074j065p626q07O255M32o790j231P032L611n958
2089b63m046L518L594j799k255J462L59k256J15K889K06l200M46M297j032n318
2105c283M6O865J219p640l638O398N835l953n334L369M353l878n362K130O386
2120C513K26l651j029J072j079p21L369J691l604k642K574K754m082k038O034
2135B387M766n850p535K298P730o74o453J038N612M11n814j597N136J950l547
2150a42j853J854M29j515J320K573k353l498K252M693j684n835J361O076r20o881
2166d123J04P590K850o912m797M127L714l303j893L388K747k544l459J055J821
2181C65m42K17K345j263n109K8N623K075m476k358N166J497o084m113O157N818
$$ y = [1234, 3011, -1579, -6392, -2190, 5884, 4819, -2807, -3614, 2641, 3073, -3717, -4948, 2084, 5695, -263, -4309, -791, 2803, 1004, -1251, 211, 570, -1686, -1571, 1318, 1524, -1676, -1230, 3067, 2035, -3283, -3237, 3628, 4847, -2793, -6431, -33, 5802, 1849, -3485, -116, 4237, 359, -5003, -2873, 3513, 3739, 88, -941, 131, -948, -1669, 1700, 3391, -213, -2855, -281, 2473, -1609, -3647, 2387, 7153, 1303, -6232, -3934, 3796, 3122, -3331, -2293, 3319, 3730, -2084, -3681, 1455, 3405, -142, -1995, -141, 288, -1227, 93, 2666, 313, -3185, -933, 3760, 2076, -3759, -2398, 3678, 2758, -4123, -4019, 3571, 6421, -491, -5288, -1161, 2553, -750, -2643, 745, 3492, 948, -2511, -1456, 365, -77, 140, 2485, 1222, -3887, -3859, 1764, 3839, -637, -2995, 2171, 3668, -2416, -6529, -372, 5446]
2197E446l073o039J081N192p64m034J76L955p85k987M69K081j73j303J419P93
2213A454k703j737L722L522m231m251K839N093j718n579K029N864j503o616j173
2228d988O016K854l038k354J562R02k414pK200Q51j827K37J093k204k135K956
2244b96M808j701n681m75M762J098m427o32M835J998m630l634L058L797j317k969
2260a406N33J636n12r31J279M26j425K20R67J2k666N99L458L69m307k116M539
2277F75L623l131m363J959L745j753l603J371M447L07l850k177K133J053j79O79
2293I36l05j105o52J093O74j169m69K490J420l972l061K261N113m14m460q57L963
2310A486L73l422j036K983K125k083k361N81J622L56Q7o53j077k03O99J710j016
$$ y = [5446, 2373, -3666, -2585, 2607, 1843, -2191, -2015, 1940, 1155, -1832, -1363, 718, 545, -758, 661, 1454, -1249, -2986, 736, 4258, 27, -4224, -1385, 3708, 1990, -3589, -1560, 4304, 2801, -3815, -4988, 1028, 3882, 844, -1510, 52, 954, -1460, -1467, 733, 1584, -243, -6, 1087, -1117, -3252, -296, 4512, 2811, -2870, -3345, 1417, 2515, -1912, -2544, 2291, 4289, -341, -3975, -917, 2880, 1563, -1406, -873, 763, 251, -680, 599, 1025, -400, -180, 787, 799, -1867, -1268, 2190, 2559, -1748, -3864, 675, 4298, 1167, -3196, -1237, 2508, 755, -2848, -1477, 2970, 3277, -573, -2750, -617, 436, 257, 936, 631, -474, -1126, -33, 641, -528, -997, 1493, 2913, -1059, -4120, -1859, 3254, 2840, -1620, -2477, 1486, 1859, -1563, -2599, 384, 2509, 426, -1935, -1354, 268, 624, 711, 58, -1019, -1222, -523, 1187, 171]
2327A71j450R29K226j040l173K86M002J105l758k704K487L113j165k194J065J537
2343A437p22k291k24J725J520k76r27j541m89J325K251n39k072m38J695M97k295
2360a364o59K958K471k447l521L43L486O20k026j174J347J016q56j244Q28J122
2376I00K86n80j809l99J222K070k71j853j280J998J272j294j747R17K407o37k847
2393a645m11K667K142j712k351p7J939K10q39jN54M75m08j268p28J264J710J68
2411A689k111j165O31K135L3j734k54J246O65k000j369J948K181l52k165j222
2427a844J507J464j81j260l41P46K54m44j033R31J426M24j760j787O15K192R51
2444A860k004j060O74J395l35j644J25K166N67k281j350M51K271Q16j255j557
$$ y = [171, -1279, -350, 1876, 836, -2337, -2051, 1951, 3056, -702, -3406, -919, 2194, 1029, -1165, -100, 1437, 715, -1576, -1800, -75, 1445, 1169, 242, -1299, -1788, -463, 1788, 1249, -823, -1261, 434, 931, -1364, -2023, 935, 3406, 959, -2562, -2219, 1267, 1887, -139, -1313, 34, 1050, 194, -1050, -222, 900, 1186, 606, -1203, -1602, -380, 1690, 1419, -434, -1714, 284, 1556, 262, -1485, -568, 1839, 1202, -1645, -2056, 611, 2753, 1041, -1310, -1387, 552, 762, -77, -78, 476, 951, 543, -725, -1453, -189, 1521, 1689, -422, -1587, -956, 1179, 1212, -522, -776, 470, 1135, -865, -2234, -286, 1895, 1543, -622, -1844, -337, 1127, 946, -314, -655, 91, 345, -99, -1132, -201, 1225, 1649, -111, -1898, -1283, 909, 1860, -144, -1204, -530, 865, 530, -1114, -989, 1177, 1744, -537, -1887, -1436, 835, 1651, 396, -1161]
2460a161M24J012J25q02k76R67P75q80j855K62J698J444j003k040j10J378O36
2477E94o60p71R01R81n19j946j54J811J675j209j777l23J511Q80k06j174J54Q36
2495F04J49j975j06J227J718m65k233n55J702J339m44j336k28J032J66j171o01
2512a177J264J331k79j759j097J165J753J06j447r28J058O43n18p68K92J610m88
2529G61j199j283Q27J916K75j440j163R49J136o19o01q3J563K87j667j208N70
2546i79J724J021j500j335K24J095N66j040n18J181R43j145j670K43J836J093
2562A739j491j632K95J497J51q64j61P39N89j144p02N3J348Q50r04j508k40J187
2580a98J207o13j175K23R00K66j511j66J458J414j144k147j72J948Q06r17j007
$$ y = [-1161, -737, 275, 400, -402, -678, 289, 1064, 184, -1671, -1409, 289, 1733, 730, -1310, -1420, -42, 594, -66, -837, 64, 1045, 526, -1420, -1574, 237, 1912, 703, -1074, -1397, 114, 994, 788, -386, -232, 604, 753, -1222, -1328, -101, 1617, 1152, -1081, -1636, 66, 1405, 961, -375, -603, 429, 595, -576, -1177, 87, 1418, 1139, -620, -1717, -552, 1201, 1307, -140, -1068, -10, 633, 115, -653, -361, 1249, 761, -438, -1721, -894, 1022, 1297, -143, -1306, -357, 779, 160, -441, -524, 1039, 1326, -341, -1549, -979, 745, 1766, 266, -1069, -845, 250, 816, -224, -742, 439, 1382, 237, -1433, -1190, 646, 1739, 248, -1384, -1089, 408, 559, -305, -466, 273, 862, -282, -984, -931, 417, 1267, 363, -1145, -1385, -198, 1009, 396, -779, -556, 344, 610, -901, -1067, 391, 1805, 661, -1486, -1658, 290, 1096, 179, -828]
2597h28N85M86j50l27k14N61R73m88j258p40P85J962J21j636j125J165R95o83
2615A84j365O18J792k96j696p66J828J415m88j571n77Q34L66j74Pk97O78K8m80
2634D0q80J83J501Q04j233j743J50K000O75j901l73J362Q26j804r32R23K074o71
2652A001j614l68P29Q42j03J46p63l41M58N48q12p11R71J177R3k402n76K551J040
2671A866j445j860J070J500m90j678N77J693J2j731p84R94P91L10n62m12n12k12
2689h73J104L16q29m62J436K28j504j451J832J941o17k680nK046R54k057j61N72
2707b10K030j350j538N67J071k5m43J59p32m66O59J444j053j082M09J555o86k136
2725a827O01K593N68k409j719K320J545j309j627R35J527q94j380L89J497j03
$$ y = [-828, -243, 243, 93, -234, -448, 113, 1086, 598, -660, -1400, -615, 1347, 1468, -168, -1293, -128, 867, 184, -1181, -563, 1229, 933, -763, -1529, 299, 1714, 1226, -345, -922, -88, 278, 104, 111, -186, 492, 520, 40, -840, -657, 844, 1648, 415, -1328, -1178, 822, 1497, -404, -777, 585, 1411, -393, -1325, -402, 1672, 1001, -613, -981, -252, 590, 487, 633, -130, -471, -13, 535, -277, -988, -17, 1160, 1253, -1149, -1725, 826, 1866, 421, -1439, -369, 1131, 641, -1037, -460, 1233, 1245, -486, -1270, -276, 515, 825, 263, -149, -661, -873, 231, 547, -282, -744, 692, 920, -584, -2035, -203, 1738, 1121, -1559, -1564, 482, 1436, -621, -782, -210, 1820, 470, -1068, -501, 570, 545, 102, 261, -471, -937, -278, 1166, 113, -969, -560, 995, 309, -1827, -1226, 1367, 1935, -474, -2193, 127, 1672, 363, -1264, -329, 1198, 304, -1076, -687, 810, 707]
2741G07p91p8l08K78r7J513j97j876n72J888N90j409r75K055J264j976j905P60
2759a129K765p03k190K15J452L48j428K62J259k70m49k27J08m31k5P44Q22j455
2777c32j352J428J613n53k031Q59J603m78k554K40K707J042k149j239Q67J692
2793A363j415m88L18R64j066k87P81J00n81N71N53n14j965N37K530K46k367r97
2811a717K395M77j617j185J662J793j523j958P71J884k97n94m0M36m23q41O14
2828a63N11o38l64J413l71j276m84K106J176k059j856J364J882j099j730P51K091
2845A254l41k062l96J920M18j196j06N58K18q14O28R44o02j164R00L13n49j217
2863a294J033K272j118k459M35K279K59k178n77J775R67k000q09J499J375q17
$$ y = [707, -84, -162, -470, -192, -289, 1224, 1027, -849, -1421, 467, 1057, -352, -1327, 728, 1992, 16, -1889, -1129, 1636, 933, -1257, -1042, 410, 758, -670, -408, 851, 581, 132, -95, 13, -418, -443, 301, 1123, -332, -1684, -256, 1357, 804, -1227, -368, 1235, 757, -1797, -1557, 1150, 2192, 43, -1196, -329, 1363, -52, -540, -222, 742, -324, -611, 170, 270, -311, 260, 813, 299, -1666, -1129, 1401, 1647, -720, -1717, 678, 1155, -462, -1647, 15, 1808, 285, -1673, -902, 982, 685, 91, 51, 487, 64, -777, -163, 348, -290, -654, 759, 388, -888, -1372, 734, 1910, -149, -2005, -641, 1241, 142, -1588, -837, 1254, 913, -1149, -1545, 375, 793, -403, -509, 49, 267, -547, 81, 1025, 423, -741, 159, 472, -77, -1294, -261, 2011, 893, -1566, -1131, 1148, 1407, -771, -1348, 427, 1394, -606, -1415, 84, 1459, 642]
2879F42r34j05M92m58J39J116l45j412J92J727j153j153Q90J875m30k260l36K034
2897E21R57j003j381P24J412j226j392R04J313k60r74r3P56j51m3K73J37j219
2915g45r3J336N18j121j090J547J545j264k063J466J089l03k245k72K381L84j561
2932d91j08J307j37j001n54P40K11k15N45L15j158k90Q77R46o81j513O75J433
2950I01o66j217P7J948P38j918j094Q65R97q24o87O37O45n7p05L61L94k65m35
2969c05K52j65o35M23J121J40j717J24J360M28j199r75J368J026j475q47P21J239
2987H84pj146n17R04n5k87n6L40J67m1J76k86m17J21Q17L95j188j170J189J245
3007A068o79r15L23R07n6j352n34J645K39k50r58L18P83j17l19j44J49j84J11
$$ y = [642, -292, -397, 95, -363, -224, 892, 547, -865, -673, 1054, -99, -1252, -362, 1513, 1083, -1177, -1513, 521, 1478, 475, -906, -182, 1230, 4, -1388, -484, 829, 569, -405, -498, 258, 107, 64, 337, 474, -745, -838, 498, 1016, -105, -1195, 352, 1897, 633, -1430, 36, 1125, 822, -1423, -1695, 686, 1070, -491, -599, 708, 571, -430, -984, -244, -33, -248, 297, 612, -546, -836, 41, 987, 306, -1207, -532, 901, 235, -982, -905, 1043, 1781, -137, -1231, -366, 631, -193, -880, -243, 402, 345, -360, 1, 395, 130, -305, -53, -218, -853, -430, 691, 831, -886, -762, 598, 1026, -173, -1148, 220, 1246, -229, -1076, -355, 884, 877, -269, -786, 118, 63, -224, -280, 60, 227, 186, 362, 76, -341, -220, 597, 992, -196, -1366, -177, 1068, 389, -526, -203, 704, 648, -704, -1238, 407, 646, 396, -562, -244, 539, 422, 103, -41, 108, -76, 35]
3026C5ol50p1Q92R24j281j075M76J428k19j489J4J069L04o84n74O80J226j029
3045B70j008L65M98K62J3m73J44k98J43J10J12m18L67J71k52q93N4J543K36o77
3065B69q17L04Q30j06r25J27Q30pn11q66N06J102l60m54j94r9J77N28L6o87p5
3086c92N12J53j035L6N71P81l65p96j97J041L75j196k6m52J091J1p58O81M06J29
3106E70o60j61r46J358j34M15j390O45m80J267m10k92N39M07l85j065j8O45O04
3125E09k46m07l34J008n09k27L3P7J066m36p73o81P80M99K72p15k61L1K32L68
3145B86m3J79j70Q4o06j1J43R25J09j538p4J098O25p24k72m45N42l35N35j754
3165a446P06J374n81l40m21J174O62j371L85l31M13jj93p32J35R08L38l67r39
$$ y = [35, 29, -321, -392, 500, 1424, 143, -932, -456, 972, 753, -736, -722, 347, 651, -33, -607, 73, 1299, 270, -738, -373, 125, 387, 400, -73, 71, -227, -84, 26, 138, -280, 87, 258, 6, -887, -833, 710, 946, 269, -548, -244, 586, 480, -445, -318, 512, 505, -6, -872, -366, 736, 376, -78, -272, -371, -194, 334, 370, -317, -392, 120, 273, -762, -726, -155, 626, 261, -535, -732, 309, 684, -512, -538, -990, 101, 112, -646, 35, 441, 570, -90, -251, -1197, 161, 27, 442, -948, -303, -783, 484, 74, -218, 321, 728, 343, -722, -740, -95, 509, 263, -144, -478, 530, 21, -206, -173, -96, 970, 534, -239, -920, -140, 359, 631, -84, -345, -314, -82, 286, 243, 422, 252, 336, -270, -281, -138, 787, 896, -642, -716, 382, 1007, 283, 11, -434, 108, -227, 308, -1446, -740, 634, 53, -287, -708, 466, 1128, -243, 142, -189, 224, 223, 30, -702, -567, 341, 679, 312, -627]
3184f27L59O07J98l58k58j70K38j07j37J3K16N09j52p49l25M75Q26j22o70m17
3204f51P95J87m66k16O70R9%q05k50P87N54o21l61L3J79O06m00n69J27P91k30
3225B59m80o13R07N44n70k05l68O61L5M32j088L39O75p5q02j85K26M60J34l79
3245i3l52K32N18l09j07PP1K13l50j91K4Q49j14p40k04J47R36k1o34l76M59K69
3267B34l79k25L02K23O03j043l31L71M90J48j74l46o9O58l76j62n5K39J38j20
3287A26n96k29R80L67j50j023K45N99L8l99j32l9P73m80l77J61K64M75m08m65
3307b70r6K99L63o4l35k1N85pn90k09N6J038m41p20k31N65L98k30l64Q3L96j28
3329G7k41j91J76N57j88k69j80j58M98M37o11k50L76R4j60k72K50N71j2q77l85
$$ y = [-627, -268, 339, 537, 179, -79, -249, -11, -118, -255, -242, -26, 483, 331, -418, -743, -268, 558, 436, -234, -651, 144, 331, -135, -351, 319, 418, 418, -387, -637, 150, 704, 83, -278, -245, -66, 540, 140, -429, -302, 489, 259, -221, -834, 73, 617, 47, -158, -526, 135, 170, 602, -486, -147, 528, 453, -349, -534, -308, 152, 286, -93, -445, -213, 305, -4, -111, -104, -33, 180, -170, -361, -337, 512, 398, -342, -546, -399, 537, 516, -118, -494, -35, 234, -145, -370, -68, 155, 758, -285, -616, -245, 245, 393, 219, -127, -196, 462, 86, -76, -131, 108, 246, 126, -470, -699, 281, 648, 498, -525, -280, 319, 357, -42, -174, -213, 560, 80, -297, -136, 128, 603, 195, -270, -366, -67, 296, 232, -103, -124, 461, 454, -136, -345, -289, 749, 308, -412, -643, -78, 320, 90, -274, -191, 205, 77, -164, -355, -179, 378, 190, -79, -259, -417, 81, 518, -93, -343, 33, 127, -33, -305, -55, 516, 504, -373, -758]
3350g58P15O10k88n81M6L14j0o3M2m4J62kk09r4o3M72L94n53o79J89O38l0m49
3373b41k6N13P05r62p31Q58N39o16j91l26K01M29j44j35j1J33J64J76m12L1o2
3394a08P51p6q47j63M65N45m96p07K33J019l25o53K30K94N42r44r7K44K80l5K0
3415A72ll54L1p8L80j07j25M52J33n84o37M13J330m67p89m19R09Q4o45m35R22
3436A83L62l84n39RN68M8k01r2m0j72M58n0j23l63K22L46J57r05rR16J83q59m72
3459g57P90Q83p30o29M20N45o56k68NP76j36l89J1N4k45Q6O37m22j24k05O91%
3481C37n45l09M44P69k85j015J58R76k32o20q2O25N58p55l93M20R7j77k81J55
3501a55J43J22J36q2m59j73N72K88j02p58J33Q64p7q52k41Q36M28p39p54Q37J35
$$ y = [-758, -43, 567, 279, -302, -256, 58, 48, -15, 27, -17, 145, 143, -66, -160, -223, 249, 643, 90, -589, -400, 238, 208, -241, -267, 246, 951, -11, -742, 116, 655, 39, -152, -478, -277, 152, 8, -127, -138, -5, 159, 335, -77, -46, -108, 643, 567, -280, -443, 22, 567, 71, -636, -403, 616, 291, -362, -132, 162, 704, -240, -337, -93, 187, 152, 172, 169, -185, -154, -232, 148, 41, -84, 368, 501, -83, -720, -307, 1023, 556, -233, -652, 257, 341, -304, -739, 183, 545, 161, -378, -369, 199, 247, 46, -46, -86, -258, 200, 150, 27, -336, -114, 232, 389, -516, -525, 391, 574, -285, -757, 33, 916, 186, -443, -23, 522, -134, -402, -397, 379, 243, -146, -135, -81, -326, -240, 397, -25, -149, -354, 337, 337, -208, -517, -73, 696, 411, -604, -446, 530, 298, -322, -404, 221, 779, 24, -369, 51, 148, -29, -310, -155, -12, 110, 246, 164, -295, -468, 104, 392, 290, -468, -335, 529, 452, -400, -641, 195, 623, -116, -870, -33, 102]
3522A02J84o30J68P32k24l53k42J55j51K37J99L80p41k55O91O62j289J87O60M56
3542I28r26q57N99R84j82p38l07P69R3q31M1N20m5m2N9J45l05k92M87K22l96o54
3564g28J157O5l41p90L70Q04l55q35N04R35o76l38m64Q80L29k74n04K02M7m5q9
3585a46L03J61k00J4Q1m19j35J11P97o2o71L9Q69j2p44p68J094N08q47n51M60
3606a18P25n33j39l17O05J17m71M86j05o23K61L04l8q10M55N26K0n38o44O95R06
3627G64n75q40J25R82m12n41J04P75q1m18k33J12L21k44L62M5n37M11j%m41j95
3649e17N68K01p3p91J75J103q2q38j48N38L54q04k2L78N07n26j68K71O6q9M8J87
3671C38k53n18O17O4k07l40L7P95j83j238P37L18J05l82l77N20K28Q1n46L16k21
$$ y = [102, 286, -344, -176, 556, 332, -21, -263, -108, -259, -22, 177, 557, -184, -439, 252, 914, -375, -188, 472, 928, 2, -855, -256, 728, 546, -192, -499, 270, 363, -468, -427, 93, 48, 6, 65, 210, -95, -387, 100, 322, -74, -728, 429, 494, 153, -637, -267, 537, 182, -653, -149, 786, 110, -228, -692, 188, 517, 243, -261, -59, -12, -57, -146, 157, 318, 118, 132, 213, -206, -341, -230, 567, 505, -166, -127, 742, 730, -14, -782, 312, 820, -27, -578, -118, 607, 74, -65, -382, 223, 340, -131, 355, 250, -373, -112, 192, 154, -656, -201, 325, 345, -193, -837, -142, 764, 189, -651, -526, 456, 44, -497, -393, 382, 301, -117, -350, -238, 83, -161, 201, 246, -291, 120, 119, 119, -322, -517, 51, 252, 179, -612, -437, 666, 584, -254, -402, 136, 490, -314, -336, 42, 549, 23, -145, 126, 192, 103, 151, 338, 85, -433, 184, 248, 41, -299, -262, 533, 350, -888, -151, 167, 272, -110, -487, 33, 261, 342, -204, 112, -109]
3692a09M4j72m54N44O4J69J73j15l75J91L6J84m67P8L87L40r07K40Q5K68k49n30
3714e75L94K95M38o30J5o2M33k94J17k03J0j56L31j90J28k3J57K01m75k82K32
3735a39N40K4p65P0N75j17k65l11J48P82p96l64M61p3K02n4o4J25l6L04n67J29
3757a91m9J71J04N2l95p4O29r3j03p3J6q7J13p28P90L6J47n44L07j70P72p55k36
3780c61L89r31O39K65j94J14J52J82k83m37L3M96O85p20k49L89J62j15o79L15
3800a48Q2K67l18k70M34k14M54j27k56J54j25O3N5j71J26P7L3j31J21l52N04j79
3822G9n24M74j91L40k89r4R9M26r3l73o6K87Lj38Q4k68L12M63m15k86j37L28J30
3845A51L5m48K71l2K51l43J32j63K34J1k49O4J22J06j59l52J43P18n13K03n71
$$ y = [-109, -65, -237, -691, -147, -83, 86, 259, 144, -231, -40, -4, 180, -287, -209, 178, 518, -389, -149, -64, 204, -45, -575, -181, 114, 552, -78, -63, -125, 308, 14, 131, -72, -62, -218, 113, -77, 51, 28, 185, 386, -89, -371, -139, 401, 425, -340, -270, 305, 188, -77, -388, -240, 542, -254, -618, -157, -230, -28, -82, -146, -21, -57, 247, -320, -191, -240, -69, 35, 87, -308, -382, 247, 154, 51, -22, -6, -93, 20, -708, 82, 118, 265, -279, 28, -142, 630, -125, -361, 28, -903, -264, 1, -193, -79, 73, 255, -28, -465, -432, 64, 749, 29, -220, 169, 331, 216, -463, -148, -66, 201, -117, -387, 47, -167, 287, 160, -96, 58, -67, -4, 51, -120, 6, 83, 116, -15, 106, -246, 258, 79, -445, 29, -162, 178, -111, -205, -106, 320, 227, -146, -212, 75, 78, -60, 24, -244, 68, 531, 116, -170, -307, 21, 151, 186, -262, 9, -23, 228, -115, 17, -146, 88, 99, -150, -86, 36, 142, -17, -369, -226, 492, -21, 182, -389]
3866c89J56J77J78r0n19L49Q3j33L17J9j30P5k01lr7M53k61M3q7j17K32J63n88
3889c70J63L95j94J28m45J31K66O9k52Pl1M72o5m07j4r7M19j42r7L0J04J83n27
3912b74O1L38K7J99l36j56L25J46j30l17m9L92n5l21q4k33K02N11k01j02N7%M91
3935D91o58J22j09M60j84j99l08L86J26o0j17j61K43l9P7j40j39N45j35m54J63
3956i0k89N63K3K2o58J63L85j58j6o2K50k89J64l03K59J64m0k44L08q0L2J00l21
3979a17M6K26K55m06j65p4O31n12L6k30O6J2O40n28K03q0L08k25l25R8K21K56
4001C36m41j24K31K33k12p1j66J40O2m2J63k0l0j66J66k71Q4K90J88l58j20O2
4023f6J57O7l38K28L42j56j51k36K77n47P83M24k50K83q67M70n19l31O79m13J74
$$ y = [-389, -233, -56, 122, 32, -487, -138, -55, -188, 129, 148, 18, 93, -108, -111, -208, 245, -16, 27, -60, -177, 55, 218, -370, -207, 188, -6, 122, -323, -192, 74, 143, -109, -102, -133, 339, 274, -133, -147, -244, 175, 33, -64, -34, 70, 253, -274, -213, 125, 152, 351, 15, -141, 184, 330, 200, -117, -166, 226, 171, -150, -234, -467, -265, 246, 45, -57, 0, 0, 491, -167, -45, -154, 306, 122, -77, -385, 1, 127, 67, -50, -211, 32, -7, 70, -70, -209, 336, 201, -253, -90, -379, 184, 207, 229, -429, -266, 119, -39, -55, -117, 133, -156, 8, -295, -36, 128, 88, -156, 152, 72, 104, 204, -117, -71, 155, 410, 4, -161, -235, 396, -116, -80, -310, -244, -232, 408, -120, 83, 3, 311, 86, -239, -141, 80, 336, -105, -229, 2, 235, 23, -48, -214, -74, -12, -54, 109, 89, 59, -107, 59, -212, -128, 162, 350, -8, -128, -66, 91, 158, -180, 48, 390, 234, 83, -153, 124, -423, 360, 784, 534, 817, -50, 420, -99, -430, 249, -164, 10]
4044A0j2o85P99L41J43j073N39L53l19k62K44n23N9Q55k16p25Q12n33M19M7j088
4065h15P69J14O60j000N25k0J03L20k91n17J38N5k65K77J55J68o38P77j125j7
4085f27Q26M36m58J95j72l05K92m49J89P45j255R77r76L62M58j1k84J85p5L45
4105C98m81P1l18N42O5k11k43K11N81q99K61m6R1P9j98J15m3k92L80J51k65l69
4127d20N84K09k41l60o0K51L22n7k34jM12m37k14J81l49M47j78Q0Q6L8Lj52O3
4150b7j90L09l18R9o2m30J046k7n21n4L93l56mMJ92j27Q8j85j35K12k1J82Q5k87
4174a34K22j68J18p2k54K10M79m06k55R8M07n2q9k09K08K09r2m35j77N72K17o41
4196b44K85L2j45J10M4k65KL56q0J29j70m46M00lk26j80L54N11l86k77l6J75L27
$$ y = [10, -2, -687, 112, 453, 596, -477, 62, 415, 96, -166, 78, -445, -386, 469, 253, -472, 340, -193, 226, 273, -815, -46, 68, 728, -272, 253, 233, 336, 656, 365, -152, -14, 41, -224, 53, 208, 376, -262, 515, -610, -627, 199, 635, 177, 372, 200, -105, 187, -262, -73, 672, -583, 394, -582, -220, 238, 227, -57, 128, 53, 398, -83, -12, -330, 212, 277, 66, -177, 34, 615, -284, -23, -69, 22, 101, -97, 18, -25, -317, 63, 214, -51, -420, 164, 373, 132, -228, -288, -37, 285, 228, -6, -7, 405, -32, -246, -65, -414, 33, -145, -65, 21, 59, 62, -90, -27, -217, 92, -226, -127, -189, -619, 427, 400, -121, -175, 218, -138, -142, -138, 54, -73, 15, -170, -305, -93, -114, 68, 153, -134, 88, -80, 38, -34, -288, -78, 401, -5, -260, -162, 245, 193, 104, -105, 103, 312, 220, -215, -392, 180, 397, -244, 41, 73, -72, 38, 82, -183, -181, 175, 95, 224, 54, -392, 8, 5, -221, -401, -47, 464, 78, -199, -235, -60, 267]
4219B67n13Q1R1J80J30k42j98L25j12j06k39O06n53K23Jj5J31k03M04J013k55
4240A016q62q93J578q01n50Q14n27n1r9L48J66J56j17K6j50j11n8r0N4K33k0k52
4262a90N63p76L54K23j26J4j09J73L7p5k52J60J48q7Q8k29j27K56m8j06J25K3
4284C9J12l06J90n3k8L26k59J87n52K95K51m08P5P8M53k60m59rL67K14q3n02N64
4307B32j21p5N8Nj94J13j13J67J90j83l59M79j45k95m9P41k80l65Q8n8M78j36
4329A78o4k5J93l96j6l2K30j67k2J94k78K33J99j64j04k23L41j50o8j9j7m4K74
4352E3j86K9L21m6K07p30K32L18j64m4k02N15R0l62j64j40K94k87%L57j74n2k
4375a37J00N7O5Mj67l6k07k2M89K9l97J63J5M65k50j15j27K29o7p7O4K93m32J3
$$ y = [267, -246, -165, -74, 106, 236, -6, -204, 121, 9, -97, -336, 270, -283, -60, -59, -74, 57, -146, 258, 1271, 1016, 154, -739, 839, 38, -512, 302, -225, -276, -375, -27, 139, 295, 178, 204, 54, -57, -115, -205, -151, 82, 62, -190, 373, -403, -49, 174, 48, 62, -47, 126, 163, 88, -164, -4, 144, 57, 145, -84, -211, 45, -3, -109, 16, 39, 151, -155, 35, -18, -46, 280, 21, 208, -344, -49, 202, -206, -131, -53, 400, 140, -319, -328, 39, 253, 170, -332, 232, 111, 36, 94, 99, -95, 18, -95, 72, 262, 79, -280, 199, 54, -241, -290, 451, 171, -194, -106, -164, 314, 178, 114, 89, 282, -114, -130, -162, 68, -99, -121, 73, -205, 28, 227, 63, -41, -264, 77, -73, -141, -160, -177, -221, 53, -133, -104, 217, 171, 378, -352, -120, 198, 34, -10, -212, 303, 393, 31, -133, -273, 21, -266, -266, 91, -83, -135, -137, -37, 20, 85, 89, -78, -114, -321, -343, 146, 175, -222, -59, -44, 421, 171, 56, -71, 158, 91, 14, 78, 371, -61, -48]
4399d8L13j95p9J53J72k39j0j75p5L64l33J13L26j63k78k3j25K31k6j44l29P71
4421B01M8j28k2k92K52J64n5K4j42K9L4n4j2R4J10j11N5k87j01J93j9j33J81j3
4445A6K42k88L31m24M3k2k96M03K5r7R0j63J00k7J8K12l45Q1K09J64l37q6P6N7
4469a8L82k87P0k35L25j61n6Q5q3J51j01J28k35J05J5j97J17J93l76K89n5j19
4491f3p3K11J50n54J15M16j7K3p4j72K21k52K85m58K10JK43k78m6R9L5j96Q1L05
4515B12j83j50K37O3j67J0m4j37m0K64j3j68J71j7n6J27N6l29M19l48K98kj78
4538B5k73O70n05j27J09N8M35m32J08k65N17m28J88J7j43n5J86J67j86L4R8j35
4560F3N3r0J20j80K63j59l48J9M57j2j63q4l6l4K45m18L01O9J85p4l78L13m2K51
$$ y = [-48, 265, 70, -9, 144, 316, 77, 67, -108, -183, 181, -152, -39, 287, 124, -154, -177, -302, -71, -97, -241, -570, 201, 249, 121, 99, -193, 59, 223, 168, 192, 50, 79, 113, 59, 47, 141, 251, 140, 195, -92, -193, 0, -19, -152, 29, 16, 258, -30, 301, -123, -80, -102, -398, 5, 30, -67, 23, -140, -40, -67, -49, 163, -182, -101, 108, 272, -65, -151, -75, -18, 364, 77, 147, -88, 237, 76, 20, 105, 22, 173, 72, 200, -35, 70, 85, -112, 5, 198, -178, 111, 56, -63, -136, 75, 225, -329, -214, 202, 185, 208, 134, -38, 183, -69, 216, -242, -32, -31, 212, -66, -112, -13, 22, -174, -93, 212, 29, -121, 116, 179, 12, 22, -22, -159, -199, 65, 52, -116, 55, 38, -18, 109, 165, -164, 255, -93, 205, 203, 25, -248, 422, -83, -210, -101, -43, 392, -40, 68, -197, 320, -108, 80, 97, -46, -101, 85, 252, 66, 100, 198, 63, 116, 26, 146, -34, 229, 70, -278, -259, 198, 186, 23, -61, -97, -131, 114, -304, -3, 66, 251, 177, -201, 112, 70, 321]
4584C21l27J9k56R8K64m32J26K12m4P3j84m9K85j1J32l78L52l76L18n3j08J81
4606A63j83O0l0m3J7n8q1M6J08K4j42n8K51Q2L0o0k08J76k43K12K73l69l30N51
4630A88j20k99J62n3O9K01J2k68K69l6L1o1j36J19o3j05L18l58K75l88K46l1j05
4653a33J75J87k92Qm5J12J6o0O2j91J80k27K71r3j5J63r7j74k8J92n7k09J13R7
4677d5o5J25k03j68K78m6K27n2q7K0N3M3j50o3L30l32p0K01J65j14j5m7J78n0
4701A13k58P1K25l3j76J57K8J13k1j63j17j83K7K74j24J07r5m9J87k20R7k50K86
4724dj02Q6J31j65Q6K8j25J71n46N81j78j20M64l10J1j00m4O1R0M7j32J98l16
4747a88j35N44j46k7r9K87k47O4o9O0J83k12K89j55n42K27J85l38M25j20K40K4
$$ y = [321, -6, 13, -243, -145, 119, -313, -187, 25, -19, 54, -130, -179, 106, 95, 227, -151, 201, -175, 143, 90, -18, 163, -20, 40, 10, -33, -16, -74, -155, -109, -1, 23, -119, -177, 74, 156, 186, 126, -82, 94, -149, 63, 336, -33, -363, 188, 68, -231, -69, -122, -53, 148, 160, -108, 161, 125, 156, 95, -41, 78, 15, -90, 228, -130, 145, -243, 3, -28, -133, 42, 229, -63, -55, -100, 12, 28, -32, 30, -161, 19, -208, 63, -30, -45, 118, 21, -153, -181, 11, -46, -255, -142, -45, -110, 15, -188, -356, -78, -124, 103, 51, -36, -16, 37, 80, -70, -133, 197, -135, -205, -4, 161, 47, 32, -15, 163, 113, -145, -74, 151, 118, -58, 99, 127, 240, 219, 56, -61, -244, -217, 57, -67, 40, -55, -104, 83, -137, -40, -290, -4, -106, -20, 111, -54, 32, 60, -65, 106, -440, 141, -37, -157, 307, -3, 8, -92, -136, -75, 15, 62, -70, 128, -188, -323, 221, 75, 48, -51, 236, -11, 53, -16, 44, 227, 15, 304, 149, -393, -166, 19, -319, 106, -14, 226, 250]
4769B50j59j59n2R9K18m44J24L04J69m89M24m00J44o8rJ5L22j31j97lJ89N0n19
4792c22L63j83m5K20K32M1l35J78K10m78r7oQ9N5M0J00j8K08J20k07m13J8L59
4815A29K2k05J07k69j3L25k43R8n8j31M10O5l76K37j48L67k56l9K01l78M91j12
4837B24k53K73j24J16k36o8k39R3R3J69M3Ok08K92j86L56o3m06K34R2l41J1n9
4860a81L61N9r0j11j90Q8J29r6j5J40j8L3J31l32Q9j02k22M98l43M39l37K02n7
$$ y = [250, 91, -68, -120, -21, 197, -247, -123, 181, 350, -139, 285, -115, 29, -39, -48, -33, 289, 158, -39, -42, 147, 197, -322, 41, -142, -187, 33, 265, 306, -29, 149, 359, -119, -216, -222, -133, -78, -38, 62, 44, 252, 372, 165, -248, -230, 129, 151, -54, 53, -216, -229, 96, -147, -49, -107, -238, 172, 237, -139, 98, -50, 317, 61, 22, 223, -155, 336, 224, -29, 244, 120, 236, 0, -68, -307, -214, -121, 48, 91, 97, -111, 181, -5, 351, 288, -118, 116, 208, -133, -122, -181, 180, 239, 149, 38, -152, -64, 65, -31, -46, 94, 76, 109, 240, -92, -3, -105, -327, 171, -172, 267, -70, 132, 75]
$$ [...]
8191A10
##END NTUPLES=NMR FID
##END=
