##TITLE=1H_LR-707-B3
 D2O, 8 sc, 
 29.10.2020
##JCAMPDX= 6.0         $$ Bruker NMR JCAMP-DX V2.0
##DATA TYPE= NMR FID
##DATA CLASS= NTUPLES
##ORIGIN= UXNMR, Bruker Analytische Messtechnik GmbH
##OWNER= root
$$ XWIN-NMR		Version 3.5
$$ Thu Oct 29 09:44:43 2020 Russian Standard Time (UT+4h)  she@DPX200
##.OBSERVE FREQUENCY= 200.1315066352
##.OBSERVE NUCLEUS= ^1H
##.DELAY= (6, 6)
##.ACQUISITION MODE= SIMULTANEOUS
##.ACQUISITION SCHEME= undefined
##.AVERAGES= 8
##.DIGITISER RES= 18
##SPECTROMETER/DATA SYSTEM= spect
##.PULSE SEQUENCE= zg30
##.SOLVENT NAME= CDCl3
##.SHIFT REFERENCE= (INTERNAL, CDCl3, 0, 15.7039)
##AUDIT TRAIL= $$ (NUMBER, WHEN, WHO, WHERE, WHAT)
$$ ##TITLE= Audit trail, XWIN-NMR		Version 3.5
$$ ##JCAMPDX= 5.01
$$ ##ORIGIN= Bruker BioSpin GmbH
$$ ##OWNER= she
$$ F:/spectra/data/she/nmr/H-F/1/audita.txt
$$ ##AUDIT TRAIL=  $$ (NUMBER, WHEN, WHO, WHERE, WHAT)
(   1,<2020-10-29 09:43:45.73 +0400>,<she>,<DPX200>,
      <created by zg, POWCHK disabled, PULCHK disabled
       configuration hash MD5:
       00 E9 B6 7A A2 85 ED C7 34 08 36 98 17 FE 4E 26
       data hash MD5: 16K
       3B 46 B5 0C D6 51 E8 36 CE 77 1F 07 D7 AC 60 1A>)
$$ ##END=
$$ 
$$ hash MD5
$$ AF CC 0D C7 21 45 0A A8 6A 4E 66 67 7C 17 0F AA
##$RELAX= 
##$RELAX= 
##$RELAX= 
##$RELAX= 
##$RELAX= 
##$RELAX= 
$$ Bruker specific parameters
$$ --------------------------
##$DU= <F:/spectra>
##$EXPNO= 1
##$NAME= <H-F>
##$PROCNO= 1
##$TYPE= <nmr>
##$USER= <she>
##$AMP= (0..31)
100 100 100 100 100 100 100 100 100 100 100 100 100 100 100 100 100 100 
100 100 100 100 100 100 100 100 100 100 100 100 100 100 
##$AQSEQ= 0
##$AQ_mod= 1
##$AUNM= <au_zg>
##$AUTOPOS= <>
##$BF1= 200.13
##$BF2= 200.13
##$BF3= 200.13
##$BF4= 200.13
##$BF5= 200.13
##$BF6= 200.13
##$BF7= 200.13
##$BF8= 200.13
##$BYTORDA= 1
##$CFDGTYP= 0
##$CFRGTYP= 5
##$CHEMSTR= <none>
##$CNST= (0..31)
1 1 145 1 1 1 1 1 1 1 1 1 1 1 1 1 1 1 1 1 1 1 1 1 1 1 1 1 1 1 1 1 
##$CPDPRG= <>
##$CPDPRG1= <>
##$CPDPRG2= <>
##$CPDPRG3= <>
##$CPDPRG4= <mlev>
##$CPDPRG5= <mlev>
##$CPDPRG6= <mlev>
##$CPDPRG7= <mlev>
##$CPDPRG8= <mlev>
##$CPDPRGB= <>
##$CPDPRGT= <>
##$D= (0..31)
0 1.2 0 0 0 0 0 0 0 0.06 0 0.03 0 0 0 0 0.0002 0 0 0 0 0 0 0 0 0 0 0 0 
0 0 0 
##$DATE= 1603950225
##$DBL= (0..7)
120 120 120 120 120 120 120 120 
##$DBP= (0..7)
150 150 150 150 150 150 150 150 
##$DBP07= 0
##$DBPNAM0= <>
##$DBPNAM1= <>
##$DBPNAM2= <>
##$DBPNAM3= <>
##$DBPNAM4= <>
##$DBPNAM5= <>
##$DBPNAM6= <>
##$DBPNAM7= <>
##$DBPOAL= (0..7)
0.5 0.5 0.5 0.5 0.5 0.5 0.5 0.5 
##$DBPOFFS= (0..7)
0 0 0 0 0 0 0 0 
##$DE= 6
##$DECBNUC= <off>
##$DECIM= 32
##$DECNUC= <off>
##$DECSTAT= 4
##$DIGMOD= 1
##$DIGTYP= 9
##$DL= (0..7)
0 120 120 120 120 120 120 120 
##$DP= (0..7)
150 150 150 150 150 150 150 150 
##$DP07= 0
##$DPNAME0= <>
##$DPNAME1= <>
##$DPNAME2= <>
##$DPNAME3= <>
##$DPNAME4= <>
##$DPNAME5= <>
##$DPNAME6= <>
##$DPNAME7= <>
##$DPOAL= (0..7)
0.5 0.5 0.5 0.5 0.5 0.5 0.5 0.5 
##$DPOFFS= (0..7)
0 0 0 0 0 0 0 0 
##$DQDMODE= 0
##$DR= 18
##$DS= 0
##$DSLIST= <SSSSSSSSSSSSSSS>
$$ [...]
##$SUBNAM2= <"">
##$SUBNAM3= <"">
##$SUBNAM4= <"">
##$SUBNAM5= <"">
##$SUBNAM6= <"">
##$SUBNAM7= <"">
##$SUBNAM8= <"">
##$SUBNAM9= <"">
##$SW= 16.880792210976
##$SWIBOX= (0..15)
0 0 2 0 0 0 0 0 0 0 0 0 0 0 0 0 
##$SW_h= 3378.37837837838
##$TD= 16384
##$TD0= 1
##$TE= 0
##$TE2= 300
##$TE3= 300
##$TEG= 300
##$TL= (0..7)
0 120 120 120 120 120 120 120 
##$TP= (0..7)
150 150 150 150 150 150 150 150 
##$TP07= 0
##$TPNAME0= <>
##$TPNAME1= <>
##$TPNAME2= <>
##$TPNAME3= <>
##$TPNAME4= <>
##$TPNAME5= <>
##$TPNAME6= <>
##$TPNAME7= <>
##$TPOAL= (0..7)
0.5 0.5 0.5 0.5 0.5 0.5 0.5 0.5 
##$TPOFFS= (0..7)
0 0 0 0 0 0 0 0 
##$TUNHIN= 0
##$TUNHOUT= 0
##$TUNXOUT= 0
##$USERA1= <user>
##$USERA2= <user>
##$USERA3= <user>
##$USERA4= <user>
##$USERA5= <user>
##$V9= 5
##$VALIST= <valist>
##$VCLIST= <CCCCCCCCCCCCCCC>
##$VD= 0
##$VDLIST= <DDDDDDDDDDDDDDD>
##$VPLIST= <PPPPPPPPPPPPPPP>
##$VTLIST= <TTTTTTTTTTTTTTT>
##$WBST= 1024
##$WBSW= 4
##$XGAIN= (0..3)
0 0 0 0 
##$XL= 0
##$YL= 0
##$YMAX_a= 219512
##$YMIN_a= -175805
##$ZGOPTNS= <>
##$ZL1= 120
##$ZL2= 120
##$ZL3= 120
##$ZL4= 120
##$ABSF1= 10
##$ABSF2= 0
##$ABSG= 5
##$ABSL= 3
##$ALPHA= 0
##$AQORDER= 0
##$ASSFAC= 0
##$ASSFACI= 0
##$ASSFACX= 0
##$ASSWID= 0
##$AUNMP= <proc_1d>
##$AZFE= 0.1
##$AZFW= 0.1
##$BCFW= 1
##$BC_mod= 2
##$BYTORDP= 1
##$COROFFS= 0
##$CY= 11.3945322036743
##$DATMOD= 1
##$DC= 2
##$DFILT= <>
##$DTYPP= 0
##$F1P= 15.9154993809931
##$F2P= -4.1035820241983
##$FCOR= 0.5
##$FTSIZE= 0
##$FT_mod= 4
##$GAMMA= 1
##$GB= 0.15
##$INTBC= 1
##$INTSCL= 1
##$ISEN= 128
##$LB= 0.24
##$LEV0= 0
##$LPBIN= 0
##$MAXI= 10000
##$MC2= 0
##$MEAN= 0
##$ME_mod= 0
##$MI= 1.114404
##$NCOEF= 0
##$NC_proc= 0
##$NLEV= 6
##$NOISF1= 3.799351
##$NOISF2= 2.8
##$NSP= 1
##$NTH_PI= 0
##$NZP= 0
##$OFFSET= 15.70392
##$PC= 1
##$PHC0= -10692.64
##$PHC1= 14.40088
##$PH_mod= 1
##$PKNL= yes
##$PPARMOD= 0
##$PSCAL= 0
##$PSIGN= 0
##$REVERSE= no
##$SF= 200.130013532006
##$SI= 16384
##$SIGF1= 3
##$SIGF2= 2
##$SINO= 400
##$SIOLD= 16384
##$SREGLST= <1H.CDCl3>
##$SSB= 0
##$STSI= 0
##$STSR= 0
##$SW_p= 3612.71676300578
##$SYMM= 0
##$S_DEV= 0
##$TDeff= 0
##$TDoff= 0
##$TI= <>
##$TILT= no
##$TM1= 0
##$TM2= 0
##$TOPLEV= 0
##$USERP1= <user>
##$USERP2= <user>
##$USERP3= <user>
##$USERP4= <user>
##$USERP5= <user>
##$WDW= 1
##$XDIM= 8192
##$YMAX_p= 0
##$YMIN_p= 0
$$ End of Bruker specific parameters
$$ ---------------------------------
##NTUPLES= NMR FID
##VAR_NAME=  TIME,          FID/REAL,        FID/IMAG
##SYMBOL=    X,             R,               I
##VAR_TYPE=  INDEPENDENT,   DEPENDENT,       DEPENDENT
##VAR_FORM=  AFFN,          ASDF,            ASDF
##VAR_DIM=   8192,          8192,            8192
##UNITS=     SECONDS,       ARBITRARY UNITS, ARBITRARY UNITS
##FACTOR=    0.000296,      1,               1
##FIRST=     0,             0,               0
##LAST=      2.424536,      0,               0
##MIN=       0,             -175805,         0
##MAX=       2.424536,      219512,          0
$$ Real data points
##PAGE= N=1
##DATA TABLE= (X++(R..R)), XYDATA
$$ [...]
2142Ek711K29J759L490J32k955k418o46K824L109j58k368k965j91K763K424N84
2159B907k694l085J40K498K945o9k554k688k90K355K875N04k539k922k90K454
2175d53K946M50k549k783l74K166L318K44k632k830n53K600K565N23j972l213
2191b547j56K394K702P37k530k802n79K019L190J49k358k324r13K684K548L06
2207B520j684l200n76K698K328R52k445k979n9J727L030O16k667k164j142K269
2223g76L131Nj716k783p09K524K259J028k179l241j0J527K840J033k644k218o92
2240b621J638L256J08j812k332j229K707K037Q88j708l338n7J914K193J301k495
2256D50k241o53J416L333K89j799k380j170K109K676L71j496k827p56J947K445
$$ y = [5, -2706, -2477, -718, 2772, 2904, -51, -2469, -3115, -291, 2818, 2660, 292, -2673, -2864, -101, 2323, 2907, 213, -2872, -2732, -234, 2711, 2642, 88, -2600, -2890, -535, 2340, 2844, 305, -2617, -2907, -453, 2493, 2943, 394, -2389, -2763, -597, 2721, 2965, 333, -2497, -3050, -450, 2115, 2638, 666, -2547, -2703, -309, 2393, 3130, 600, -2202, -2781, -762, 2428, 2577, 219, -2105, -3018, -334, 2214, 2520, 836, -2364, -2940, -242, 2086, 3038, 593, -2386, -2445, -718, 2312, 2928, 261, -1903, -3045, -776, 2355, 2360, 644, -2139, -2848, -324, 1935, 2963, 784, -2457, -2467, -940, 1900, 2933, 289, -1929, -2621, -983, 2273, 2381, 569, -1763, -2992, -285, 1752, 2640, 932, -2406, -2463, -549, 1644, 2945, 450, -1791, -2444, -1028, 2305, 2594, 795, -1585, -2755, -646, 2030, 2401, 905, -1922, -2678, -731, 1714]
2272A714J157k221k571n34J676K565P38k111k045j116J567L302J41j229k868j169
2288c004K353K315R78j536k833m11J284K329J207k009k116r63J429K647Q36j416
2304A090k532j405J767K611R78j319k816r32J595K394J217j787k593l64J152K129
2320A185J416j713k309q02J237K653N94j109k363j663J703K511J273j231l062
2335a680r19J791K103J245j549k715n09J121K023J782j929k035r81Q46K664J171
2351B429j300k443j273J538K006J246q03k825r34J255K010J738j625k730l48N11
2367a548L153O30j454j421j769J335K451N81o97k502j350J712J912J391j022k973
2383a571n90O42K676J769k104j578j524J135K751J09p38j761j720J331K256R85
$$ y = [1714, 2871, 650, -1921, -2455, -779, 1786, 2524, 413, -1632, -2748, -1181, 2121, 2262, 1033, -1835, -3004, -651, 1664, 2642, 1106, -1727, -2138, -854, 1475, 2682, 673, -1443, -2406, -977, 1670, 2506, 1090, -1442, -2847, -1080, 1531, 2509, 1190, -1626, -2558, -963, 1431, 2648, 861, -1732, -2096, -944, 1185, 2601, 888, -1421, -2223, -986, 1667, 2261, 1152, -1211, -2874, -1171, 1340, 2613, 1382, -1680, -2599, -808, 1295, 2540, 991, -1724, -2233, -1112, 911, 2693, 764, -1271, -2252, -1406, 1258, 2429, 1129, -1314, -2587, -1049, 957, 2203, 1400, -1425, -2359, -1104, 906, 2644, 1019, -1711, -2059, -1548, 1605, 2235, 781, -640, -2409, -1074, 1377, 1958, 1261, -1241, -2591, -879, 1033, 2424, 1402, -1571, -2161, -1519, 1157, 2926, 822, -756, -2280, -1145, 1606, 1715, 977, -784, -2504, -1173, 1083, 2068]
2399B068o39k468j305J131J811J655r18k333j017M96K534J603j525k080j156J039
2415a104K302Q52o25k360j319J129J683J489m07k745j051R99J817J776j287k170
2431a021j184N25K905J148j306j677j706J102K316P70n20j930j766J197J705J245
2447A803l15k109j345O72J885J659j219j801j121K69K499J030n36j983j655R00
2463a367K154J165o12j908j479J220J533J232p65k084o29J55J800J464p04j676
2479e01j359M31K205J041n38j653j757R34J910J285m13k216j161M71J930J502
2495B111o58j933j137K67J458J615l36j733j500M82J967J147m79j975j394N91
2511a507J866J138j05k268q59L16J987J071n40j584j063L73J342J479j62j878
$$ y = [2068, 1429, -1039, -2344, -1213, 598, 2253, 1335, -998, -2015, -1519, 1015, 2618, 1093, -987, -2143, -1104, 1198, 2050, 1425, -935, -2254, -1125, 558, 2047, 1640, -1105, -2156, -1157, 660, 2436, 1149, -1021, -2205, -1680, 1225, 2373, 1067, -610, -2316, -1214, 1102, 1872, 1352, -578, -2344, -1147, 558, 1803, 1488, -621, -1966, -1294, 591, 2250, 1031, -770, -1891, -1622, 877, 1907, 1371, -612, -2267, -1367, 787, 1952, 1340, -568, -2047, -827, 706, 1938, 1173, -911, -1540, -1385, 415, 1879, 1175, -501, -1860, -1429, 776, 1817, 1279, -374, -2131, -1197, 713, 1998, 1585, -631, -1792, -1321, 609, 2111, 1453, -480, -1617, -1350, 108, 1723, 1387, -346, -1846, -1364, 603, 1750, 1271, -704, -2098, -1507, 359, 1497, 1392, -876, -1735, -1419, 568, 1639, 1099, -485, -1548, -1175, 167, 1646, 1484, -394]
2527c94j191L61J433J545k83j590j864O68J584J574l96j973j052M20J526J507
2543A875m94j749j155O1J777J492n58j591j212R4K104J053j72j733j470L32J777
2560D31J176j89j805j367K03J640J329n2j390j641K37J624J412k19j651j192K02
2577a252J606J349j45j588j573R1J731J343l3j714j245J3J750J109j99j302j445
2594a504K87J587J150j64j502j256k6J339J532J90j764j370O4J545J257k33j033
2611I9j562J81J402J118J56j342j434J63J059J539J1j645r12j56J529J264j79
2628A291j144j340l88J400J571L61j903j293L57J119J420J27j483j293j53J286
2644f5J418k97j052j441k00J706R04M33j303j619L98Q46J549J00j420j227L3O67
$$ y = [-394, -1585, -1224, 209, 1754, 1471, -119, -1983, -1315, 269, 1843, 1447, -526, -1578, -1158, 368, 1875, 1381, -368, -1523, -1462, 315, 1807, 1249, -342, -1554, -1460, 644, 1697, 1525, -208, -1678, -1346, 431, 1607, 1418, -387, -1754, -1551, 89, 1418, 1366, -24, -1665, -1428, 196, 1608, 1389, -262, -1454, -1252, 354, 1703, 1558, -30, -1603, -1512, 219, 1562, 1529, -185, -1430, -1417, 333, 1442, 1243, -59, -1504, -1217, 370, 1520, 1356, -146, -1402, -1428, -89, 1443, 1633, -131, -1501, -1437, 108, 1365, 1132, 99, -1463, -1282, 120, 1238, 1394, 52, -1382, -1219, -160, 1379, 1390, -255, -1167, -1323, 206, 1470, 1291, 147, -1193, -1581, -181, 1390, 1751, -152, -1445, -1088, 31, 1451, 1578, 95, -1198, -1351, -65, 1353, 1056, 4, -1437, -1637, 69, 973, 1406, 103, -1516, -1118, -272, 1277, 1377, -43, -1270, -1237, -570]
2662e70J598J39q78j576J29J162J103K38j093j596K06Q46J216L42j349j013k31
2679a327R14J904k65j361q67m11J475R65L30q98j775j79J435J304M0j318j319
2696a353K04P61J670m5j015j051r54J449J745j95j035j491p5J225J120K64j222
2713Bj268J72N31J915K31j440j013m15J078J358K0r75j129n10R47J566L35j011
2731C94j231o11J150J507O5j297r71o4O80J392L56j193j232j98J097J179Q8p47
2749C64j308k62R37J260K29j075r00l91Q07J317J80q36j210m97P90J378M18q10
2767C91j318n86J238J118N28r67r07o68R94J147J22q69j144j94J067R03J86o02
2785D39j519j29P42J323L24o22j100n48O29J342J80o70j304m74J121J093L06o12
$$ y = [-570, 1028, 1167, 289, -1287, -1158, 4, 1107, 1345, 252, -1344, -1138, -292, 924, 1266, -83, -1096, -1327, -413, 1491, 1226, -135, -1002, -1413, 62, 1027, 1357, 459, -1316, -1495, -60, 1244, 1284, -34, -1353, -1149, -388, 1282, 1237, 222, -829, -1783, -334, 1411, 1216, 181, -1310, -1385, -160, 960, 1224, 2, -1266, -1094, -563, 1352, 1583, 143, -870, -1285, -207, 1151, 1171, 196, -933, -1443, -496, 1070, 1405, 394, -837, -1448, -298, 1209, 1274, -23, -994, -1058, -378, 1014, 1370, 177, -1055, -1253, -156, 1023, 1111, 364, -944, -1206, -269, 991, 1220, 145, -755, -1146, -339, 978, 1158, 322, -888, -1385, -595, 783, 1201, 391, -927, -1513, -275, 843, 1371, 404, -503, -1171, -177, 970, 1092, 223, -921, -1115, -48, 855, 1041, 439, -1080, -1209, -467, 856, 1180, 558, -542, -1090, -461, 881, 1061, 391, -913, -1387, -266, 827, 1133, 521]
2803E21j335m13O10J505L40q73j009n07O35J090M22p66j071l21Q24J025K82m88
2821D71j016n26N94J179M00p57j186m46R81Q30N73p85j032n33P51J219L31k89
2839G59j732J2O77O98N95o55j264l05P73J471m7o43p39p78Q90J234m6k18j308
2858f26l29O01J069L56n35j127l01N12J073M36p36p74n16K86J355J72m52q47q10
2877a193O60J137M22n74j241k64P30P03O72n99j073m87L45J295M82q82p30m37
2895a034M00J322J61j85j009o34M74J307L58o28r63n03K03J309L79p47o06n36
2913i32P03P73P36q80q32p57O33J073L72j87j213m06L74P62P96o86j114j04J60
2932g29J425J44l79p56o01L91J147L97n68r14m82L74J055L67n9j390k29K91R73
$$ y = [521, -814, -1227, -617, 888, 1228, 355, -654, -1161, -526, 564, 986, 220, -851, -1172, -348, 677, 959, 471, -545, -1071, -477, 702, 1102, 345, -841, -1287, -306, 524, 1097, 312, -720, -1253, -502, 717, 1048, 759, -973, -961, -284, 414, 1009, 354, -910, -1215, -442, 1029, 982, 339, -400, -1178, -288, 946, 900, 682, -626, -955, -354, 715, 1071, 536, -591, -892, -380, 693, 1129, 393, -381, -897, -611, 744, 916, 464, -383, -1193, -533, 604, 1026, 452, -789, -1053, -323, 380, 1052, 453, -620, -1107, -762, 533, 1015, 133, -597, -1034, -634, 688, 849, 664, -345, -979, -505, 802, 1160, 532, -431, -934, -731, 578, 957, 210, -396, -932, -229, 544, 1280, 400, -432, -1189, -556, 517, 889, 702, -511, -917, -543, 219, 1015, 329, -785, -889, -729, 696, 840, 461, -295, -896, -505, 642, 1039, 471, -443, -925, -551, 504, 871, 812, -578, -807, -516, 457]
2951D57O22l55j382j04L23P77M23j65r95n32L39J050P66q88n55o73M20P10P46
2970I84l76q36p33K91J260L32l84p02q24O00R34K32n12p29n83M98R27L47k37p81
2990b92o59L68P13O90o3j205l68L51O31Q60m51p87n24J3Q13O84j58q97o71J39
3010h13J128O48o61p62q9K3Q69L35Lr16n45Q9R44M60j17q47p66O53P31L36Q6q78
3032h9j072P32O80L18rq64p25L77R33L31j7q03m83J71Q86L02O8r48p85K90R58
3053B51N84m65m97p01M37N22N66l3j113l51J57Q20O15k15n86p61K33N48O42K37
3073H90j201k53Q3N76N73p0q04l21k49R54O09k19q44n06K08N52P44k01l91r65
3093h35J52N47Q30J86r54n52O1N73P94k64p38m89p3Q29N86j9n77o63J38Q16L18
$$ y = [457, 1079, 724, -658, -762, -439, 338, 761, 596, -399, -931, -592, 458, 1224, 336, -219, -892, -472, 238, 984, 608, -228, -961, -670, 590, 922, 538, -164, -988, -388, 546, 778, 266, -463, -1046, -548, 379, 726, 489, -292, -951, -583, 130, 820, 757, -448, -816, -465, 166, 1026, 575, -212, -736, -723, 90, 774, 616, -281, -952, -813, 315, 963, 302, -460, -549, -526, 343, 678, 681, -235, -780, -691, 253, 713, 596, -251, -1017, -364, 367, 703, 789, -89, -1161, -429, 251, 569, 560, -304, -1029, -652, 281, 612, 595, -208, -691, -520, 366, 668, 736, -212, -997, -707, 251, 835, 370, -127, -828, -391, 131, 697, 664, -449, -800, -643, 177, 792, 577, -9, -770, -537, 11, 653, 890, -311, -564, -481, 95, 668, 598, -206, -527, -776, 178, 787, 568, -276, -782, -574, -22, 722, 521, 130, -835, -683, -136, 694, 880, -74, -626, -565, 8, 802, 538, -200, -689, -762, 67, 653, 634, 57, -606, -468, 348, 666]
3114F66L7q77n17L06M86P23n09n30o35K64P01L40r2o00l35l90J062K89K46r50
3134c15n71K41P47N93j23q88j29m9M50O50on07n20r4O73L77L7p18p45L43M95Q22
3156G63J07r86m88K14J6J082j44n32o09r6N84P30K48q65n87kN13N39J54q02l18
3177d79k23N40O91o4m70o21j9O28O09k8o66k56p4K40Q02j98l60o76l8Q15L92j93
3199C52l80l82n2M10N39P7m20q07J08N87M28O8o01l67j28L04J011j16m65n20j58
3220e12O58L33P7m45p35M28j55J131j98p98k58l1N35M04k7k77o07l7L26N05J92
3241E09k56q99J16M32K81L73n55n25J10K68N33M17q87j99l76N19O57J37n68m78
3261c91l33N90N58K49n27o25m8K12P50J90o36n38K54J14Q34k11l79l98j85P48
$$ y = [666, 703, -174, -691, -385, 101, 824, 315, -215, -850, -586, 115, 455, 363, -237, -572, -962, 100, 389, 635, -315, -886, -645, 102, 695, 572, -316, -445, -494, -44, 606, 600, 93, -427, -521, 152, 529, 566, -152, -897, -554, -59, 763, 870, -116, -604, -390, -374, 708, 564, 32, -577, -673, -89, 641, 889, 24, -563, -565, -52, 487, 641, -161, -479, -702, -162, 529, 465, -5, -626, -645, -17, 592, 564, -102, -358, -432, -192, 610, 412, 52, -624, -662, 153, 545, 352, -28, -410, -462, -52, 487, 564, 144, -663, -555, 32, 460, 528, -73, -440, -568, -264, 747, 631, 166, -354, -512, 146, 479, 556, 111, -624, -196, -351, 780, 582, -216, -474, -505, 30, 434, 407, 130, -477, -514, -188, 317, 509, 253, -646, -530, -98, 183, 556, 1, -524, -414, -146, 387, 804, -83, -282, -658, -139, 518, 655, 87, -391, -724, -134, 424, 673, 146, -479, -527, -315, 435, 625, -11, -549, -295, -181, 653, 442, 63, -335, -520, 228]
3281B28J41M6k67n75l66O56L74L34m84m53j94K51Q96m0n66m71Q2L97M61j56j34
3302A60l16l61M07O87j50m84l85n7L20L73J73r0q61J00J74P73J61p30k38j66M80
3323c0N39k5n83k75m56Q36K57J22j61n70j47M83M62J44m14n07j21K65M46K17k63
3344B19n38r8R2O97R7j94o78k82L93O41J48l74n05j43L04M26M46k35o44l41L95
3365a74L78L05m56j86m05N19N16k49k40j97m58O04R5L70m51k36J58j7M22p1j26
3386A01l69j7L5N12n9j89k92k73L59J81N03k69n48l01O15K12L89n89l47nJ58O37
3408D44q9j40r1n41N94L24k04l11j56l67K36M48O00n72l78j55K54N37o4l24l72
3429c27K19M7N31J33n09l70k63L20M63J01k22n03j26L07O06l27J64o43n7K63K89
$$ y = [228, 369, 415, 148, -427, -793, -137, 237, 571, 87, -366, -560, -309, 587, 547, -19, -490, -408, -11, 450, 294, 160, -156, -517, -110, 577, 427, -57, -442, -499, -179, 194, 367, 277, -584, -484, -310, 463, 624, -106, -344, -510, -30, 509, 484, -99, -374, -830, 6, 263, 385, 224, -346, -493, -10, 452, 596, 182, -325, -446, -181, 265, 482, 219, -319, -417, -325, 372, 469, 275, -403, -685, -292, 349, 497, 123, -382, -525, -221, 205, 651, 416, -228, -569, -174, 204, 509, 53, -133, -538, -19, 497, 248, 8, -189, -647, -43, 52, 422, -29, -265, -107, -124, 298, 227, 101, -268, -285, -250, 262, 203, 14, -278, -551, -192, -11, 492, 223, -325, -626, -11, 201, 590, 1, -346, -351, -193, 444, 355, 215, 124, -417, 177, 501, 297, -14, -170, -537, -301, 147, 747, 175, -203, -358, -104, 433, 369, 45, -327, -108, -61, 470, 603, 94, -276, -539, -219, 244, 345, 123, -380, -506, -199, 407, 80, 244, -399, -456, -193, 96]
3450I6K75mo73r5M8O18L1k48k56j32J05K56O67n23l33n07L27O23K38j42m91l26
3472d46J60L12Q4M7m76j19J70L36L48j71m94p5n8O66J09m68k65P3P4M87j00J51
3494C45n08m31O95J96j6j85j37n17M32L79p0L5k90k24J76L32K18k0l02o14L84
3515a22l1N41l49k30j57J32M40J92l11l33j26R2N65J77m92j94m6L2M11nN7m47
3537b04mOL86mJ55p85K30N3K20L96l82k90j72K48J98K46Q7o08n02O31L10J30j53
3560A92l15k21K28M16J62k99k89j24R3L08L91l12l33j91j5L17L91k64k40k58J41
3581b22M49M9J10m15j56L4L64K44m61j8o32N07L40R2k86J10k76q0K18L59j31l52
3603a53j68K6N21L77m31j54k40k19O86m4j55k70k48O3N09J53k6m31J36M2J27P7
$$ y = [96, 371, 367, -306, -401, -353, 265, 296, 48, -208, -340, -235, 21, 688, 165, -168, -675, -348, 275, 513, 371, -120, -446, -286, 26, 110, 157, -319, -438, -268, 68, 416, 245, -249, -324, -382, 284, 393, -75, -340, -267, -193, 294, 194, 345, -163, -594, 101, 297, 281, 96, -41, -558, -126, 253, 183, 218, -72, -296, -120, 212, 430, 410, 108, -506, -122, -153, 388, 39, -191, -348, -216, 224, 416, 105, -228, -354, -262, 303, 480, -12, -206, -252, -220, 191, 186, 243, -204, -208, -202, 184, 180, 335, -450, -220, -167, 53, 449, 67, -223, -395, -147, 51, 297, 384, -224, -726, -95, 215, 345, 192, -123, -344, -116, 300, 462, 163, -126, -250, -157, 151, 542, 230, -103, -294, -309, 8, 399, 135, -105, -363, -222, 227, 276, 386, -29, -185, -151, 213, 457, -4, -22, -654, -147, 193, 285, -1, 109, -167, -247, -29, 330, 199, -153, -321, -295, 226, 603, 172, 18, -222, -441, 245, 201, 46, -224, -472, -409, 100, 253, 227, -204, -68, -26, 101, 178]
3625A78J04k00l42K34K27K03j98k90n00K56M75J56n6j36m50J82K33J65l31J61
3645G1k31o2L80L28j82l56k12n2J03K14P7K7l50J62J7M49l66j49l62N37J75j63
3667E5L89o81nQ5J08K34K0k89k43L7N08J15j80j76l11J16M09J91q5m76q4J16N0
3690i7L31j61k5j47k2K90J43k23j3m77K05q4L68J78m45n7J41L53po8k8j33l18
3713b96M74J38j36l15q7l11O87J74j60k25k81J4K98K34J20m36O6J05j83M61k84
3734E7p7j90J49J18RJ94l6o24M29J44J28q1l21j04k53O82J91k45l77J2P7K79J25
3757B86l6k48k58r9M64J78Jl57o7m6L66K49m33q4l16J84L72L25k83l21k02O3L99
3780A37L88m72j10Jk23M00J93j17k39l06K67J89O5O7k50j22p6L1L27Rj71l33K1
$$ y = [178, 282, 82, -260, -26, 201, 404, 206, -84, -584, -328, 147, 303, 247, 111, -339, -157, 76, 241, -90, 71, -160, -222, 158, 486, 304, -52, -264, -316, -213, 1, 78, 105, -245, -83, -66, 383, 17, -132, -494, 43, 218, 55, 444, -237, -242, -157, -49, 185, 205, -84, -327, -290, 218, 333, 153, -23, -334, -218, 191, 382, 297, -179, -263, -147, -97, 234, 73, 48, -99, -121, 169, 312, 89, 76, -401, -196, -280, 88, 266, -179, -236, -95, 258, 251, 183, 155, 22, -296, 178, 316, 180, -135, -222, -533, 154, 328, 168, -57, -338, -324, -26, 208, 328, -108, -42, 63, -120, 341, 57, -20, -210, -61, 57, 66, 260, 224, -400, 29, 173, 301, 220, -101, -205, -458, 224, 415, 170, -207, -195, -118, 161, 286, 250, 2, -256, -355, 109, 287, 288, -69, -136, -182, 184, 433, 0, -84, -400, -216, 156, 481, 198, -123, -325, -262, 137, 525, 53, -57, -56, -279, 121, 314, 197, -42, -348, -81, 108, 173, 240, -10, -132, -208, -177, 150, 159, -12, -345, -324]
3803c24L65l8K28j45m35P7M32j22R2k78j22K2K87J67P4m43j50R7L54K6O9k68m02
3826d37L29J23L76l78k27k53J95L66j0J0k04r0pQ5K71J77m14j94JJ20N75k59k16
3849f1M8k93K18L20nm18kJ27m2K17J97m00j1K13l7K40j05k89j10n9L12o3K01j86
3873A2l95J94K71K95m00M9k66K68j84J26M63l31l39o2K23L16J0j69j95j18K20
3894a2J35J10j66j78r3J91L64j84o7j60k09K78J03J42m95M6J9L00L7L6j10k18
3916a31k25K59L02k05K62n77K25j8M84l05j69k08J60OJ62L65n10l0j07J61K41
3937A42j32J74k74q8J1L29q5J19m05L0J67M6K39j22q2k60K62Q6k06R3n8j27N9
3960h2K29m8j65K8P0j66M68j56l32M5J3M9K80O7l95r5J57K04J81k42L6m15M9K33
$$ y = [-324, 41, 3, 231, 86, -349, -272, 160, 38, 130, -148, -270, -248, 39, 206, 280, -163, -313, -216, 138, 164, 233, -35, -437, -108, 15, 391, 13, -214, -467, -272, 94, 84, 94, -110, -200, -207, -122, 149, 326, -88, -282, -281, -161, 414, 155, -61, -13, -306, -88, 232, 227, -191, -193, -66, -108, 109, 306, -94, -105, 108, 71, 311, 206, -83, -193, -252, 60, -3, 198, 12, -383, -189, 82, 377, -23, 26, -240, 28, -156, -30, 433, 102, -237, -299, -76, 240, 250, 81, -114, -232, -12, 123, 233, 67, -111, -204, -13, 351, 167, 100, -60, -269, 9, 112, 254, -241, -195, -176, 124, 161, 197, 87, -131, -356, -97, 205, 0, 262, -315, -90, -108, 376, 71, -98, -306, -146, -140, 22, 387, -123, -153, -260, -99, 142, 10, 184, -90, -178, -167, 162, 77, 196, -209, -179, -12, 34, 273, 151, 69, -191, 71, 157, -49, 44, -14, -141, -82, 147, 99, -66, -38, 32, -134, 334, 178, -154, -109, -96, -47, 233, 300, -95, -190, -33, 171, 352, 110, 146, -269, -220, 13]
3984A3J04O8n8l49j01J35L90J2l13j58q2K72J39J58l22l6Q3P4J44N0l89J6p6M76
4008B50l4j86l1j27J22n7J34j11P9k03J76PK09p8n4l39P9L90J20j79j45k66J8
4031b26M27J41m7j17k34l6J72J55k75Q3j89k90N28q4o7O7p1k86N19j47K76m19
4053a20q7J76o9L89j74P8m45j69M79K19k55l1l49J67O7j1K66k62K43j16l7J20
4075G9J86l54L6n1J01j05R4j34qj76K94O0N8k76J98kk08K42J63k31P6j52r9L30
4099A21n1O5l45k24M05j29K03j6l15J38J75R7j85NJ06l57J19K39P6q9J99n83J64
4122a82K87J6q9k04J50R3K27k01J73o32J65K62O1j4j35J43l53K66M0j3j05J88
4144A43o45N09l7K08k54JK06j11j3J04L8j71k43L35M3o8k55J34MJl9J94k49N7
$$ y = [13, 117, 185, 127, -222, -323, -188, 202, 214, -99, -257, -339, -67, 72, 230, -92, -128, -45, 29, 173, 223, -166, -150, -226, 250, 216, 30, -1, -128, -6, -63, 71, -40, 39, -164, 12, 19, 228, 150, 96, -243, -164, 226, 346, 167, 22, -244, -226, 201, 342, 295, 178, -56, -92, 80, 235, -40, 43, -146, -436, 92, 8, -59, 8, -63, -349, 170, 23, 299, -120, -207, -31, -100, 289, 115, 193, -252, -421, 58, 277, 22, -9, -358, -191, -124, -135, 131, -131, 112, -4, -41, 79, 265, -89, -53, -104, -3, -108, -14, -148, -156, -332, -38, 22, 80, -196, 2, 0, -208, 34, 197, -34, 42, -110, -209, 121, 70, 135, -210, -434, -29, -158, 45, 29, -286, -148, 27, 124, -61, -56, 50, -307, -188, 51, 127, 38, 237, -346, -182, 105, 121, 32, -172, -22, 71, 298, 97, 270, -362, -197, 65, 126, 112, -23, 120, -233, 33, 73, 60, -45, 143, -502, 7, -30, 178, -76, -75, 131, 20, 7, 111, 149, -22, -265, 70, 113, 45, -210, -76, -72, -71, -110, 84, -165, -108]
4168a08l74N05J77n0l36k02K53K6Q4j2K10j47k21K83m5J47p7l38K55K39q4J54
4190C39m81J01m4P3P0K37m5l04k38L17p9j33J69q2rN5P0J73j23j74m0J93k69K38
4214A4j16K21j60P9J9R2Q7m10N9Q8J06J41J24m24J35j03lL12k81k39L79j46O4
4237C8J47j85j0k55K95j37Q1pn9o8K93j30j57J09K06n96K77K28oj54K89q7k4J99
4261B87p9j64n2p2J20K67j32%l38J12r2K32j36%Q6l02K14j5J29J42l37J08K3K59
4285B60rm11N8j69L77nnk94K11O5J42m4J5m16J29J07J84l49L77k52j01j46J49
4308a27J21K1j55p3O7K42k08J1K27l91J48Q5RK30l15k32J89J75J27l6K61l68k11
4331b03M45k13N1J16k95j13K53J50M3k23j38O7J96j67K31O8m52j9J98M59l49j33
$$ y = [-108, -482, 23, 200, 150, -186, -388, -135, -109, -25, -37, 173, 26, -195, 88, 43, 190, 113, -225, 30, 269, 185, 339, -142, -41, -85, -12, 58, 295, 250, -54, -292, 25, -54, -187, -18, -100, -109, -54, 16, 189, 66, -108, -148, 45, -224, 14, -102, 119, -41, 38, 57, 149, 236, -174, -115, -27, 79, 220, 344, -80, 55, -48, -51, 261, -20, -259, 120, -26, 38, 185, 0, -10, -265, 30, -107, -26, -33, -92, -160, 133, 3, -154, -45, 161, -435, -158, 70, 64, -90, 199, 112, 88, 287, 208, 44, -8, -80, 40, 307, 175, 175, -163, -51, -143, 89, -47, -47, 39, -263, -49, -64, 65, 207, -130, -22, 1, 260, 251, -160, -102, -271, 106, 101, 96, -198, 13, 78, 220, 176, 191, -225, -96, 11, 195, -154, 223, -29, -130, -276, -127, -6, 15, -140, -213, -146, 96, -112, -101, 126, -265, -117, -32, -23, 207, -108, -340, -151, 24, 151, 115, 376, 8, -203, 242, 29, 80, 196, -99, -212, 41, 191, 234, 11, -127, -60, 136, -31, 200, 268, -184, -203, -5, 454, 105, -28]
4353b8m8k79M10j21K43l34J49m7J43r7K87k52l52L06m3K21k38P5n3R6m8k17L77
4376A50M2m37P4P2K93J58k91o8k81L40j9K81k53j21O4J21L0j36Q7k08j81K37k6
4399g2L46k55q7J98j09K1J16l3l31K07q3J76Lj45p6K52l26K61J49k70J74l78J32
4422a30K08J76k90k00J00J11J19J0n5j94%l6N07j13p3k08p0O4K28j64O6j13k5
4445h2k4K52k02p7R8j15J62j87L87l04O4j19M9ON2l5j8O8m1L27k83J32k17K3K18
4470A34j25J60j87Q1k72L6M41k53R7k33j36K02J52j71J84k99K85j68qK15k11L45
4492B69k74j20K22n2Nk25o4L63j89J21L7j92Q6q2Q7J07qj92m3J59L31k66R6k25
4516d9j62K05j0j28K26l05K47j62Q3J96j08j76n8K62l87N80j76j88k3O3P7J12
$$ y = [-28, -76, -355, 55, -66, 177, -157, -8, -55, 88, -9, 278, 26, -326, -20, -63, 158, -80, -5, -58, 38, -10, -227, 150, 192, -245, -171, -99, 194, 352, 61, -7, -288, 52, 33, 314, 61, -60, 4, 125, 155, 19, 106, -102, -283, -46, -72, 274, 19, -68, 130, 21, 42, 158, 125, -206, 1, -82, 94, 97, -48, -124, 128, -198, 63, 212, -58, 116, -262, -130, 78, 254, -36, -236, -136, -25, 94, 104, 49, -145, -145, -181, 326, 213, 140, -68, -138, -74, 154, -10, 56, -57, -82, -106, 146, -56, -133, -35, -150, 12, -175, 212, -92, -28, -147, -98, -92, -40, -75, -93, -25, -66, 261, -22, 110, -107, -84, 134, 9, 169, -18, 63, -209, -173, 268, 15, 112, -121, -257, -55, 97, -74, 110, -189, 96, -72, -80, 135, -76, 269, -5, -125, 97, 45, 50, -175, -239, 124, -65, 56, 93, -99, -13, -95, -8, 99, 91, -101, -144, 15, 346, 80, 176, -49, -211, -6, -16, -144, 82, -223, 24, -138, -55, 141, 33, -143, -201, 61, -326, 254, 78, -110, -133, -70, 7, 119]
4538A19o3l18K24K72k60J78k72K2LK38J62o8l45J10j88R3L3L24j48k86JJ83J06
4561A20%j12k97J54R5J2J31q9o5j78K71P7l3P6k01rm6Q5J10K08l92k01K01K62
4585A79o1k23N4p9K33K93q3m51p6K21l8J07J58l16k5P4J8J73Q0j39j35o0N0J97
4609A51j34J16k22J31K7J8o8n7K20k47n3n8L67l7l67lP0J67k1K3k78nK21K34R7
4634B92r5l48p8K5L26m5j61J67l19K41O9K86j55k92J49l4J64q6j57k5L9L7Kk8
4658b6O9j29k7J56n3K5J48j28l27K13L58q2P4l01r2P8J06K11k39k31L60j57k31
4681b25M31o5j77j85O20j85J6k72j41oJ03K46j27l3p9l8j78M46k23M24n06K6K13
4704H5K8J96l18j94mM4J45K35j33n9N3n5J15J01r3j77J3j06J16j14J96O8l06R3
$$ y = [119, 56, -262, -38, 234, -26, 152, -120, -98, -95, 143, 305, 237, -108, 2, -186, -93, -60, 264, 116, -170, -169, 14, 120, 120, 8, -289, -135, -40, -28, 103, 14, -51, -229, 42, 119, 86, 162, -39, -48, -94, -9, 101, 309, -83, -284, -83, 179, 118, -105, -51, -130, 103, 396, 313, -138, -214, 7, -31, 76, 234, -82, -107, -33, -15, 158, 238, 99, -36, -96, -46, 151, 17, 133, -89, 42, 69, 87, 19, -38, 182, -65, -118, -176, 191, 154, -213, -216, -146, 21, 0, 23, -255, -260, -39, 195, 292, 197, -151, -229, -204, 122, 77, -84, 83, -236, 5, 74, 360, 205, -87, 62, 28, 192, 106, -51, -76, -37, 0, 2, -26, 43, -86, -113, 43, -10, 15, 163, 35, -292, -79, 279, 197, 271, -30, -122, -44, 62, 273, 34, -197, 163, 6, -225, 206, 141, -36, -221, 399, 214, 230, -42, -183, -189, -86, 160, 33, 0, -79, -117, -295, 151, -72, 352, -154, -128, 85, 113, 309, -9, -203, -207, -163, -18, 217, 84, 25, 78, 23, 138, 239, 146, -31, -18, -124, -8, -122, 74, 142, -164, -71]
4728g1M4j9J19N4k28J71j32J27o2J34j94J98N2J91k16m26J07P1NK58Ml36l6L00
4752A15J61j64p4m3j11j62J73K60n1q0l72K76J1Q1J0j9j01j83M01j60J49p8J08
4775A47K1j52K54j83k36j7J35L78l75O2m5j70j5M36O2k67M6p0L1j47L37k35L8
4798C5L0j07J17k50K99k34k3K23P6j03J02Q9k48j02K23J73O6k08k44M3l8K83j34
4821F8j00k42K42L00k8j31l37K31KO2J21K0j33p0k86J86J86j4p5k51L49L1P3k2
4845A82l67L4N8J07J75j63J33k74l57M19K53j35k41j28K31J58J21k46M2k11J4
4866a95L20k28O7j87K35lJ97j67j45r7q1L11q5L21n8l65j20R3K76N3k10J07l82
4889c43K34P8J11J03j63j32K66l45K48J6j89N2j84L51l23L85l05M6R8k7P6K17
$$ y = [-71, -27, -46, 73, 127, -101, 70, -62, 65, 3, 137, -57, 141, 193, 384, 168, -258, -151, -80, -75, 183, 187, -149, -185, 115, 276, 112, 38, -5, -116, -278, -105, 155, 104, 24, -348, -72, -61, 20, 30, 11, -90, -273, 128, -32, 117, 39, 147, 168, 16, 270, 87, -149, -166, -31, 347, -28, 34, -11, -181, -196, 240, 302, 35, 81, 11, 42, -105, 232, -3, 35, 65, -42, 75, -175, 124, -110, -133, 90, 166, 63, 165, 254, 6, -96, 127, 300, 366, 158, -86, -43, -81, 202, 68, -32, -274, -32, 268, 240, 109, -228, 3, 5, 67, 188, 208, 75, 5, -281, -95, 91, 77, 2, -249, 100, 131, 204, 182, -185, -151, -93, 14, 189, 26, 159, -115, -472, -53, 200, 65, -176, -304, -73, 85, 206, -40, 2, -209, -195, 125, -103, -36, -223, 12, 9, 206, 39, -106, -203, -284, 27, -58, 263, 205, -160, -280, -187, 89, 142, -68, 39, -343, -109, -31, 80, 183, 20, -112, 154, -191, 57, 73, -116, -64, -248, 103, -220, 165, -140, -94, 4, -23, 53, 270]
4911B70l01o0k21L06L82l45k11K50j01J00J8J65k17j51M9K44m3o7j07k20L42k3
4933E9J2r8J65o9p9k60Q9L78j59O4l24M54k71J40j04j41M2n1K07J19k23j94M09
4956A65J25l15K01k69j98J49M10j71q3R3m94P1L60L6K8k92l9K28J18j97K33l58
4978a99K01q7L42j09M5k17o3j64M11j47J49k50k13K13J15J66j53k01R4l29N04
4999A08k00L22k93Mj65J63J23j10O5k56L13j23K19r7j35j76K11j74L68j6j09j91
5021a49M3R2K51j48Qk54n8J51K21p8J29n21M1K54J56r7q7j67N2O8K81o1j45J4
5045dk34Q5M47K0l39m2l2k4K28R9m07J55j05K8R8J89k71j2kj3J5J66j24M25l46
5070@N2l54L24l48K60pp3K53j79N5J83j45l6K09m4j03m67N28J42l8l7k35j28J25
$$ y = [270, -31, -91, -312, -6, 376, 31, -180, 70, -31, 69, 87, 252, 35, -116, -67, 177, 134, 67, -40, -260, 82, 59, 71, -27, 138, 69, -10, -270, -181, 197, 38, 102, -222, 232, -39, 101, -3, -144, -102, -153, 54, 173, -50, -244, 165, 290, -25, 176, -93, -291, -142, 268, 97, 14, 107, -387, -316, 44, 80, 108, -184, -223, 5, 123, -74, 159, -199, 2, -85, 257, 148, 193, -24, -87, -251, 160, 13, 162, -88, -301, -88, 27, 193, 40, -161, -67, -396, 108, -92, 230, -63, -59, -224, -61, 62, -48, 17, -239, 74, -49, 170, 73, -62, -238, -27, -201, 167, 151, 42, -149, -106, -14, 237, 89, 97, -157, -215, -64, 157, 79, 208, -313, -272, -18, 138, 41, -46, -213, -161, -93, 188, 127, -18, -4, -238, -153, 294, 314, -25, -67, -99, -123, 105, 204, -203, -48, -153, -125, -27, 162, -109, -121, -123, -136, -121, 45, -79, 346, 0, 52, -302, 22, -326, -66, -73, -146, 107, -72, -17, 166, 21, -15, 194, 150, 47, -420, 108, 250, 212, 175, -60, -188, -63]
5094f3j80J28N6J40k86j20M26J94Q0l72k01K08nM4j06J3J14o6Q0j58Q3rj24l75
5118d99M71K79k57q2j41K56o6J73j46m5J8M6o3K62n4k0k78j06J37K07M54j73k49
5141A24k67N1J46J57l42rJ04O1K56j84k05N7m6P1K79O3k03j07r6L51j66k01K94
5164A88l90M2J7L57l4l48K09l05N3L68j22J1k38N9J52l8Q9o5j3K56m12K82j48
5187c0r0K0OJrK57p7l20J43j58K76K15k67j5o4J12N7K76k34m35K60K80j76l8K05
5212A95k91n9L16pk2k8q0j02P8J27m75L44P1o3J37j78j75K52k36K50j12O9L04
5235C15j78j50j40KK53j41j25l4L60l09J88K51k53j34l4q5J20K25k27j70N33k50
5257A7K41L0n16K18j74J7K60j93K45j97l4j27K02L51k27j76j96J1J83L12m36K66
$$ y = [-63, -243, -115, -59, 81, -205, -325, 101, 295, 375, 3, -198, 10, 5, 49, -57, -44, 70, 4, 84, -74, 9, 0, -124, -499, -28, 251, -6, -88, -229, 27, -39, 134, -12, -57, -39, 7, -56, 206, 152, 132, -146, -252, -115, 92, 546, 373, 124, -143, -92, 54, 211, -131, -140, -36, 25, 281, 97, -108, -51, -97, -26, 253, 316, 113, 6, -90, 261, 95, -106, 188, -202, -160, -143, 214, 180, -168, 41, -264, -211, 157, 35, 46, -192, -133, 19, -19, 70, 5, -8, 248, -164, 118, -30, -120, -100, -94, -93, -102, 155, 78, -242, -99, -257, 19, 234, -33, -48, -112, 0, 57, 333, 99, -336, -76, 204, 28, -10, 195, -96, -155, 161, 154, 132, 104, 24, -78, 0, 127, -348, -4, 67, 4, 141, -37, -212, 40, -196, 54, -58, 11, 315, 137, -13, -153, -151, 102, -39, -164, -198, 162, -147, 41, 292, 39, -95, -129, -214, -94, 131, -96, -266, 267, 17, 258, 288, -228, -10, -184, -167, 93, -100, 145, -52, -86, -213, -11, 340, 113, -63, -259, -248, -65, 247, -189, 77]
5279G7K1k38J84K09j03l42P8k9K34P3k29j54k8K93l1K2j22K6J10p7q4L61k59j81
5303a89J30KO7L0N6k89J21N9K28p7j46L7n4K79j33N8J84n81J76k9K40K2j86J62
5327A67n00L08N7Q2o6j68J64KL3J04Jn38J94M56j88oJ43k01j90N5K58m2J94m02
5351h3J02j03L94j10k65k2pj6R3L30m47k7J0J13J13K60k42j76m8K9O7J84J39l28
5375d0N2o7J26J20j15m78K60J44P1J10j82Q7J7k99K00P0j86J3m1Q2l5M30k73l77
5399c11L42L2J56k81L3j22J02M8J79q8j55j08j63K40J04K30m0l07k36J68K73l
5421I3J9j94l56M22K3R0j72K01p0n9k7n9R0n5J0j20J65K4o4P6p4N5P7k13K9o4
5447a53Rj52J83J68j43j23K40oj27L56r0j85L8J39j97M8j5j29J63Rr4K57l1j90
$$ y = [77, 98, -140, 44, 253, 150, -192, -114, -143, 91, 164, -65, -219, -247, 46, 15, 37, -85, -59, 51, -26, -110, 251, -8, -189, -59, -57, 10, 40, 96, -193, -72, -13, 215, 138, -8, 29, -25, 254, 121, 179, 363, -218, -42, -71, 169, 191, 5, 167, -333, -25, 32, 114, 48, -120, 44, 46, 79, 183, 184, -354, -160, 296, 108, 102, 245, 44, -146, -91, 167, 125, 319, -83, 19, -84, 310, 200, -65, -87, -94, -110, -17, 313, -134, -161, -151, -38, 75, 335, 93, -83, -131, -102, -35, 149, 288, -40, 12, -55, 71, 191, 76, -402, -142, 2, 73, 183, 1, 88, 105, -194, 6, 76, -110, -97, -138, -56, -91, 339, 66, -311, 31, 63, 219, -62, -29, -151, -49, -1, 178, 90, -65, -173, -336, -96, 8, 238, 198, -109, -345, -177, 96, 93, 112, -82, -438, -16, 7, 97, -75, 126, 56, -3, -30, -89, 1, -54, -44, -164, 1, 25, -39, 37, -37, 18, 95, -118, -89, -153, -144, -296, -113, 55, -88, -211, 29, 23, -104, 252, 162, -23, 15, 154, -43, 5, -10, -139, 24, 33, -61, 196, 165, -25]
5471b5M5j82L08k56J39m4j97L89K4m0l0O3n35M48q7n0J02l8ql07L86O4o2j00j99
5496a92L52m0j39R4Q9l63K77O5K7p1j58j41N9L01k49K62r5m9m8K01l23L44m7l66
5520b10J46K11k1k1m25J59R7K9J8k94J90P8r9L10J38m83L91l68R9OJ47J73k32
5543C9k50k11N05q6nO4l09K35N1J33j81K7J97m74M91j19r7J2j10L7J8K52N1l15
5567d5j27J34J30pJ6j35j28J89q1N0J26j37j70K34j5O1lq8j09J74j7L00p6k26
5591E0j20J06m9n7J7k6n7J06J0K66j5k56k31K95M8J6L66m61J23k20L38r6m0j73
5615f0j28K41l07J71N2J12l31R8J22J76k7k87K21r3K8K01q7J8k13L0J78n8j41
5638h4P6J7m3J44N9q5K8l06J43K19j26K7o5M6j80J38K36k33n3J9J8J98J7j38j03
$$ y = [-25, 20, -162, 146, -110, 29, -15, -212, 177, 201, 161, 131, 194, -341, 107, 20, -30, 72, 34, 26, -281, 105, 169, 107, 7, -192, 160, 120, -19, 75, 164, -199, 78, 143, 170, 99, -59, -200, -141, 160, -89, 173, 78, 29, -19, 182, -141, 203, 156, -210, -64, 147, 126, 105, -320, -161, -64, -35, -17, -311, -121, -43, -142, 168, 306, -177, 214, -154, -55, -49, 98, 271, 39, -211, -422, 83, -3, -8, 56, -253, -18, 33, 166, -15, 12, 209, -265, 226, 107, 10, 22, -88, -51, -33, 219, 270, -45, -172, -38, 92, 85, 101, -34, -162, 27, -54, -4, 122, -15, -185, 49, 34, 95, 92, 4, -105, 69, 52, 352, 276, 50, -70, 36, -13, -70, -53, -79, -136, -30, -20, 246, 231, -25, -256, 39, 87, 103, 469, 8, 131, -89, 249, 153, 113, -60, -188, 53, -254, -83, -31, 81, -250, -152, -30, 146, 119, -168, 53, -40, -12, 189, 102, 120, -93, -63, 115, 57, -84, -8, 9, -34, 110, 169, 84, 112, -194, -51, 168, 42, 69, 4, 50, -130, 8, 244, 11, -42, -23, -5, 193, 210, 72, -31]
5663c1K10l78K52K54k07j55p7O0j2L11k37L5j77K70j25p3J08k11J41k00K96N0
5685A04l7m7j93K2m9K61P4k11r4K08o6l1J17j76K3Q9l8K61p1r2m9L2JJ99k90L01
5711B48m17j0K54l1J47l1l31K13m32O17R6k66k11r1J57K17j48J87j24Pp2J96l19
5734a44K84j23J13q4n3L25m73J5L10l98J17K38p9N04p85L22k34L53pl2j49l03
5756b83K62j79J15j60J43R0J96k01r8N6o2m8J75J16l7j82j27L14p7n9J88j55j50
5779a63j5J53P7k66J52l7%LJ67q9M5J08J48j82j34R7l7l04J52K7J86L1r8j50J83
5804E4j06L9K15k46LJ16J02O0o7j11j75J16K44j66j54K5P3k00rL22k13J18j72
5827a32K16L62k59l76l9j3J41J48J96k7m70J69j55K94j92J83k43J61J94J09j09
$$ y = [-31, 179, -199, 53, 307, 100, -55, -132, -72, -84, 227, -10, 25, -152, 118, -7, -80, 28, -183, -42, -242, 54, 104, 67, 20, -173, -151, -200, 61, 135, -76, -170, 38, -28, -59, 58, -118, -95, -6, -44, 217, 146, 54, 5, 37, 38, 237, -53, 248, -169, -179, 75, 44, 191, 160, -171, 42, -390, 227, 323, 57, -154, -245, -88, 129, -19, 168, 44, 51, -21, 175, -144, 140, 17, 130, 46, -7, 318, -155, -140, 170, -228, -111, 127, 48, 552, -233, 89, -145, 208, 201, 169, 20, -283, -21, -200, -85, -245, -102, -12, 184, -17, -115, -59, -121, -169, 6, 122, 85, -97, -224, 90, 13, -46, 142, -13, -163, -178, -25, 52, -214, -62, -99, -99, -96, 71, -18, 27, 135, 283, 101, -33, 64, 27, -277, -125, -98, 88, 119, 21, -129, 54, -52, -13, 202, -44, -41, 75, 177, 237, 170, 59, -116, 0, 244, 78, -76, -51, 22, -178, -187, 135, -78, 40, -132, 84, 446, 187, -189, -228, -241, -100, 48, 244, 217, -253, -84, -239, 55, -137, 46, -197, -36, 158, 267, 158]
5848A58j89p5P6nr7K15J0k66Q1J55P6J20l55p0J69M0l6J54q3j70O6ON1K08k02
5873C7k25j48L47J05o2l2jj25J34r1M9P1l4j70k02L38J0J01k44j49K12J63J72
5896B56n06O4M1J91J20J7k15J06N7j24J33k66J4l6M4J74J42l6j56k95p0L20k92
5919c17M24k85j36K47O0K42k44o2q7m1l0L38n2Q0j38j19L55m9K2j19q6O9J24j1
5943A85L6l89Q5l39L43O5J87j46L8J91k45P6P5l18J40r6J83Q9Q8Jk90j61J38%
5967f4P6o0k61NM75j66K65k04j42J74K5J21j55J99l93J2J91j5P9n3j24R3m8O2
5991I2k5o0J40l12j2M82k78J05J18k95j71N36k55j3j69L7J23q5K9m1k27j3L93
6014I9O3k18J0j35J71j66M29j95L9m6J48j62L6p3M9l5k34J09J15L61l09O6k19
$$ y = [158, -31, -106, -30, -35, -132, 83, 93, -173, -92, 63, 139, 259, -96, -166, 3, 43, 7, 161, 78, -92, -26, -20, 31, 239, 37, -188, -336, 11, 116, 54, 22, 21, -104, 30, -61, -12, 59, 25, -145, -347, -9, 1, 102, -142, -291, -79, 84, 256, -250, -186, -145, 46, 166, 183, -32, 74, 131, 7, 140, -126, -112, -148, -104, 70, 212, 176, 20, -275, -345, -25, -317, 107, -178, -314, -67, -7, 235, -9, -71, -158, -199, -229, 109, 57, 137, -1, -120, 235, 186, 208, 89, 3, 72, 196, 185, 221, -168, -83, -422, -79, -14, 173, 27, 65, 256, 11, 87, 162, -156, -16, -112, 71, 160, 248, 249, -41, -202, -64, -64, 12, -48, -309, -304, 171, 5, 270, 66, -76, 98, 123, 244, 89, 288, -105, -93, 98, 83, 162, 109, -15, 78, 30, 92, 67, 7, 147, -165, -177, 305, 27, 132, 250, -45, -216, 320, 65, 52, -117, -80, 43, -42, -13, -54, -281, -294, 99, 162, -56, -46, -181, -10, -176, 253, 58, 97, 51, 199, 37, 73, 0, 49, 14, -220, -111, 4, 365, 56, 122, -97]
6037i7NR1J46j3j68j15q0R6J80L9l79J94J56n2K3J53l27J91k04J48J6l2j06J05
6061c0J52k95J90J05j23L2q5o3L93n09J63J6rJ34j66j37J92J7K3J40P1j24M5l96
6085b64L58o4j26L32j02j04j08K68j52P0j08p8J63j11Q2r7L7j45n1Q1O6K52k85
6108h6k6Q0lJ01P5k23J20l32M2L26j13J10J93n38K53L15j86l20L16j68m7J30j03
6131h4J02j60L2L7N02m54J69j43J16M7J21j91n8j24R4k1J14o9j1j25o1J39K35
6154B07J04m14R7l8j9K82k48k35M00k55K29R8m10J75j42p7K82j91K01j70m3K17
6176E0l7R6J89j31m53M4L60r2j40J94j71P5L32k80j8K1r2j3K1KK53k50N1j46O2
6201g3J14k6J66m82R5L20m19O22r8m47L40ll2j59N5l8q2K31lk03K79k68N7j9J43
$$ y = [-97, -92, -1, 145, 132, -36, -151, -231, -135, 45, 84, -295, -101, 55, 3, 26, 179, -148, 43, -161, -13, 3, -29, -135, -30, 122, -173, 17, 122, -1, 31, -54, -117, 276, -233, -70, -54, -63, 71, -95, -232, -40, -23, 0, 140, 211, 87, 132, -264, 94, 30, -96, 236, 134, 30, -78, 190, 38, 108, 0, -78, 85, -26, 56, -41, -4, -149, -200, -119, -53, 199, -86, -112, -32, -35, 66, 141, -82, 38, -294, -252, 74, -39, 71, 264, -274, -21, 294, 108, -212, 104, -64, -111, 19, -84, 18, -142, -110, -73, 429, -25, 144, 1, 117, 164, 285, 94, 36, -88, 6, -15, 99, 30, 19, -106, -167, -28, 207, 311, -103, -6, -44, -63, 219, -29, -264, 136, -119, 110, 208, -202, -27, -169, -246, 36, -155, 46, -124, -167, 50, 13, 109, 298, 167, -286, -242, 118, 26, -114, 80, -91, -16, 316, 36, 18, 39, -53, -66, -45, -43, 210, -40, 11, -135, -73, 41, 15, 181, -301, -206, 114, -305, 317, 219, -228, 112, 109, 77, -82, -27, -65, -147, 84, 81, -122, 157, -111, -54, -73, 70]
6226G0j17Q5p2J41O1l1L4m77K37k88J92Q7l8j81K65K7J10l3m8j46r5J22MR5o0
6251e6l2Pk1oR2L98m06J12j24j75L21l0k00K30j80L7q9K77Q0l69j55J62K39Mj98
6276h2Q6nlMj19J66R4l13K96j05Nr4j04J96J29lj87J2K1N6n0J24j04K5m15K67
6302a03m3K73k38N7Km8K09j10J50j17j23j65K04K67l2l16R9J74k62K54j67k44
6324b79J54J11n8J08j18J08k34J47j6K12k75K45k38J01l0M5n8Kj14NJ81K45j61
6347H3j40k21L05J25K6K1k12l9oR7n5J87j91N7N1P1j35j4j88L86k60PM1J47k89
6372a46O2NJ9J54J16k33k44J43J6J63J69j30k30R6Q1O7K3k00j3m2j08N17k11n4
6396B0j13j7N1L56k80R5j99J49j9j71O9R5o7rJ65j63qL9L8o8m3O0L18l4l59KK75
$$ y = [70, -47, 38, -34, 107, 168, 137, 171, -306, -69, -357, -165, -78, -116, -297, -32, -5, 105, 72, 24, -122, -217, -95, -91, 4, -56, -88, -81, -102, -108, -16, 382, -24, 88, -36, -211, 110, 80, -120, 110, -70, -33, -122, 155, 235, -134, -289, -127, 112, 116, -82, 4, -1, -4, 0, -119, 47, 141, -172, 124, 19, 24, -70, -174, 22, 151, 148, -39, -27, -6, 50, 0, 124, 20, 45, -370, -103, -146, 127, -111, -54, -52, -100, 109, -1, 149, 32, -91, -256, -52, 215, 183, -133, -34, 140, -122, 132, -35, -279, -125, -14, -72, 36, -82, 26, -208, -61, -77, 135, -140, 105, -133, -32, -62, -17, -75, -73, -187, -182, -1, 244, 83, -57, -278, 27, 152, 178, 199, -13, -52, -58, 39, -16, 171, -20, 37, 88, 159, 24, 10, -178, 208, -52, -45, -4, 143, -146, -84, -79, -60, 94, 210, -23, -267, -124, -108, 55, 224, 94, -136, -40, 41, 108, 131, -69, -82, -124, -232, 285, 74, 20, -93, -110, -59, 297, 17, 112, -87, 62, 43, -128, -59, 36, -31, -40, 125, -38, -46, -7, 31, -37, -80, -20, 298, 264, -95, -93, 182]
6423A82j8q9o1p0ln9L73k06k48J05J6J6J76j07J17l07J69q3K2J73k21K00m15K49
6447h9J03j73J24j22J79O5k07J24j5j93R3L8K04r1L05l47j80N0L30l89L62j14
6469E7k2k2P2M0P6l19L7K46K5j92K9oK0j04J28k9qJ70k26j3L77j96%j41O0N9N6
6496A74j16k74O4R2J22PL12n27J69j2j05J10Q7j39L52m12J91Jk20K03j78j9L15
6519A97k90K20j38J62j31j61P6K82k63PQ5j86K19Jk47k7l1L47k0R9j04q6Q4k04
6543a09P2K53n6j93L2k49L78k48O1k35L33n7k4K94j20o9j09K20L9o6J4j81l6j24
6567a80L62k48P0j34J89k59K56J72K7l62K26k17Q3Q3OL1j94Q5K57r8k88L8L2m4
6591a07J10J3K60l19r3J56j3P2l0p6J18l5J8n4j33J69Lj03J78j50K07l55K06O2
$$ y = [182, 164, 75, 14, -56, -59, -118, 255, 49, -199, -94, -78, -62, 114, 7, 124, -183, -14, -97, -75, 98, -123, 77, -338, -89, 14, -159, -35, -157, 22, 87, -120, 4, -11, -204, -111, -73, 131, 40, 345, -2, -182, -132, 198, -191, 171, 57, 35, 13, 85, 125, 201, -118, -81, 165, 190, -2, 27, 21, 41, -63, 65, 36, 28, 198, -28, -41, 336, 140, 140, -1, 59, 118, 174, 58, -216, -152, -60, 62, 69, 381, -146, 23, 11, -94, 16, 103, -36, 316, -96, 95, 96, -124, 79, -99, -118, 197, -93, 127, -11, 151, 20, -141, -65, 217, -46, -39, 46, -140, 79, 80, -167, -194, -225, 122, 102, 201, 97, 11, 95, -109, -37, 216, 160, -33, -1, -250, 128, -120, -59, -294, 39, -18, -42, 252, 132, 63, -46, 174, 213, 147, 161, -20, -56, -180, 182, -66, 4, -130, 59, -200, 56, 228, 255, -107, 119, -98, -15, 68, 74, 105, -89, -4, 253, 155, -133, -95, -63, -107, 3, 16, 276, -43, -136, 20, 7, 79, 49, -27, 91, 56, 74, 20, -113, 56, 59, -44, 134, -16, 191, -164, 42, 104]
6615A04M7j28J1m4J58j39m0K02nk36j04N2%N12m88K17o5k10J63R4k6K2k05j02
6639b10M37l11O9k63J72J38k18L31Q8r8l68k2K78j2J37j48J6l24L07N9j59J65
6661F4j72J41J12J07r6k06p1NK41k5rk1j04M7l7J07M3j62n2R5r3j00J89p0p6j27
6687b70L36Q3j39j05q3j31O02j76j73M9j25r0J17J18RP0k68M9K88L2%j53j04p7
6711a41K9J12K27l99K0M6J02K41k15l7j90J75K26l41J6J17j83K36J1M7k65J1%
6734a55K10j70K71J58l5k54J62j69KJ11r4j76k21M64j83L15l04P2j02M8M36l65
6756B1k01r4K50L3M0j29m8r7J30lJ30P0l10L81l43J42J06l09L08R4k95l8J11R2
6780D1k70K33n1J55k48KJ7J08j42j1J83K45m67L3N7L21J32l04Q0k38M2j5k10N62
$$ y = [104, 151, 23, 34, -10, 148, 9, -31, 171, 166, -70, -174, -122, -122, 390, -98, 119, 54, -156, 7, 101, 75, 97, -108, -210, 227, -84, -15, -278, -106, 32, -186, 145, 233, 135, -233, -255, 23, 11, 148, 0, 16, -308, -1, 58, -101, 64, -108, 33, 145, 252, 156, -50, -121, -116, 125, 100, 91, 70, -34, 13, -24, 83, 126, -36, -88, 7, -86, -186, 3, -67, -143, -270, 66, 149, 10, -95, -178, -309, 293, 117, -56, -7, -132, -222, -105, 13, 22, 92, -176, -127, 161, 193, 193, 40, -64, -141, -112, 0, 227, -172, -152, -106, -4, 237, 22, -15, -205, -30, 196, -145, -129, -12, -195, 41, 52, 99, -166, -155, -155, 55, -115, 156, 314, 279, 25, 187, 18, 20, 131, 37, -139, -360, 104, -79, 236, -68, 4, -98, -50, 386, 21, -180, -274, -24, 9, 49, -80, -128, -225, -95, -98, 32, 102, -208, 173, -170, -28, 78, -231, 77, 171, -124, -162, -51, 41, -229, 4, -47, 108, -140, -138, -121, -13, -155, -166, 17, 262, -205, -172, -115, 206, 338, 34, 114, -124, -82, -97, -307, 255]
6804B55j86j54o3LJ21K8N1N9l26m3L62Rr9j66J56k3j12M20m72o2J52J19J39j68
6828@j06K9J26j82K75k05K1K37l52O5J05l7p6k7J13pL08n10K99k97K55J16j51
6851aJ31j81k00K1L10l34M04j1k72O9J32l5j77L32j94j06L33k19J55o5J41l6k56
6874e9M1J67l25L97m42n2M90l54K55l3k32Q8P1K8j43k16M09k6k13J89kj14J8P1
6898A3j56M08j93l00L15o9q5L85l04l5L6j09K62j74k4k3J11L5J01j54P1k44J00
6921c3K72l74J37R1k01L65k63j14L81k92L4R6n0r8K34n2J0j35K12j06j17M6J64
6944B07m87K96l9j1J83p7l25N64l70K96%n49M92j35j82K93j33j37J72j34J04J07
6966A35q7k73j9j4M41k04lJ73j15k36K25nR2j79OJ35j11R1k45M9Q9j10L1M74r9
$$ y = [255, 69, -85, -148, -145, -24, 4, 55, 114, -212, -255, 107, 116, 17, -149, 7, -16, -128, 292, -180, -242, -90, 29, 168, 0, -106, -77, 49, -133, 142, -63, -42, 195, -157, -92, 13, -24, -100, -127, -14, -21, 287, -223, 76, -221, 34, 150, -1, 130, -51, -251, -230, 80, -254, 150, 139, -133, -64, 68, 33, -144, 188, -6, -112, 221, 2, 157, 92, 233, 197, -59, -18, 149, -176, 221, -221, -273, 217, -137, 118, 85, -147, -59, 12, 40, -103, -319, 90, 64, -149, 40, 38, -76, -58, 13, -143, 265, 72, -228, 87, 18, -67, 318, 14, -21, 15, -94, 168, -6, -30, -53, 58, 93, 194, 40, 111, -133, -33, 239, -135, 2, 93, -108, 257, -6, -120, 261, -31, 3, 99, 49, -49, 185, 133, 143, 8, 220, 114, -3, 43, 207, -280, 16, -23, -34, 149, 72, -253, 311, -59, 237, 237, -312, 180, 45, -137, 156, 23, -114, 58, -76, 28, 135, 48, -225, -244, -258, 183, -21, -24, 149, 34, -202, 23, 18, 110, -69, -63, 72, -39, 52, -193, -144, -55, -165, -134, 340, 241]
6991B41j27j20J73j67N0Jm1l15L20J28j37Mj04N5N7J13k03n2J27L4j55oK02J8
7015I6n7j81k22N00q9k29P5j6J35J67j2J62l45j88L01l29L92k68J35q2q7K58j67
7038e1P2j60J18K09j05j9j12o5O7O9K10j27J3k2j03O8J79P4j73j64j60J24J26
7061F8o3j15R8M1j17L27j57k95K71k8L7J33k2n5j07m8J74j70J22j51J65l08J73
7084b7N2j5K7j30m0J93q0j9j13m2K17l0J90q1k26P5p6J17kP2J58l35K50j08p6
7109d9K46j83P7p2l3j37P7R3J07l24J01L92k07j55j0R2j25K24k4j68J87l74J39
7132a26K25j00J95j17k88K88j84K21p8o5oq7L9J27J33m3j20o2kRM9L5J35k21J46
7157A03j51m5J5R5k64J53N2P9k0j88M0P9K28j57k18J98j84J56J52K8l5k62K53
$$ y = [241, 114, -6, 167, 0, 50, 51, 10, -305, 15, 143, 6, 10, -94, -39, 18, 131, -72, -124, 3, 37, -118, -124, 78, 96, 39, -142, -364, 136, 47, -182, -107, -123, 12, 179, 167, 329, -16, -204, 97, -232, 160, -108, 27, -55, -142, 116, -51, 21, -139, -21, 188, 83, 64, -48, -113, -46, 23, 233, 106, 119, 97, -6, 62, 241, 315, 142, -22, -182, -58, 68, 5, -110, -12, 29, -88, 239, 82, -213, 58, 30, 67, 200, 178, 123, 16, -32, 142, -28, 94, -57, 108, -200, -27, 25, 10, 37, -93, -133, 60, -20, -39, -152, -194, 23, -7, 183, 102, -124, -49, -125, -8, -10, 62, 220, -115, 135, 27, -49, 197, 14, 91, 19, -14, -151, -74, 19, 126, -198, -97, 295, 88, -67, -77, 15, -110, 114, 90, -78, 109, -265, -126, 99, -1, 194, 77, -211, 77, -107, 114, 36, -29, -35, -122, -83, 44, 177, 134, 14, -48, -50, -41, 8, 43, 178, -43, 103, -48, -93, -78, 17, -247, -94, -42, 37, 17, -171, -131, -52, 176, 19, -199, -1, -185, -29, 123, 151, 116, -146, 107]
7180A07j72K85m15j28L39j61K69l57L86k69M07m30L18j02K0J64j00k4l30M4M02
7201B53j95J02k33J15K25l85l9nM7K63l65K34n5j82J53Q0J72l14L20k69n3K48
7223A17q9J6n8j5p9J88N4j10J58j39j2M5k54K43j18j8k70L09P9jj24K08K01k95
7247C6J65j01n6j4O7N1l17L10j54J67k12j84L16j88L89m92K37l4K75k29J75n27
7269c20K65K11PM5l66k9K05l5K5P1L0j14j49L3L11k92k9J72j71J73r7OP6k3O5
7294G0l95K82N6K05n44N10l10K57j93K9O9k74L09k17K66k9j86J05Q6k85J9J19
7316e1j40K64j84J43Q3p1k37L84q8j34J11oj50K10j46q5K35j83J08j9J39k16P3
7339D0J45l64j52K48K71j16j10K9j18J84k6K32k94J61j36l3nP5l3m0J5j82J67
$$ y = [107, -65, 220, -195, -323, 16, -145, 124, -233, 153, -116, 291, -139, 179, 77, 97, 261, 161, 137, -193, -149, 253, 58, 160, -73, 42, 267, -118, -157, -162, -115, 148, -217, 17, -38, -220, -67, 13, 185, -129, 191, -78, -131, 117, 28, 44, -14, -29, -108, 80, 134, 24, 182, 43, 31, 76, -178, 65, -53, -71, -341, -32, 47, 46, -78, 130, 331, 36, 201, 100, 44, 30, 97, 148, -169, 141, -13, 154, -58, -242, 74, -114, 275, -217, 20, -14, 261, 32, 207, -320, -55, 156, 163, 208, -158, -187, 18, -17, 8, 79, 109, -5, -154, -121, 190, -102, -131, 41, -130, 43, -54, -48, 28, 5, 70, -325, -43, 13, 218, -326, 184, -126, 131, -62, -33, 36, -238, 71, -146, 120, 91, -95, 10, 96, -189, -170, -51, -191, 73, -111, 32, 115, 44, -193, 191, 103, -31, 80, 74, -76, 134, -12, -97, 138, -45, 63, 44, 183, -33, 40, 185, -179, -331, -83, 188, 72, -38, -9, -127, 57, 31, 263, -31, 130, -6, -39, -44, 31, -2, -42, -27, -209, -42]
7362d2J19j77J66l2j79K17j95Q0J63l04L83Mk00J93l81J48qJ03L9r9j28K00m91
7385d21M83N7q8j90K99j71q4K68J15Jn06M1K5K50n0Q3j27k6J69n8Oj89L9J76o0
7410D2j58j06J21K04J76j48l3j43q1KK12m64M76k13l4L8J35j34K94k32J43j2j89
7433a04J30k73K16o7l4J56r5l2M24k59p8k5K37K0k14j72K17p5Q0J5Oj71k6J19
7457eK2Q2J21n18L93j89J16j01K1J41l57M74k15Q5j2k18J98P2k92K56q4j08K58
7480A40k72K21K07l45p5K56m31L63k7Po0k48M03k46K22l44J41J67j33L43l58J27
7502E8k6r2Q2J89j49j69K23l57J53N4K33k81Q1K5m1J35J22l18L9n9J12J12j46
7525b0n7K6M7N2L30l25j85K05j68j0L07r0o1n0l4M5k8K1R5K8j57J7j9K87k85p9
$$ y = [-42, 77, -100, 66, 34, -145, 72, -123, -43, 120, -184, 199, 203, 3, 196, -185, -37, -45, 58, 97, -2, -130, 70, -421, 62, 119, 31, -159, 140, -31, -115, 153, 268, 269, -237, -196, -171, 79, 29, 112, -15, -41, 128, 70, 76, -113, -74, 102, 42, -116, -222, -101, 103, 279, 131, 98, -45, -126, -124, 88, -376, 100, -113, -147, -109, 26, -108, 186, -46, 97, 85, -104, 26, -247, -31, -98, -132, 24, -71, -103, 321, 62, -16, -41, 196, 216, 2, -170, 47, -28, 52, 67, 73, -98, -124, -5, 17, 99, 220, -298, 95, -94, 22, -79, -58, 83, -274, 200, -15, 70, 58, -160, 38, 110, -182, 74, -10, -118, 140, -132, 89, 296, -49, -124, 132, -299, 64, 37, 44, -16, -264, 139, -107, 115, -229, -88, 79, -54, 289, -69, 58, 32, -60, 22, 211, 62, -107, 116, -241, -88, -34, 199, -82, -1, 24, -17, 118, 240, -78, -39, -98, 14, 126, -20, -77, -51, -4, 48, 378, 53, -132, 73, -95, -105, 202, 112, 51, 1, -33, 12, -16, 5, 100, 128, -29, -12, -31, 256, -29, -108]
7551a08k46K42L59l10J30rk42J06r3M52j20k62J71j38J08L8Q9j7l64J93m0K46
7573A85l81K37l02K79J91k68L65k92r2M8J04ll71K87R7j28K2J94J08k91M5k16
7595a82K93k3K64o06Q9L41O4j9k86j6j8L61j43j52j74K74k44O9J26P0j0j31Q2
7618B9K4L21m61R2o0J22RO1k42J66k8p2J5O8J05L0j95k61K49M6J49pM4l30L00
7643A74j07q1J1mpj88J38J76j50J0N2k03J47J51Q4k03j63L21o5J18j56k8qn6p6
7668a13J35k15K25R5l17K26j38J30r4J72k6k50L43J30l60j55L82j00M2k13j1Q2
7690c0K36k38k5L91j70j65M2N5J1q4J47l00J78j79M58l32J48j94J53p0Q9k84Q8
7713g5J15j35K0J06j37J15K61m05J73l05J48j3J93j56J69L6K96m40n0r6J72J30
$$ y = [-108, -354, -112, 247, -63, 67, 58, -184, -78, -171, 281, 161, -101, 70, -68, 40, 78, 167, 150, -214, -21, -61, 185, -196, 41, -261, 18, 209, -59, 306, 14, -78, -30, 74, 71, -300, -13, 84, -44, -22, 172, 280, -11, 34, -182, 111, 88, 352, -254, -165, 176, 240, 221, -65, -81, -99, 262, 119, -33, -207, 67, -177, -108, 18, 88, 78, -53, 29, 53, 374, -87, 5, -55, 67, 76, 137, -105, 61, 33, -39, -24, 44, 149, 179, -16, -277, -28, 18, 167, 160, 204, -126, 174, 67, -14, -3, -7, -14, -202, -64, 112, -38, -28, 24, -179, -32, 119, 203, 0, -163, 158, 93, 211, 55, 27, 19, -37, -113, 22, -193, 32, 127, -190, 36, -102, 28, -66, 106, 80, -170, 173, 303, -57, -212, 170, 70, 112, -101, -112, -30, 206, -32, -57, 334, 164, -1, 41, 96, 107, 23, 170, -130, 48, -131, 327, -5, 143, -51, 102, 32, 121, -163, -75, 40, -95, -75, 31, -106, 9, 270, -135, 38, -267, -119, -132, 61, -95, 74, 110, 406, -34, -84, -180, -8, 122]
7735A22r7j02K88k87J18L21n02K23J02j13M0J17Q1k52k36J57k3l5K41k57J01o1
7757e4r5k9M03l19q3j3K92K5j07j02J54k88J57J46j04J0p3j21K19P1j48J33k08
7780a34q5M55j40k28K25j52m4p8J63o5J98j68k03J48J79r1j64K27l55M98k33K07
7802A60j90j75n4M07j49O8j43NM6J5J44qk79P0J56J48l59K11q6J05k23K90l11
7825a52L04j15m57N48l06L08k7j26j80K41J19j43J10j27n4Q2J63j83J60k63L07
7846B09k82o5K49k25q4J73k1j30PJ97j83J29M7j41J94J28k25K67k75q5J44L2k23
7869a63J48m9J4P1J69J33m20K64j11J10k72K07q7L0k55L53o3Q9j02j83J28p8L49
7892B82p1l76P8JJ40j47J55r1N2j92K71k17J54M5j85K51O5j55J80m42K35j13J72
$$ y = [122, 25, -77, 211, -76, 42, 363, -139, 84, 186, 73, 113, 230, 311, 59, -177, -20, -43, -78, 163, -94, 7, -54, -149, -178, 225, -94, -177, -190, 102, 127, 20, -82, 72, -216, -59, 87, -17, -7, -80, -201, 18, 89, -59, 74, -134, -219, 236, 96, -132, 93, -59, -103, -181, -18, -83, 115, -53, -256, -108, 71, -20, -184, 43, -312, 186, -47, 160, -30, -205, -259, 148, -1, 67, -76, -71, -25, -10, 134, 126, -153, -83, 73, 221, -138, 73, -13, 92, -131, 159, -152, 152, 37, -420, 128, -178, 130, 103, -23, -203, 38, 157, 14, 124, -3, -57, 25, 188, 5, 165, -98, 209, -73, -138, 111, -114, -198, -25, -46, -176, -169, 28, -155, -26, 21, -120, 74, 202, -23, 244, -31, -116, 28, 60, -163, -15, -64, -50, 21, 190, 323, -97, 167, 56, 166, -106, 101, 14, 44, -211, 142, 79, 168, 66, -117, 11, -67, 282, 211, -165, -87, -86, 54, -93, 62, -29, 23, -169, 102, -115, 39, 84, -101, 150, 215, 60, 240, -202, 33, -80, 92]
7915I2J0l87K85J39k19J75j36K45l33j11K18K21j85j91J63L8K5Oj40J48k64J23
7937g8M9J02J81l85K61m23J69J02J59n6k05J31J59j90K25k84J62k18J34K67m0
7958B22j94j38J72M1k8j49J76r1p7k5j16K98K57n96J71L56k05j18K32m28L5J28
7980g7M0O7N3j00QO3n0O2j5k11L8J71l1j00K10j08j7J3j56K03n8M4l04L72k2L8
8006A33q2J61k47j11J51J50J44m23K63k78LJ12j50L6K7R9j46J75Rk73L42r5r6
8029i6J39j33L8k6J1J18j52J58p5K56k31m2K52k15jK0j41M17m51P9q4J92J14j31
8053A6K7j10j6j23L37r7J6o9l53K21O0K00j95K20j23K2O5K1R6m6j23n4Q0j02J81
8078A51k14q5J84k32J53J60m06M72j60m1l57M51J26k14oj38P4P2K0j45K0J6J56
$$ y = [92, 102, -285, 0, 139, -80, 95, -41, 204, -129, -240, -22, 199, 14, -177, -14, 24, 49, 55, -85, 63, -201, -78, -29, 73, 254, -131, 130, -293, -124, -22, 137, 81, -124, 7, 166, -24, 201, -83, 79, -139, -5, 262, 222, 28, -110, 62, 103, 75, -74, 102, 11, -66, -91, -207, 91, 348, -248, -77, 279, 74, -44, 188, -240, -205, -77, -37, 30, 83, -17, -9, 54, 4, 66, 51, -160, -122, 49, 18, -82, 128, 20, 3, 16, -140, 63, 5, 49, -255, 117, 95, 133, 51, 212, -35, -146, 5, 155, 299, -124, 139, -139, -136, -24, -174, -138, -111, -12, -158, 17, 26, -247, 95, 0, -96, 43, -90, -52, -78, -67, 51, -101, 57, -18, 238, 7, -35, 217, 2, 1, 21, -120, 297, -154, -75, -159, 33, 147, 16, 43, -67, -83, -206, 131, 34, 50, -19, -372, -151, -91, 109, -86, 134, 11, 33, 98, 119, 215, 169, 46, -8, 72, -30, 151, -63, -148, 36, -196, -43, 117, -289, 183, 23, -18, -375, 76, 202, -12, -18, -156, -82, -10, 10, -135, -115, -99, 57]
8101E7M7L3rk60P5N8L2k6k1K4P0j46J66j26J11J04r2J6j54J31j57K08j06kq9K71
8127B15j78j84J7j04K50op1Q2l12O0L08PK3j57J2k3J36l5P0k6MK87m22k47J39
8152a55J68K58m14J30qO6l2k16J94o8J2J76J2P6j48O1Q4j59j27M21n34K75J92
8175B64m03J37R4j63J54k41J58p4M02l64%J13k3o6J52k51
$$ y = [57, 104, 137, 128, -132, -57, 1, 33, 7, -14, 10, 80, -66, 100, -26, 85, 189, 97, 113, -41, 90, -67, 141, 35, 33, -56, 215, 37, -147, -130, -234, 16, 10, -61, 21, -291, -231, 77, 84, 107, -50, -38, -61, 75, 40, 110, 84, 88, 375, -47, -294, -155, 13, 271, -143, -13, -21, 45, 13, -203, -9, -77, -65, 111, 123, 199, 51, 112, 196, 37, -90, 331, -203, 72, 264, -139, -2, 92, -71, 83, -158, 0, -74, 328, -36, -36, 77, 54, -12, 140, -111]
8191a11
$$ Imaginary data points
##PAGE= N=2
##DATA TABLE= (X++(I..I)), XYDATA
0@%%%%%%%%%%oJ4j6J6j6K4l2M0m8N6p2Q8j04J20j40J64j92K24k56K91l33L81m33
33b30M92n56O25p03P86q77R81j093J214j348J493j650J823k012K219k446K694
50A412k968L272l605L975m392M860n390O000o705P532q521R729j1242J3193j5822
65h672J9573k5382L5635n8907K04986K0523l57950J29957m6091P4160J50424p4174
77F4082q4265k2953n1912N4277J28031O5445j74989p9940L7912K2436J52472n033
89A05563j36665J6713j15314N5292K46604q0306j24104k3999n1938J02224R8207
100I2277p078p3024r7750Q057M9382R9568N7421j45190p3164K5549L5663J14114
112H5825m851p8530m6430o9915R3437J19870l7237m0220q1111n0423R8650Q7685
$$ y = [0, 0, 0, 0, 0, 0, 0, 0, 0, 0, 0, -6, 8, -8, 8, -8, 16, -16, 24, -24, 32, -40, 48, -56, 64, -76, 88, -104, 120, -136, 155, -178, 203, -230, 262, -294, 331, -372, 414, -463, 518, -575, 639, -709, 784, -866, 957, -1055, 1164, -1282, 1412, -1556, 1716, -1889, 2086, -2306, 2554, -2836, 3164, -3541, 3991, -4530, 5199, -6043, 7150, -8672, 10901, -14481, 21154, -37753, 167233, 187756, -170194, -40237, -86328, -12168, 138256, 64082, -20183, -43136, -95048, -40771, 87260, 152705, -22284, -102224, -64312, -41876, 110596, 105563, -31102, -14389, -129703, -74411, 172193, 91887, -32217, -56216, -108154, -5930, 92277, 85199, 12175, -85575, -77518, -28136, 71432, 128853, -16337, -89501, -63952, -28289, 85825, 80974, 2444, -43986, -113901, -20464, 99406, 62169, 21949, -59162, -109585, -10935, 76750]
124G6750J1463p5336r3961R24O1151R6742J0247j02122l6805j3564K0437J11703
136F7629K0616p1032p4437m6496Q7831R9315j5106n3096p6702k2475P2567O5679
148E4293K4887n5261r0103j0503N2111Q6822K4067q3884n2833j7426L0679J00821
160F3670J6641o4370o7105l4059P1481P2043M315l1084q4318k4418N7237N8890
172C8923M9672n7705r8894k805M8431P9942J9672p1163m5838k6461L6115Q4633
184E4522Q738l4207o9051m1482O6166N8113K2691k8966q7032j6933M0746O4129
196C7434M8053o4687p1247j1550L2195Q1442J4675m9439m7353m0010M3904P0090
208D3507J7845k4857q0621k7364N4371N0485L4473l8181p2983j4901K5809P0173
$$ y = [76750, 88213, 12877, -81084, -80160, -19009, 77733, 87980, -14142, -50947, -64511, -44074, 67629, 88245, 17213, -57224, -103720, -15889, 83426, 68320, 15224, -61478, -83953, -11386, 54293, 79180, 23919, -66184, -76687, -24576, 62246, 86313, 2429, -50404, -67830, -37151, 63670, 80311, 15941, -51164, -85223, -13742, 58301, 62616, 31532, -52786, -77204, -19967, 38923, 88595, 30890, -68004, -70809, -22378, 57564, 77236, 6073, -39765, -66226, -30111, 54522, 63260, 29053, -39998, -81480, -15314, 42799, 65490, 36524, -50508, -67441, -26695, 37434, 85487, 20800, -50447, -61997, -29802, 51640, 66315, 16876, -30477, -70487, -26583, 43507, 61352, 36495, -44126, -71490, -17119, 33366, 67839, 29658, -43325, -58226, -32417, 37756]
220C7756L3949n1453n3036l1341L2146P4546J6006k9029o0734l8893M5212N8841
232C3970K9028l0303p4911j8137L5805N3487L4823l7806n7845k6802K4231O8529
244C4069K7260l4014n6254l6680L6760O1961K3480k5128o3453l0054L4382N5394
256B7723L2397l1223o1080k4117K5702N7121L1752k9379n4800l3325K5513O1819
268B8103K9771k6835n8764l3007L1371N7015K8042k5923n7972k7044K6776N1335
280B2868L1388k2767n5005l0404K1137N4770L4800k3682n7128l2570K5272N6677
292B5356K9548k4443n3409l0379K3372N1881L0378k0304n2446l0530J9039N0885
304A8948L5160k0265n3704l2555J9169N4814L2694k3302n1123l0204K0355M9604
$$ y = [37756, 71705, 20252, -32784, -64125, -31979, 42567, 58573, 29544, -31190, -70083, -24871, 33970, 62998, 32695, -42216, -60353, -24548, 28939, 63762, 25956, -31889, -58691, -34460, 34069, 61329, 27315, -28939, -65619, -28859, 33102, 56582, 31454, -31999, -62053, -27671, 27723, 60120, 28897, -32183, -56300, -30598, 26523, 58275, 28896, -25904, -59229, -33716, 28103, 57874, 31039, -27725, -60732, -29361, 27654, 55696, 29773, -28199, -55243, -28467, 22868, 54256, 31489, -23516, -53920, -32783, 21987, 56787, 33105, -24023, -56593, -31321, 25356, 54904, 30461, -22948, -53327, -29955, 21926, 52304, 32000, -20446, -50976, -31937, 18948, 54108, 33843, -19861, -52416, -33247, 21567, 54261, 30959, -20164, -50368, -30013, 19591]
316A9591K9163j5981m8142l4511J6479N0376L4503j6792n2393l2703J7993N0264
328A7847L2353j8095m8420l1806J5131M9128L2287j5311m7763l3907J5252M8052
340A4748L3667j4449m8797l4040J6129M8129L1509j4854m6668l1585J4703M3341
352A1833L1893r242m5620l5401J1172M6544L6189j3102m7827l3822J3970M7149
364A3736L0708j2978m3647l2195J2855M0651L1909n908m5449l3648R751M1138
376F923L8691r953m8391l1799J1275M4236L1403j1124m0148l3073R522M0127L1448
389C9137l478m3048l5159Q952L9259L8400q927m6269k8420O087L9469L6969j0747
402C2225m0432l1181O817L9508L0225k453l8712l6654Q152L6110L6002k038m5042
$$ y = [19591, 48754, 32773, -15369, -49880, -33401, 16975, 51478, 34686, -17707, -50410, -32417, 17847, 50200, 32105, -16315, -48121, -32990, 16138, 48425, 33114, -14649, -48556, -33304, 14748, 48415, 33966, -14831, -48871, -32742, 15387, 46896, 32042, -14626, -46211, -31508, 11833, 43726, 34484, -11136, -46537, -35365, 11179, 47368, 34266, -13561, -47383, -33413, 13736, 44444, 31466, -12181, -44376, -31521, 9130, 41039, 35131, -10318, -43966, -34215, 6923, 45614, 35661, -12730, -44529, -33254, 10982, 42385, 31261, -8887, -41960, -32438, 7689, 39137, 35659, -7389, -42548, -33596, 5663, 44063, 35136, -11133, -39553, -33466, 6003, 42972, 32225, -8207, -39388, -32571, 6937, 37162, 34709, -4003, -40657, -32505, 3605, 39607, 37569, -7473]
415g473l2351O510L9276L6363j2165l7141k7244J227L7323L1882k623l4473l7373
428c8262M585L6452L4107J316m3316l4610R144L3791L4103k959l8414l1835K870
441c3028L7192L1628l573l2927l5868L548L7552K8874K57l4011l6262N511L2937
454A830L0025K493l4303l3802L99L1127L7670J405l8821l4430K491L6229L2886
467C5199l443l4014l1604L163L3076K6167L009k8061l7823J876L3366K7558L487
480C1956k9327l1987n065K7563M1472J119l6381l0915n523L6750L6374p625k8304
493A07l1434K70L2141K2421R868k6498m2175M850K8894K8582P218l3801k7903
506b7460l535K3751L7862M13k5462l2349j1858L8021K9918J058k3018m1463M401
$$ y = [-7473, -39824, -33314, 5962, 42325, 30160, -6981, -34225, -32998, 4325, 36207, 33584, -889, -38262, -33677, 2775, 36882, 38198, -5118, -39728, -30584, 3207, 37310, 34351, -4063, -35898, -33028, 4164, 35792, 32219, -708, -36576, -33028, 4524, 33398, 33655, -356, -36618, -31107, 1830, 31855, 34348, 45, -33757, -33358, -2231, 35439, 36844, -1977, -36407, -33916, 2313, 35199, 31756, -2258, -33862, -30699, 2377, 28544, 31553, 3492, -34331, -32455, 911, 28469, 31956, 2629, -29358, -34423, -6860, 34612, 35731, -650, -31565, -37088, -338, 36036, 28411, 107, -31327, -31057, 1084, 23505, 33373, 6875, -35300, -30450, -1556, 27026, 34244, 443, -27460, -30995, -7244, 30618, 31031, 5569, -26780, -38638, -617, 29301, 30359, 7341, -34122, -29721]
519b9721K9633K1587J4830l3628l3937O029J7677L4209O173l1139k2720j2321
531c3328K5456L7183O45k0550l7544o402L4996K2365J0184k5524l8536M953J9341
544f761K9986J3709l6458k4344l282J8222L7070o62k1974k3752j5931K6962L1471
557B4256P091k0486l8990k901K6864K6184J2738l0243l0331m76J6721L4757P283
570C2467l0099k3882p369K1565L1032K906j7758k8055j2682K3014K9686J0557
582C1382k0872l4363p644K2593L1140J0352k5843k9544o587J9266L3134P903k5102
595E815k6455p982J8809L1105O479j9227k6514j3230K1815K9870O314j5208l0343
608a8752j1836J9998K7533J4661k0043l2532p943J5509L4320J1811k7435k3155
$$ y = [-29721, -88, 21499, 36329, 2701, -31236, -25207, -7530, 26679, 32852, 1713, -21007, -33328, -7872, 29311, 29956, 9406, -28138, -34540, 456, 22821, 33005, 7481, -31055, -26102, -6761, 23225, 36934, 476, -23868, -27150, -8928, 28142, 27480, 5506, -18246, -34177, -7215, 24256, 31347, 10861, -28129, -31030, -4166, 22018, 34756, 4513, -25818, -26294, -9573, 25184, 32467, 2368, -21514, -28883, -7318, 23714, 26620, 8862, -19193, -31875, -8861, 20825, 31382, 10510, -23853, -31497, -8904, 22236, 32588, 6745, -22799, -29386, -10120, 23014, 30917, 5815, -20640, -28622, -9813, 21292, 27771, 8544, -17970, -31200, -9385, 20485, 26799, 11591, -18752, -30588, -10590, 16943, 31604, 11561, -20971, -28914, -13405, 20915, 32726, 5291, -17864]
620a7864j0136J6115L3187M381j5682k5915j4955K3059K3572J0071j0951l4043
632a9161q274J6210K4796J9456k3230k8157p760J1395L5370P240k0722j8988j8126
645b9951J8592K9695O291r705l2613j2034K3191J9451J5419j5339l1377m846R593
658a3633K8349J5495k1376k1246j5662J4295L3483L751j0561k4281j9462K0732
670a0116K5051J1761j1689l3693o370J5575K0988J6009j6449k3399j1442P511
682a6263L1229J2179j3985k4663j9386J9547K8224O288r644k6847j2730J4761
694a1290K1835J6698j3922k7489r104Q908K5960J5303j4666k3627j4493J1527
706a4360K7214J1908j0644k5747j5444J4839K4235J1833j0208k4424j3631R223
$$ y = [-17864, -28000, -11885, 21302, 25683, 10001, -15914, -30869, -7810, 15762, 25833, 14882, -19161, -27435, -11225, 13571, 33027, 9797, -18360, -26120, -14725, 20645, 27885, 7163, -11825, -29951, -11359, 18336, 24627, 14922, -17691, -29725, -6534, 12917, 28336, 12997, -18380, -23226, -13633, 14716, 30211, 8835, -12411, -28073, -13778, 19705, 23456, 12895, -11386, -30848, -10116, 14935, 26696, 15007, -18686, -25056, -9481, 11507, 27516, 11067, -12332, -23774, -16263, 14966, 27145, 13160, -11503, -30889, -11342, 16882, 23170, 13526, -13321, -26051, -11290, 10545, 27243, 13321, -14168, -23272, -14364, 11596, 26899, 12233, -11394, -25887, -14360, 12854, 24762, 14118, -11629, -27073, -12234, 12001, 23834, 13626, -10798, -24429, -15206]
718a5206K5569J5897j3094k4734j2711R507K5553J4551j2683k3392j2832R450
730a4125K3651J3973r201k3732j5323J0270K4318J3454p789k5485j5579J2367
742a3201K2806J3563q697k4614j2593Q319K2258J5972r738k2006j5308P340K5806
755I907J2884q061k2632j6293J0827K2066J3242n966k5115j3233Q878J9953J6733
768B3190q398k2257j3743M815K4461J5301r370k0295j7470Q752K4133J1468n268
781A5319k1712j5778Q205J9610J6771o326k3564j3476N515K2132J5973q799j9408
794e538j5852N198K3751J3028n278k0420j7042Q215J9714J4407l765k2711j4070
807b0363N374J9441J7646o712k1362j4567M828K1696J4270n822j8363j7236N403
$$ y = [-15206, 10363, 26260, 13166, -11568, -24279, -14772, 10781, 25332, 12649, -10743, -23575, -14125, 9526, 23499, 14298, -9434, -24757, -14487, 9831, 23285, 15496, -9989, -25568, -13201, 9605, 23168, 14471, -10143, -22736, -14417, 7841, 23813, 14075, -7931, -23239, -15899, 9907, 22791, 14730, -7902, -24195, -13368, 8698, 21940, 15974, -9141, -22374, -13496, 6457, 23190, 14792, -7465, -21208, -16393, 8068, 23369, 13999, -6296, -23766, -15014, 9119, 20587, 15319, -6393, -22171, -13966, 5644, 22415, 16089, -7475, -20951, -15436, 6696, 22669, 13870, -5538, -21390, -16192, 7559, 20587, 15309, -5111, -22153, -13938, 5776, 20183, 16418, -6293, -20363, -14989, 4452, 22098, 15386, -5976, -20543, -15715, 5981, 20251, 14429, -3934, -21170, -15767]
820a5767K0970J4345k929k1839j5921O724J8491J6098m627k0486j4537L549J9851
833C922J5768m465j8717j6423M025K0243J4621l131j9630j6211M938J8299J5580
846A8819k479k0320j5129L738J7720J6956l645j8851j5664K466J9813J4918k924
859A5418j7912j6496L646J8223J4699j331j9165j5483L528J6247J6536j537j8854
872b481j4659Q28J7325J7499k812j7548j6559K115J9113J4002p49j7099j7012
885a8037L161J6318J5134J21j8830j4466P78J6357J7886l777j5936j3364k404
898a7059J8362J5899j890j4801j7695J330J6469J5432J427j8966j5838L063J3411
911h56J8001r06j8192j2025k211J6414J6803l578j2371j5725k361J7585J4365
$$ y = [-15767, 5203, 19548, 16619, -5220, -21141, -14417, 4074, 20172, 15545, -4941, -19478, -15929, 3922, 19690, 15225, -3492, -19915, -15890, 4353, 18974, 15843, -3787, -19998, -15060, 3239, 18819, 16340, -3980, -19109, -15371, 2349, 19305, 15660, -3191, -18855, -16389, 3424, 18342, 15418, -2494, -18990, -15344, 2879, 17578, 16247, -2918, -18401, -14873, 1374, 17910, 16373, -2481, -17140, -16312, 1013, 18512, 15700, -1848, -18407, -16292, 2821, 16823, 16074, -1025, -18037, -14876, 1442, 16576, 16697, -2133, -16599, -15821, 536, 18422, 14645, -1291, -14655, -17059, 1303, 17202, 15312, 511, -17184, -15854, 615, 16047, 17474, -1492, -17330, -14267, -856, 17145, 16239, -1953, -13978, -16189, 225, 17028, 13450, 1079, -14646, -17007, 578, 14943]
924A4943J600j5713j7372J938J3385J6678K566k0131j2391j55J2485J8502j067
937A5268j5475j3757k889J7071J4008K24j1891j7974l24J4991J3841L553j5569
950A077j5855qJ1900J8050J303j6446j3281k841J3794J7851r74j3488j5135j766
964a5819J5437J3323J127j1534j5983j560J2738J4203M288j3381j6132k967J2675
977c585J8099K046j5847j4026k858J3666J7654o95j3212j3858k735J4005J3784
990A2438J792j0718j6462j804J2444J2982N527j3063j5545k214R483J7669M311
1003A6840j4795j3277n299J2852J8193k7j1111j5392l744J4244J2475M055j0504
1016D510j8143M18J0267J2935O311j4054j2613l028P806J7633K689j0518j3432
$$ y = [14943, 16543, 830, -16542, -14604, -1219, 15459, 18025, -2106, -14497, -14652, -2167, 16335, 15268, -207, -13964, -16853, 218, 14226, 14450, 2559, -15415, -15739, -748, 13093, 16646, 1077, -14778, -14786, -2886, 15164, 16467, 21, -13260, -16101, -2307, 15544, 14570, 1082, -14053, -15819, -382, 12941, 14068, 2534, -13449, -15009, -2271, 11932, 16220, 2839, -13293, -16260, -3585, 14514, 16560, 713, -13313, -16171, -2505, 15149, 14454, 1242, -12616, -15351, -1346, 12438, 14230, 3512, -12950, -14754, -2310, 10672, 16199, 3136, -12409, -14623, -5140, 12529, 16840, 2045, -11232, -16531, -3679, 14514, 14487, 3376, -12016, -15760, -1516, 10959, 15014, 4510, -13633, -13215, -2948, 9987, 16298, 2244, -10369, -13397, -5591, 12042, 14731, 4213, -9219]
1029i219q619J4194J5844K410r474j7858k049J2800J0890O736j1635j5804j025
1042a2809P440J6092M514j2489j1491o436J0562J5425K055o621j5900o660J3024
1055c294J2759N429r435j7218j763R144J3315O054j1406j2814n029Q494J6290
1068A0526L189r185j3433o008J1222J1900N248p185j6429l947R154J3114P355
1081A5521j0888j4359m269Q486J4975M105q660j3745o046J0438J3031M963q041
1094E511j4997l777P933J2333P198q405j3835n822P084J5812N301q736j4033n795
1108a4228R240J3064N404p873j4197m445P317J2644P730r339j3655m005O079J3573
1122G309O128p454j2182p899P506J4384N618o600j4283n747P303J2985O909q272
$$ y = [-9219, -17838, -3644, 12200, 14610, 5136, -12722, -14771, -1971, 8919, 15655, 4020, -11784, -12809, -5369, 10723, 15237, 2748, -8743, -15179, -4617, 10808, 12863, 6242, -9658, -16318, -3294, 9465, 14894, 5459, -11759, -13522, -4378, 8937, 14991, 3585, -9229, -14258, -5764, 10526, 13715, 4530, -8903, -14911, -3689, 8211, 13459, 6274, -10155, -14102, -4948, 8166, 15521, 4633, -9726, -13995, -5509, 9466, 13571, 4911, -8834, -14880, -4442, 8589, 13552, 5511, -9486, -13263, -5330, 7003, 14201, 5796, -8039, -13861, -6777, 9035, 14336, 5600, -8433, -14228, -4988, 8076, 13480, 5607, -8590, -13035, -5718, 6926, 14656, 5317, -8338, -12343, -6264, 7309, 13437, 5983, -6199, -14098, -6592, 7792, 13410, 6810, -7473, -13220, -5917, 7068, 13977, 5705]
1136E705j2662n385N308J4334O324q074j1957o282O669J2568N839n865j2784o637
1150a2899O397J2265P421o275j3208o565O042J3549O068o468j2035o936O103J2308
1164E767O922n748j3570n677N702J2156P593o867j1913o277M539J3245O180n520
1178F532j1206q683O986J2124N679m144j3373o032N664J0602Q696o081j2071o113
1192a1420L409J3487O794n884j0520q775N779J2609M898k131j3216p927P239R254
1206C596Q381m679j2942m746K380J2036Q526o395r294q800L284J4426M907l289
1220G391j0969r097O579R468P549k308j3901n515L827J0106R850o334j0591o249
1234a0194J755J3226O516m448r195j0015N218J1530N697j793j2003p338M082R362
$$ y = [5705, -6957, -12342, -7034, 7300, 13624, 5550, -6407, -12689, -6020, 6548, 12387, 6522, -6262, -12899, -6502, 5763, 13184, 6909, -6299, -12864, -6822, 6727, 12795, 6327, -5708, -12644, -6541, 5767, 12689, 6941, -6629, -12306, -6604, 5552, 13145, 6278, -5635, -11912, -7373, 5872, 12052, 6532, -4674, -13357, -6371, 5753, 11432, 7288, -6085, -12117, -6453, 4149, 12845, 6764, -5307, -11420, -8011, 5476, 12270, 6386, -4134, -12909, -7130, 5479, 10377, 8246, -4970, -12897, -5658, 3596, 11977, 7298, -5644, -10390, -8010, 4026, 12552, 6157, -3137, -11937, -8653, 5773, 10680, 7391, -3578, -12675, -6096, 3372, 10921, 8613, -5288, -10803, -6976, 3130, 12980, 6646, -3945, -10194, -8439, 4787, 11303, 6855, -2340, -12355, -7137, 4393, 10090, 8297, -3706, -11044, -6962, 2400]
1248B400R491m085j1672o217J632J2267P944n256r024q338L053J1677O090j936
1262H026j0641q767M615R657P197k018j1281p138K823R936Q244l212j0060p522
1276a0141K068J0987P233k750q921q889K316J0651P639j910j1097p666K976R893
1290B389P830k686r896p344J925R639P987j729j0198q088J839J0708P404k138
1304G642r361q273J838J0164P585j835r531q048J933R544P639j212r750p867J577
1319g955R009Q649j410j0216p630J815R437P563j619q555q510J204R977O922o84
1334G997q952q523J754R029P632l42j0004p596J379Q433Q125j005r273p341O30
1349h057Q919P711p22q046r049J296R303O679L12r007q707J950Q089P500k1q705
$$ y = [2400, 11891, 7806, -3866, -10083, -8451, 3816, 11760, 6504, -2520, -10858, -7805, 3872, 9962, 8026, -2615, -11382, -6767, 2890, 10087, 8069, -3212, -10350, -7527, 2409, 10653, 7441, -2619, -10141, -8073, 2914, 10147, 7397, -1524, -10413, -8097, 2554, 10193, 8283, -2814, -10480, -7504, 2389, 10219, 7533, -2363, -9707, -7782, 1857, 9844, 8115, -2083, -10171, -8332, 2376, 9780, 7642, -1719, -9992, -8154, 2010, 9595, 7760, -1771, -9819, -7886, 1658, 9297, 8085, -1665, -9532, -7955, 1054, 9703, 8293, -1923, -9553, -7738, 1699, 9262, 7643, -912, -9422, -8218, 1759, 8681, 7997, -955, -9478, -7724, 1305, 8937, 8595, -1409, -9005, -7626, 807, 8932, 7927, -1346, -8687, -8057, 862, 8573, 7851, -195, -9244, -7948, 1355, 8034, 8346, -661, -9368, -7418, 671, 8171, 8150, -555]
1365e55p869N35Q128Q395j96q810q080L10Q668Q211p40p930q944J263Q845O700
1381G931j84p889q472J452P103P514J032q536p746j39P734Q707n72q085p353q75
1397h378Q552P590j97o739r162K56Q707O733P56p898q364J348O331P640R30p928
1413A77p203j088P386Q421n4o916p861j462Q375O937J175o322j0026N11Q006O822
1429F878J530q266p833O78O268P491J176p380o717k007O846Q807k85o199p685
1444f698j726Q042O948J192n875r548o8P093O892K070p764p533J92M785Q578J296
1460G876p184o476k475O699Q714k44m843q389j993Q131N887K235n311j0170O47
1475f896N651P097K955q666o529k02L994R178O10n862n734m315P130P702Q84m068
$$ y = [-555, -8424, -7889, 239, 8634, 8438, -372, -8452, -8142, 526, 8737, 7997, 67, -8877, -7614, 1231, 7931, 7747, -142, -8614, -7162, -59, 7455, 8487, -49, -7795, -7934, -200, 8507, 7935, -150, -7503, -8378, 174, 7764, 7567, 828, -8334, -8078, 629, 7362, 8118, 220, -8144, -6796, -465, 7175, 8105, 177, -7026, -8114, -728, 7693, 7639, 723, -7138, -8600, -225, 6712, 7887, 1565, -8461, -7950, 56, 6878, 8408, 142, -7691, -7013, -745, 6746, 7922, 542, -6175, -8182, -1336, 7471, 7186, 987, -6698, -8424, -382, 6566, 7758, 1883, -7665, -7733, -640, 6252, 8322, 558, -6975, -6783, -1998, 6580, 7876, 692, -5784, -8259, -1560, 7154, 6910, 2067, -6322, -8315, -184, 5703, 7938, 2627, -7543, -6896, -1245, 5852, 8807, 141, -6388, -6590, -2596, 6582, 7192, 1330, -4404, -8719, -1589, 6113, 6997, 2929]
1491B929r585j224P252N009M220o607q943M31L902Q786K517q349n156k743N363
1506b198R313j131l955o848l758P764N309K568l680r585m36M541O302M624p651
1521A179o575j670L741R868M08n785n083m356O576P567N7k993q692j622O347M725
1537C692L593m957p705q40K762Q396L127o274o049l413M909Q701L75l711p291
1552d685l415N961O550K781m365q236j202M395O535L145n445o216k339L223P572
1567D259K737m109o714l625M713P416K234l909p663k378M537O456K888l907p458
1582d523k564M536O694K782m040o891k665L755O737K939l748o504l385L966P012
1597D101K574l598o986l256M879O043K820k762q319k382M082O342L697m503o557
$$ y = [2929, -6656, -7880, -628, 4381, 8601, 1994, -6949, -6518, -2616, 6170, 8687, 338, -4818, -7561, -2198, 7115, 5984, 2029, -4819, -8577, -813, 4496, 7064, 3384, -6201, -6637, -2096, 4206, 8830, 1179, -5396, -7066, -3325, 6543, 6951, 1166, -3917, -8273, -1697, 5870, 5927, 2934, -5758, -7380, -1033, 3692, 7285, 2328, -5377, -6217, -3455, 4941, 8068, 1794, -4255, -7668, -2759, 5942, 6317, 2606, -4685, -8100, -2139, 4411, 7192, 2827, -5409, -6611, -2216, 4319, 7464, 2019, -4197, -6536, -3313, 4259, 6996, 2887, -3827, -7452, -2739, 4677, 6911, 3002, -4661, -7039, -2502, 3954, 6842, 2935, -4523, -7087, -2551, 4143, 6925, 2885, -4006, -6671, -2916, 3821, 6760, 3012, -3492, -6877, -2911, 4101, 6675, 3077, -3909, -7165, -2286, 3757, 6577, 3815, -4504, -6886, -2804, 3538, 7235, 2732, -3825]
1612c825k057K577P245K676l417o005m452M292O658K638k737p697k747M853M639
1627B641M289l433p403j907J941P011M022m659n334l673L133P105K113k154o656
1642b964m231M693M677M219k545p981j579K428N496M921m407n315l422J417Q120
1657C527K719k911n712m763M448N676K373r57p718k798K995M882N227l632o578
1672c222k039J015P203L000l225m414m863K643O795K774j452o953l707L828M564
1687A947M075k095o916k373J297O144M317l539m971l711J987O417K778j678n382
1702a703m353K740N435L774j683o925k932K317N216M176k618n336l284J377N635
1717A836L959j879n682m071K326N416L452j551n607l829J807N503L929j495n894
$$ y = [-3825, -5882, -3305, 3940, 6616, 3199, -2806, -7258, -2966, 3692, 6330, 3593, -4104, -6851, -1998, 2641, 6930, 3497, -3906, -5813, -3872, 3139, 7161, 2502, -2832, -6505, -3372, 3733, 5846, 3692, -2964, -7195, -2502, 2175, 6394, 3849, -4132, -5711, -3283, 2213, 7134, 2727, -2588, -6010, -4593, 3527, 6246, 3335, -2377, -7140, -2692, 2984, 5357, 4400, -3318, -6116, -3121, 1761, 6988, 3356, -3222, -5261, -4246, 2957, 5957, 2732, -1682, -6545, -3902, 2893, 5667, 4215, -2738, -6445, -2617, 1947, 6022, 3927, -2989, -5362, -4065, 2079, 6396, 2857, -2114, -5825, -3838, 2579, 5357, 3679, -1703, -6056, -3316, 2119, 5893, 4210, -2715, -5647, -3330, 1886, 6062, 3444, -1892, -5176, -3799, 1836, 5795, 3916, -1766, -5837, -3511, 1905, 5357, 3806, -1801, -5630, -3823, 1680, 5609, 4114, -1780]
1732a780l988K042N932L528k024n514l531J429N415M178j787n383l947J258N869
1747A697L694j855n046m220J877N399L486q24n657m091J748M925L996j167n806
1762a844l099P40N214M331j837m337m627J109O028L084p52n098m459K109M510
1777A072L741n45n710l330O50M810M793j894m571l968N36N927L262j234m085m871
1793e417J475M736L700Q1n988l509J191M441M151q54n109l186l23N188M578j814
1809C341l438m865J005N046L120k5m708m527J443M347M127m32n391l515L87M575
1825D90M458j368l875l759m14N351L409n61l428n225R62M746L664l50m568m106
1841d574Q54L818M462j79n048l554J96M439M430q97m042m006P6M321L483L50l943
$$ y = [-1780, -5768, -3726, 2206, 5734, 3710, -1804, -5335, -3906, 1509, 5687, 3900, -1483, -5430, -4172, 1697, 5391, 3536, -1510, -5730, -3853, 1546, 5032, 4208, -1449, -5540, -3792, 1133, 5129, 3962, -1844, -4943, -4203, 1011, 5342, 3505, -832, -5459, -4350, 1678, 4762, 4010, -1088, -5547, -3438, 1072, 4813, 4268, -1442, -4772, -4122, 688, 5481, 3587, -984, -4952, -4416, 1511, 4773, 3539, -546, -5417, -3942, 794, 4494, 4575, -1413, -4922, -3731, 710, 4861, 4007, -1102, -4288, -4611, 577, 5155, 3341, -97, -4962, -3957, 1089, 4209, 4184, -524, -5051, -3608, 739, 4866, 4434, -957, -4472, -4085, 490, 4948, 3580, -295, -4054, -4468, 883, 4292, 3731, 303, -4922, -3960, 786, 4450, 4100, -468, -4574, -3720, 98, 4560, 4381, -667, -4221, -4025, 414, 4844, 3947, -95, -4101, -4025, 296, 3779, 4129, 186]
1858A86m691O45L983M162k12m618l758O08L413M572k9m546l554m08M091M623p54
1875C713l745l854o19M832L343M07l577m359k97L983L995P44m678l912P0L320
1891f34M873j59m326l351p62M437L970o40k957m208n54M614L038O15l158n008
1907d210M83K957M139J271m391l744p30L165N323k03l558l920j176M516L808j78
1923C552k878m462N4L675K981J181l569m098O0K712M080J241l874m106p36L421
1939g66M609l28k964l803j318M362L740K15l139m422N4L597K931J413l869l682
1955c370L4K416M098R08l458l265j363K972M362K68k402m554r39M009L210J013
1971C939k870m822R1K712L778J636m168l287k54K231M318N08l141l175j868L427
$$ y = [186, -4505, -3860, 123, 4285, 4073, -545, -4303, -3695, -282, 4290, 4261, -285, -3839, -4247, -156, 4467, 3713, -32, -3886, -4505, 327, 3670, 4077, 500, -3859, -4156, -173, 3822, 4566, -112, -4024, -3954, -634, 4239, 4080, -246, -3597, -4359, 78, 4048, 3408, 451, -3757, -4311, 303, 3341, 3956, 798, -4210, -3727, -770, 3369, 4640, 249, -3495, -4225, -1060, 4263, 4060, 502, -3418, -4594, -78, 3730, 3552, 674, -3788, -3734, -59, 2922, 4103, 534, -3564, -3504, -792, 3288, 4529, 655, -3451, -4187, -766, 3843, 3515, 551, -3252, -4570, -208, 3532, 3747, 608, -3814, -3760, -163, 2768, 4181, 312, -3370, -3336, -920, 3178, 4086, 628, -2637, -4000, -1028, 3334, 3602, 1200, -3354, -4293, -284, 2926, 3939, 1069, -3753, -3662, -950, 2828, 4464, 296, -2991, -3245, -1014, 3304, 3812, 671, -2504, -4372, -945]
1987i45M009N04k103m604q62L317L287J402l104m093KK438L362J237l234k797
2003b184j600K520M395N29k547l503j946L504L464J068k176m451r41K551L731
2018B414J528l091l667p77K272M013R99k711l373j236K376L826J031k229l937
2033b562j190K698L440J314k308l766j509K599L828J423k766m086p84K553L281
2048B165J721k862l305j347J977M029J026j975l227k101K285L609J285j123m663
2063b506j256K442L337J798k150m252p83J803L838J638k659l159k032K376M160
2078B595N48j751l199j924K645K794J493j262m134j169J731L434K244l142k879
2093a976j296J348M224J033j790l050k344K382L270J463j310m161j194K414K305
$$ y = [-945, 3064, 3568, 1465, -3139, -4001, -684, 2603, 4005, 901, -3192, -3190, -752, 2610, 3847, 613, -2184, -3784, -1264, 3131, 3660, 1113, -2390, -4336, -832, 2632, 3700, 1524, -2927, -3868, -1317, 2414, 3942, 851, -2816, -3593, -1321, 2692, 3691, 980, -2393, -3629, -1253, 2573, 3604, 1375, -2562, -3752, -1054, 2386, 3700, 1392, -2374, -3883, -1284, 2544, 3967, 1201, -2885, -3669, -1116, 2165, 3886, 1024, -2281, -3628, -1651, 2378, 3404, 1429, -1798, -3899, -1614, 1995, 3280, 2157, -2506, -3762, -1320, 2017, 3815, 1665, -2587, -3370, -1567, 2271, 3909, 1250, -1909, -3941, -1565, 2595, 3143, 1392, -1807, -3731, -1086, 1708, 3201, 1939, -2195, -3364, -1633, 1801, 4045, 903, -1976, -3272, -1924, 2300, 3333, 1543, -1507, -3851, -1469, 1801, 3264, 1954, -2207, -3401, -987, 1318]
2108A318K295j945l575j268J261L963J488k397k487k238J893L534J145q64l845
2123a722j832K408K529J809j298l840r87J203L292J910k029k890j868J607L672
2138A964J243j648l108k077K132K892J776j220l632j590J445K913K140j550l153
2153a473j732J445L203J382j107l082j732J139L212J826j380l211j695J405K994
2168A194K092j507k844k071J106L210J754q85l541j373J007K828K212j142l245
2183a205j926J193L118K049j655k263k291R71L459J475q38l164j778J335K340
2198H20K155r45l266j620R26K799K395j446k519k140P67L518J167m46l025k315
2214c175J255K801J783m06l390j485Q51K442K504j492k689j616M70L266J740j122
$$ y = [1318, 3613, 1668, -1907, -3175, -1914, 2049, 3537, 1140, -1347, -3585, -1692, 1842, 2987, 2123, -1722, -3554, -1146, 1383, 3192, 1894, -1946, -2933, -1730, 1562, 3472, 1443, -1447, -3315, -1708, 1964, 3207, 1559, -1549, -3626, -1494, 1398, 3174, 1954, -1678, -3268, -1823, 1090, 3230, 1680, -1473, -3205, -1760, 1443, 2825, 1718, -1364, -3096, -1957, 1255, 3081, 1701, -1510, -3205, -1800, 1194, 3286, 1779, -1065, -3136, -2030, 1180, 2934, 2049, -1492, -2865, -1858, 970, 3182, 2040, -1205, -3131, -1938, 1180, 3229, 1574, -689, -2980, -2009, 1450, 2925, 2087, -1077, -2855, -1520, 820, 2975, 2030, -1236, -2856, -1930, 869, 3264, 1818, -701, -2841, -2074, 1444, 2611, 2165, -860, -3175, -1920, 881, 2664, 2258, -1132, -2617, -1766, 676, 3180, 1688, -1001, -2617, -2147, 1119, 2859, 1737]
2230A737k080k606J152K783J247k8l198k139J552K301K337j039l073j166J3K894
2246F87K264j291k191k380O46L451J108Rk822k364J372J692K379k61l503j293
2262b497O66J988K911j429k229j909L12K817J674l68k359k247N38K538K034J35
2278B575l214j897P58J667K959j016k641j366l34L271J677o76j985k297O40K562
2294F83J668j60k577k029N66K050K325l30k855j173l04K344K278m42k378j903
2310b237J68K620J821j89k422k318O08K442J606J32k493k004K35K051K389l09
2326B100k121k071J1K005K408m84j765k204m3K507J781k12j865k554P33J984J567
2343A777M38k579j768J78K032K327m37k350j444m51K474J901l46j455k691%K852
$$ y = [1737, -343, -2949, -1797, 986, 2233, 2205, -993, -3132, -1580, 721, 3058, 2019, -1054, -2220, -2207, 687, 2951, 1660, -531, -2911, -2265, 1186, 2294, 2303, -519, -2883, -1511, 181, 2560, 2299, -1204, -2497, -1831, 157, 3068, 1639, -590, -2499, -2187, 630, 2304, 1936, -423, -2670, -2132, 406, 2440, 2575, -639, -2536, -1778, -111, 2848, 1832, -809, -2175, -2509, 762, 2439, 1763, -222, -2519, -1879, 683, 2351, 2191, -386, -2415, -1849, 201, 2526, 2196, -659, -1832, -2136, 208, 2486, 2044, -334, -2237, -2069, 551, 2372, 2183, -239, -2557, -1949, 493, 2099, 2231, -262, -2266, -2031, 20, 2409, 2100, -21, -2092, -2081, -76, 2332, 1848, 83, -2121, -2164, 343, 2124, 1912, 47, -2507, -1774, 210, 1777, 2215, -364, -2132, -1954, 78, 2405, 1968, -382, -1826, -2277, 197, 2098, 1752, 297, -2394, -2394, 458]
2360D58J358L84j963k817P27J985J776J57k207j722J80J231K648l86k025j602
2376a818l88K674J476pj663k381J6K210J616P20k472k146M70J379K369J00k196
2393d1j466p96K109K067l8j485k049n04K395J252L88j331k491K69J546K147M30
2410B402k335j976K44J384K465k62k059j127q63J963K102l40j242k002m78K179
2426E5J382M60j459k149j88J144K232O19k048j638n20J766K441k67j657j686m64
2443a977J860J568L5j093k117k36J551J852M60j283k058j75J275J844L39j442
2459D03j919n81J775K092M4j528j578n77J870J407N54j325k055l30J296J581R37
2476B066j936j713m02J455J937M71j480j652n15J405J902K60j147k353J21J308
$$ y = [458, 1816, 2200, 237, -2580, -1853, 132, 1908, 2065, -142, -1864, -1684, -453, 2195, 1809, -216, -1818, -2206, 468, 1944, 1937, 274, -2107, -2091, 119, 1735, 2455, -17, -2163, -1693, -314, 2055, 2155, -41, -1507, -2303, -194, 1873, 1835, 350, -1699, -2203, 192, 1444, 1832, 501, -1990, -1721, -175, 1972, 2402, 67, -1909, -1665, -281, 2184, 1922, -137, -1264, -2127, -164, 1938, 1598, 356, -1646, -2124, 55, 1437, 1897, 438, -1711, -1899, -755, 1477, 2096, 48, -1590, -2110, -344, 2097, 1830, 173, -1513, -1977, -117, 1451, 1486, 393, -1724, -1960, -409, 1443, 1903, 620, -1438, -1613, -338, 1506, 1845, 403, -1516, -2097, -322, 1770, 1814, 286, -1292, -1869, 1, 1408, 1962, 637, -1418, -1748, -452, 1129, 2066, 130, -1583, -1985, -530, 1407, 1878, 398, -1254, -1769, -364, 1538, 1798, 651, -1702, -1581, -273]
2492b73J732M66j607j533l07R61K107L13j384j832o40J266K285M12j589j658o01
2509a882J385J923K78j148k067l14J410J794M09j410j608m05J160J817N79j143
2525G78k012m63J220J869M63q72k228o35J481J512P46j340j879n58J359J805L21
2542A567r76j800o38J112J937N43j219j598p15J184J803N02j030j824p82J375
2558e59J727O44j397j663p53J491J388R53j363j715n03J140J739M94r26j819p96
2575a918J230J840N51j107j391r18J300J476M67r03j470r65R93J741Q70j155j724
2592a083p00J164J888K17n59j976q47J460J311Q92r45j664p98Q60J932M57j045
2609E64j149j206J031J741M27o41j670n32O91J701Q91q66j908l97R01J198Q42
$$ y = [-273, 1459, 1925, 318, -1215, -1522, -561, 1546, 1859, 475, -1357, -1997, -731, 1554, 1966, 377, -1281, -1882, -497, 1426, 1704, 556, -1511, -1825, -415, 1379, 1788, 378, -1230, -1635, -475, 1342, 1921, 778, -1234, -1697, -477, 1392, 1855, 983, -1245, -1880, -399, 1113, 1859, 519, -1360, -1918, -559, 1246, 1567, 591, -1209, -1847, -735, 1202, 1745, 526, -1072, -1787, -603, 1200, 1702, 672, -1152, -1934, -559, 1168, 1812, 415, -1248, -2001, -510, 878, 1831, 468, -1247, -1750, -610, 1129, 1623, 697, -1122, -1918, -688, 1152, 1703, 596, -795, -1713, -413, 1063, 1530, 627, -843, -1808, -815, 926, 1796, 641, -1083, -1783, -619, 1269, 1486, 927, -1049, -1896, -436, 875, 1767, 822, -842, -1640, -780, 1152, 1609, 564, -585, -1791, -760, 981, 1408, 767, -903, -1435, -744, 957, 1848, 982, -926, -1323, -422, 776, 1618]
2626A618q87j548p42Q09J757M42m95j703j142J413J310O25m89j816p91R51J390
2643G02R66r02j959o5J10J965O85p97j219r55O26J634J089j040j761n44Q27J219
2661E81R91p80j529n80L97J844P39j064j239p81P43J314N50l87j426q97Q86J076
2679D38J164q74j481n21M93J383O43n93j174j062O00J783M85k02j656r67P56J149
2697C64J023n58j330o48L13J056J265r15j181p73N48J647N09o28j273q35O18J312
2715E14R87j88j831o01K67J177J105o01j177o29J92J365R34o70j467p52N83J292
2733E00O70j82j472n02J51Q83J165n68j309o33M06J244J061p22r02j037N26J096
2751C75Q74l10j505p40L10J365Q16n80j143o78L01J342P93k71j253r11L79J116
$$ y = [1618, 731, -817, -1559, -750, 1007, 1449, 954, -749, -1891, -478, 832, 1457, 968, -848, -1639, -688, 702, 1668, 766, -1193, -1258, -1148, 817, 1502, 705, -514, -1469, -843, 791, 1880, 840, -921, -1465, -638, 581, 1572, 792, -737, -1317, -920, 924, 1663, 599, -640, -1421, -678, 636, 1186, 799, -627, -1524, -638, 438, 1602, 728, -753, -1274, -781, 602, 1245, 652, -522, -1584, -984, 799, 1284, 1082, -574, -1541, -785, 364, 1387, 829, -501, -1149, -836, 220, 1485, 570, -611, -1384, -836, 811, 1320, 692, -581, -1416, -798, 514, 1501, 1313, -518, -1119, -852, 325, 1430, 829, -348, -977, -785, 580, 1514, 844, -623, -1375, -792, 500, 1170, 988, -484, -986, -835, 48, 1213, 645, -664, -1297, -891, 353, 1414, 692, -210, -1247, -721, 375, 1249, 939, -566, -1306, -996, 369, 1185, 605, -538, -1216, -915, 427, 1220, 949, -304, -1215, -836, 280]
2769B80J052l98j174q97L78R40J313m92j366q03K09J304Q14m52r50j111O26J201
2787D74O31k59j200q37L77R71J142m33j353n47J54J319O89j26r75j290K15J382
2805C34N77K25j485q18L36J070P71M0j322p90K10R22Q19n9q68j080j18J528Q84
2824A176j69j298p45M47N12J233l20j082n45J08O81J131n94o23j021J0J352N94
2842H47J44j122r79L43Q82J019j13j212q78K24R05R99k25q90q03j40J478N87k40
2861H26r82r03L80Q20P55o1r49r88J59R96R89l3j358o98Q7R98Q67j56p15j315
2881a281L54R90Q16L9q68j108L32P05J108l63p14r29j62J130P83N7q61p82k65
2900a019J163P65k64l84j070qJ020N05L42r12j175L49O89O89l5o53o09m30J145
$$ y = [280, 1332, 934, -240, -1137, -759, 181, 1494, 1002, -364, -1167, -958, 346, 1160, 708, -242, -1353, -727, 474, 1105, 846, -354, -1191, -814, 157, 1299, 866, -487, -1034, -880, 439, 1128, 1002, 27, -1263, -1048, 334, 911, 1136, -349, -1167, -831, 239, 1010, 1050, -272, -1062, -852, 70, 889, 830, -38, -1118, -1236, 292, 1176, 1007, -291, -1036, -589, -77, 1156, 836, -246, -791, -683, -2, 1129, 535, -88, -1109, -1099, 253, 847, 991, -131, -1110, -767, 115, 1134, 1021, -191, -1069, -845, 60, 1059, 834, -56, -859, -999, 479, 1066, 826, -156, -1059, -679, 141, 896, 835, -114, -1102, -943, 53, 1042, 1009, -349, -1047, -960, 38, 905, 749, 34, -1281, -927, 63, 879, 918, 50, -1058, -726, -21, 1087, 724, 10, -919, -1081, 49, 832, 889, 28, -754, -1019, 144, 909, 645, 261, -809, -817, 203, 708, 1050, 138, -1037, -688, 1, 690, 655, 2, -607, -1037, 108]
2919A08P29K3q56q03o9R52O48K73j268o07J2P75J047j97p09p18j80P68J097j66
2939H59j030o55k43R36J069j52o25q27j8Q62M34J68r69q62K63O96Q10J11q83p56
2959h12K95K65Q13P4m85r02j85R25P33L65r30q72J59N84P67J50q46p26k98P70
2979a56R54Jo14m73m92N99R46J30q16p86p6N90R66j18n44m85n31P37Q81J12p31
3000I4o13l72P27Q18K80o87r75o2N54J010J1o12p11l60R82P63p9o76o97j15N09
3021b11J078j61l89r90j35N02Q78L66o58p91j91M17R16K32m68j060QN67O21K44
3041G75p54n27l04O95Q37M0m25r60k94N04Q80J02l41p77k46M24Q41L51n65r81
3061g25N2K54J054L83r36n25k69L42Q42L76o99n60o36Q58M47N37l44r43k54M56
$$ y = [108, 837, 860, 4, -799, -868, 84, 732, 1005, -263, -870, -858, -83, 964, 767, 58, -660, -840, -72, 1025, 859, -171, -826, -1069, -133, 936, 784, 159, -668, -686, 176, 610, 778, -191, -1053, -790, -94, 716, 827, -56, -812, -517, -252, 561, 635, 150, -752, -937, -12, 721, 1086, 156, -716, -557, 27, 794, 944, 98, -628, -926, -156, 798, 799, 185, -288, -780, -181, 765, 895, 79, -707, -783, -193, 773, 655, 111, -374, -905, -168, 713, 825, 94, -519, -891, -164, 654, 934, 247, -728, -790, -236, 774, 785, 173, -538, -898, 84, 847, 768, 92, -605, -720, -211, 867, 706, 317, -673, -808, -306, 572, 938, 280, -511, -702, -285, 631, 863, 395, -665, -657, -90, 531, 775, 21, -506, -810, -115, 722, 762, 337, -623, -917, -413, 467, 569, 228, -549, -795, -371, 470, 821, 256, -725, -673, -419, 635, 1018, 82, -443, -712, -370, 472, 848, 149, -411, -1047, -189, 258, 795, 451, -492, -746, -290]
3081b90P40J4j71q60l15O02P62J68m41p73o2O34M65K12k34q56n50N88P73L32l52
3102C86r05R2J1Q34O16q11n89n46M67J024k29j05o14m05N60O38M21m18p92n34
3122h99O60P72J45m68q53K7J79R08M00o31m29n15M22Q72J79m52p71j69N08M91
3142C76L36l70o15n67N66P68L00n57n74m05N51N23J44k5j075J42J18N57N41m19
3162C15p49k30M03L26O20l90n95n75N68M85M31j79q88k07N06P01k08l4k86p41
3182g27M70O12M56j70r15p48O85Q59K48m98o23k25K95M19M70l36o90O3p5N72M08
3203E50q8q70j53J68N18O70l37r46k38N16M92M34k11q01k38K48Q24J46k74n67
3223a57n08N84M71l2j88p25j78N06M15P60o84m17j99j58Q90j94L16o19n89K53
$$ y = [-290, 450, 464, 293, -567, -882, -280, 482, 650, 209, -564, -626, 8, 473, 685, 451, -405, -955, -367, 406, 738, 386, -519, -427, -416, 418, 1034, 223, -366, -912, -445, 579, 350, 245, -369, -774, -214, 424, 845, 427, -365, -899, -239, 533, 678, 210, -643, -616, -437, 471, 871, 240, -189, -704, -282, 590, 769, 317, -454, -623, -115, 376, 712, 342, -273, -840, -274, 494, 794, 237, -337, -742, -191, 332, 476, 451, -624, -482, -364, 193, 734, 315, -434, -664, -261, 65, 685, 295, -300, -875, -307, 178, 609, 430, -458, -665, -159, 542, 334, 300, 14, -727, -257, 355, 811, 641, -274, -1022, -337, 522, 770, 272, -351, -576, -281, 138, 608, 272, -418, -355, -430, 142, 550, 462, -408, -561, -393, 125, 795, 458, -488, -726, -210, 282, 716, 505, -296, -534, -286, 538, 684, 410, -157, -665, -81, 390, 358, 170, -555, -733, -227, 188, 948, 264, -153, -352, -510, 380, 186, 502, -117, -706, -453]
3243d53R13J52k48p10l24M04M83L91kr24K0j89M67P01l04p22j49J05Q88J5k41
3264B73n31m30K96L34O26j25o59m43M86J98M30n3o46l46K46P46J3l00k26m72J35
3285d48O15J88j38m61j60L29K07M84j49p49k85M59N5M58J14p99j68l6Q68J33j46
3306C71m88k64j36M92N77j42o63l27L15N52L29k88o71n6N1M65L92k43n84k47N9
3327e06O67L30l41l31m55K10N85J83q7o54j16L6M65P22j69l60n34n6N98K77j80
3348B84m65j23j22M73K03j48j27m74O3M75K98n3l53m83K51K84L39K46q24n6kL61
3370D7N09k65l76k46J10M37Q7K99q23l60M03M24O1l3m53j99j21L70O73l96j86
3391c8m55j17P24M48m27j96k39J18L09J61m0m32k07K45j9P13l58n88j1R3J48N94
$$ y = [-453, 460, 612, 364, -346, -670, -266, 217, 608, 606, -318, -298, -487, -20, 681, 377, -345, -494, -389, 499, 514, 273, -258, -688, -392, -58, 568, 443, -216, -659, -173, 25, 455, 402, -244, -590, -344, 402, 415, 115, -111, -583, -448, 167, 355, 217, -244, -404, -75, 132, 616, 467, -282, -567, -108, -53, 405, 519, -280, -448, -484, 384, 517, 371, -117, -381, -517, -25, 552, 410, -253, -580, -265, 287, 616, 328, -343, -399, -348, 117, 509, 266, -318, -565, -506, 161, 491, 150, -181, -636, -426, 159, 342, 255, -399, -515, -479, -14, 708, 539, 179, -355, -411, 187, 464, 284, -181, -304, -426, 47, 250, 102, -25, -499, -436, 39, 337, 284, -69, -552, -301, -17, 322, 568, -256, -312, -314, 47, 556, 291, -85, -331, -221, 216, 303, 602, -221, -581, -178, 246, 307, 274, -179, -378, -499, -129, 544, 148, -38, -493, -610, 114, 562, 135, -61, -300, -182, 127, 288, 248, -184, -391, -146, -165, 548, 190, -398, -409, -316, -168, 426]
3413D26m2m24k90m9N02L71j50n47J22l72K64L55L85p12j73J53K95J76j8l70l52
3434d50K24L86K69j42l49l06K73O0L71K03o05k58j24O08M35l54j84n26K33N31
3454B95J86j31l03m80J71M91J65l4l41k49J15J01L79j54l4o74K17K53K95L7n44
3475b39l6M3L95J45j5o14p6n6P93K54j99p48P0k05N10M76k20k09p25K26M90J39
3497A99K83l02o52j84Q44J39J42j86n29j02M32M31Q3m56p89J36N90K63k78M6l93
3518b83J9L65J98J59l70m21J3M42K94J85o16l22J45J86K81J14l05l48m1K83M03
3539C81j10n24p4r3M28K55K18m16k06j82J76M65K59m30l79K33J05K9L09k71n95
3560d22n7L58K58J94k91l38P6L30M14m52j09m23K34K68K23pj89l72N9J49M88J01
$$ y = [426, 384, -40, -330, -379, 123, 494, 344, -203, -81, -453, -189, 166, 551, -161, -334, -181, 114, 290, 272, -98, -450, -226, 160, 429, 287, -62, -368, -95, -35, 336, 539, -66, -324, -448, 160, 595, 241, 57, -469, -236, 295, 481, 350, 47, -433, -262, 229, 394, 360, 19, -230, -115, -14, 365, 211, 177, -497, -280, -27, 268, 305, -239, -275, -232, 163, 308, 293, -321, -397, -453, 340, 594, 395, -353, -283, -488, 22, 498, 278, 69, -656, -430, 60, 199, 482, 180, -472, -656, 188, 327, 469, 283, -246, -348, 84, 515, 598, 142, -647, -511, 79, 342, 64, 110, -283, -264, 101, 299, 458, 88, -333, -320, 122, 416, 601, -15, -337, -192, -6, 275, 389, 84, -264, -305, -22, 381, 271, -253, -327, -420, 8, 263, 481, 65, -141, -323, -147, 318, 577, 147, -232, 1, 106, 135, 444, 173, -422, -479, -121, 137, 331, 40, -298, -222, 108, 522, 70, -39, -462, -228, 40, 263, 256, 67, -305, -246, -97, 391, 492]
3582D92o69l6J11J57K60K5l08j84j46N58J74j54l0m03k96L10L82j66O2l98K10
3603d9o1J42M31n58j81J1K32K42L52o73l40K97M6M39kn01o5k17N17M58p3m79n9
3626i1l49M79J02K38m77q2j1N30P7k40l45j56JJ98K52J85q8n27%L53R9M0j53k74
3650b39R9K0M22k57j21P1l00J31N53O3l90k51j91K19M55k75j97Q9o9J61L30n8
3672B65m17k28L12J55P4J81m39o2NK64J19K2k70kk53J13K67J02j69M2k48M9J68
3695E0J98l06n8Q2J79n1j33n2l3j11M9N31k17j0j97j9J83K00K51n56l9n65N64
3718f0M86j41j12j48j51j56N05Pln11MJ51L53k1l09j82j6K96K74J11k43j81j88
3741b35J68N8J36k76K1n3K39J72p8k89J1j06N0L48J27o9n97J15K15P2K30l10k72
$$ y = [492, -177, -213, -102, 55, 315, 340, 32, -152, -298, 260, 434, 280, 250, -153, -449, -139, 243, 77, 139, -259, -49, -110, 32, 463, -95, -276, -265, -33, 209, 561, -112, -452, -155, -109, 330, 328, -173, -238, -455, 62, 520, 447, -32, -91, -440, 39, 141, 379, -98, -180, -191, 339, 416, 176, -169, -325, -324, -126, 126, 311, 223, -304, -304, 49, 148, 188, 35, -239, -140, -120, 302, 45, -76, -5, -305, -174, 379, 442, 52, -199, -390, -171, 284, 9, -188, -99, -168, -7, 323, 265, -152, -380, -68, 87, 161, 342, -97, -159, -154, 110, 229, 251, -19, -21, -274, -161, 106, 208, 39, 81, -167, -118, 50, 248, -58, -116, -34, 145, 94, -39, -91, -124, -235, -186, 345, 128, 118, -79, -98, 85, 285, 536, -20, -59, -624, -60, 426, 285, 173, 25, -126, -282, 223, 230, 227, -284, -280, -129, 224, 203, -106, -288, -304, -8, 266, 377, 134, -47, -235, -67, -9, 127, -149, -128, -181, 58, 230, 152, -137, -126, -232, -182, 166, 293, 224, -373, -258, -43, 29, 259, -51, -323]
3764c23p2L84K28k70J02l51J13J81J92J25k21m41M0L49J70j1p9k63k13J75M67
3785B82p6l11%j14Q5M63Ml36N6m58M23J43K8j04m47O0L30K78K05m09k58K32m88
3808d12O04j0J9l85k70N42l3K69J5m49j03j18N12k07J60l49KK51K51k19K2j86
3830i4k27J21L94K46l75J62n34L6N34J00n8l95o4J59K45O4m90R3m32O73JJ62m68
3853a47R5j61J51M64j62k95k44q0L82j15L59k18k41j56L21J80J86m16N3R5o4J21
3875A08j28Q3r9K33l86K11L95j40k93k22J18P9K44j65l49L18j53M18j27rj96o6
3897a26m1K01M15l77k75r1M46q5K63j44o9l91M99J5j63j79j0O5q7M06j52J09n07
3920b78K41p7K47J50p8k11k80L00q5K60j50k26q4J86M8N71l63m09J3K65k6M7J61
$$ y = [-323, -395, -11, 217, -53, 49, -302, -189, -8, 184, 309, 88, -353, -313, 36, 206, 195, 116, -147, -360, -185, 282, 206, -105, -105, -219, -134, 329, 333, -3, 53, -405, 18, 161, 189, 85, -362, -302, 28, 306, 511, 102, -156, 76, -412, 192, 182, 201, -184, -454, 88, 55, 324, 339, -110, -213, -331, 181, -26, 134, -215, -213, 38, 289, 70, 92, -94, -321, -200, 194, 440, 65, 227, -307, -271, 263, 363, 305, -90, -154, 5, 250, 314, -176, -83, -515, 158, 159, 321, -147, -52, -213, -62, 402, 240, -55, -299, -379, 3, -112, 247, 29, -212, -368, -47, 133, 319, -97, -44, 51, -13, 108, -20, 63, -36, 197, -189, 22, 417, 277, -16, -238, -120, -41, 203, 38, -311, 7, -146, 272, 145, 136, -60, -126, -167, 34, 449, 72, -203, -294, 152, 67, 330, 186, 117, -274, 225, 240, 77, -102, -112, -47, -134, 272, 120, 229, -278, -37, -114, 133, 283, 205, -6, -286, 14, -71, 189, 39, -187, -271, -85, -37, 534, 171, -238, -225, 40, 14, 61, 222]
3943B22k31l99Q8L81J79j52j00k77J55L94j59j07l15J77l3J99J32J70m28J08j16
3964a12M22o7j83l50r0M66p5J87l32q7J18%K91j74J34k76O0o4M0L65l0j97j80
3987a34QN55l71j41k41R8K3N81l09K08l35k91M93J42k73J34m16L97k69L23j32
4008E0J73j23k60K08J54K13l88j79k5L39n3p9qk7Q0r2J83J07Ol8m08M7K06J32
4032B18p1k82k30L97K81k70K60m10k07L13J39p4J15k57o4K70k20L79k77j35j29
4053b54K04K90M8k59j61J97m06J47L16j65Op4lK85r8N6j65j00j50L64K91m80K90
4076A79m58L13J80k57N8L3j3k3J37n7K15l83q1mK01O2Q1j63l48j4L89J81k09m4
4100b5o1r5K39K09k15l98K98J6L1R0J51l47MJJ27r2L7L2l40J85J51K39j55q8j15
$$ y = [222, -9, -408, -320, 61, 240, 88, -12, -289, -134, 260, 101, -6, -321, -144, -177, 22, 154, 324, -104, 4, -112, 310, 243, 60, -290, -380, 86, 11, 198, -134, -221, -103, -103, 188, 14, 148, -128, -68, -132, -92, 273, 243, 46, -134, -126, 429, 58, -83, -324, -226, -203, 378, 69, 277, -58, -349, 144, 286, 13, 147, -269, 128, -141, 182, 50, 223, 100, -160, 48, 202, 415, 27, -152, -177, 162, 109, 30, 22, -5, 75, -17, 166, 273, 279, 241, -167, -120, 86, 218, 147, -135, -365, 32, 313, 43, 303, -107, -314, -1, 138, 64, 179, -78, -142, 128, -92, 287, 10, -125, -254, -50, 240, 288, 29, -132, 65, -341, -194, 122, -43, -37, -111, -114, 171, 73, 129, -36, -136, -286, 78, 369, -111, 179, -279, 34, 214, -43, 15, 48, 35, 12, 149, 92, 307, -76, -157, -161, 40, 102, 183, 20, -328, -342, 47, 228, 19, -25, -86, -181, 58, 267, 52, -346, -48, -32, -1, 89, 240, -107, -103, -102, 25, -67, -30, 2, -338, -153, -2, 237, 82, -6, -121]
4125a21j69M03Pj4k16q0L7J93Mj67J53l22J18L37J47l05j10M9J1K44j42N4p0r2
4149e1j43L38J16M6j87k31j07M05k3k83q8J48k55J49K42K29n62MQL31k2n3Mj54
4173a39k43K82K02l0p2k16J3L35R5k16M9J4r8J06K30k44L4l05L45k1M1j80j05
4196a23qJ94pK15Q4m11j36J82O5M10l31j22j97K20n9K74j82r9Q8j59J05K39j17
4219A25j35O4n0K12j83q5J07k18J34j48K45j5K7j79n6J93q7%M5l4j16K19J2n9
4243A8J2mj79J61R9J86n33j23K36K22j02K05j79k42J69l2P9M2k36jN1K78MQ6j90
4268B7l76m0N23m2L10l56l26R5L60l99K66l3k74J18K60J90j36j85k19L3M38j31
4290A03j64j03P1j79K28L0J41l78m1K71L30k49J80r9l64J79%J77n8R9k66j06M71
$$ y = [-121, -290, 113, 120, 106, -110, -190, -153, 40, 44, -123, 30, -292, -174, 163, 310, 5, -105, -56, -45, 199, 57, 111, 41, -51, -194, 144, 260, 306, 119, -112, -219, 186, 163, -120, -208, -60, -315, -166, 76, 305, -257, -253, -245, 86, 64, 11, 15, -139, -382, -100, 102, 72, 0, -216, -203, 132, 227, 11, 60, 74, -24, 82, 312, 68, 102, -203, 142, 121, 162, -18, -123, -131, 63, 56, 271, 355, -56, -192, -10, 55, 465, 134, 12, -185, 35, -24, 250, 68, -31, 57, -102, 3, 242, 125, -10, 54, 4, 216, 33, -52, 55, -163, -29, -177, 68, 53, 80, -99, -155, 38, -49, -49, -4, -38, -154, 65, 77, 18, 30, 26, -153, 8, 107, 293, -240, -363, -127, 95, -7, 198, 19, -223, -54, -86, -7, 35, -201, -202, -151, 127, 131, 217, 27, -349, -389, 134, 92, 402, 46, -280, -185, 175, -224, 42, 9, -265, -147, 113, 303, 167, -18, -237, -204, 234, 103, -61, -164, -93, -272, -44, -14, 127, -251, -292, -21, 309, 60, 240, 141, -223, -44, -44, 133, 75, 174, -92, -198, 273]
4313B73j39j95J39j18k03K61J61j84J90m31L45j24K33p8k67k12J33K92l8n0R1
4334G9j36J6L75k27O9n1k13J67J30J66k74p4l19L94k27K49J52k77j97J9L93j04
4356A10N0k33q5R6j19K67M6j91J37j41L76j47l16J30m31M42L08J57m42M8k28K02
4378C6k06M47r6k75J90m8J3M06J06n99j56j24K06M60j01m74L6J60L15j48j00O2
4400A10l17K42J81j7n9n0k14MK26n3j65qo4P6J76j49p4J91k96K78n2P3J18j82
4424b5k77K27K3n9L4k7R9q4m2L92k08k26N4O6N1m5J08j34j0J13k19J69R6k16N9
4449h1P3J14k57K26j8l33J54J31K37j97L5l04J47J41k9K11j55o3p2K34o4M6k03
4472b7j4j28Q4K51J3j63j24R3m5p7k2M0pk2K11QJ04n0k52j76M21l6K51k68k82
$$ y = [273, 134, -61, 78, -40, -243, 18, 179, -5, 185, -246, 99, -25, 208, 130, -137, -349, -216, 76, 38, -12, 79, -57, -41, 334, 107, 176, 125, -88, 79, 209, 375, 101, 27, -292, 102, -125, 124, 276, -1, -198, -179, 214, 110, 160, -73, -158, -62, -181, 86, 132, -59, 78, -63, 313, 166, -150, -20, -451, -9, 299, 456, 14, 62, -166, 36, -170, 277, 181, -94, 96, 48, 61, 467, 573, -26, -182, -306, -100, 360, 259, -215, -179, -19, 296, 148, 48, 110, -207, 35, 216, 199, 140, 90, -124, -120, 106, 53, -112, -120, -184, -108, 68, -81, -155, 36, -260, 18, -34, 39, 157, -25, -302, -75, -52, -111, -77, -104, -5, -89, -131, 261, 53, -173, -119, -53, -2, -47, 61, -73, -83, 30, -189, -20, 76, -140, -81, -8, 106, -151, 75, 57, -276, -122, 9, 246, 49, 84, -220, -73, 68, 39, 250, 95, 32, -40, 194, 130, 176, -27, -41, -169, -85, 166, 179, 16, -108, -15, -60, -137, -159, -119, -126, -148, 63, 71, 175, 125, -127, -303, 118, 82, 333, 65, -217]
4497b17Q6M57k64Q3o1j97L02o9j35Pk66L84j82J62j03J88k38O9q7j0L1J81j64
4520d3K7pJ6J11O4l5k44M1o0K31R8j64k5l03M73l12K18j72J07Pn6J31j27j23K12
4545F5k71Q0J89Rn9J14k93J23P0O6J33m73L32K24j63O5j50k39J91n6L72l15L2
4568D6j18K58l21J96o6r6j78O0K71n3J4n5no9K84J24l86R0j80L0l1K84J25m04
4592a80L55l33M53p1j92j08n1K56q7Q4J57k17k55j57O23q3j05n8j07k20K33J26
4614F3L07l30q4Q8j19K81j01%k27j4L85l10J60j5r5Q9j90M97k41j43k37K9J23
4637h4K24q3j62l5M0R9J13j1j75jlJ13j26M58k97O8k78K46j87L10k18k11J14Q8
4661BJ00Jn0k12K11o5P2J46n54M76m64K52r5K06l51J69J74k75N44r4j97qk14M36
$$ y = [-217, -131, 326, 62, 145, 84, -113, 189, 120, -15, -8, -274, 110, -72, 90, -13, 175, -63, 6, -81, -91, -60, 121, -43, -16, -23, -7, 104, 168, 133, -111, -70, -130, 101, 199, 35, 10, -293, 180, -132, 86, -86, 21, 28, -28, 103, -24, -147, 65, -206, -126, 63, 72, 13, 127, -166, -43, 27, 93, 226, -247, 85, 309, 146, 211, 61, -178, 13, -43, 329, 14, 46, -72, 186, -135, 61, -5, -101, -279, -219, 52, -1, 13, -42, -47, -116, 168, 292, -94, -4, -184, -154, -185, 99, 224, -180, 175, -158, 295, 224, 32, -76, -127, 129, 42, 126, 283, 66, -189, -346, 277, 194, 89, 31, -76, -296, -63, 63, 370, 40, -44, 44, -75, 206, 105, 105, -122, -136, 249, -61, 99, 84, -11, 78, -112, 385, 144, 1, -236, -207, -84, 140, 57, -105, -140, -100, -1, 112, 101, -74, -75, -78, 35, -91, 367, 70, 138, -140, 106, -81, 229, 11, -200, -86, 2, 102, 103, 53, -159, 52, -13, 59, 205, -349, 127, -337, -85, -180, 26, -325, -156, 18, -257, 287, 193, -4, -12, -226, 210]
4685B10j69Q7Jm86L48J31j15K86l84Q2j98L12m9K07k7m50J37R8K36l53k2P7j75
4708b16K29QR1j77j23n9L16K44k74Q1k09k17M10j50K84o00L15j91L33J64k62J03
4730A00j94PK12J18l03K18k61Qj5J70J86l56j2j54J79J90L08l43k43L85oj98j4
4753a8k16r6L13K17L9j72k75O5O5J98j95L01j79k02k07J43M23j16j83o2p0K70
4775D3K11j83Nj42k07M87k35L20l37r1R4l0K64k05J12k56J37K04j15O2j42l13
4797c17Q2L6J86J37J08k57j78J30j3K50K7j76m4J37j79J19Q0l03J03J15k2Q8k66
4820a57q0J91Q8J28J2m5j16nj35O3K01j59Lk63L62P8L9l05j44N7K62k48L90k12
4844Ej06R4O9l3J39l45J90j29j04K35P8J80k69l8L57l33L38k56l12K20j50J11
$$ y = [210, 41, 128, 129, -357, -9, 122, 7, 293, -91, -9, -207, 105, 56, 263, 236, -214, -77, 21, 257, -96, -118, -41, -216, 13, 21, 112, -65, -188, -247, 69, 313, 39, 120, -89, -306, 104, -46, 238, -362, -47, -238, 95, 259, -3, 100, -94, -87, 125, 243, -60, 158, -103, -95, -110, 60, 246, -110, -122, -276, -97, 93, 401, 58, -185, 200, 194, -4, -18, -234, -330, -17, 200, 239, 67, -208, -143, -78, 120, -75, 226, 47, -155, -362, -219, 204, 88, -95, -157, -227, 43, 254, 71, 76, -66, -273, 214, -21, 299, -38, -129, -35, -65, 199, -6, 106, -150, -13, 191, 76, 138, -4, -317, -235, -199, -13, 124, 232, -25, -203, -73, -86, 164, 191, 15, -29, 108, -71, 48, 128, -175, -72, 43, 21, 109, -157, -237, -46, 42, 170, 182, 137, 21, 16, -119, -56, 145, -14, -11, -274, 88, 166, 205, -100, -244, -187, 75, -173, 217, 5, -101, -7, 62, 29, 168, -177, 13, -116, -220, 15, 93, 273, 4, -34, 323, -10, 328, 72, -240, -20, -170, -59]
4866e9J26J57m00j92O44l5j32M2m15J50K84l9Mj13k60OKM94j99Kl10O9j79N32
4890A79R2k08j87n8J77j11K10J18k03m3J3K42p7k77J4K9j38J84J36j64Oj75K26
4913a5P5j06J08n3P8j98J76L6m1j85N5L6J9K58q3l39Q2J2OK06k1M8j83o8K43l1
4939A15m8J6j11R1j27M34M7k94k68K55J20j7j37j76J39O9k66J97mj54j06L66J38
$$ y = [-59, 67, 224, -176, -368, 276, 241, 109, 151, -264, -114, 170, 131, 135, 22, -238, -232, -230, 264, 65, 67, -243, -174, -353, 179, 271, 63, -124, -182, -5, -116, 94, 212, 9, -34, -21, 221, 144, -133, -119, -90, -228, -44, 92, -72, -66, -241, -15, 60, -46, 62, 9, 87, -111, 65, 101, 60, -125, -70, -34, -15, 243, 160, -179, -97, -85, -79, 127, 106, 154, -29, -97, 146, 115, 67, 83, -28, 63, -64, 370, 417, 123, -145, 110, 230, 213, 76, -100, 39, 108, -158, 39, 35, -119, -225, 141, 279]
$$ [...]
8191A0
##END NTUPLES=NMR FID
##END=
