##TITLE=1H_LR-704-Ac1
 CDCl3, 8 sc, 
 19.11.2019
##JCAMPDX= 6.0         $$ Bruker NMR JCAMP-DX V2.0
##DATA TYPE= NMR FID
##DATA CLASS= NTUPLES
##ORIGIN= UXNMR, Bruker Analytische Messtechnik GmbH
##OWNER= root
$$ XWIN-NMR		Version 3.5
$$ Tue Nov 19 15:11:21 2019 Russian Standard Time (UT+4h)  she@DPX200
##.OBSERVE FREQUENCY= 200.1315
##.OBSERVE NUCLEUS= ^1H
##.DELAY= (6, 6)
##.ACQUISITION MODE= SIMULTANEOUS
##.ACQUISITION SCHEME= undefined
##.AVERAGES= 8
##.DIGITISER RES= 18
##SPECTROMETER/DATA SYSTEM= spect
##.PULSE SEQUENCE= zg30
##.SOLVENT NAME= CDCl3
##.SHIFT REFERENCE= (INTERNAL, CDCl3, 0, 15.7039)
##AUDIT TRAIL= $$ (NUMBER, WHEN, WHO, WHERE, WHAT)
$$ ##TITLE= Audit trail, XWIN-NMR		Version 3.5
$$ ##JCAMPDX= 5.01
$$ ##ORIGIN= Bruker BioSpin GmbH
$$ ##OWNER= she
$$ F:/spectra/data/she/nmr/H-F/1/audita.txt
$$ ##AUDIT TRAIL=  $$ (NUMBER, WHEN, WHO, WHERE, WHAT)
(   1,<2019-11-19 14:59:48.43 +0400>,<she>,<DPX200>,
      <created by zg, POWCHK disabled, PULCHK disabled
       configuration hash MD5:
       00 E9 B6 7A A2 85 ED C7 34 08 36 98 17 FE 4E 26
       data hash MD5: 16K
       2D FB 3E 21 7B 12 94 94 53 34 E2 BA B6 72 0C 8E>)
$$ ##END=
$$ 
$$ hash MD5
$$ D9 AE EA 24 33 4E 21 F5 51 D6 F0 50 78 D5 32 E8
##$RELAX= 
##$RELAX= 
##$RELAX= 
##$RELAX= 
##$RELAX= 
##$RELAX= 
$$ Bruker specific parameters
$$ --------------------------
##$DU= <F:/spectra>
##$EXPNO= 1
##$NAME= <H-F>
##$PROCNO= 1
##$TYPE= <nmr>
##$USER= <she>
##$AMP= (0..31)
100 100 100 100 100 100 100 100 100 100 100 100 100 100 100 100 100 100 
100 100 100 100 100 100 100 100 100 100 100 100 100 100 
##$AQSEQ= 0
##$AQ_mod= 1
##$AUNM= <au_zg>
##$AUTOPOS= <>
##$BF1= 200.13
##$BF2= 200.13
##$BF3= 200.13
##$BF4= 200.13
##$BF5= 200.13
##$BF6= 200.13
##$BF7= 200.13
##$BF8= 200.13
##$BYTORDA= 1
##$CFDGTYP= 0
##$CFRGTYP= 5
##$CHEMSTR= <none>
##$CNST= (0..31)
1 1 145 1 1 1 1 1 1 1 1 1 1 1 1 1 1 1 1 1 1 1 1 1 1 1 1 1 1 1 1 1 
##$CPDPRG= <>
##$CPDPRG1= <>
##$CPDPRG2= <>
##$CPDPRG3= <>
##$CPDPRG4= <mlev>
##$CPDPRG5= <mlev>
##$CPDPRG6= <mlev>
##$CPDPRG7= <mlev>
##$CPDPRG8= <mlev>
##$CPDPRGB= <>
##$CPDPRGT= <>
##$D= (0..31)
0 1.2 0 0 0 0 0 0 0 0.06 0 0.03 0 0 0 0 0.0002 0 0 0 0 0 0 0 0 0 0 0 0 
0 0 0 
##$DATE= 1574161187
##$DBL= (0..7)
120 120 120 120 120 120 120 120 
##$DBP= (0..7)
150 150 150 150 150 150 150 150 
##$DBP07= 0
##$DBPNAM0= <>
##$DBPNAM1= <>
##$DBPNAM2= <>
##$DBPNAM3= <>
##$DBPNAM4= <>
##$DBPNAM5= <>
##$DBPNAM6= <>
##$DBPNAM7= <>
##$DBPOAL= (0..7)
0.5 0.5 0.5 0.5 0.5 0.5 0.5 0.5 
##$DBPOFFS= (0..7)
0 0 0 0 0 0 0 0 
##$DE= 6
##$DECBNUC= <off>
##$DECIM= 24
##$DECNUC= <off>
##$DECSTAT= 4
##$DIGMOD= 1
##$DIGTYP= 9
##$DL= (0..7)
0 120 120 120 120 120 120 120 
##$DP= (0..7)
150 150 150 150 150 150 150 150 
##$DP07= 0
##$DPNAME0= <>
##$DPNAME1= <>
##$DPNAME2= <>
##$DPNAME3= <>
##$DPNAME4= <>
##$DPNAME5= <>
##$DPNAME6= <>
##$DPNAME7= <>
##$DPOAL= (0..7)
0.5 0.5 0.5 0.5 0.5 0.5 0.5 0.5 
##$DPOFFS= (0..7)
0 0 0 0 0 0 0 0 
##$DQDMODE= 0
##$DR= 18
##$DS= 0
##$DSLIST= <SSSSSSSSSSSSSSS>
$$ [...]
##$SUBNAM2= <"">
##$SUBNAM3= <"">
##$SUBNAM4= <"">
##$SUBNAM5= <"">
##$SUBNAM6= <"">
##$SUBNAM7= <"">
##$SUBNAM8= <"">
##$SUBNAM9= <"">
##$SW= 24.9337058887773
##$SWIBOX= (0..15)
0 0 2 0 0 0 0 0 0 0 0 0 0 0 0 0 
##$SW_h= 4990.01996007984
##$TD= 16384
##$TD0= 1
##$TE= 0
##$TE2= 300
##$TE3= 300
##$TEG= 300
##$TL= (0..7)
0 120 120 120 120 120 120 120 
##$TP= (0..7)
150 150 150 150 150 150 150 150 
##$TP07= 0
##$TPNAME0= <>
##$TPNAME1= <>
##$TPNAME2= <>
##$TPNAME3= <>
##$TPNAME4= <>
##$TPNAME5= <>
##$TPNAME6= <>
##$TPNAME7= <>
##$TPOAL= (0..7)
0.5 0.5 0.5 0.5 0.5 0.5 0.5 0.5 
##$TPOFFS= (0..7)
0 0 0 0 0 0 0 0 
##$TUNHIN= 0
##$TUNHOUT= 0
##$TUNXOUT= 0
##$USERA1= <user>
##$USERA2= <user>
##$USERA3= <user>
##$USERA4= <user>
##$USERA5= <user>
##$V9= 5
##$VALIST= <valist>
##$VCLIST= <CCCCCCCCCCCCCCC>
##$VD= 0
##$VDLIST= <DDDDDDDDDDDDDDD>
##$VPLIST= <PPPPPPPPPPPPPPP>
##$VTLIST= <TTTTTTTTTTTTTTT>
##$WBST= 1024
##$WBSW= 4
##$XGAIN= (0..3)
0 0 0 0 
##$XL= 0
##$YL= 0
##$YMAX_a= 337786
##$YMIN_a= -173636
##$ZGOPTNS= <>
##$ZL1= 120
##$ZL2= 120
##$ZL3= 120
##$ZL4= 120
##$ABSF1= 10
##$ABSF2= 0
##$ABSG= 5
##$ABSL= 3
##$ALPHA= 0
##$AQORDER= 0
##$ASSFAC= 0
##$ASSFACI= 0
##$ASSFACX= 0
##$ASSWID= 0
##$AUNMP= <proc_1d>
##$AZFE= 0.1
##$AZFW= 0.1
##$BCFW= 1
##$BC_mod= 2
##$BYTORDP= 1
##$COROFFS= 0
##$CY= 11.3945322036743
##$DATMOD= 1
##$DC= 2
##$DFILT= <>
##$DTYPP= 0
##$F1P= 16.9975609425685
##$F2P= -3.02152046262296
##$FCOR= 0.5
##$FTSIZE= 0
##$FT_mod= 4
##$GAMMA= 1
##$GB= 0.15
##$INTBC= 1
##$INTSCL= 1
##$ISEN= 128
##$LB= 0.24
##$LEV0= 0
##$LPBIN= 0
##$MAXI= 10000
##$MC2= 0
##$MEAN= 0
##$ME_mod= 0
##$MI= 1.114404
##$NCOEF= 0
##$NC_proc= 0
##$NLEV= 6
##$NOISF1= 3.799351
##$NOISF2= 2.8
##$NSP= 1
##$NTH_PI= 0
##$NZP= 0
##$OFFSET= 15.70392
##$PC= 1
##$PHC0= -9789.047
##$PHC1= 16.00086
##$PH_mod= 1
##$PKNL= yes
##$PPARMOD= 0
##$PSCAL= 0
##$PSIGN= 0
##$REVERSE= no
##$SF= 200.130013532006
##$SI= 16384
##$SIGF1= 3
##$SIGF2= 2
##$SINO= 400
##$SIOLD= 16384
##$SREGLST= <1H.CDCl3>
##$SSB= 0
##$STSI= 0
##$STSR= 0
##$SW_p= 3612.71676300578
##$SYMM= 0
##$S_DEV= 0
##$TDeff= 0
##$TDoff= 0
##$TI= <>
##$TILT= no
##$TM1= 0
##$TM2= 0
##$TOPLEV= 0
##$USERP1= <user>
##$USERP2= <user>
##$USERP3= <user>
##$USERP4= <user>
##$USERP5= <user>
##$WDW= 1
##$XDIM= 8192
##$YMAX_p= 0
##$YMIN_p= 0
$$ End of Bruker specific parameters
$$ ---------------------------------
##NTUPLES= NMR FID
##VAR_NAME=  TIME,          FID/REAL,        FID/IMAG
##SYMBOL=    X,             R,               I
##VAR_TYPE=  INDEPENDENT,   DEPENDENT,       DEPENDENT
##VAR_FORM=  AFFN,          ASDF,            ASDF
##VAR_DIM=   8192,          8192,            8192
##UNITS=     SECONDS,       ARBITRARY UNITS, ARBITRARY UNITS
##FACTOR=    0.0002004,     1,               1
##FIRST=     0,             0,               0
##LAST=      1.6414764,     0,               0
##MIN=       0,             -173636,         0
##MAX=       1.6414764,     337786,          0
$$ Real data points
##PAGE= N=1
##DATA TABLE= (X++(R..R)), XYDATA
$$ [...]
2692E13k268J654J4l905m49N222K779l032k088J807J723l871k220M770L691k404
$$ 513 -1755 -101 -87 -3992 -4441 781 3560 528 -1560 247 1970 -1901 -4121 649 4340 1936
2708A936l930J417K778l372l441L058N052j962m487J206L491j083l947K913N895
$$ 1936 -1994 -577 2201 -1171 -4612 -1554 3498 1536 -2951 -1745 1746 663 -3284 -371 5524
2723E524j296o237j452L294r91m300K139P174Q43n099j633L805k46m996m74O495
$$ 5524 4228 -2009 -3461 -167 -1158 -5458 -3319 3855 4698 -401 -2034 1771 1525 -3471 -3945 2550
2739B550K927n728l253L766J063m950j518O689M023n094l608L560K877m507k731
$$ 2550 5477 -251 -3504 262 1325 -3625 -5143 1546 5569 475 -3133 427 3304 -1203 -3934
2754c934N484M843m875n944K205L747l895l017O244O911l024o457J142L377l377
$$ -3934 1550 6393 1518 -4426 -2221 1526 -2369 -5386 858 7769 4745 -1712 -570 2807 -570
2769e70n039M085P604j466o607j87M492j858n713K882Q130O33o795j837M852n15
$$ -570 -5609 -1524 6080 4614 -1993 -2180 2312 454 -5259 -2377 5753 6386 -409 -2246 2606 2091
2785B091n629P91P880J132p504l411M762J360m368K72Q488L551o961n533K695
$$ 2091 -3538 -2747 5133 6265 -1239 -4650 112 1472 -2896 -2624 5864 9415 2454 -3079 -384
2800c84K264n177j819P299N976n325o134K573L681l925l371O131O634l804p588
$$ -384 1880 -3297 -5116 2183 8159 2834 -3300 -727 2954 -971 -4342 1789 8423 4619 -2969
2815b969J286M626k981n047M621P629k969q022K07O071j020m732L183Q489j027
$$ -2969 -1683 2943 -38 -5085 -464 7165 4196 -3826 -3619 2452 1432 -3300 -117 8372 7345
2830G345r402k702N378l50n409J831R314J634q606l434N344J826o449m60Q757
$$ 7345 -2057 -4759 619 269 -5140 -3309 6005 7639 -967 -4401 943 2769 -3680 -4140 4617
2845D617K864p710n341M964K922o059j656P903M911p217n962M376M998n064k910
$$ 4617 7481 -229 -5570 -606 2316 -3743 -5399 2504 7415 198 -5764 -1388 3610 -1454 -4364
2860d364O971N454o867p954K819N047l504m061O839P485m234q093J599M794k927
$$ -4364 2607 8061 1194 -6760 -3941 1106 -2398 -6459 380 7865 3631 -4462 -2863 1931 -996
2875i96m849M333P833k527q196k31N080j314m926L358P962p86p803j234M988L38
$$ -996 -5845 -1512 6321 3794 -4402 -4633 447 -867 -5793 -2435 5527 4741 -3062 -4296 692 1030
2891A030m937J148P250N65q151l483M614J651l433J039P199K581o612m943K387
$$ 1030 -3907 -2759 4491 5056 -3095 -6578 -1964 -313 -3746 -2707 4492 7073 461 -4482 -2095
2906b095K752l707j386O061L963m953n421J753L945k268j679M623M478l406o330
$$ -2095 657 -3050 -4436 1625 5588 635 -4786 -3033 912 -1356 -3035 1588 6066 2660 -3670
2921c670M27M183q61k836K737M601k420o498o08M682J325k157J707M979n65p005
$$ -3670 -3243 940 79 -2757 -20 4581 2161 -4337 -4945 -263 1062 -1095 612 5591 5026 -1979
2937a979k951L501J810k527O8N553J202n756l518L712K898k430j216M404K432
$$ -1979 -4930 -1429 381 -2146 -2078 3475 4677 -1079 -4597 -885 2013 -417 -1633 2771 5203
2952E203n160n006K677M330k025k831L281L884l771n488J617O226p64l629K533
$$ 5203 43 -4963 -2286 2044 19 -2812 469 4353 582 -4906 -3289 2937 2173 -1456 1077
2967A077L923l184o858K09M956Q00m065K191N675j304o370o15N505L74m029J63
$$ 1077 5000 1816 -5042 -4833 123 923 -3142 -951 4724 3420 -2950 -3565 1940 2314 -1715 -1552
2983a552M950j26o412j757N239J997m233k91M575Q93n309k046M823K754l610j842
$$ -1552 3398 3272 -3140 -4897 342 2339 -1894 -2185 2390 3283 -2026 -4072 751 3505 -105 -1947
2999a947M246J038n745l157M070L560k944j583M685K636m300m156K727L056k639
$$ -1947 2299 3337 -2408 -5565 -1495 2065 -879 -2462 2223 4859 559 -3597 -870 2186 -453
3014d53k451L087K838l054l737K369L289j576k410K206L431j979l883J204L434
$$ -453 -2904 183 3021 -33 -3770 -1401 1888 312 -2098 108 3539 1560 -2323 -1119 2315
3029B315p56l048J149K710j921l244j7L837N22j803J316K509o25l383j155K180
$$ 2315 1559 -1489 -340 2370 449 -2795 -2812 1025 1547 -256 1060 3569 2944 -439 -1594 586
3045E86L4j739J04K782L42k534r03K072J281j580n95J867Q38j888j965J757J156
$$ 586 620 -1119 -1015 1767 2109 -425 -1328 744 2025 445 -150 1717 2555 667 -1298 459 1615
3062A615r78j064N90J385j387j600J567J896p7p99O82M01j084k109j62J478O9
$$ 1615 637 -427 163 1548 161 -1439 128 2024 1947 1148 1830 2231 1147 -962 -1124 354 423
3079D23j070N23J876q2j437q6J274L85j634l55J262j54j039r83J630O87j225o04
$$ 423 -647 -124 1752 1670 233 147 1421 1806 172 -183 1079 925 -114 -1097 533 1220 -5 -609
3097f09R08N53j184j76J406J090n26j064J33J17j470r29M52J084K16m18J037Q35
$$ -609 299 852 -332 -508 898 1988 1462 398 531 648 -822 -1751 -1299 -215 1 -417 620 1455
3115A455m47j141J32O01m14j210J93P10l10q69N43P70J67o35n71J076M07n35m00
$$ 1455 1008 -133 -1 600 186 -1024 -831 -121 -431 -1300 -757 13 180 -455 -1026 50 457 -78 -478
3134d78J167j00o35o91J34q7j085K05R04N48m5J32Q29j44o29p19J65p5m52l19
$$ -478 689 589 -46 -737 -603 -690 -1775 -1570 -666 -118 -163 -31 798 654 25 -694 -529 -604 -1056 -1375
3154a375N05L78k08J33M11L70l67j42QK23M3m2n9K00j54o95k24lJ08k53O81P18
$$ -1375 -870 -492 -700 -567 -156 214 -153 -295 -287 -64 -21 -63 -122 78 -76 -771 -995 -998 -890 -1143 -462 256
3176B56J89R4pRk90o70l82j44n9k2K48N67M39K2k27L14j18R0o65L22J62j41k33
$$ 256 445 539 532 541 251 -419 -801 -945 -1004 -1026 -778 -211 228 250 23 337 219 309 -356 -34 128 -13 -246
3199b46k48j24J90l66k5J78J48L98L50O04l34J30l64m50j93o72N3R3K61J17J36
$$ -246 -494 -618 -428 -794 -819 -641 -493 -95 255 859 525 655 291 -159 -352 -1024 -971 -878 -617 -500 -364
3220c64Q53n7L12l72j37l37l70m4J6M9O2J23k35j08p5J05N66j12r6N41N74l75
$$ -364 489 432 744 372 235 -102 -472 -516 -500 -451 -389 -266 -501 -609 -684 -579 -13 -125 -221 320 894 519
3242E19m22n11j26K05q44K37J18M69r6L29O16L80k05p18m47Q0m21j11L36L32k61
$$ 519 97 -414 -540 -335 -1179 -942 -824 -355 -451 -122 494 874 669 -49 -496 -416 -837 -948 -612 -280 -541
3263e41K6L29K61k65m60Q07L69m5n53L59O08j064n20J26K53k35l42N33R14J79
$$ -541 -515 -186 75 -190 -650 157 526 481 -72 287 895 -169 -689 -563 -310 -545 -887 -354 560 739
3283G39m58O76M89l48q22n42O42m09p10J40R93L20m86K9R20j98n77m27P76Q59
$$ 739 281 957 1446 1098 276 -266 376 -33 -743 -603 390 710 224 253 1173 975 398 -29 747 1606
3303A606r27o47P03j37q66o49J168Q31m37o81Q51J255r95p48P09Q40p05j677m5
$$ 1606 679 32 735 598 -268 -917 251 1082 645 -36 815 2070 1075 327 1036 1876 1171 -506 -551
3322e51Q34j24j188Q88K086j5j350J94J076o38j478qJ958O6j449q62J405M6k045
$$ -551 283 159 -1029 -141 1945 1930 580 774 1850 1212 -266 -274 1684 1750 301 -561 844 890 -1155
3341a155j50K527R31j601q00J808K74j737r96J886J257k197k286J605J721j289
$$ -1155 -1305 1222 2153 552 -248 1560 1834 97 -899 987 2244 47 -2239 -634 1087 -202
3357b02j293K216K815j823k386M77J334j912j770K134K837j450k734J055J948
$$ -202 -1495 721 3536 1713 -673 -196 1138 -774 -2544 -410 2427 977 -1757 -702 1246
3372A246j537k377K128L095j046k870P63K166j075l322J187L426m41l822L16K925
$$ 1246 -291 -2668 -540 2555 1509 -1361 -598 1568 493 -2829 -1642 1784 1343 -2479 -2163 762
3388G62k50k621J065L991l20l473j417K626o82k852M40M013J050l141j592L119
$$ 762 512 -2109 -1044 2947 2627 -846 -2263 363 -319 -3171 -2731 1282 2332 -809 -2401 718
3404G18J84l286j42L588J908l228k285K180J192k752j418L261K431k367k555J739
$$ 718 902 -2384 -2526 1062 2970 -258 -2543 -363 829 -1923 -3341 -80 2351 -16 -2571 -832
3420h32K065k072j554K892K799k255l522N01J999j570k070K477L637k74l440L5
$$ -832 1233 -839 -2393 499 3298 1043 -2479 -1978 21 -1549 -3619 -1142 2495 2221 -1219 -1184
3436a184K034q82k691J389L901K40l464j463K011j77k443K62M212J242l049j740
$$ -1184 850 -32 -2723 -1334 2567 2807 -657 -2120 -109 -286 -2729 -2467 1745 2987 -62 -1802
3452a802J891Q94k144j023L589J973l333l071J310J757j498j217L613L541k360
$$ -1802 89 983 -1161 -2184 1405 3378 45 -3026 -1716 41 -1457 -2674 939 4480 2120
3467B120l880M16K358j456k486K444L977j149m662k83L034n59k431J234M880M4
$$ 2120 -1760 -1344 1014 -442 -2928 -484 3493 2344 -2318 -2601 433 -126 -2557 -1323 3557 3601
3483C601m641j543L427J0l042r9M843J050n409k260L708J321k860oN335J752m892
$$ 3601 -1040 -2583 844 854 -2188 -2287 2556 3606 -1803 -4063 -355 966 -1894 -1900 3435 5187 295
3500B95m349L205J980l349j352M957L673m307m468K527K858k589k380M524M287
$$ 295 -4054 -849 1131 -2218 -3570 1387 5060 753 -3715 -1188 1670 -919 -3299 1225 5512
3515E512l909n061J633L604k395k939L470M667k520n955J135M447r83l263K949
$$ 5512 1603 -3458 -1825 1779 -616 -3555 -85 4582 2062 -3893 -2758 1689 706 -2557 392
3530C92N058j960o590m34L967J05l866J970N900l96n884j327M228M10l709O79
$$ 392 5450 3490 -3100 -3534 433 538 -3328 -1358 4542 4146 -1738 -3065 1163 1573 -2136 -1457
3546a457N569P17n559l099L780J632l300m92N346J842m856l397L265K363k505
$$ -1457 4112 4829 -730 -3829 -49 1583 -1717 -2209 3137 4979 123 -3274 -9 2354 -151
3561a51j293M178K852m590m938K046L242j953j522L769M006k900n102Q39L395
$$ -151 -1444 2734 5586 996 -3942 -1896 1346 -607 -2129 1640 5646 2746 -2356 -1517 1878
3576A878j264k364K671M158k322n057m18L571L98k989J739M777j014n195j192
$$ 1878 614 -1750 921 5079 2757 -2300 -2718 853 1251 -1738 1 4778 3764 -1431 -2623
3591b623L896J144k993K45L721K81n519k180L553K479k389m33M253J434m464l855
$$ -2623 1273 2417 -576 -331 3390 3671 -1848 -4028 -475 2004 -385 -818 3435 4869 405 -3450
3607c450K647K552j941j653L426K598l917m151K003L761j516j950L089K951l316
$$ -3450 -803 1749 -192 -1845 1581 4179 262 -3889 -1886 1875 359 -1591 1498 4449 1133
3622A133m361J103L662p83k518J690L043k090m553K95M430K93k493J265L611j590
$$ 1133 -3228 -2125 1537 754 -1764 -74 2969 879 -3674 -3379 1051 1344 -1149 116 3727 2137
3638B137n105m85L295Q55k700O37L419Q5m203j666L400J873k431m24L165N21l827
$$ 2137 -2968 -3453 -158 697 -2003 -1366 2053 2138 -2065 -3731 -331 1542 -889 -1313 1852 2373 -1454
3655a454k206K352K346j906j434K910J168k960k742K263L295j257j584J708J933
$$ -1454 -3660 -1308 1038 -868 -2302 608 1776 -1184 -3926 -1663 1632 375 -1209 499 2432
3670B432k483l709J111K992m87j440J145K659r54l635M85K912k78j857L51K303
$$ 2432 -51 -3760 -2649 343 -144 -1584 -439 2220 1266 -2369 -1884 1028 750 -1107 -756 1547
3686A547r34l117l09L071L85j669j93K245M81k523j512K767J508j694p97J495
$$ 1547 613 -2504 -2813 258 643 -1026 -1219 1026 1507 -1016 -2528 239 1747 53 -744 751
3702G51P82l119j727K161K519j498j053K115J437j834k591J400J732n37j809J354
$$ 751 1533 -1586 -3313 -1152 1367 -131 -1184 931 2368 534 -2057 -657 1075 538 -1271 83
3718H3J686j754k290Q15K415k3k228J018K462j396k455P40K024M3j730l12J542
$$ 83 1769 15 -2275 -1460 955 932 -1296 -278 2184 788 -1667 -927 1097 1140 -590 -902 640
3735F40j48k686k17K774J059j606k5J836Ok465p73J924M11j759l35K167M07k069
$$ 640 492 -2194 -2411 363 1422 -184 -209 1627 1633 -832 -1605 319 730 -1029 -1364 803 1210 -859
3753h59p48J774J295j342p63J441N59j810j362J734R81r94j356J258Q52j357j052
$$ -859 -1607 167 1462 120 -643 798 1357 -453 -1815 -81 900 -94 -1450 -192 660 -697 -1749
3770a749J435J658m81q85L35J119j330j575L04J492o65p17O48J071j17j215N17
$$ -1749 -314 1344 863 -22 313 1432 102 -1473 -1169 323 -342 -1059 -411 660 543 -672 -155
3787a55R73M4j172R5Q12l60j022K04Q07J41p44r2Q10P6n77K19M64O50o59P3K39
$$ -155 818 862 -310 -215 597 237 -785 -581 226 367 -377 -469 341 417 -160 59 523 1173 514 587 826
3808H26l23p99p46P85L65K35l47O64M8N9l86M53k47m86k05K09O25k09p20J41M33
$$ 826 503 -296 -1042 -257 108 343 -4 660 708 767 381 834 587 101 -104 105 730 521 -199 -58 375
3829C75K41j39j97N44j07k00K31M11j72n42m12O0j8j39m64R28J30Q3o3P87m10
$$ 375 616 477 280 824 717 517 748 1159 987 445 33 93 75 -64 -528 400 530 613 550 1337 927
3850I27m21j64J63j13l43m1J64K80j25q6j49N49q2j71k0M3J48o9m5k6k0l91j25
$$ 927 506 342 505 392 49 8 172 452 327 241 92 641 559 388 368 411 559 490 445 419 399 8 -117
3873a17M2j07K86k0M25K14l02L19m2l51l52k87J00k60P2RM93j89K85k94K90J08
$$ -117 -75 -182 104 84 509 723 421 740 698 347 -5 -292 -192 -452 -380 -371 122 -67 218 -76 214 322
3895C22j96k21k1K36k29j81J85k2l93l46J57O50n18j1N46M39j14Lk32l29k04j63
$$ 322 126 -95 -116 120 -109 -290 -105 -127 -520 -866 -709 -59 -577 -588 -42 397 283 286 54 -275 -479 -642
3917f42j42j26L53L04mM73k7k49k61M25m15lp2K29k13l14L87K8l2n55M43L07K27
$$ -642 -784 -910 -557 -253 -257 216 189 -60 -321 104 -311 -314 -386 -157 -370 -684 -297 -269 -301 -856 -413 -106 121
3940A21k53L00n3n3l69k66R6K0o18N9K18O20n4o6N59M48q07l66L46K47n50J9j43
$$ 121 -132 168 115 62 -307 -573 -477 -457 -1075 -1016 -798 -178 -232 -298 261 709 -98 -464 -118 129 -421 -402 -545
3963e45L13J03m93N41K63n24k22M48R6J49n00K32K08M2r98O14K46l12k24J47P94
$$ -545 -232 -129 -622 -81 182 -342 -564 -116 -20 129 -371 -139 69 111 -887 -273 -27 -339 -563 -416 378
3984C78J08n21j18R52k44j043P9J75J59n79l6P80R9m75j66O03J17o26j13M14O63
$$ 378 486 -35 -153 799 555 -488 -409 -234 -75 -654 -690 90 189 -286 -452 151 268 -358 -471 -57 606
4005F06q70k99M34N81j422m95J046N11m70m02O97Q29o40o85O54P58o86q81j36
$$ 606 -264 -563 -129 452 -970 -1465 -419 92 -378 -780 -83 746 106 -579 75 833 147 -734 -870
4024h70N12l22l41P91J016j57j228M57O49n24r59O12R80r0j338J30Q78J09j559
$$ -870 -358 -680 -1021 -230 786 629 -599 -142 507 -17 -976 -364 616 526 -812 -682 196 305 -1254
4043a254M68J690K72j270l30J307Q0j441k07J222M64j181j080J142M34q14j17
$$ -1254 -786 904 1176 -94 -424 883 963 -478 -685 537 1001 -180 -1260 -118 316 -498 -615
4060f15J788R28j451j040M31J022j334q55J509J231r36j759M69J422p05j065J425
$$ -615 1173 2101 650 -390 41 1063 -271 -1126 383 1614 678 -1081 -612 810 105 -960 465
4077D65J974q69j757N5J425r04j403P40J795k93k199R1J811J86j519k7K719K36
$$ 465 2439 1570 -187 -132 1293 389 -1014 -274 1521 1228 -971 -880 931 1117 -402 -429 2290 2526
4095B526k581r94J838J99j783k50K703Q40k404j148J972Q95k106o79K700J125
$$ 2526 -55 -1049 789 988 -795 -1045 1658 2498 94 -1054 918 1813 -293 -972 1728 2853
4111B853k254j652J174J279j864j220K144K059k075k066J446J908j494j409K000
$$ 2853 599 -1053 121 1400 -464 -1684 460 2519 444 -1622 -176 1732 238 -1171 829
4126H29K143j660k886J49K400j334j695J650L067r37k655k11K081l2k577J289
$$ 829 2972 1312 -1574 -1425 975 -359 -2054 -404 2663 1726 -929 -1140 941 909 -1668 -379
4142c79K932k73l476p47K185N49k747J75L449O56l186j017K395P11k298m0K831
$$ -379 2553 2280 -1196 -1943 242 791 -1956 -1781 1668 2324 -862 -1879 516 1227 -1071 -1111 1720
4159A720O26l002k273K128J144k027j50L102J953l168k340J476J809j853j363
$$ 1720 2346 -656 -2929 -801 343 -1684 -1834 1268 3221 53 -2287 -811 998 -855 -2218
4174b218K659K086k285k656P65J839r38j170J962K676j630k973P4J944N6k043
$$ -2218 441 2527 242 -2414 -1649 190 -748 -1918 44 2720 1090 -1883 -1809 135 191 -1852
4190a852J192K323n67l062m48K226M26j580N18L206k01l169j590J863Q71j631
$$ -1852 -660 1663 1096 -1966 -2414 -188 238 -1342 -824 2382 2181 -988 -2578 -715 156 -1475
4206a475J13K726Q69l071j506J202J529j014n26K155K021k759k930J390K057q33
$$ -1475 -1362 1364 2233 -838 -2344 -1142 387 -627 -1153 1002 3023 264 -2666 -1276 781 -52
4222e2j770J851K200j711l251N92K968o0j809J377K428j078l752q17L065L82j883
$$ -52 -1822 29 2229 518 -2733 -2141 827 767 -1042 335 2763 1685 -2067 -2884 181 563 -1320
4239a320M58L179k24l874q59K876J239k413J11K985K01l936j169K365J551k000
$$ -1320 -862 2317 2093 -1781 -2640 236 1475 -938 -827 2158 2359 -1577 -2746 -381 1170 -830
4255h30q03L252J147l608k405K399K457j588j860L275J739l692l298J688L523
$$ -830 -1633 1619 2766 -842 -3247 -848 1609 21 -1839 1436 3175 -517 -3815 -2127 1396
4270A396j563j556K304K796k873l228J015L108j075k183K114K758k136l968O14
$$ 1396 -167 -1723 581 3377 504 -2724 -1709 1399 324 -1859 255 3013 877 -3091 -2477
4285b477L442l68k565J877K846j054m096N04K908J73k330O01K677p13l779q73
$$ -2477 965 597 -1968 -91 2755 1701 -2395 -1891 1017 1190 -1140 -539 2138 1425 -2354 -3227
4301c227L416J155j915QL106k09l596j448K484J700j948m74K444M12k460k200
$$ -3227 189 1344 -571 -563 2543 2334 -1262 -2710 -226 1474 -474 -948 1496 1908 -552 -2752
4317b752K281K020j288j002J952J765l071j838J404K048j217j127J423J687k052
$$ -2752 -471 1549 261 -741 1211 2976 -95 -1933 -529 1519 302 -825 598 2285 233
4332B33k385J194K381k50j306J211J381j197k640j08K174N4r54J54J998o17k550
$$ 233 -2152 -958 1423 1173 -133 1078 2459 1262 -1378 -1486 688 742 -212 -58 1940 1323 -1227
4349a227l69K540O34j645K43J434L4k377r34J846J257j590k85J422Q07k285j326
$$ -1227 -1596 944 1578 -67 176 1610 1644 -733 -1667 179 1436 -154 -439 983 1790 -495 -1821
4366a821J823J922j106r00P90J289k048j880J165J752m34r23Q71J294j137j882
$$ -1821 2 1924 818 -82 708 1997 -51 -1931 -766 986 552 -371 500 1794 657 -1225
4382a225L40K145k38j579L99J534o77k285Q8K005L86j458J45J455j57j875r0J537
$$ -1225 -885 1260 1022 -557 -158 1376 699 -1586 -1498 507 893 -565 -420 1035 878 -997 -1087 450
4400D50R76j340o02J076K5j970q74J988J051j119l23J115O52j253j450J328J231
$$ 450 1426 86 -516 560 585 -1385 -2259 -271 780 -339 -662 453 1105 -148 -1598 -270 961
4417I61j034r80J245N65j534j184J495J343o70j102N29J262p12j142L35J128j13
$$ 961 -73 -1053 192 757 -777 -1961 -466 877 207 -895 -366 896 184 -958 -623 505 392
4434C92j133K10Q33p10j376O49J344N49j397M73R19m22j356q6J106N49j356j17
$$ 392 -741 -531 302 -408 -1784 -1135 209 758 -639 -166 753 331 -1025 -1111 -5 544 -812 -929
4452i29Q88K26r06o06J538M20j151k25Q75N15j115k59O92P90j167m50M73K41k05
$$ -929 -41 185 -721 -1327 211 631 -520 -745 130 645 -470 -729 -37 753 -414 -864 -391 -150 -355
4471c55q00J014R74l66q13N71M83o95r82O02L87p6o08J28Q60M4p19j70J179Q9
$$ -355 -1155 -141 833 467 -346 225 708 13 -969 -367 20 -56 -664 -536 324 368 -351 -521 658 747
4491G47r45j63N24k54n83k65J124J13p39k19N84L27m06j4N13M51p05l18K72J80
$$ 747 -198 -361 163 -91 -674 -939 185 298 -441 -660 -76 251 -155 -169 344 795 90 -228 44 224
4511B24p63O9M99J33l31k43Q20M0p86Q1M09K40k91m31R2K41m28k79N46L57m7n23
$$ 224 -539 -470 29 162 -169 -412 408 448 -338 -257 152 392 101 -330 -238 3 -425 -704 -158 199 152 -371
4533c71O04j81O8j6m0K72K98o75m43J28L6q9k93N46L00k43l9O94m51l81o5L43
$$ -371 233 52 120 104 64 336 634 -41 -484 -356 -320 -409 -702 -156 144 -99 -138 556 105 -276 -341 2
4555BL8l45j26J94L92q6l79M70K76k58k18J76J77l95L09k05n0L69n71k71N48j73
$$ 2 40 -305 -431 -237 155 69 -310 160 436 178 -40 136 313 -82 227 22 -28 341 -230 -501 47 -126
4577a26Q9K37L78j03j63K00j3k60o05L06J59K21m94J25L59RJ38K7k31M80l51j22
$$ -126 -37 200 578 475 312 512 499 239 -366 -60 99 320 -174 -49 310 319 457 484 253 733 382 260
4599B60j24Rq4K8k94L08J41k06m7K97L32l40K17K7m67M13k34P2l41K27j64J41
$$ 260 136 145 61 89 -205 103 244 38 -9 288 620 280 497 524 57 470 236 308 -33 194 30 171
4621A71q9L5L63J70l57M7r0K64R8l87o3j38K44n35M83K0q6j5J44j8Q4j78j22N89
$$ 171 82 117 480 650 293 340 250 514 612 225 162 24 268 -267 216 236 150 135 279 261 345 167 45 634
4645F34r2o22j2P1J29n28J06J13L20p9k0M97n9o08J64J98j03m04l77K68L88O9
$$ 634 542 -80 -92 -21 108 -420 -314 -201 119 40 20 517 458 -150 14 212 109 -295 -672 -404 -16 53
4667E3l99M3K98k70J27K21m1k34K9j05N16m00n63P28pk56n15R78O0J21l30P1L32
$$ 53 -346 -303 -5 -275 -148 73 32 -202 -173 -278 238 -162 -725 3 -4 -260 -775 203 263 384 54 125 457
4690D57n10k68j94N25l49n92O22N25j79n94K87M13N7n13j07Q30R0p79J98q8k1
$$ 457 -53 -321 -515 10 -339 -931 -309 216 37 -557 -270 143 200 -313 -420 410 500 -279 -81 -169 -190
4711a90j61j29M18O67n83k27M24J99m86k86N68K32l44p91L40K72l68k47O11P97
$$ -190 -351 -480 -62 605 22 -205 219 418 -68 -354 214 446 102 -689 -349 -77 -445 -692 -81 716
4731G16l26r58N60N02p20k44M60M41j44q97o1P03J79r68M37P35N9k80k88J86O73
$$ 716 390 -568 -8 494 -226 -470 -10 431 287 -610 -671 32 211 -757 -320 415 474 194 -94 92 765
4752G65r72l8P24L0q83n15O97K98k70m61J163N61p11j014O83K98o90n91R31P58
$$ 765 -207 -245 479 509 -374 -889 -192 106 -164 -625 538 1099 388 -626 57 355 -335 -926 5 763
4772G63o07j231Q01P78p54l76L99J410p24j212L28J193m63j510Q41J159l20j526
$$ 763 156 -1075 -274 504 -250 -626 -227 1183 459 -753 -425 768 305 -1205 -364 795 475 -1051
4790a051K08J001K59r10J54J444j73j819l24J065R1j198N35J554K43j659m14J307
$$ -1051 -843 158 417 -493 -339 1105 932 -887 -1211 -146 -55 -1253 -718 836 1079 -580 -994 313
4808C13k5j169R2J744M20j761j213J160J222j435o12J499J201j375j384J222R03
$$ 313 288 -881 -789 955 1375 -386 -1599 -439 783 -652 -1264 235 1436 61 -1323 -101 802
4825H02p89q43J417J214j287j880P64Q89n32p78R62K014j628j426L06J568l46
$$ 802 13 -830 587 1801 514 -1366 -602 287 -245 -1023 -61 1953 325 -1101 -795 773 427
4842D27j296Q64J512k24k092n39J625J18j025k5K149j9k335p6J172Q24j381k7
$$ 427 -869 -5 1507 1283 -809 -1348 277 395 -630 -655 1494 1475 -860 -936 236 1060 -321 -348
4860c48J767Q0k271m78J053J063j178k61J763R38k027j881J488J116j115n93J571
$$ -348 1419 1499 -772 -1250 -197 866 -312 -573 1190 2128 101 -1780 -292 824 -291 -884 687
4877F87J233j584j872Q56J243k51j170J399J805j281k335M60J754k92j460J009
$$ 687 1920 336 -1536 -680 563 312 -858 541 2346 1065 -1270 -810 944 652 -808 201
4893B01J881j029k518l5K146L64j451M90J764j27k516j023K001N84j339l7K116
$$ 201 2082 1053 -1465 -1500 646 1010 -441 49 1813 1686 -830 -1853 148 732 -607 -644 1472
4910A472K71k752p18J707J223j417m28K091N21k332j236R84J380r39q84J512J206
$$ 1472 1743 -1009 -1727 -20 1203 -214 -642 1449 1970 -362 -1598 -614 766 -173 -1057 455 1661
4927A661j927j635J334J409o80p94J490R38j608k259P08J786l77j051R97J715
$$ 1661 -266 -1901 -567 842 162 -632 858 1796 188 -2071 -1363 423 46 -1005 -8 1707
4943A707j019k444K38J965J31j011L77J656o72k106p55K117M55j119R5J417j55
$$ 1707 688 -1756 -1518 447 578 -433 -56 1600 928 -1178 -1933 184 639 -480 -385 1032 877
4960H77j761q23J762J034r78n06J322K56j717j829J540J625p93n34J210R98j851
$$ 877 -884 -1707 55 1089 111 -395 927 1183 -534 -2363 -823 802 9 -525 685 1683 -168
4977a68j568P38J815k72j245Q54J343j115k105O97J907k41j515O54J549p12j860
$$ -168 -1736 -998 817 545 -700 154 1497 382 -1723 -1026 881 640 -875 -221 1328 616 -1244
4994a244N1K070J51j260j20J446m77k103l03K152J015j486m06J908J0k292r66
$$ -1244 -1193 877 1028 -232 -352 1094 617 -1486 -1789 363 1378 -108 -514 1394 1404 -888 -1854
5011a854J764J403j335p18J361L64j682j439J816J715j193j085J453J070j800
$$ -1854 -90 1313 -22 -740 621 985 -697 -2136 -320 1395 202 -883 570 1640 -160
5026a60j663J291J875j282q63Q75J021j372j769J347J875l73j297O52R71o87k459
$$ -160 -1823 -532 1343 61 -802 73 1094 -278 -2047 -700 1175 802 -495 157 1128 441 -2018
5043b018O65K028k25j003J83J474o58j731oJ645O53j235k58J219pk266K05J586
$$ -2018 -1353 675 450 -553 -370 1104 446 -1285 -1291 354 1007 -228 -486 733 726 -1540 -1335 251
5061B51P52j633k30J415L62j888o95J714R80r35q30J486k69r94r26R33J273m35
$$ 251 1003 -630 -860 555 917 -971 -1666 48 1028 93 -737 749 480 -514 -1440 -507 766 331
5079C31q18P00Q10j131r71J025J063o14q11L68R23r57j132L80J248J86r50L65
$$ 331 -487 213 1023 -108 -1079 -54 1009 395 -416 -48 875 -82 -1214 -834 414 600 -350 15
5097A5M08l08q80K65J143J39r19l24O30Oj111J55Q81P32q77j14M82L70q07l53
$$ 15 423 115 -765 -500 643 782 -137 -461 169 175 -936 -781 100 832 -45 -159 323 693 -114 -467
5117d67P10L65l35l06J28L61m66q09O97P44j61q48O04O95m16q23L77J119n90o82
$$ -467 243 608 273 -33 95 456 -10 -819 -122 622 461 -387 217 912 496 -327 50 1169 579 -103
5137a03p0N56l43n77NJ195O6m95k02P17N7p73n57P39k1k33k92M11K50p16J23O49
$$ -103 -173 383 40 -537 -532 663 729 234 32 749 806 33 -524 215 194 -39 -331 80 330 -386 -263 386
5159C86L64p23j71K86L80p54l88P12L31m07k85l1L34q5m03M65Q51j68o15n4M17
$$ 386 750 27 -144 142 522 -232 -620 92 423 16 -269 -300 34 -51 -454 11 862 694 79 25 442
5180D42l29p11K03P99j09p91L7R45j36q20K55N23k0n67rJ17M56o66J29L66K20
$$ 442 113 -598 -395 404 295 -496 -459 486 350 -470 -215 308 288 -279 -288 -171 285 -381 -252 114 334
5201C34n18j61M64j31p6q5L18J50j00k37K38k21k05j37M59J94q9j57M2J70l39
$$ 334 -184 -345 119 -12 -88 -173 145 295 195 -42 196 -25 -230 -367 92 286 197 40 82 252 -87
5222h7o2J53J40l2m28O7M20k90m0r0J97K48j07k09K74j80J18J90m6k00J35k67
$$ -87 -149 4 144 112 -316 -249 171 -119 -159 -249 -52 196 89 -120 154 -26 92 282 236 36 171 -96
5244i6K75l85K09l01N51j13j26m2J44J41M4l36K70J3m62J44l07O26k29J39rq2
$$ -96 179 -206 3 -298 253 140 14 -28 116 257 301 -35 235 248 -214 -70 -377 249 20 159 150 68
5266F8P9j53K16J49k27J72l49j12L20m62L39J15l41q2L17J27n9Q8j4l93O78k67
$$ 68 147 -6 210 359 132 304 -45 -157 163 -299 40 155 -186 -268 49 176 117 205 191 -202 476 209
5288B09m65Q6p3LP2M00k64L96l15J03L8l87M02l4k57J6k35K96l63M03m23R9L65
$$ 209 -256 -170 -243 -240 -168 232 -32 364 49 152 190 -197 205 171 -86 -70 -305 -9 -372 31 -392 -293 72
5311G2j93R7M3j28J01j74k88K34lM2q7J39J35k34J41J49n8k83J39jR4k07K3N69
$$ 72 -121 -24 19 -109 -8 -182 -470 -236 -239 -197 -284 -145 -10 -244 -103 46 -12 -295 -156 -157 -63 -270 -247 322
5335C22k48m82o4J49K78j89K6K12L45k89%J76k43o2k92K72O0p9j67j9N53k34K99
$$ 322 74 -408 -472 -323 -45 -234 -208 4 349 60 60 236 -7 -69 -361 -89 -29 -108 -275 -294 259 25 324
5358C24k89J61j52k00M55j85Nk21J95j63R7n5o4K12j79J15J02N01k79m70J09L57
$$ 324 35 196 44 -156 299 114 119 -102 93 -70 27 -28 -92 120 -59 56 158 659 380 -90 19 376
5380C76l92m48K66N25J74o67J9N16Q6p57O81K2j33n91J3L82r5j14j45O76%p40
$$ 376 -16 -464 -198 327 501 -166 -147 369 455 -302 379 401 268 -323 -310 72 -23 -137 -282 394 394 -346
5402c46L98J62J41n09J47M31q4l71k16L51K99l19p02J160J78p10o9J12O30l77
$$ -346 52 214 355 -154 -7 424 340 -31 -247 104 403 84 -618 542 720 10 -59 53 683 306
5422C06l52K00L31l27p85M76K99j39n94O35N45o22k11K05L22J4o16J39P51m20
$$ 306 -46 154 485 158 -627 -151 148 9 -585 50 595 -27 -238 -33 289 303 -313 -174 577 157
5442A57p61L83K62k38o56N35J094n06o07M2N19k6m96J08N69j22p72p1L90M76m92
$$ 157 -604 -221 41 -197 -853 -318 776 270 -337 -295 224 198 -298 -190 379 257 -515 -586 -196 280 -212
5463b12J1Q95k21o81j78J53K71o21P0O96N09o97q27O47L61j31m50R52K21m61o88
$$ -212 -201 694 473 -208 -386 -233 38 -583 -513 183 692 -5 -832 -185 176 45 -405 547 768 307 -381
5484c81L53L51j25p70Q47K30k62q65J44J133n5q31P8P75k64p25k73O72Q9l98J7
$$ -381 -28 323 198 -572 275 505 243 -622 -478 655 600 -231 -153 622 358 -367 -640 32 121 -277 -260
5505b60Q15J11j086l26Q08M89p35J13O80K30r15q30J433m0m82r07J132P09r66
$$ -260 555 666 -420 -746 62 551 -184 -71 609 839 -76 -906 527 487 5 -902 230 939 -27
5524b7j152R75Q77l73o73M49Q13r60r37O21P57k95m36M59J230n86j536J44J377
$$ -27 -1179 -204 673 300 -373 76 889 -71 -1008 -387 370 75 -361 98 1328 742 -794 -650 727
5543G27m49q23M68J109l92j379o8J100K27j104L41J313Q0j796k25R57N02p39n48
$$ 727 278 -545 -77 1032 640 -739 -807 293 520 -584 -243 1070 1150 -646 -871 86 588 -151 -699
5562f99J695m61j362n96J123P66r65j18J564J56j397o32N36J078q33m87R56R09
$$ -699 996 535 -827 -1423 -300 466 -499 -617 947 1103 -294 -926 -390 688 -145 -632 324 1233
5580A233j786r24O41J434l92p68O11J028j271q87M25J163k17o08M53Q30p36j296
$$ 1233 -553 -1477 -836 598 206 -562 49 1077 -194 -1081 -656 507 290 -318 135 965 229 -1067
5598a067J36J320n2q15L47J468q55j343j77J290K1m73p5R61K07j638j93J062O81
$$ -1067 -931 389 337 -478 -131 1337 482 -861 -1038 252 273 -200 -275 686 893 -745 -938 124 805
5617H05o57n66J236J55j763n15J255Q20p93k63P29K89r68j001Q44J453n92r77
$$ 805 148 -418 818 973 -790 -1305 -50 770 -23 -286 443 732 -236 -1237 -393 1060 468 -509
5635e09R03R95j154j778O09J453j78o59N93Q35o87j348M5J558J21q48Q8Q27l20
$$ -509 394 1389 235 -1543 -934 519 341 -318 275 1110 423 -925 -880 678 799 -49 39 866 546
5654E46j576k04J590L66o26k72R15q5j558l77J827N20n18r92R04N92j790o97J356
$$ 546 -1030 -1234 356 722 96 -176 739 654 -904 -1281 546 1066 548 -444 460 1052 -738 -1435 -79
5673g9P05o69k02R07M14j371q55Q44J258p53n11N74P66o97j957Q84J376k95j057
$$ -79 626 -43 -245 662 1076 -295 -1150 -306 952 199 -312 262 1028 331 -1626 -742 634 339 -718
5692g18Q07R74o58j487K22J447k3r20K14J063r69j236L51J318L07q98j64J169
$$ -718 89 1063 405 -1082 -860 587 564 -356 -142 921 -48 -1284 -933 385 692 -206 -370 799
5710G99n6j597k01J112O59q42n18J120K05j515k33R57R88m51q77R10J19j039m92
$$ 799 743 -854 -1055 57 716 -126 -644 476 681 -834 -1067 -110 878 427 -450 460 579 -460 -952
5729i52R45R99o66q29M93N94q92q78R65J122j43q70J10O74m11j384L54J284k05
$$ -952 -7 992 326 -503 -10 584 -308 -1186 -221 901 758 -112 -2 672 261 -1123 -769 515 310
5748C10o77J45P27k07j339M71J161J34p76k72P62q7j148j03R39N47m95o11P82
$$ 310 -367 -222 505 298 -1041 -570 591 725 -51 -323 439 352 -796 -899 40 587 92 -519 263
5767B63k8r46K3Q24Q91l80r18N66P2q01m37N96J077n15p38P12L13n45q30O86R99
$$ 263 235 -711 -688 136 1027 647 -271 295 367 -434 -871 -275 802 287 -451 261 574 29 -801 -115 884
5788H84n60n67K34K84l86p00M22J143m89p06K26N56j28j043M91J072L4r96k85
$$ 884 324 -243 -9 275 -111 -811 -389 754 265 -441 -215 341 213 -830 -339 733 767 -229 -514
5807e14Q49J0r76K47M25K72n33K0O48j13o09k07Q17K42q61l02P74k1l61n04O33
$$ -514 335 345 -631 -384 41 313 -220 -200 448 335 -274 -481 336 578 -283 -585 189 168 -193 -697 -64
5828f4N90n82l32M41N35q08l15M49P50n84m87L95k05m2j43J48R92p83m3Q2K91
$$ -64 526 -56 -388 53 588 -220 -535 -86 664 80 -407 -12 -217 -259 -402 -254 738 -45 -88 -6 285
5849B85l17m02J52M66k8l43K65%J58p10N3N69J62m31k36N95r4o08J42M76L77q10
$$ 285 -32 -434 -282 184 156 -187 78 78 236 -474 -421 148 310 -121 -357 238 144 -464 -322 154 531 -279
5871b79o4K93J32L83n12J98P7Pm22L09J64k65k47P5N33k21o24L87N18r8m92J82
$$ -279 -343 -50 82 465 -47 151 228 235 -187 122 286 21 -226 -151 382 161 -463 -76 442 344 -148 34
5893C4J39J66k32k41L47Q9j99j08J55L16m67m07Q27k49j47j81M16M49m43n60M66
$$ 34 173 339 107 -134 213 302 103 -5 150 466 -1 -408 419 170 23 -158 258 707 264 -296 170
5914A70J33l25k06N40p8k78k3K62q4J33n00J90N17l98j72K8J91l83J49N8J91j88
$$ 170 303 -22 -228 312 234 -44 -67 195 111 244 -256 -66 451 53 -119 -91 100 -283 -134 -76 115 -73
5936g3p6N52J5k92k3p4J11O5n63K55M3l5m86L52K31J49k45L72j65j93K75k63j95
$$ -73 -149 403 418 126 103 29 140 205 -358 -103 -60 -95 -581 -229 2 151 -94 278 113 -80 195 -68 -263
5959b63K27M9k61P3N11k02q6j31M75m88L14k99R8o7K22l73L66n46J68n2J61Kj7
$$ -263 -36 13 -248 -175 336 134 48 -83 392 -96 218 -81 17 -50 172 -201 165 -381 -213 -265 -104 -102 -119
5982a19j42M53N3o0j9m22J33j77R9N0Or2O9j45M68l24L66J0j39ml24K55M7k77
$$ -119 -261 192 245 185 166 -256 -123 -300 -201 -151 -145 -237 -168 -313 155 -169 197 207 68 64 -260 -5 42 -235
6006b35j57K11K56Q8k50K90j59J02Q6l71L03M8O8r9m61L21k32LN05j39m5K7j05
$$ -235 -392 -181 75 163 -87 203 44 146 232 -139 164 212 280 181 -280 41 -191 -188 317 178 133 160 55
6029E5J32k55M06k26q5l8m5o2J02p9K00j84P9q0J75L1K01k26k77K81P3l00J06
$$ 55 187 -68 338 112 27 -11 -56 -118 -16 -95 105 -79 0 -80 95 126 327 101 -176 105 178 -122 -16
6052a6J55j50l78L93j80K94l38K66J17L7j38l73M22J54l16k36L12lj99k36N31
$$ -16 139 -11 -389 4 -176 118 -220 46 163 200 62 -311 111 265 -51 -287 25 22 -177 -413 118
6073A18j07k9J38J07R7j80k91J66Q1j98k68M88J1O5m90J04K17J40n26N44k42k82
$$ 118 11 -18 120 227 324 144 -147 19 100 -98 -366 122 133 198 -292 -188 29 169 -357 187 -55 -337
6095c37J90k67J94R9n81L63L37M4p1n27N41r6k6K9J71J73m18j36J63K16m32L0
$$ -337 -147 -414 -220 -121 -702 -339 -2 42 -29 -556 -15 -111 -137 -108 63 236 -182 -318 -155 61 -371 -341
6117c41M74N5l33J06N8K40n44p2L94J91k36k50j73O68k92j67M56K88m42l34L19
$$ -341 133 188 -145 -39 19 259 -285 -357 37 228 -8 -258 -431 237 -55 -222 234 522 80 -254 65
6138F5q4P6l44J23M31k3o76J92N31k16m15L49L93o3m91J78N06k45n86N52p9J09
$$ 65 -19 57 -287 -164 267 244 -432 -240 291 75 -340 9 402 339 -152 26 532 287 -299 253 174 283
6160B83n24k37L02N68m29k50L03K43l78k22N57q1k27q4N80J41n19o62O78K62j82
$$ 283 -241 -478 -176 392 -37 -287 16 259 -119 -341 216 135 -92 -176 404 545 26 -636 42 304 122
6181A22l90M10O17n96o78M29L82n98K65q5M64p82q9K70M71k03N8K1L04L5q61j6
$$ 122 -268 142 759 163 -515 -86 296 -302 -37 -122 342 -440 -529 -259 212 9 67 88 392 427 -434 -450
6203d50Q33j14o37J47P03p3q89J00N30K58p59N1P77J99j196j55O57J22o7j85N18
$$ -450 383 269 -368 -221 482 409 -480 -380 150 408 -351 -300 477 676 -520 -675 -18 104 37 -148 370
6224C70j02p26k15Q22L79k84l30M52L77r53p06P67K72j43k97N71J43l85n44L56
$$ 370 268 -458 -673 149 528 244 -86 366 743 -210 -916 -149 123 -20 -317 254 397 12 -532 -176
6244a76O75j30o18M35M91m56r54j22J208j59l99p0R81R7j287n5Q81K06n04j14
$$ -176 499 369 -249 186 677 221 -733 -855 353 194 -205 -275 706 803 -484 -539 342 548 44 -70
6264g0M46K15j174k75J414k1n36q2K90M49r84l51O27M23j43l86O42K44o11j273
$$ -70 376 591 -583 -858 556 535 -1 -83 207 656 -328 -679 -52 371 228 -158 484 728 117 -1156
6284a156P32J036k33r63Q30O24r72n32J05J014L64j163L61Q11p52j115M86J055
$$ -1156 -424 612 379 -584 246 870 -102 -634 -529 485 849 -314 47 858 106 -1009 -523 532
6302E32J6j044N84M78j09j086l23J355k2p76J48Q90m35p95k82J172L40n60o32
$$ 532 548 -496 88 566 457 -629 -952 403 381 -395 -247 643 208 -587 -869 303 643 83 -549
6321e49Q80J05j106k48J142M54o84m47P45L58j061p97J235M51j61p69M11N35q39
$$ -549 331 436 -670 -918 224 678 -6 -453 292 650 -411 -1208 27 478 317 -452 -41 494 -345
6340c45p66R63O21m74m06L45O25o77o96p5J132K48o94K26L00m77o28n0J192j23
$$ -345 -1111 -148 473 -1 -407 -62 563 -114 -810 -885 247 495 -199 27 327 -150 -778 -828 364 241
6360B41o54K73P20l91j098K56J048J12p82o0N20l14p31j50R47Q53r11k57Q12j44
$$ 241 -413 -140 580 189 -909 -653 395 507 -275 -335 185 -129 -860 -1010 -63 790 -121 -378 434 290
6380B90n64n47P57M73k80m80O48J67q36n01N43P98j70n75N15M2k12o67M47O15
$$ 290 -274 -821 -64 409 129 -351 297 464 -372 -873 -330 468 298 -277 238 280 68 -599 -152 463
6400D63o9l47m3J71Rp24J89P99rp50L43L98r1p49j23P38L65m40m08O30L0p98k45
$$ 463 394 47 4 175 184 -540 -351 448 439 -311 32 430 339 -410 -533 205 570 130 -278 352 382 -416 -661
6423f61P67O99r27j15L28L26p36l47P68N61l23o33L20K68o03n67Q11R04l72m67
$$ -661 106 805 -122 -237 91 417 -319 -666 102 663 340 -293 27 295 -308 -875 -64 840 468 1
6443AK60j3l29m29K98P94n7r49nO75q7n24J46N60J75m37j53K73p8n57K17P22J88
$$ 1 261 248 -81 -510 -212 582 525 -424 -429 246 159 -365 -219 341 516 79 -74 199 121 -436 -219 503 691
6466F91p51m39P65r2o54p8P81L10l27l70J98J64k92n26P33K94n17l09K97L63m62
$$ 691 -60 -499 266 174 -480 -558 223 533 206 -164 34 198 -94 -620 113 407 -110 -419 -122 241 -221
6487b21k93M16Q24k23n12M1J42j53o61N32O12k35l66K19J25l04l50j6P43J63n42
$$ -221 -514 -98 726 503 -9 32 174 21 -640 -108 504 269 -97 122 247 -57 -407 -423 320 483 -59
6508e9j08N24j08n84k38Q44j20j15j44K40Q3l29l21P94j31m25k11M34K66m92j71
$$ -59 -167 357 249 -335 -573 271 151 36 -108 132 215 -114 -435 359 228 -197 -408 26 292 -200 -371
6529c71O33J19k67l71M19J84j62j06N6M69m38k49jJ47J09m27K14N23p4l86o8M4
$$ -371 262 381 114 -257 162 346 184 78 134 603 165 -84 -85 62 171 -256 -42 481 407 21 -47 -3
6551cj47p9L17k62Q1m3j18M30j16k46j78O95Kk78k42K42R6j72j10M8K69l56j43
$$ -3 -150 -229 88 -174 -93 -136 -254 176 60 -186 -364 331 333 55 -187 55 151 -21 -131 -83 186 -170 -313
6574c13N08k00pK08p7K69m85J05R5J7k89m6J38K45k85m2J62K94m40J19j53L50
$$ -313 195 -5 -12 196 119 388 -97 8 103 120 -169 -215 -77 168 -117 -159 3 297 -143 -24 -177 173
6596A73j65l87L13m3j14J08l15M57jj28k57M26J32j86k63J61K31l51J03J60R3
$$ 173 8 -379 -66 -109 -223 -115 -430 27 26 -102 -359 67 199 13 -250 -89 142 -209 -106 54 147
6617A47m24p3K83J89k96L96l94k5K76l18J82J27j81k76O24p13N00l85J46N58m36
$$ 147 -277 -350 -67 122 -174 222 -172 -197 79 -239 -57 70 -111 -387 237 -476 24 -361 -215 343 -93
6638i3k72L12K58j62M5k8QQ7l56K4J68J44l24r4K16N9J81j10N7Oj70M3J98l02
$$ -93 -365 -53 205 43 88 60 68 155 -201 -177 -9 135 -189 -283 -67 -8 173 63 120 126 -44 -1 197 -105
6662a05k2K00L03j81l80Q6L2P3M33m63l0J57j62K66k3j19j68Q2j30K26K32M1m3
$$ -105 -127 73 376 195 -185 -99 -67 6 439 -24 -54 103 -59 207 184 65 -103 -21 -151 75 307 348 305
6685C05m4J0l06J94j72K41j63k15L45k21j21L32n7J74n37K36mk1K45m08J51j96
$$ 305 261 271 -35 159 -13 228 65 -150 195 -26 -147 185 128 302 -235 1 -3 -24 221 -187 -36 -232
6707b32K45j60K21j21J27k96J72K35j84k05K96j06K82m01r5j6J75N8j27RJ26L19
$$ -232 13 -147 74 -47 80 -216 -44 191 7 -198 98 -8 274 -127 -222 -238 -63 -5 -132 -123 3 322
6729C22m24o5R0q5n1K62k23j8N9OJ5M5J99j46k73K40k51M06k43J70J55j17l48
$$ 322 -102 -167 -77 -162 -213 49 -174 -192 -133 -127 -112 -67 132 -14 -287 -47 -298 108 -135 35 190 73 -275
6752b75K62m06L42j42j30L20k61L96j9Q5rK7j14k29J48j66J74j44J25r7n4R1O2
$$ -275 -13 -419 -77 -219 -349 -29 -290 106 87 172 163 190 76 -153 -5 -171 3 -141 -16 -113 -167 -76 -14
6775a4K15j46l57M71J54k46K17k24M63m76j25L00p2j76K83k22J43K2k96K41K12
$$ -14 201 55 -302 169 323 77 294 70 533 57 -68 232 160 -16 267 45 188 210 -86 155 367
6796C67l45m5j43L11M2k39M9M22j39l70K32J69j53n5Q0Q4Om32J51J70J58l25k53
$$ 367 22 -23 -166 145 187 -52 -3 419 280 -90 142 311 158 103 183 267 273 -159 -8 162 320 -5 -258
6819b58N09J24m47j09J21q8O6M66m47J07l17q3L24K6J37k39K60Q6m11Q8m0K90
$$ -258 251 375 -72 -181 -60 -148 -82 384 -63 44 -273 -356 -32 -6 131 -108 152 238 -173 -85 -125 165
6841A65l10Kj05L72R2m79J12K69P8l61J58K11k99k39M4N03J2m88J41K78j28m00
$$ 165 -145 -143 -248 124 216 -263 -151 118 196 -165 -7 204 -95 -334 -290 213 225 -263 -122 156 28 -372
6863c72J83K84k4j60j0K29K37l96l53K87K56n94N5N04J06o50j33O68K48m47j72
$$ -372 -189 95 71 -89 -99 130 367 -29 -382 -95 161 -433 -378 126 232 -418 -551 117 365 -82 -254
6884b54L10K15l73k87J36M60k45k71J59M04m23l96M23N11k80m52M33K10r5n78
$$ -254 56 271 -102 -389 -253 207 -38 -309 -150 254 -169 -565 -142 369 89 -363 70 280 185 -393
6904c93K61N5N8o15O23O98m64o16K5M17R4j54o3M58k25o14K0N32K07l16n25P16
$$ -393 -132 -77 -19 -634 -11 687 223 -393 -368 49 143 -11 -74 384 159 -455 -435 97 304 -12 -537 179
6926A79J12m55k08P07j12j89LJ84K71o18m35N08M30o26J08L30J33l35o26P32N99
$$ 179 291 -164 -372 335 223 34 37 221 492 -126 -561 -53 377 -249 -141 189 322 -13 -639 93 692
6947F92o10l8J80J30R4j115K69P88j09k68m25Q48M7r82K0R63k34o60K15M53k47
$$ 692 82 44 224 354 448 -667 -398 390 281 13 -412 436 483 -499 -479 484 250 -410 -195 258 11
6968A1o40k4P10M11m94J08J80Pp87j10P59K07l43l26O89p5p14j75N68M35k2q85
$$ 11 -629 -653 57 468 -26 82 262 269 -518 -628 131 338 -5 -331 358 283 -431 -606 -38 397 375 -510
6990e10O22j5j27p80P52P47l80n11L01K86n59l40K73N18o5j94k60N73j33o28K14
$$ -510 112 97 -30 -810 -58 689 309 -202 99 385 -174 -514 -241 277 212 18 -242 331 198 -430 -216
7011b16N09j47l92J0O75m86j06m53R99j02k79j26L53K76r67j25O18O22q12q4M62
$$ -216 293 146 -246 -236 439 -47 -153 -606 393 291 12 -114 239 515 -452 -577 41 663 -149 -233 229
7032B29K73q75k00N23O66l32n68L54P12n95r15O38N92k22l89J57L55n46l94L50
$$ 229 502 -373 -573 -50 616 284 -284 70 782 187 -728 -90 502 280 -109 48 403 -143 -537 -187
7052a87Q19kq49L05K69l74p96O07O43k20n06K80M10j28n61N0N76N7l43l10M99
$$ -187 632 630 -219 86 355 -19 -815 -208 435 215 -291 -11 399 271 -290 -240 336 393 50 -260 239
7073B39N7m83l16P33M3o0n61L74N66o46o08J002K49k90o64M37M07p04o81J220
$$ 239 296 -187 -503 230 273 213 -348 26 592 -54 -662 340 589 299 -365 72 479 -225 -906 314
7093C14K65l10l84N6R6k31l88M00Q21k84l21j89K66l71j26K6P28k9n75J07N22
$$ 314 579 269 -115 -59 37 -194 -582 -182 639 355 34 -155 111 -260 -386 -360 368 339 -236 -129 393
7114C93j78p75Q5O37Km33j71L46J55l16l0L34L32l30l95O43k35o16J32N17N69
$$ 393 215 -560 -475 162 164 -269 -440 -94 61 -255 -285 49 381 51 -344 299 64 -552 -420 97 666
7135F66p30j77K71pn65Q2N36O50n87j91J78J97n65l44J90N25K28p52n3N24k04
$$ 666 -64 -241 30 23 -542 -460 76 726 139 -52 126 323 -242 -586 -396 129 357 -395 -448 76 -128
7156a28n6l8O30K7l66n1L28m56l10K88N11j16p14R6M31N34p31j27K14K95L3l37
$$ -128 -184 -222 408 435 69 18 346 -110 -420 -132 379 263 -451 -355 76 610 -121 -248 -34 261 294 -43
7178d3J29L37m15l01J82N11k98l82M88J14m21j62P37J10l52m95K43M84n32j93
$$ -43 86 423 8 -293 -111 400 102 -280 208 322 -99 -261 476 586 234 -261 -18 466 -66 -259
7198b59Q6N56j87m49k22O83J27q42N56J25Q6l42N7N7R9k88l13N45K47l60k43N30
$$ -259 -173 383 196 -253 -475 208 335 -507 49 174 260 -82 -25 32 131 -157 -470 75 322 -38 -281 249
7220B49Lj5n20L82J36l89j40K81K01l34K23J84N8j80m52L90m9j30l58M31K19K7
$$ 249 252 237 -283 99 235 -154 -294 -13 188 -146 77 261 319 139 -313 77 28 -102 -460 -29 190 217
7242B17o7q8Oo9k7J47p4o6l5q4L20k64nK37j37l15k6j82N66J31m24K00K06n7k62
$$ 217 150 62 68 -1 -28 119 45 -21 -56 -140 180 -84 -89 148 11 -304 -330 -512 54 185 -239 -39 167 110 -152
7267a52N7M3O4j19L01j70n9K5m85L83j70J94L7Q7K51j38m72Q3L44j54k9J57j04
$$ -152 -95 -52 12 -107 194 24 -35 -10 -495 -112 -282 -88 -51 36 287 149 -323 -240 104 -50 -79 78 -26
7290b6j44j12K82K57K3j38j26J80j64J83o28O97j88j36J61R1o1l02J55r1J96o0
$$ -26 -170 -282 0 257 280 142 16 196 32 215 -413 284 96 -40 121 212 151 -151 4 -87 109 49
7312D9L41n37K98k27J07R9j00J86l51K22J73l69KK44O1j40q2m6J49J42j60j39
$$ 49 390 -147 151 -76 31 130 30 216 -135 87 260 -109 -107 137 198 58 -24 -70 79 221 61 -78
7334g8L23k4O9m03N2R5j22L40k8p3k3j95L05k15p7M9K87j56k18K00J05j85q0N7
$$ -78 245 221 290 -113 -61 34 -88 252 224 151 128 -67 238 23 -54 -5 282 126 -92 108 213 28 -52 5
7358EJ3J00Jm42K81J27j96K98k44M2k97L49N7m4k32o1R8M8rK18J6j29Q7k89n0
$$ 5 18 118 119 -323 -42 85 -111 187 -57 -15 -312 37 94 50 -182 -243 -145 -97 -106 112 128 -1 86 -203 -253
7383b53K62L16m34j2L4J03j67L67k41o6k3RK15Mj08LJ76m95J71J55j78J17j48
$$ -253 9 325 -109 -121 -87 16 -151 216 -25 -91 -114 -105 110 114 6 9 185 -310 -139 16 -162 -45 -193
7406a93K21o7J42l4k13j2J82l3j39j26K49o2p0M35j94k29L01J60k55l60M3R2O21
$$ -193 28 -39 103 69 -144 -156 26 -7 -146 -272 -23 -85 -155 280 86 -143 158 318 63 -297 -254 -162 459
7429D59m03j21J87QJ10r1M6k67J32k70J85J00k11J40j10L0K21m13P82k51k82K52
$$ 459 56 -65 122 130 240 149 195 -72 60 -210 -25 75 -136 4 -106 -76 145 -268 514 263 -19 233
7451B33l03J27k8k1j94K21n4J71j74J32K79p12L37J55M6k10K1k6Q0j18K01r1k40
$$ 233 -70 57 29 8 -186 35 -19 152 -22 110 389 -323 14 169 215 5 26 0 80 -38 163 72 -168
7474a68J03r1J10N8k4P3J96q2k97Q8j02K48j47j31R9J25j62K1R7Q9j27P1k23K54
$$ -168 -65 -156 -46 12 -12 61 257 175 -122 -34 -136 112 -35 -166 -67 58 -104 -83 14 103 -24 47 -176 78
7498G8k3k02q7M61l37J06N0Q0Q2m17jM77m24j61M06Q6n3l99M0K54J20j32j22J77
$$ 78 55 -147 -234 227 -110 -4 46 126 208 -209 -210 267 -157 -318 88 174 121 -278 -238 16 136 4 -118 59
7522E9n5j32N0K39k26K98m26J40N96p96J3L9M38j45M1Pr1l34L04j18J95k87L18
$$ 59 4 -128 -78 161 -65 233 -193 -53 543 -253 -240 -201 237 92 133 140 49 -285 19 -99 96 -191 127
7545A27K7%k3k52k9J56j92K23l36N82Q6n01J08k6K98n71J11J54Ll3l28K36K98
$$ 127 154 154 131 -121 -150 6 -186 37 -299 283 369 -132 -24 -50 248 -323 -212 -58 -55 -88 -416 -180 118
7568A18j31J6K7ML9j65K2K48k95K00L5j01j91k81L23M30l57j40L34O6k60k37M5
$$ 118 -13 3 30 34 73 -92 -70 178 -117 83 118 17 -174 -455 -132 298 -59 -199 135 201 -59 -296 -251
7591b51N87j27k50J64R3Mp30L17M43M7n17L56K12l10k63q6M35M2l10l6M82n10
$$ -251 336 209 -41 123 216 220 -510 -193 250 297 -220 136 348 38 -225 -311 124 166 -144 -180 302 -208
7613b08l12L87J40P8O1m56N82K29r62M46R2J61k37o6L23l83j05j42M12K11n01
$$ -208 -520 -133 7 85 146 -310 272 501 -461 -15 77 238 1 -65 258 -125 -230 -372 40 251 -250
7634b50J63J53n3m26O7M47Q7j62l15P3O88n62m01N19L79J48n85J45M8j59l80K07
$$ -250 -87 66 13 -413 -346 101 188 26 -289 -216 472 -90 -491 28 407 555 -30 115 163 4 -376 -169
7656a69M56j17m31J53J71Lk21r9L60K72m66J64J39l02l04J31L76K19j22n53M29
$$ -169 287 170 -261 -108 63 66 -155 -254 106 378 -88 76 215 -87 -391 -260 116 335 213 -340 89
7677H9k2k88j38L05O54o54j41L84J03n24j55J11N26l2m90K77J13j71k44K91M30
$$ 89 67 -221 -359 -54 600 -54 -195 189 292 -232 -387 -276 250 218 -272 5 118 -53 -297 -6 424
7698D24P9n97q9N57l17k43m5M01K66m90K52l2M9n14L41N16k92m11R6N47m70k11
$$ 424 503 -94 -183 374 57 -186 -231 170 436 -54 198 166 215 -299 42 558 266 -145 -49 498 28 -183
7720a83l11N69N94l37o08N69j62k74j64L87J18l54J15J21M44r51R1M60K80q1n32
$$ -183 -494 75 669 332 -276 293 131 -143 -307 80 198 -156 -41 80 524 -427 -336 124 404 323 -209
7741b09M93J6m50k06K05O13l06m79L29M14p11J30j14P57k28m94k9P34m14l94Q6
$$ -209 284 300 -150 -356 -151 462 156 -323 6 420 -291 -161 -275 482 254 -240 -269 465 51 -343 -257
7762b57Q27k73n39m0O18l21n20J43O11K25p18R9M01j88m52N4N29M38p76k2L23
$$ -257 570 297 -242 -282 336 15 -505 -362 249 474 -244 -145 256 68 -384 -330 199 637 -139 -161 162
7783A62J24o44k51O10N14n32k47K41j2o2k81J55M79O6n84R9J18P9m47L16O39p6
$$ 162 286 -358 -609 1 515 -17 -264 -23 -35 -97 -378 -223 256 322 -262 -163 -45 34 -413 -97 542 466
7805D66q92K90J47L9k73k18P32J54m33j2J06J93l75k13N80Lm88k62N82n6j79m25
$$ 466 -426 -136 11 50 -223 -441 291 445 12 0 106 299 -76 -289 291 294 -194 -456 126 70 -109 -534
7827e34Q51l68L07l35M30J63p76l8P61k0l22m81O3N98n30RL87K21l96Q7l4L44
$$ -534 317 -51 256 -79 351 514 -262 -300 461 441 119 -362 -299 299 -231 -222 165 386 -10 77 43 387
7849C87k75j11q8L61k96k45j2N58l50k24QQ18n52n2L5K71O7l64j73N39k8k41j77
$$ 387 112 1 -87 274 -22 -267 -279 279 -71 -295 -287 531 -21 -73 -38 233 300 -64 -237 302 274 33 -144
7872a44M20j47l50Q3N00j82m25R3J91O8l00M37j85K35k75j97j89L49j50m5J61
$$ -144 276 129 -221 -138 362 180 -245 -152 39 107 -193 244 59 294 19 -178 -367 -18 -168 -213 -52
7893e2M60m41j93J15j21J96l13L58M2m8j62J50L8r7k29J39J46N90o46J65j9k06
$$ -52 408 -33 -226 -111 -232 -36 -349 9 51 3 -159 -9 29 -68 -297 -158 -12 578 -68 97 78 -128
7915a28j4j4K40j09m46J56N09j80K15l51J38M00n21j70N63p0j01l60K50N4j00
$$ -128 -142 -156 84 -25 -471 -315 194 14 229 -122 16 416 -105 -275 288 218 117 -243 7 61 -39
7936c9jl1J43j56N9L0Q2j31Rk24K23L61l93n2M17k93k21K78M2j40n9J38K85m42
$$ -39 -40 -71 72 -84 -25 5 87 -44 -35 -259 -36 325 -68 -120 297 4 -217 61 103 -37 -96 42 327 -115
7960a15k8L5J85P9m48KK88O3j4j93M4J73n5j33N26j29r3l45K57J27k44j74O66
$$ -115 -143 -108 77 156 -292 -290 -2 61 47 -146 -102 71 16 -117 409 280 187 -158 99 226 -18 -192 474
7983D74k09n85K1J85K15p1j74N21j24l09q7M9K48l45R1M59k60K7k97J99j78J21
$$ 474 265 -320 -299 -114 101 30 -144 377 253 -56 -143 -94 154 -191 -100 359 99 126 -171 28 -150 -29
8005b9j24K76p5j36J41J3K10j64j15j03K96j5l40L2J85k63Q2m8L94r2n03L30J37
$$ -29 -153 123 48 -88 53 66 276 112 -3 -106 190 175 -165 -133 52 -211 -129 -177 217 125 -378 -48 89
8028H9K3k03n4nM44l08J38k60K26k8j17k66K63o5r5K57q3J68K8Lm9K72m42M9L
$$ 89 112 -91 -145 -150 294 -14 124 -136 90 62 -55 -321 -58 -123 -218 39 -44 124 152 155 106 378 -64 -15 -12
8053a2J11p1j72L09k61K04k61L03r8m00M84J85n01k1K55J84l94J89o4J05K24k78
$$ -12 99 28 -144 165 -96 108 -153 150 52 -348 136 321 -180 -201 54 238 -156 33 -31 74 298 20
8075B0pr2L11k3j48J11Q2j22j55j29L96l62M85k70k4J98l76L9k7jK4J32J37l8
$$ 20 13 -79 232 209 61 172 254 132 -23 -152 244 -118 367 97 73 271 -105 -66 -93 -94 -70 62 199 161
8099A61m53M61l8j7k27K55O9o5j16J20j88J77N8k70j76J83R7K2L61m77J54k2N7
$$ 161 -292 169 131 114 -113 142 211 146 30 150 -38 139 197 -73 -249 -66 31 53 414 -63 91 69 126
8122A26l7r7l83L04K58k47J48j30K32j73j13L28l52R8m4q3M33k60j25k7j02K94
$$ 126 89 -8 -391 -87 171 -76 72 -58 174 1 -112 216 -136 -38 -82 -165 268 8 -117 -144 -246 48
8144D8j8j62o2J41K25l52J82R6o2k35J87M6r6K55k44j33K24k4o9J07l05J26J50
$$ 48 30 -132 -194 -53 172 -180 2 98 36 -199 -12 34 -62 193 -51 -184 40 16 -53 54 -251 -125 25
8167B5k25j04K28J22j55J70K35l49P6J61l87K10k8j19J63L9M0k20l33J36N12k60
$$ 25 -200 -304 -76 46 -109 61 296 -53 23 184 -203 7 -21 -140 23 62 102 -118 -451 -315 197 -63
8189f3k25L13
$$ -63 -288 25
8191B5
$$ Imaginary data points
##PAGE= N=2
##DATA TABLE= (X++(I..I)), XYDATA
0@%%%%%%Qj6J6j6K4l2M0m8N6p2Q8j04J22j46J72j98K29k66L08l53M03m59N22n89
$$ 0 0 0 0 0 0 0 8 -8 8 -8 16 -16 24 -24 32 -40 48 -56 66 -80 92 -106 123 -143 165 -188 215 -244 278 -311
30c11O63p48Q40r39J047j169J303j446J604j780J973k185K419k678K967l289L653
$$ -311 352 -396 444 -495 552 -617 686 -760 844 -936 1037 -1148 1271 -1407 1560 -1729 1924
47A924m066M538n086N729o499P433q598J0108j2147J5069j9641K7882m7404J77276
$$ 1924 -2142 2396 -2690 3039 -3460 3973 -4625 5483 -6664 8405 -11236 16646 -30758 146518
61A46518J91268k11735m3435L5642k8342j31687N3041J73864M7384j37491m2154
$$ 146518 337786 126051 82616 118258 89916 -41771 11270 185134 232518 95027 52873
72E2873Q0980N839j12159J1776J44316M0140j31094n5917Q8685L9131q5552r028
$$ 52873 133853 139692 27533 39309 183625 223765 92671 36754 125439 164570 79018 69990
84F9990J15143L0236j39479r1085O7838O2222m5350L201J22734O0997j12185j15601
$$ 69990 185133 215369 75890 -15195 52643 114865 69515 72716 195450 256447 144262 28661
96B8661J8970L5977n7862k9210R7159Q5430n6461q4723K3668N0782m1177n0264
$$ 28661 47631 83608 25746 -3464 93695 179125 122664 37941 61609 112391 71214 20950
108B0950N3899P1005m1006q2770R844N7013j8422n3826K3415N8024k8892q5389
$$ 20950 74849 145854 104848 22078 31922 88935 70513 16687 40102 98126 69234 -16155
120a6155j1617N9891J5943l1656J9455O6389r47q3806n0189K4612J0546l7740
$$ -16155 -27772 32119 48062 16406 35861 102250 101303 17497 -32692 -8080 2466 -35274
132c5274p43O8494M0970m4831m7237J7777J8797m0655l4677L8095M5383k9575
$$ -35274 -36017 32477 73447 28616 -18621 -844 17953 -22702 -57379 -19284 26099 -3476
144c476n0664J6008M1861j8068m1160K1412M8054k3050o6634j948N2996P128l5634
$$ -3476 -54140 -38132 3729 -14339 -55499 -34087 13967 -9083 -75717 -77665 -24669 -17541 -53175
157e3175J6519N7593j1307q2113l6070L8632J4386l2451J5963P8432K5798o4740
$$ -53175 -36656 20937 9630 -72483 -108553 -69921 -55535 -87986 -72023 6409 32207 -32533
169c2533m4880K6227P986n1550j5908O3330L7529m8074l7791M0540L3141l9301
$$ -32533 -77413 -51186 -43200 -94750 -110658 -47328 -9799 -57873 -95664 -55124 -21983 -61284
181f1284k8464M6916L4768n1031n2415L4648N0150k0156k8843L9755L7731n0833
$$ -61284 -89748 -42832 -8064 -59095 -111510 -76862 -26712 -46868 -75711 -35956 1775 -49058
193d9058p0653J4340N1328m875j9575M6566N8488k8865p0464p802L3327j5449
$$ -49058 -119711 -105371 -54043 -58918 -78493 -31927 26561 -2304 -72768 -80570 -47243 -62692
205f2692l8293K7772O2292k165m8244L306M6583j108m3331L963M3774n299n2336
$$ -62692 -100985 -73213 -10921 -13086 -61330 -58024 -11441 -12549 -55880 -51917 -8143 -13442 -65778
218f5778o599M8259J6378l1003l070L7580j30n1956k0755L9256K9722j4209L047
$$ -65778 -72377 -24118 -7740 -38743 -41813 -4233 -4363 -56319 -77074 -37818 -8096 -22305 -19258
231a9258M1496J3152m5195l7156J3722J4366k0933p681L8265L2226j7254k2034
$$ -19258 22238 35390 -9805 -46961 -33239 -18873 -39806 -47487 -9222 23004 5750 -16284
243a6284J7157J9933k0786k5370J3882K1902j5264k3572J6611L2218j694k0598
$$ -16284 873 20806 20 -25350 -11468 10434 -4830 -28402 -11791 20427 18733 -1865
255a865O895J9091j3763l0481L915L1306J1169j0899P440K0567r436l6984j5763
$$ -1865 5030 24121 10358 -20123 -16208 15098 26267 15368 22808 43375 33939 -3045 -18808
268a8808J5338O338r333J0048L3785J4267j8619j1309J1086K69k4076j2640J6929
$$ -18808 -3470 2868 -6465 3583 37368 51635 33016 21707 32793 33062 8986 -3654 13275
281A3275J1817j2200o063K0946J6330j1486j4336P528P031j6465j4378J4638K0825
$$ 13275 25092 12892 6829 27775 44105 32619 18283 25811 32842 16377 1999 16637 37462
294C7462p42q873O490N588j8823k2711R58J4766L137l03J6579J9059l859j8842
$$ 37462 36720 27847 34337 39925 21102 -1609 -651 14115 17252 16949 33528 52587 48728 29886
308B9886o353K025j1108j7037J677J5376N388m023O403J4333O48j3893p401K686
$$ 29886 23533 25558 14450 -2587 -910 14466 19854 15831 22234 36567 37215 23322 15921 18607
322A8607k894r582N41J3394P364n020m706k57n929j3551n875P613R768M118O024
$$ 18607 15713 6131 6672 20066 27430 22410 17704 17447 11518 -2033 -7908 -295 9473 13591 19615
337A9615R752K767j1035j2567o652n349q238k837Q669J1751N822K356M079N58
$$ 19615 29367 32134 21099 8532 1880 -3469 -11707 -14544 -5875 5876 11698 14054 18133 18691
351A8691p654j1523n930q63q10M02N614O809J686m030m797l990m994l189J631
$$ 18691 11037 -486 -6416 -7279 -8089 -7687 -2073 4736 6422 2392 -2405 -6395 -11389 -14578 -12947
366a2947P325O690N127K976on774j0740q705n647j681J122O223J0207Q607L588
$$ -12947 -5622 1068 6195 9171 9165 3391 -7349 -16054 -21701 -23382 -22260 -16037 -5830 2777 6365
381F365q92l255n836q754p542j826K265M761N344N330L229l37l282m269l863j395
$$ 6365 5473 2218 -3618 -12372 -19914 -21740 -19475 -14714 -9370 -4040 -811 -1148 -4430 -8699 -12562 -13957
397a3957J466L791M442L417J424j330m758p241o281k547P43M087P134Q276P269
$$ -13957 -12491 -8700 -4258 -841 583 -747 -5505 -12746 -19027 -21574 -20831 -16744 -9610 -1334 5935
412E935L217j589m380n894p197n409j847J814N311N875N780L532J46j629k904
$$ 5935 9152 7563 3183 -2711 -9908 -15317 -17164 -15350 -10039 -4164 1616 5148 5294 3665 761
427G61l597k426o82J836L529K188L04o06j289l367m317j148K755M744M397N364
$$ 761 -2836 -5262 -5944 -4108 -579 1609 1913 1307 18 -3349 -7666 -8814 -6059 -1315 3082 8446
443H446O037K911k914o969n502n705o394l594K992O805N532M824N343L138k837
$$ 8446 14483 17394 14480 7511 2009 -3696 -10090 -13684 -10692 -3887 1645 6469 11812 14950 12113
458A2113o146k668j352k962j587M269N114m92l190M09J181l620n388J395O377
$$ 12113 5967 3299 1947 -1015 -2602 1667 6781 6289 3099 3508 4689 1069 -4319 -2924 3453
473C453K690j57L654N344j691r374o768k427m343n868J879R900Q488K837K430
$$ 3453 6143 5986 9640 14984 13293 3919 -2849 -5276 -9619 -15487 -13608 -3708 4780 7617 10047
488A0047M250k423r631p114J76M79l147M26O723M337m576l993J852K129n107m855
$$ 10047 14297 11874 2243 -4871 -4695 -4216 -7363 -6937 -214 4123 -453 -4446 -2594 -465 -5572 -10427
504a0427L625O472n64k914L250N216l997j0904m648K270j471l548O029J4100P614
$$ -10427 -6802 -330 -894 -3808 -558 4658 661 -10243 -14891 -12621 -14092 -17640 -11611 2489 10103
519A0103l562m041M67n414j3976o591O619P122k546q18R602N653q214q300O337
$$ 10103 6541 2500 2967 -2447 -16423 -23014 -16395 -9273 -11819 -12637 -3035 2618 -5596 -13896 -7559
534g559P010p308q579P681J0953n679r637P289J1079p845j6466J325J1789k468
$$ -7559 -549 -7857 -16436 -8755 2198 -3481 -13118 -5829 5250 -2595 -19061 -17736 -5947 -8415
548h415r307R806K1871r58j8095m428P930r560k0266L203K4588Q383j1841K680
$$ -8415 -17722 -7916 13955 12997 -5098 -9526 -1596 -11156 -31422 -28219 -3631 4752 -7089 -4409
562d409J8784j552k3227m918K0204N042k0603n332K0340M695k2059o782K3852
$$ -4409 14375 12823 -10404 -15322 4882 9924 -10679 -16011 4329 9024 -13035 -19817 4035
575D035J0458k1755j1982J9788J0936j8868o863K8407J7807k1773k1048J1357
$$ 4035 14493 -7262 -19244 544 11480 -7388 -14251 14156 31963 10190 -10858 499
587D99O013k4259j4171K9187K9131j0649j6614J5456J3090k5659k4987J8085K6730
$$ 499 6512 -17747 -31918 -2731 26400 15751 -863 14593 27683 2024 -22963 -4878 21852
600B1852j2453k2979J2580K1065j5680k3846J6374L1831p573k7061N328K2744
$$ 21852 9399 -13580 -1000 20065 4385 -19461 -3087 28744 21171 -5890 -562 22182
612B2182r192k4736J1629L3066k994l2678p100J7523o889k5314R419M0406J2609
$$ 22182 12990 -11746 -117 32949 29955 -2723 -9823 7700 811 -24503 -15084 25322 37931
625C7931k4321q843J7858l795l1883o091L1857J5560k3285j3365J9641Q973k4052
$$ 37931 13610 4767 22625 18830 -13053 -19144 12713 28273 4988 -8377 11264 20237 -3815
638c815j1164K9522K2169k0730k3169J3230J4533j9078j6524K4032K7249j6268
$$ -3815 -14979 14543 36712 15982 -7187 6043 20576 1498 -15026 9006 36255 19987
650A9987l0060M492J7471j3538j8518K3139L8090m622l1322l143J6212j4210l0949
$$ 19987 -10073 -5581 11890 -1648 -20166 2973 41063 36441 5119 1976 18188 3978 -26971
663b6971R342L9490N842k9369m547K4944j369l0977M60L8054J0981l3476j5777
$$ -26971 -17629 21861 27703 -1666 -6213 18731 17362 -13615 -13155 24899 35880 2404 -13373
676a3373K1671N598k9764o333L8700K0260l1011k3999J8558J2310k6593j0139
$$ -13373 8298 13896 -15868 -22201 16499 36759 5748 -18251 307 12617 -13976 -24115
688b4115M0080L1104k5750l2832R513J1471k8880k1255L4851M0709j3250l1731
$$ -24115 15965 47069 21319 -11513 -2000 9471 -19409 -40664 -5813 34896 21646 -10085
700a0085Q832J9485k1763k8213K3875L9768r441l8583j005K1911j1828k6267J9654
$$ -10085 -1253 18232 -3531 -31744 -7869 31899 22458 -16125 -17130 4781 -7047 -33314 -13660
713a3660M5017n66l9621j0723K0252m787k5464J2959M5993P305m0900k3040J3848
$$ -13660 31357 30791 -8830 -19553 699 -4088 -29552 -16593 29400 36705 -4195 -27235 -13387
726a3387k03k5595O594M8100K2333l1270k5943J2539O830k4774o642L6593K4149
$$ -13387 -13590 -39185 -32591 15509 37842 6572 -19371 -6832 -2 -24776 -31418 5175 29324
739B9324k8474l3613Q267J7355j3512r250L3085L0851k2330m0198r52K1073p494
$$ 29324 850 -32763 -24496 -7141 -20653 -29903 3182 34033 11703 -28495 -29447 -8374 -15868
752a5868j4093K5138L5692j4234m5067j0098K3007K16j7270J8917M2549j19m3283
$$ -15868 -29961 -4823 30869 16635 -28432 -38530 -15523 -15307 -32577 -13660 28889 28770 -14513
765a4513j7691K2458N203k4555K237L8407P900l9686k2240K7067J9895j9154m943
$$ -14513 -32204 -9746 -4543 -29098 -26861 11546 19446 -20240 -42480 -15413 4482 -14672 -19615
778a9615L5293J5603m0568l3217K1117K4942j7309j2614L3298K4818l4244m0223
$$ -19615 15678 31281 -9287 -42504 -21387 3555 -13754 -26368 6930 31748 -2496 -42719
790d2719J6222L0948j2757j7963L0420L4787k4526m4165P905L0225j3042k8521
$$ -42719 -26497 4451 -8306 -26269 4151 38938 14412 -29753 -21848 8377 -4665 -33186
802c3186K0584L9891j3132m0866O516L7207m246l1445J1578L7976j0143m6180
$$ -33186 -12602 27289 14157 -26709 -20193 17014 12768 -18677 -7099 30877 20734 -25446
814b5446l305L6907K028k9863Q254M2289l46m4457j0201L3684P364k9399K869
$$ -25446 -28751 8156 10184 -19679 -11425 30864 30518 -13939 -24140 9544 16908 -12491 -9622
827i622M1835Q091m2379j9609K5909P681k9418l669M0850J8559l1795j9081K4611
$$ -9622 32213 40304 -2075 -21684 4225 11906 -17512 -21181 19669 38228 6433 -12648 11963
840A1963J2952k6150j1621L1086J6985k9737k4953J8419J8393j7270j0729K8543
$$ 11963 24915 -1235 -12856 18230 35215 5478 -19475 -1056 17337 67 -10662 17881
852A7881K2289k3472k8315R738J8372j0989j2781K1326K3393j6274l0723J8J5868
$$ 17881 40170 16698 -11617 -1879 16493 5504 -7277 14049 37442 21168 -9555 -9537 6331
865F331m921j0944J6926K6673n101k5111m557J3290j911j4067N262J9069j487
$$ 6331 1410 -9534 7392 34065 28964 3853 -704 12586 10675 -3392 1870 20939 19452
878A9452k3120q391J4702P840p403K028J7554L751k1328j5706Q878J0637m890
$$ 19452 -3668 -12059 2643 10483 3080 5108 22662 26413 5085 -10621 -1743 8894 4004
891D004l056J3564Q380j6656j9281L476J4230N80m845J0831J4300r425k1436k665
$$ 4004 948 14512 22892 6236 -13045 -9569 4661 5241 396 11227 25527 16102 -5334 -7999
905g999J2570M86j1170L447J4042k563j9030j746J7943P324j0830j609J3699j244
$$ -7999 4571 5057 -6113 -2666 11376 8813 -10217 -11963 5980 13304 2474 865 14564 13320
919A3320k1475r235J5956J0482j0544m498J4093N184j8968j2460J4420J3503p445
$$ 13320 -8155 -17390 -1434 9048 -1496 -5994 8099 13283 -5685 -18145 -3725 9778 2333
932B333o955J2897P856j6434j6573Q576J2828q081r966J2039J3058j0479j3724
$$ 2333 -4622 8275 16131 -303 -16876 -8300 4528 -3553 -13519 -1480 11578 1099 -12625
945a2625R357J5248n990j3193N660J0502j0217j7282N424J5726j374j1223N392
$$ -12625 -3268 11980 5990 -7203 -1543 8959 -1258 -18540 -13116 2610 1236 -9987 -4595
958d595J3262m971j5921J797J4598M10j1233K211J1306l359j5985k002J1894J462
$$ -4595 8667 3696 -12225 -10428 4170 4580 -6653 -4442 6864 3505 -12480 -14482 -2588 -1126
972a126q850J975J2858J597j1625k517J1080J352j0954l654Q019N83j1133l354
$$ -1126 -9976 -8001 4857 6454 -5171 -7688 3392 4744 -6210 -9864 -1845 -1262 -12395 -15749
986a5749J0483O772n083k501P815L231q450n797N817M885m549m123M336K770o594
$$ -15749 -5266 1506 -3577 -6078 1737 4968 -3482 -9279 -3462 1423 -3126 -7249 -2913 -143 -6737
1001f737o020L843N703j788k255N620N147k924m963J010K929l220o029O87L485
$$ -6737 -12757 -8914 -3211 -4999 -7254 -1634 3513 589 -4374 -3364 -435 -3655 -9684 -8997 -5512
1016e512j120k673K334O444J301k451n42K250j407m234j335K721J210k261j051
$$ -5512 -6632 -9305 -6971 -527 774 -1677 -2219 31 -1376 -5610 -6945 -4224 -3014 -5275 -6326
1031f326J677N91k915m55L070K664J9P69K274R12k532k819j54k39k288k024J973
$$ -6326 -4649 -4058 -6973 -7428 -4358 -1694 -1675 -906 1368 2280 -252 -3071 -3225 -3464 -5752 -7776 -5803
1048e803K877J134M3J992K529n87k572p27K52j120j611J7J431P98m05L65P41M18
$$ -5803 -2926 -1792 -1749 243 2772 2185 -387 -1114 -862 -1982 -3593 -3576 -2145 -1347 -1752 -1387 -646 -228
1066b28N4O93J906Q61k28k8k88p26k538j458o51O03K0R82K751J763J613o3J63
$$ -228 -174 519 2425 3286 3058 3030 2742 2016 -522 -1980 -2631 -2028 -2008 -1026 1725 3488 5101 5038 5201
1085E201j56j448j715j334r0m6j71J003Q95M76P15N41K01J57J79M70k69M49j049
$$ 5201 5045 3597 1882 548 458 412 241 1244 2139 2615 3330 3871 4072 4229 4408 4878 4609 5058 4009
1104D009p42j241r88o27k33J001R13J469K226J519O57m34j191j263j767j846j167
$$ 4009 3267 2026 1038 411 178 1179 2092 3561 5787 7306 7963 7529 6338 5075 3308 1462 295
1121B95J8K56J254O53J465J213J64k36M5n01k16j29l88k30j048j020k97k12p76
$$ 295 313 569 1823 2476 3941 5154 5318 5082 5127 4626 4410 4281 3893 3663 2615 1595 1298 1086 310
1140C10r0J439K081Q30M63J011P35j127k585j367j420j119j145M75K177J552L68
$$ 310 220 1659 3740 4570 5033 6044 6779 5652 3067 1700 280 -839 -1984 -1509 668 2220 2588
1157B588R16J589p42j628n29Q78o15k009K78J058p32k574j45K323M43j241P19
$$ 2588 3504 5093 4351 2723 2194 3072 2457 448 726 1784 1052 -1522 -1667 656 1099 -142 577
1174E77L532J320k420q96K113l39m334k698J206O92k151l81M971L519j493j347
$$ 577 4109 5429 3009 2113 4226 3887 -447 -3145 -1939 -1247 -3398 -3779 1192 4711 3218 1871
1190A871J891J270m220k687K307K620l045l225K210K664l031l010L933M558j956
$$ 1871 3762 5032 812 -1875 432 3052 7 -3218 -1008 1656 -1375 -4385 -452 4106 2150
1205B150l338L281L779l121n429J628M365l260o049J112N770j680l638L477P355
$$ 2150 -1188 2093 5872 2751 -2678 -1050 3315 55 -5994 -4882 888 -792 -4430 -953 6402
1220F402l47n859M3L707k786p410P63O096K02n292kN903Ro501M30P306K581n540
$$ 6402 6055 196 239 3946 1160 -6250 -5487 609 811 -4481 -4483 1420 1429 -5072 -4642 2664 5245 -295
1238b95k355N217L76p768l467N632L602n406l350M532M378m248k508O238N989
$$ -295 -2650 2567 2943 -4825 -8292 -2660 942 -4464 -7814 -3282 1096 -3152 -5660 578 6567
1253F567m256o279R71K034n392n825M936P747m80n224J737M752l296o307J730
$$ 6567 2311 -3968 -2997 -963 -6355 -12180 -7244 503 23 -5201 -3464 1288 -2008 -8315 -6585
1268f585R071O70o970k366M568j624q071p49Q834N094o019l795O102L155o981
$$ -6585 2486 3156 -3814 -6180 -1612 -3236 -11307 -12056 -3222 1872 -4147 -7942 -1840 1315 -5666
1283e666l068R183O225p599r441K623M031o801m937J0397J2082l983j0111K785
$$ -5666 -8734 449 6674 -925 -10366 -7743 -3712 -10513 -15450 -5053 7029 3046 -7065 -4280
1297d280O954o893r380P635J4015l378j3783J14R665m389j2204O034J7957N32
$$ -4280 2674 -4219 -13599 -5964 8051 4673 -9110 -8996 669 -3720 -15924 -9890 8067 8599
1311H599j5307j384J2178r98j4104J876J7937J764j8535o292J2969K272j3582
$$ 8599 -6708 -8092 4086 3088 -11016 -9140 8797 10561 -7974 -14266 -1297 975 -12607
1324a2607J852K2003P150j7772r505J2134L564j6784m280K0730J0910j7662j2493
$$ -12607 -10755 11248 18398 626 -8879 3255 6819 -9965 -14245 6485 17395 -267 -12760
1337a2760J2681P664j4778o857K0747J4882j5245j5028J0658J0151j4517j0808
$$ -12760 -79 7585 -7193 -14050 6697 21579 6334 -8694 1964 12115 -2402 -13210
1349a3210J6514J6153j3650j7937Q169J3482r923j1475J7138K0634j0370k1118
$$ -13210 3304 19457 5807 -12130 -3961 9521 -402 -11877 5261 25895 15525 -5593
1361e593L162J2232j0210j5032J3059K2527m758k0346J406J4825o413j5552Q858
$$ -5593 -2431 9801 -409 -15441 -2382 20145 15387 -4959 -3553 11272 4859 -10693 -1835
1374a835K3065m88k0781l573J2036l427j6170L930K1854L480j8537o961J2576
$$ -1835 21230 20742 -39 -3612 8424 4997 -11173 -7243 14611 18091 -446 -7407 5169
1387E169K588j2918J935K0866P093j8638j4179O990M001j1718k380K0773J3762
$$ 5169 7757 -5161 -3226 17640 24733 6095 -8084 -1094 2907 -8811 -11191 9582 23344
1400B3344j2791j5601M261O877q389o389J5196J5926q722j8891j050Q458n055
$$ 23344 10553 -5048 -787 6090 -2299 -8688 6508 22434 13712 -5179 -6229 2229 -2826
1413b826q156J0569J8362k727j8746m321J1287J027r847N740J7727n59k1925j0944
$$ -2826 -10982 -413 17949 15222 -3524 -7845 3442 4469 -5378 362 18089 17530 -4395 -15339
1427a5339J0152N299q145K713K0796P128j9756j5787Q704Q559r186l265J7905
$$ -15339 -5187 112 -8033 -5320 15476 22604 2848 -12939 -4235 4324 -4862 -8127 9778
1440I778J0925j7859j9079O628J3102o774p237J5672J6184j3433k1204M600J5991
$$ 9778 20703 2844 -16235 -9607 3495 -3279 -10516 5156 21340 7907 -13297 -8697 7294
1453G294n292j1522J0722J7302j2171k4814J310J9217M52j1722R178K1038n894
$$ 7294 2002 -9520 1202 18504 6333 -18481 -17171 2046 2498 -9224 -46 20992 15098
1466A5098k6689m313J7432K154j5084L933K2390p47k4264p588J7862N912j4704
$$ 15098 -11591 -15904 1528 3682 -11402 -7469 14921 14174 -10090 -17678 184 6096 -8608
1479h608n9K1488M851k2526j1466J5607Q040j4543n811J8436Q227j9499j4100
$$ -8608 -8667 12821 17672 -4854 -16320 -713 7327 -7216 -13027 5409 13636 -5863 -19963
1492a9963J4741J3608j0399p184J6605J2478j7910j9927P678J3071p988r963J4518
$$ -19963 -5222 8386 -2013 -9197 7408 19886 1976 -17951 -10273 2798 -5190 -15153 -635
1505f35J6726j0696j9709L714J4508m683j1503J0158J7864o943k0853o81J3870
$$ -635 16091 5395 -14314 -10600 3908 -775 -12278 -2120 15744 8801 -12052 -12733 1137
1518A137j951j2683N396J8454j345j9800l548J5827M067j1975Q11J6965R03k1632
$$ 1137 -814 -13497 -8101 10353 9008 -10792 -14340 1487 5554 -6421 -5610 11355 12258 -9374
1532i374j0733J2412P908r251n00J7859P312j7447j4048R775R741q249n025J4106
$$ -9374 -20107 -7695 213 -9038 -9538 8321 15633 -1814 -15862 -6087 3654 -4595 -9620 4486
1546D486J0349j4976j6446O509J1932o056p339J2299J3339j0655j7032M685J4680
$$ 4486 14835 -141 -16587 -10078 1854 -4202 -11541 758 14097 3442 -13590 -8905 5775
1559E775k523j0263O737J2253q900j9835K48J5963K966q035N925J4405m271j9402
$$ 5775 3252 -7011 -274 11979 3079 -16756 -16508 -545 2421 -5614 311 14716 10445 -8957
1573h957l884J3613L563j0228J973J3604l41j7913n437J3127O251q692o03J2960
$$ -8957 -12841 772 4335 -5893 -3920 9684 9343 -8570 -14007 -880 5371 -3321 -3924 9036
1587I036K864j4640p668J1065Q086q053n220R021M038j3492q713J0118J1541l915
$$ 9036 11900 -2740 -10408 657 8743 690 -4530 4491 8529 -4963 -13676 -3558 7983 4068
1601D068m300Q594M877j1191j1556M794Q988k724n952O936P545o794j0311L592
$$ 4068 -232 8362 13239 2048 -9508 -4714 4274 1550 -4402 2534 10079 3285 -7026 -3434
1615c434R420j329o465M071P949m085r942L33Q616j1p314P0O497q55q126J46R121
$$ -3434 5986 4657 -1808 2263 10212 6127 -3815 -3482 5134 5123 -2191 -2121 4376 3521 -4605 -4459 4662
1632D662M086m629j108M141n10r060m722N253M472k378j430N631L053n413n011
$$ 4662 8748 4119 3011 7152 6642 -2418 -7140 -1887 2585 207 -1223 4408 7461 2048 -2963
1647b963L357M772k315l758L206M207m430n957J745M860o20m901J215M755q43
$$ -2963 394 5166 2851 -907 2299 6506 2076 -3881 -2136 2724 2104 -2797 -1582 3173 2330
1662B330m533J240O657J411m891j869K251j843o615j400O357L605k322m32M751
$$ 2330 -2203 -963 5694 7105 2214 345 2596 753 -5862 -7262 -905 2700 378 -54 4697
1677D697J303o087l230M046K661l780k298L875K618m483l874L570L459k707l032
$$ 4697 6000 -87 -3317 729 3390 -390 -2688 1187 3805 -678 -4552 -982 2477 -230 -3262
1692c262K962M260k450k934L155L820k894n077J50K534l436k795L008N590M89
$$ -3262 -300 3960 1510 -1424 1731 5551 2657 -2420 -2270 264 -3172 -5967 -2959 2631 3120
1707C120j924J522K732k677n049OL213p46l042R96M056l31l246J7L211p2k861
$$ 3120 1196 2718 5450 2773 -2276 -2270 943 197 -2845 -1849 2207 1876 -1370 -1353 1858 1786 -1075
1724a075J48L223Q78k389k62K055m10l353j672J220L91j517J322L722J840n31
$$ -1075 -927 2296 3174 785 523 2578 2168 -1185 -2857 -1637 -1246 -2763 -1441 2281 4121 3590
1740C590j047R29j114l047j985Q96P14j022N41K392J480j228p69Q16j8j001l63
$$ 3590 2543 3472 2358 -689 -2674 -1778 -1064 -2086 -1545 847 2327 1099 330 1146 1128 127 -236
1757b36L83J115k99o47K55p39j139j304J31M43Q87Q04J670J425j99p16q86j220
$$ -236 147 1262 963 316 571 -168 -1307 -2611 -2480 -2037 -1150 -346 1324 2749 2550 1834 948 -272
1775b72j867j365k82M06J170R45J341Q46M86n57q63n49m77m88n39L58M67r1j20
$$ -272 -2139 -3504 -3786 -3380 -2210 -1265 76 922 1408 851 -12 -561 -1038 -1526 -2065 -1707 -1240 -1331 -1451
1794a451n05l88l67j85L12O05J245J136L13K35q46r87j774j044j037l58J018J577
$$ -1451 -1956 -2344 -2711 -2896 -2584 -1979 -734 402 715 950 104 -883 -2657 -3701 -4738 -5096 -4078 -2501
1812b501J070J225O84M02l98j369j447n97k22l74N02Q04M10K14k73j5J56l85J38
$$ -2501 -1431 -206 478 880 482 -887 -2334 -2931 -3153 -3527 -3025 -2221 -1811 -1597 -1870 -1885 -1729 -2114 -1976
1831a976P63Q10N55J75j07p88j199j681k12j01P5N22J820K082N48j0N99l49j675
$$ -1976 -1213 -403 152 327 220 -568 -1767 -3448 -3660 -3761 -3686 -3164 -1344 738 1286 1276 1875 1526 -149
1850a49j848p89J93J76l10J613J729K09q36O0nm56p41P28J908l34p05M4M60j170
$$ -149 -1997 -2786 -2593 -2417 -2727 -1114 615 824 -12 48 43 -413 -1154 -426 1482 1148 443 487 947 -223
1870b23k438J8J622O49o74J731K663N24j789o04J094j179l183j244J693Q86q50
$$ -223 -2661 -2643 -1021 -372 -1046 685 3348 3872 2083 1479 2573 1394 -1789 -3033 -1340 -454 -1304
1887a304R24K801J568j874j205Q29J96k304q12K433J721j993j360J557M01k428
$$ -1304 -380 2421 3989 2115 910 1739 1935 -369 -1181 1252 2973 980 -380 1177 1578 -850
1903h50j788K358K656p12j194K513K205j797l494L75J578k117l217R41L389J12
$$ -850 -2638 -280 2376 1664 470 2983 5188 3391 -103 272 1850 -267 -3484 -2543 846 958
1919I58j458J788M237k88m350p29J774j121l680P71M659P40l106j215L128J6m313
$$ 958 -500 1288 5525 5237 887 158 1932 811 -2869 -2098 2561 3301 195 -1020 2108 2124 -2189
1936b189l75M788K590k804j552L305N45m840l163L533L002l765k745L748L918
$$ -2189 -2564 2224 4814 2010 458 3763 4308 -532 -3695 -162 2840 -925 -3670 78 3996
1951C996k262k653M689L959l888n545J052K561l282l687M551O491j407n348R56
$$ 3996 1734 -919 3770 7729 3841 -1704 -652 1909 -1373 -5060 -509 5982 4575 -773 183
1966A83L404k628n251L504P329o00n866l89M214k256o588R08P438J345o112q07
$$ 183 3587 959 -4292 -788 6541 5941 75 -314 3900 1644 -4944 -4036 3402 4747 -1365 -2172
1982b172O269O74n322j60P008R96p854m281L989J608n182L40Q595N088o527n367
$$ -2172 4097 4771 -551 -711 6297 7293 -561 -4842 -853 755 -4427 -4087 4508 9596 3069 -2298
1998b298L471K315n778k378O847O080m823o780K096L812n248m098N930P732k969
$$ -2298 1173 3488 -2290 -4668 2179 8259 3436 -3344 -1248 2564 -2684 -6782 -852 6880 3911
2013C911o839J546N883k602n631L178O977k367r705j267O137j11m278L464R747
$$ 3911 -2928 -1382 4501 1899 -3732 -554 6423 4056 -5649 -6916 -779 -890 -5168 -1704 8043
2028H043O47r540m534M848Q48o432R7R575L926q401o317M793L615o045k415Q913
$$ 8043 8690 -850 -5384 -536 312 -6120 -6023 3552 7478 -923 -7240 -2447 1168 -4877 -7292 1621
2044A621O879p088p869L937N592n327n621O598P638o802j0365L050Q809k369n286
$$ 1621 8500 1412 -6457 -2520 3072 -2255 -7876 -1278 6360 -442 -10807 -7757 1052 -1317 -6603
2059f603O475J0929n118j3761o11Q209k126q042N285J3403j259j3792k647R922
$$ -6603 -128 10801 5683 -8078 -8689 -480 -2606 -10648 -5363 8040 6781 -7011 -9658 264
2073B64L6r267K373J4613J468j4235n405R935K239j0484j289J4174L941j4074
$$ 264 300 -8967 -6594 8019 9487 -4748 -10153 -218 2021 -8463 -9752 4422 8363 -5711
2087e711p023J1082N847q775j558J3878N397j5136j1343P765O764p973l076J4019
$$ -5711 -12734 -1652 4195 -4580 -6138 7740 13137 -1999 -13342 -5577 1187 -6786 -9862 4157
2101D157R786j2069j2700O305Q941p425o219J2080J1118r831j4216L622J0072
$$ 4157 13943 1874 -10826 -4521 4420 -3005 -9224 2856 13974 4143 -10073 -6451 3621
2114C621n270p959R229J2605p118j4157K750J1866k693q125O682J1557o133j5748
$$ 3621 -1649 -9608 -379 12226 5108 -9049 -6299 5567 2874 -5251 1431 12988 6855 -8893
2128h893j368J0657R67p182N276J3590j554j4738l846Q378J970p473J293J2261
$$ -8893 -10261 396 1363 -5819 -543 13047 11493 -3245 -7091 1287 3257 -4216 -2923 9338
2142I338J223j2793o052Q124M055o721r20J0348M607j0626o888O042O088m882
$$ 9338 10561 -2232 -8284 -160 3895 -2826 -3746 6602 11209 583 -6305 -263 5825 943
2156I43l587P292M939q789r764L331Q187r90l317O787P790n488j1905j006P164
$$ 943 -2644 4648 9587 798 -8966 -5635 2552 1562 -1755 5032 12822 7334 -4571 -5577 1587
2171A587O9n225L622R215j678j0744l411P233L365n807M58R406J744j0695n432
$$ 1587 1656 -3569 53 9268 7590 -3154 -6565 668 4033 -1774 -1316 8090 9834 -861 -6293
2186f293O667M845n860k728P716L962r972p923O344Q673k559m141P058O611r537
$$ -6293 374 5219 -641 -3369 4347 8309 -1663 -9586 -3242 5431 2872 -1269 5789 12400 2863
2201B863j2058K403R339j723n379O139R624n588j2945J143R682l17o758M330R611
$$ 2863 -9195 -6792 2547 824 -4555 1584 11208 5620 -7325 -6182 3500 3183 -3575 755 10366
2216A0366l362j3741q98J0088J620q377J908J0431j470j3228k388J1999M248p420
$$ 10366 7004 -6737 -7635 2453 4073 -4304 -2396 8035 6565 -6663 -9051 2948 7196 -224
2230b24q33J0396q60j4469o148J0009O196o124r19J1024K702j2497p706Q403O861
$$ -224 -1057 9339 8479 -5990 -12138 -2129 4067 -2057 -2976 8048 10750 -1747 -9453 -1050 5811
2245E811n990l619R085L682j0667q464P426P991m875m770P285N443q701q660O148
$$ 5811 -179 -3798 5287 8969 -1698 -10162 -2736 5255 380 -4390 2895 8338 -363 -9023 -2875
2260b875R447k516o144L786N396p672j0241L338R702L19m619L977O621m468j0131
$$ -2875 6572 4056 -2088 1698 7094 -578 -10819 -7481 2221 2540 -2079 1898 8519 4051 -6080
2275f080k53Q074P69n763J506O502j991q698r00P861K616n760m94O260J44p867
$$ -6080 -6333 1741 2510 -3253 -1747 4755 2764 -5934 -6834 1027 3643 -2117 -2611 3649 3793 -4074
2291d074j707O758L382m811k841M142P21o946l235O075N522j765k466M280J938
$$ -4074 -5781 977 4359 -452 -3293 849 1570 -5376 -8611 -2536 2986 1221 -1245 3035 4973
2306D973n769o147L051M780j959l045K699M437l093n279J985N122n57m163J279
$$ 4973 -796 -6943 -3892 888 -1071 -4116 -1417 3020 -73 -5352 -3367 1755 1198 -2965 -1686
2321a686M513j963n261M61N367R5m650n65L715j63n029J92N885K351l078j032
$$ -1686 2827 864 -4397 -3936 1431 1526 -3124 -3689 26 -137 -5166 -4974 911 3262 184 -848
2337h48L308m61n758k679L927K977k509j134M231J922l718k820L470K477k624
$$ -848 2460 1999 -3759 -6438 -2511 466 -2043 -3177 1054 2976 -742 -3562 -92 2385 -239
2352b39k711L293K369l228l497K294L830j645l074J210K976j741k498K153M070
$$ -239 -2950 343 2712 -516 -4013 -1719 2111 466 -2608 -1398 1578 -163 -2661 -508 3562
2367C562m64k881r6J429j762l890L16L852J182j625Q08K951k19l543k96K109P6
$$ 3562 3098 217 121 1550 -212 -4102 -3786 66 1248 -377 431 3382 3163 -380 -676 1433 1509
2384A509k419j73K053L07k106o07K201J573k214j318J777J563k036n48K533J494
$$ 1509 -910 -1083 970 1277 -829 -1436 765 2338 124 -1194 583 2146 110 -438 2095 3589
2400C589j575k325Q1K56j414j395J756K317L70l16J059Q18j448k321n6J130m35
$$ 3589 2014 -311 -230 26 -1388 -2783 -1027 1290 1660 1344 2403 3221 1773 -548 -604 526 91
2417I1j721P89J657O36j639K62J294j13j259o48J424N68p14m56J066j31j241j192
$$ 91 -1630 -841 816 1452 -187 75 1369 1256 -3 -651 773 1341 627 171 1237 1106 -135 -1327
2435a327K48K92o09J50J870J366j50n84N33o85j721j147K93O77k62j93J123J115
$$ -1327 -1079 -787 -1396 -1246 624 1990 1840 1256 1789 1104 -617 -1764 -1471 -794 -1056 -1249 -126 989
2453I89K0n66kM10p21q75K55J131l76j08j23M00p46q14J72r8N73R2R80J325M07
$$ 989 1009 443 441 851 130 -745 -490 641 265 157 34 434 -312 -1126 -954 -1052 -479 -387 593 1918 2325
2474B325o35o25o05j001q55n26O70M61O40L91J558J67o95k85j71o43q41K29L64
$$ 2325 1690 1065 460 -541 -1396 -1922 -1252 -791 -151 240 1798 1965 1270 985 814 171 -670 -441 -77
2493g7P58k35mk15r2J99n72K99N17L52K75P01L36l55j214j58j249m91o0K26J075
$$ -77 681 446 442 227 135 334 -238 61 578 930 1205 1906 2242 1887 673 515 -734 -1225 -1285 -1059 16
2514A6O69Q09R46j30O0j469o12O4j158K12K14R52j55L81K43l88l41k94L21K54
$$ 16 685 1494 2440 2310 2370 901 289 353 -805 -593 -379 573 418 799 1042 654 313 19 340 594
2534E94K70M81k52M17n75o24q45m2k99m18O50J118O60M94n9J2l19j177q46l34
$$ 594 864 1345 1093 1510 935 311 -534 -576 -875 -1293 -643 475 1135 1629 1570 1582 1263 86 -760 -1094
2554a094j31k05j8P59Q76M41o20J65O6m78m86J67O77J28q90j10Q05n18j680m1
$$ -1094 -1225 -1430 -1448 -689 187 628 8 173 239 -239 -725 -558 119 247 -643 -753 52 -466 -2146 -2187
2574b187P92N69p08N31J477N39o93q82P56j22k168j067R89P45o55J42K023J442
$$ -2187 -1395 -826 -1534 -1003 474 1013 320 -562 194 72 -2096 -3163 -2174 -1429 -2084 -1942 81 1523
2592A523r99j339L52O67j722q12J098J465j226r16N87J529j828j494J671K146
$$ 1523 524 -815 -463 204 -1518 -2330 -1232 233 -993 -1909 -1322 207 -1621 -3115 -1444 702
2608G02j277j215K015J729j628k150R11J330j470k558N64K626k10j384J987K860
$$ 702 -575 -1790 225 1954 326 -1824 -913 417 -1053 -3611 -3047 -421 -631 -2015 -28 2832
2624B832n27l266l43J919j100k694N43L562O58k983k76K727o90k705N4L797J360
$$ 2832 2305 -961 -1304 615 -485 -3179 -2636 926 1584 -1399 -1675 1052 362 -2343 -2289 1508 2868
2641B868k926q90K577J93l313r65K800J038k893j307K708J898k087o25L620J675
$$ 2868 -58 -948 1629 1822 -1491 -2456 344 1382 -1511 -2818 -110 1788 -299 -924 2696 4371
2657D371l059l198J068J223k084j755L745L310k105l037J002K341j856k466K956
$$ 4371 1312 -1886 -818 405 -1679 -3434 311 3621 1516 -1521 -519 1822 -34 -2500 456
2672D56L988j571m034J69K681j661k706J244L798k40l930n3L414O90k793P59L644
$$ 456 4444 2873 -1161 -992 1689 28 -2678 -1434 2364 2124 -1806 -1859 1555 2245 -548 211 3855
2689C855J61n160k428K154J413k638P54N098J813l949l281K527J613l045j375
$$ 3855 4016 -1144 -3572 -1418 -5 -2643 -1889 3209 5022 1073 -2208 319 1932 -1113 -2488
2704b488M510L145l704m652J940K733j857l051L673M335k500m615J453L965j025
$$ -2488 2022 5167 1463 -3189 -1249 1484 -373 -3424 249 4584 2084 -2531 -1078 2887 1862
2719A862l333J959M075j923o757m44M901P6k749K311O209n17o801j931M332N39
$$ 1862 -1471 488 4563 2640 -4117 -4561 340 416 -2333 -22 6187 5670 -1131 -3062 1270 1809
2735A809m277K32O405J160o584k967M287K345m402o92O591K705n972m336M036
$$ 1809 -2468 -2236 4169 5329 -1255 -4222 65 2410 -1992 -2684 3907 6612 640 -3696 340
2750C40L091l752k737N035L668n471n932L594M850k040k523M964N248n079p337
$$ 340 3431 -321 -3058 1977 5645 174 -5758 -2164 2686 646 -1877 3087 8335 3256 -4081
2765d081J262M395j745l996M312O717l159p615L62N259p0m289K670O836j395p780
$$ -4081 -2819 1576 -169 -4165 147 6864 3705 -3910 -3548 1711 1641 -2648 22 6858 5463 -2317
2781b317k032N346N93m249Q07O435J70p796l058O204L101l991J15O666P82q723
$$ -2317 -4349 997 1590 -2659 -1852 4583 4753 -3043 -6101 103 3204 -787 -672 5994 6776 -1947
2797a947n250M368M129l591j209P030L848p040o342L463M859k475l064M644N666
$$ -1947 -7197 -2829 1300 -2291 -3500 3530 7378 338 -6004 -2541 2318 -157 -3221 1423 7089
2812G089n966p843K060O201j849m048L924O380l891q533J521P583n48m509K110
$$ 7089 1123 -6720 -4660 1541 -308 -4356 -432 5948 2057 -6476 -4955 2628 2080 -2429 -319
2827c19O699l504r870j486P693K062m570J623P852j48j0049k988O325L038n235
$$ -319 6380 2876 -6994 -8480 -787 1275 -3295 -1672 6180 6032 -4017 -7005 -680 2358 -2877
2842b877o74P502J392r089m613O376M503n026j656P354K998p765n892N884N218
$$ -2877 -3551 3951 5343 -3746 -8359 -1983 2520 -2506 -4162 3192 6190 -1575 -7467 -1583 3635
2857C635m069l742N710M114p637p337N092O738j822m031N412N759n968q615K020
$$ 3635 -434 -4176 1534 5648 -1989 -9326 -4234 2504 682 -3349 2063 7822 1854 -6761 -4741
2872d741O827j995m168M360N908l898q663R57O807j46l946K449O838k541q463
$$ -4741 2086 91 -4077 283 6191 2293 -6370 -5413 1394 1248 -2698 -249 6589 4048 -4415
2887d415q67O490J171m510O92N941j253p885k073O550L614k952l60N372K04p833
$$ -4415 -5282 1208 2379 -2131 -1439 4502 3249 -4636 -6709 -159 3455 503 143 5515 5719 -2114
2903b114m363L935M625k573j157M835K108n482n161L072N337j600j976L034L029
$$ -2114 -6477 -2542 2083 -490 -1647 3188 5296 -186 -5347 -2275 3062 1462 -514 2520 5549
2918E549m964n687J905M959j0k834J483L686k927o010R15O485J437l118N32L002
$$ 5549 585 -5102 -3197 1762 1752 -1082 401 4087 1160 -4850 -3935 2550 3987 869 1401 4403
2934D403k328o610j590N676K946j943p37L674O20o050k849M499L964k734j958
$$ 4403 2075 -4535 -6125 -449 2497 554 -183 3491 4111 -1939 -4788 -289 3675 941 -1017
2949a017K806J528n126m050M146N229k190l403L188K752l984m679L203O266j164
$$ -1017 1789 3317 -1809 -5859 -1713 3516 1326 -2077 1111 3863 -121 -4800 -1597 4669 3505
2964C505m708J058L019l537n586K304O415P94m080P80M529k151o221J08O255O09
$$ 3505 -1203 -145 2874 -663 -6249 -3945 2470 3264 -816 -36 4493 2342 -3879 -3771 2484 3093
2980C093m393j58M279q04n587p00O049J751m313j112M680N84n754j461N406K730
$$ 3093 -1300 -1458 2821 2017 -3570 -4270 1779 3530 -783 -1895 2785 3369 -2385 -3846 1560 4290
2996D290m233k522L549J276n027k420N134M015k606j915K862J916m826l669L302
$$ 4290 57 -2465 1084 2360 -2667 -5087 47 4062 1456 -459 2403 4319 -507 -4176 -874
3011h74M071k912k411K833K802l304l369K625M034j842k759K040K696k687l300
$$ -874 3197 285 -2126 707 3509 205 -3164 -539 3495 1653 -1106 934 3630 943 -2357
3026b357J438L658j256k781N59K784j595l040J632L842O57k857j18K063j157l941
$$ -2357 -919 2739 1483 -1298 -739 2045 450 -2590 -958 2884 3541 684 566 2629 1472 -2469
3042b469J4L043L57j293L0J959N92k673q17K424R62j721j217J744O26k248j428
$$ -2469 -2455 588 945 -348 -318 1641 2233 -440 -1257 1167 2129 408 -809 935 1561 -687 -2115
3059b115J781J664j171j558J327Q57j149q01J675J737o08j787j88O94j360j468
$$ -2115 -334 1330 159 -1399 -72 785 -364 -1165 510 2247 1639 -148 -336 358 -1002 -2470
3075b470O14J925L97q88J04J402k41j505n04J375L38j745J9R12J66j187n45J433
$$ -2470 -1856 69 466 -422 -318 1084 843 -662 -1166 209 547 -1198 -1179 -267 -101 -1288 -1833 -400
3093d00P09j084o11J421P18j153p96J308P58p66j728L06K15o01o82J538J495l23
$$ -400 309 -775 -1386 35 753 -400 -1196 112 870 104 -1624 -1318 -1103 -1704 -2386 -848 647 324
3111C24p83O45N49q94j101K74P67p53m69L23P89k1p08R3J144J68j070K09Q03L2
$$ 324 -459 186 735 -159 -1260 -986 -219 -972 -1441 -1118 -329 -350 -1058 -965 179 347 -723 -514 289 321
3131C21o30k31M27j65r57k37M64M26n94N49R51O96l40lm5l97q14o74L96O0J86
$$ 321 -309 -540 -113 -278 -1235 -1472 -1008 -582 -1176 -627 324 1020 680 677 632 235 -579 -1253 -857 -797 -611
3152f11l29P56M07J04m01L44L35m79j64l54L86K40l77p3M4j63m07k3N61L08M9
$$ -611 -940 -184 223 327 -74 270 605 126 -38 -392 -6 234 -143 -216 -172 -335 -742 -765 -204 104 153
3173A53Q45K26p2o32m90K35q08l26j08L61N51Q0K49O74k8n43j91J15l15R0j18
$$ 153 998 1224 1152 520 30 265 -543 -869 -977 -616 -65 15 264 938 910 367 176 291 -24 66 -52
3194e2Q4j01J86k21l51r0N26l64J63N21K5K35N05k12n91m71o18K49n81L13M64
$$ -52 32 -69 117 -104 -455 -545 -19 -383 -220 301 326 561 1066 854 263 -208 -826 -577 -1158 -845 -381
3215c81L85J9P19k23M62k16m61m82j38J02l23L70L15j28J66k26j9L36j75m27P47
$$ -381 4 23 742 519 981 765 304 -178 -316 -214 -537 -167 148 20 186 -40 -59 277 102 -325 422
3236D22K28j28j39J46j88n19n72L12M13k91J54P89N27k17k0L68k34q44n20K09
$$ 422 650 522 383 529 341 -178 -750 -438 -25 -316 -162 627 1154 937 917 1285 1051 207 -313 -104
3256a04j40k15j64Q50O95m65l65N20L81k89l86K07M80k68q45J87O58o58j088P08
$$ -104 -244 -459 -623 227 922 457 92 612 993 704 318 525 1005 737 -108 79 737 79 -1009 -301
3276c01Q81l03j23O40N28K96p96k9M30o02j144o31J064K80k88K00J121M28p67
$$ -301 580 277 154 794 1322 1618 822 793 1223 621 -523 -1154 -90 190 -98 102 1223 1651 884
3295H84k68J0K96r40M9P83K26p99o91L01N13p48k59J001R58l41q41N76O35p10
$$ 884 616 626 922 -18 31 814 1040 241 -450 -149 364 -384 -643 358 1316 975 134 710 1345 635
3315F35j348M20J101j044j333N93J336n6p46M77J775k05k093k26J054m83j250
$$ 635 -713 -293 808 -236 -1569 -976 360 304 -442 35 1810 1605 -488 -714 340 -143 -1393
3332a393M39J507M62j872o73J299N44j463j18K234N19k060p20J498L78j531j436
$$ -1393 -954 553 1015 -857 -1530 -231 313 -1150 -1268 966 1485 -575 -1295 203 581 -950 -2386
3349b386K112R29j807j505J448K089j219r44K058J417k375k404R73J876j724j110
$$ -2386 -274 655 -1152 -2657 -1209 880 -339 -1283 775 2192 -183 -2587 -1614 262 -1462 -2572
3365b572K138K379j674k965J124K028n85k338K131K833j415l627K89K695q29k581
$$ -2572 -434 1945 271 -2694 -1570 458 -127 -2465 -334 2499 1084 -2543 -2254 441 -388 -2969
3381b969J132L452o26l506k6L635k32k005N35L165q17m239r75K762P06k113N05
$$ -2969 -1837 1615 989 -2517 -2543 1092 860 -1145 -610 2555 1738 -2501 -3476 -714 -8 -2121 -1616
3398a616L999N07l941j470K997R79k754n93L930J008l743k492K471J487k299q95
$$ -1616 2383 2890 -1051 -2521 476 1455 -1299 -1892 2038 3046 -697 -3189 -718 769 -1530 -2425
3414b425L474J930k531k935K036K372j807j668K528K077k945l384J276K197k90
$$ -2425 1049 2979 448 -2487 -451 1921 114 -1554 974 3051 106 -3278 -2002 195 -95
3429i5j550K655L243k049m034l85L372m34k492J231L691q39m141q01K806R17k173
$$ -95 -1645 1010 4253 2204 -1830 -2215 1157 723 -1769 -538 3153 2314 -1827 -2628 178 1095 -1078
3446a078L21L574M51l697j771K328J675k164j044K965J217l438l008K473K730
$$ -1078 -757 2817 3268 -429 -2200 128 1803 -361 -1405 1560 2777 -661 -3669 -1196 1534
3461A534p41j258K735K251l118m595J108L139p53k102K469L400k462m711L95L890
$$ 1534 793 -465 2270 4521 1403 -3192 -2084 1055 302 -1800 669 4069 1607 -3104 -2709 1181
3477A181K22k357R96M028j123n307q98L794J024k876M72L806l02m940j762M753
$$ 1181 1403 -954 42 4070 2947 -2360 -3258 536 1560 -1316 -844 2962 2660 -2280 -4042 711
3493G11K050k339o57L701N61n641l457L720L121k459j092M631J805m626m478L558
$$ 711 2761 422 -235 3466 4027 -1614 -5071 -1351 1770 -689 -1781 2850 4655 29 -4449 -891
3509h91L915k146k585M050K892m652n488K630M630j597l096L107M116l682n212
$$ -891 3024 878 -1707 2343 5235 583 -4905 -2275 2355 758 -2338 769 4885 1203 -4009
3524d009J775N523r02l382J610M183k939o649N42N647Q80l269J136M680j236o437
$$ -4009 -2234 3289 2387 -995 615 4798 1859 -4790 -4248 1399 2279 -990 146 4826 3590 -2847
3540b847r22N113J582l504j16M629n95n767k164M870K630l304o54M327R56n277
$$ -2847 -3769 1344 2926 -578 -694 3935 3340 -2427 -4591 279 2909 -395 -1049 3278 4234 -1043
3556a043l152M212L202k586j926L145J807m766m216L319M719j792j910L461K195
$$ -1043 -4195 17 3219 633 -1293 1852 3659 -1107 -5323 -2004 2715 923 -987 2474 4669
3571D669m219m874K129M104p64k671K143K882k812n209J066M720N68k591P94L394
$$ 4669 450 -4424 -2295 1809 1045 -1626 517 3399 587 -4622 -3556 1164 1732 -859 -65 3329
3587C329j672n298k14M626J056k802j88K656l66n139p45M740K522k254q46K733
$$ 3329 1657 -3641 -3855 771 1827 -975 -1163 1493 1127 -4012 -4757 -17 2505 251 -595 2138
3603B138J92n387k349L868K866j546j865K972J566m328l188L420L939j527k325
$$ 2138 2330 -3057 -5406 -1538 1328 -218 -2083 889 2455 -1873 -5061 -1641 2298 771 -1554
3618a554K040K049l543l813J971M429o54k911Q32K996k162m363K266M747J17l561
$$ -1554 486 2535 -1008 -4821 -2850 1579 925 -1986 -1154 1842 -320 -4683 -2417 2330 2447 -1114
3634a114N70K489j808m595K19M553J615k553m02L029n55l987j060L974K234k895
$$ -1114 -544 1945 137 -4458 -4239 314 1929 -624 -1026 2003 1448 -2539 -3599 375 2609 -286
3650b86r47K295L54m002j032L431K269j996j358J968J277l295j840L339K522j405
$$ -286 -1233 1062 1416 -2586 -3618 -187 2082 86 -1272 696 1973 -1322 -3162 177 2699 1294
3666A294k381R76J840k850k717K193L687m25j858Q33J786j986k417N47K933m4
$$ 1294 -1087 -111 1729 -1121 -3838 -1645 2042 1617 -241 592 2378 392 -2025 -1478 1455 1411
3682A411k317L35J900n55k975M37K688J256k428l23K105L61l195k24K410J615
$$ 1411 -906 -571 1329 774 -2201 -1764 924 2180 -248 -571 1534 1895 -1300 -1524 886 2501
3698B501k392j044J460O13k515q50K423K286j490j413J457Q54k422j770J676K230
$$ 2501 109 -935 525 1138 -1377 -2227 196 2482 992 -421 1036 1890 -532 -2302 -626 1604
3714A604r87j492O65J562j320j961J467K738r56j999N94J886j053k186M00K671
$$ 1604 617 -875 -210 1352 32 -1929 -462 2276 1320 -679 -85 1801 748 -1438 -1038 1633
3730A633o51j676j50J439k07j988O53K642Q03k120m00J117k51k325l25K364Q60
$$ 1633 982 -694 -844 595 388 -1600 -947 1695 2498 378 -22 1095 844 -1481 -1806 558 1418
3747A418j889k72J474K11j389j011J850J374j515r91J222P21j759q87J506J202
$$ 1418 -471 -743 731 942 -447 -1458 392 1766 251 -740 482 1203 -556 -1443 63 1265
3763A265j051j158Q01J241q86q43J297J222p24j311j65J003j027j134J037J222
$$ 1265 214 -944 -143 1098 212 -631 666 1888 1164 -147 -312 691 -336 -1470 -433 789
3779G89Q7r63P65R61q10j000oJ586o95r39R5R66j86j100K92Q42M05j048J31O64
$$ 789 876 -87 678 1639 829 -171 -177 1409 714 -225 -130 836 650 -450 -158 684 1089 41 172 836
3799H36N8o00L79O21j99j034m60M93n6m68j46Q98O72m47k5L11K80o93m06L51K06
$$ 836 894 294 673 1294 1095 61 -399 94 38 -430 -576 322 994 547 522 833 1113 420 14 365 571
3820E71n32j04j10J51K18j71L70j23K63k92p6K25P4m66j38O51o76j08k98L20p1
$$ 571 39 -65 -175 -24 194 23 393 270 533 241 165 390 464 -2 -140 511 -165 -273 -571 -251 -322
3841c22q1N49K38J00j19j26m3q6k91o10K39K66j84j87L95J79L14n72J4O45j02
$$ -322 -403 146 384 484 365 239 196 110 -181 -791 -552 -286 -470 -657 -262 -83 231 -341 -327 318 216
3862B16n72J36J44o4m92m4J09j85J78k07l7M30J22K09M4L96n39k19k9m58k14L59
$$ 216 -356 -220 -76 -140 -632 -676 -567 -752 -574 -781 -818 -388 -266 -57 -13 383 -156 -375 -404 -862 -1076 -717
3884g17J27P2P0K74l7K11j1l41j11K6P3l79K87j52Lj04J05J41k4j72N77K5L05
$$ -717 -590 -518 -448 -174 -211 0 -11 -352 -463 -437 -364 -743 -456 -608 -605 -709 -604 -463 -487 -659 -82 -57 248
3907B48k56K1K41o00l10J82j43j99j47L28Q15k18j11J16M67n6l43m31k8J37r5
$$ 248 -8 13 254 -346 -656 -474 -617 -816 -963 -635 180 -38 -149 -33 434 378 35 -396 -424 -287 -382
3928c82Q5K04j77k28J98J30M90o13L17M31Q8l36j59K99l22j43l33K99n1k10P6
$$ -382 -297 -93 -270 -498 -300 -170 320 -293 24 455 543 207 48 347 25 -118 -451 -152 -203 -413 -337
3949c37O47K14m54P9J45K22n44m04Q2N7Nk31M01M06M6k30J39Q3l40k00O76On84
$$ -337 310 524 70 149 294 516 -28 -432 -350 -293 -288 -519 -118 288 334 104 243 326 -14 -214 462 468 -116
3972a16O6k60N78l15m66R5N08Ol53L90P87j83o39Q5N41p06l66l85R10q7l29L28
$$ -116 -50 -310 268 -47 -513 -418 90 96 -257 133 920 737 98 183 724 18 -348 -733 177 90 -239 89
3994H9K99M75p28k83N01K41o85j13N44L89r63l32L81J88k57m22P93R68m58o10
$$ 89 388 863 135 -148 353 594 -91 -204 340 729 -234 -566 -185 3 -254 -676 117 1085 627 17
4014A7Q05L18o38j028M89J015j377n52P41Q24j29o39O60J137o69j362K91Q83n05
$$ 17 822 1140 502 -526 -37 978 -399 -951 -210 614 485 -154 506 1643 974 -388 -97 786 281
4033B81o60K64J265m56j576J35J254K61q50K70J297J96j668k98R38N76j441o58
$$ 281 -379 -115 1150 694 -882 -747 507 768 -82 188 1485 1681 13 -285 653 1229 -212 -870
4051h70J693K33j510m89J195R44q22l12J316N63j481j306Q06R31p19q24J128J338
$$ -870 823 1056 -454 -943 252 1196 374 62 1378 1941 460 -846 -40 891 172 -652 476 1814
4069A814j158j729Q85J264p07p60Q35J474j171k054N29J385j18j478O33J799l81
$$ 1814 656 -1073 -188 1076 369 -391 444 1918 747 -1307 -778 607 489 -989 -356 1443 1062
4086A062j932k69K073N76j642M2J766n72k793m64K268K31j121m7K270M69k837
$$ 1062 -870 -1139 934 1510 -132 -90 1676 1104 -1689 -2153 115 346 -775 -822 1448 1917 -920
4103i20q51J816R93j586m98J970J169k860j629J382J614j254j147J895J884j955
$$ -920 -1771 45 1038 -548 -1046 924 2093 -767 -2396 -1014 600 -654 -1801 94 1978 23
4119B3k520J596J886j049j439J383J671j919k737J136K149o2j580J501K212j384
$$ 23 -2497 -901 985 -64 -1503 -120 1551 -368 -3105 -1969 180 118 -1462 39 2251 867
4135H67l271J23K800M3k470Q75K749p66l479k76K752M27j812N11K893m7l689q23
$$ 867 -2404 -2281 519 562 -1908 -1033 1716 950 -2529 -2805 -53 374 -1438 -927 1966 1919 -1770 -2593
4153b593K675R84k132m35K631J65l213j566K592J944j700l79K867N09l142k136
$$ -2593 82 1066 -1066 -1501 1130 1295 -1918 -3484 -892 1052 -648 -1027 1840 2349 -793 -2929
4169b929J581K347j326j465K396J633k498k926J672K565p70j594K029J796j864
$$ -2929 -1348 999 -327 -1792 604 2237 -261 -3187 -1515 1050 280 -1314 715 2511 647
4184F47k987P03K353K5j578M47K501j320l095J38K834J063j644J53J894o19l259
$$ 647 -2340 -1637 716 741 -837 -390 2111 791 -2304 -2166 668 1731 87 240 2134 1515 -1744
4201a744r20K264J592j478OJ894N28l253j096J991J883j415n10J614Q22k538k691
$$ -1744 -2664 -400 1192 -286 -280 1614 2142 -1111 -2207 -216 1667 252 -258 1356 2178 -360 -3051
4218c051J498K746p03j334J562J341j729k738J062L212M4k149L84J948j465l785
$$ -3051 -1553 1193 490 -844 718 2059 330 -2408 -1346 1866 1910 -239 145 2093 628 -3157
4234c157P70L624N00j922n1K668p40l765m09L370J363k373p76K712ql700j389
$$ -3157 -2387 1237 1737 -185 -236 2432 1692 -2073 -2482 888 2251 -122 -898 1814 1806 -1894 -3283
4251c283L624K026k402r54K655O02l668j385K872K574j824j831K253R75l292k768
$$ -3283 341 2367 -35 -989 1666 2268 -1400 -2785 87 2661 837 -994 1259 2234 -1058 -3826
4267c826K757L694j617j817K065J249k792k912J745L885j091k489J311K349k630
$$ -3826 -1069 2625 1008 -809 1256 2505 -287 -3199 -1454 2431 1340 -1149 162 2511 -119
4282a19l032J609L461L82k888P28K630j698l729Q47L743J67k608l66K659p05l376
$$ -119 -3151 -1542 1919 2301 -587 141 2771 1073 -2656 -1809 1934 2101 -507 -873 1786 1081 -2295
4299b295qL758J273k399m60J983k50l530o29L215J480j900j185K081P03l041j323
$$ -2295 -2303 1455 2728 329 -131 1852 1602 -1928 -2557 658 2138 238 -947 1134 1837 -1204 -2527
4316b527K739K224j507j214J486P74k982j116K062K213j265j538J030J148j858
$$ -2527 212 2436 929 -285 1201 1975 -1007 -2123 -61 2152 887 -651 379 1527 -331
4331c31j786J797K285k20j861M11J223j682k485J049K840k77j238K05J280n35
$$ -331 -2117 -320 1965 1745 -116 295 1518 -164 -2649 -1600 1240 963 -275 -70 1210 675
4347F75k205OK638L90j628n33J456j36k411k44K460J052j531j098J326N56j568
$$ 675 -1530 -1524 1114 1504 -124 -657 799 663 -1748 -1992 468 1520 -11 -1109 217 773 -795
4364g95j153K218J701j309j528O45P93j614j260J462K112o89j376P30J134j469
$$ -795 -1948 270 1971 662 -866 -221 572 -1042 -2302 -840 1272 583 -793 -63 1071 -398
4380c98j461P82K227o72j636O05Q58o21j604L70K186M61j938l65J681p2j966o6
$$ -398 -1859 -1077 1150 478 -1158 -553 305 -316 -1920 -1550 636 1097 -841 -1206 475 403 -1563 -1629
4398a629K395K08j631q81J278L4j194m50K233J080j344q61J051M71j983n22J358
$$ -1629 766 974 -657 -1538 -260 -226 -1420 -1870 363 1443 99 -762 289 760 -1223 -1745 -387
4415c87J442j234j018J042N09r09q43J190J384r13j259R40O06o39j265P63J751
$$ -387 1055 -179 -1197 -155 354 -555 -1398 -208 1176 263 -996 -56 550 -89 -1354 -591 1160
4432A160p90j615M33J032j97q80M96J469Q6j315k67Q27n10j062J85J366J63j261
$$ 1160 370 -1245 -812 220 23 -857 -361 1108 1194 -121 -388 439 -71 -1133 -948 418 581 -680
4450f80nJ084K31r40r7J047L38o91p59L23Q74j077m50P52R03q05m36J32J219p71
$$ -680 -685 399 630 -310 -407 640 978 287 -472 -149 725 -352 -802 -50 853 48 -388 -256 963 192
4470A92m18N48Q54o45p55J26L25l17n76L96P73oo69L30O46j65q49J84N71J25q22
$$ 192 -226 322 1176 531 -224 -98 227 -90 -666 -270 503 497 -172 158 804 639 -210 -26 545 670 -152
4491a52j09P45k51q46K63N58K33n69k80P99K42n30k47R04p9o61m55L31q4p1j31
$$ -152 -261 484 233 -613 -350 208 441 -128 -408 391 633 103 -144 760 681 20 -435 -104 -188 -259 -390
4512c90N71L19k06m58K16N56q38k00L80M36k79o39L62J74K7m0K0M23j55l43K85
$$ -390 181 500 294 -164 52 608 -230 -430 -50 386 107 -532 -170 4 31 -9 11 434 279 -64 221
4533B21J49J99o58M0K36m6l23l9L37j22k58M14M34J4k12l10K97k04k91J08r5j1
$$ 221 370 569 -89 -49 187 141 -182 -221 116 -6 -264 150 584 598 386 76 373 169 -122 -14 -109 -120
4555a20L5K91K97k27l92K88M9K08lk10j27O7q0j20L28l37L6j74L03L59p4j92P6
$$ -120 -85 206 503 276 -116 172 221 429 426 216 89 156 76 -44 284 -53 -17 -191 112 471 397 205 281
4578B81J45Q7j24k71lm75l60O85j65L49P2j03J89q8K79l78J95J49l58J13l53K60
$$ 281 426 513 389 118 115 -360 -720 -35 -200 149 221 118 307 219 498 120 315 464 106 219 -134 126
4600A26q9J3k12K51k24O0J64M53l02q5M52l98j85m07k0L11l69M96k06K98P6k20
$$ 126 37 50 -162 89 -135 -75 89 542 240 155 607 209 24 -383 -403 -92 -461 35 -171 127 203 -17
4622a7J33O6j26l74K6L30k22l60J73rM20k93k47N12J13l89K6L64k8k48OJ76m33
$$ -17 116 182 56 -318 -292 38 -184 -544 -371 -380 40 -253 -500 12 125 -264 -238 126 98 -150 -144 32 -401
$$ [...]
8191E3
##END NTUPLES=NMR FID
##END=
