##TITLE=1H_LR-703-RM1
 D2O, 8 sc, 
 19.11.2019
##JCAMPDX= 6.0         $$ Bruker NMR JCAMP-DX V2.0
##DATA TYPE= NMR FID
##DATA CLASS= NTUPLES
##ORIGIN= UXNMR, Bruker Analytische Messtechnik GmbH
##OWNER= root
$$ XWIN-NMR		Version 3.5
$$ Tue Nov 19 15:39:30 2019 Russian Standard Time (UT+4h)  she@DPX200
##.OBSERVE FREQUENCY= 200.1315
##.OBSERVE NUCLEUS= ^1H
##.DELAY= (6, 6)
##.ACQUISITION MODE= SIMULTANEOUS
##.ACQUISITION SCHEME= undefined
##.AVERAGES= 8
##.DIGITISER RES= 18
##SPECTROMETER/DATA SYSTEM= spect
##.PULSE SEQUENCE= zg30
##.SOLVENT NAME= D2O
##.SHIFT REFERENCE= (INTERNAL, D2O, 0, 15.7039)
##AUDIT TRAIL= $$ (NUMBER, WHEN, WHO, WHERE, WHAT)
$$ ##TITLE= Audit trail, XWIN-NMR		Version 3.5
$$ ##JCAMPDX= 5.01
$$ ##ORIGIN= Bruker BioSpin GmbH
$$ ##OWNER= she
$$ F:/spectra/data/she/nmr/H-F/1/audita.txt
$$ ##AUDIT TRAIL=  $$ (NUMBER, WHEN, WHO, WHERE, WHAT)
(   1,<2019-11-19 15:38:20.17 +0400>,<she>,<DPX200>,
      <created by zg, POWCHK disabled, PULCHK disabled
       configuration hash MD5:
       00 E9 B6 7A A2 85 ED C7 34 08 36 98 17 FE 4E 26
       data hash MD5: 16K
       67 97 7E B4 2D 26 59 6B 23 75 2D EE AE 7A B1 06>)
$$ ##END=
$$ 
$$ hash MD5
$$ FE 98 1A 3C 9A 71 2D EE 20 57 17 BE 5E A5 84 7D
##$RELAX= 
##$RELAX= 
##$RELAX= 
##$RELAX= 
##$RELAX= 
##$RELAX= 
$$ Bruker specific parameters
$$ --------------------------
##$DU= <F:/spectra>
##$EXPNO= 1
##$NAME= <H-F>
##$PROCNO= 1
##$TYPE= <nmr>
##$USER= <she>
##$AMP= (0..31)
100 100 100 100 100 100 100 100 100 100 100 100 100 100 100 100 100 100 
100 100 100 100 100 100 100 100 100 100 100 100 100 100 
##$AQSEQ= 0
##$AQ_mod= 1
##$AUNM= <au_zg>
##$AUTOPOS= <>
##$BF1= 200.13
##$BF2= 200.13
##$BF3= 200.13
##$BF4= 200.13
##$BF5= 200.13
##$BF6= 200.13
##$BF7= 200.13
##$BF8= 200.13
##$BYTORDA= 1
##$CFDGTYP= 0
##$CFRGTYP= 5
##$CHEMSTR= <none>
##$CNST= (0..31)
1 1 145 1 1 1 1 1 1 1 1 1 1 1 1 1 1 1 1 1 1 1 1 1 1 1 1 1 1 1 1 1 
##$CPDPRG= <>
##$CPDPRG1= <>
##$CPDPRG2= <>
##$CPDPRG3= <>
##$CPDPRG4= <mlev>
##$CPDPRG5= <mlev>
##$CPDPRG6= <mlev>
##$CPDPRG7= <mlev>
##$CPDPRG8= <mlev>
##$CPDPRGB= <>
##$CPDPRGT= <>
##$D= (0..31)
0 1.2 0 0 0 0 0 0 0 0.06 0 0.03 0 0 0 0 0.0002 0 0 0 0 0 0 0 0 0 0 0 0 
0 0 0 
##$DATE= 1574163499
##$DBL= (0..7)
120 120 120 120 120 120 120 120 
##$DBP= (0..7)
150 150 150 150 150 150 150 150 
##$DBP07= 0
##$DBPNAM0= <>
##$DBPNAM1= <>
##$DBPNAM2= <>
##$DBPNAM3= <>
##$DBPNAM4= <>
##$DBPNAM5= <>
##$DBPNAM6= <>
##$DBPNAM7= <>
##$DBPOAL= (0..7)
0.5 0.5 0.5 0.5 0.5 0.5 0.5 0.5 
##$DBPOFFS= (0..7)
0 0 0 0 0 0 0 0 
##$DE= 6
##$DECBNUC= <off>
##$DECIM= 24
##$DECNUC= <off>
##$DECSTAT= 4
##$DIGMOD= 1
##$DIGTYP= 9
##$DL= (0..7)
0 120 120 120 120 120 120 120 
##$DP= (0..7)
150 150 150 150 150 150 150 150 
##$DP07= 0
##$DPNAME0= <>
##$DPNAME1= <>
##$DPNAME2= <>
##$DPNAME3= <>
##$DPNAME4= <>
##$DPNAME5= <>
##$DPNAME6= <>
##$DPNAME7= <>
##$DPOAL= (0..7)
0.5 0.5 0.5 0.5 0.5 0.5 0.5 0.5 
##$DPOFFS= (0..7)
0 0 0 0 0 0 0 0 
##$DQDMODE= 0
##$DR= 18
##$DS= 0
##$DSLIST= <SSSSSSSSSSSSSSS>
$$ [...]
##$SUBNAM2= <"">
##$SUBNAM3= <"">
##$SUBNAM4= <"">
##$SUBNAM5= <"">
##$SUBNAM6= <"">
##$SUBNAM7= <"">
##$SUBNAM8= <"">
##$SUBNAM9= <"">
##$SW= 24.9337058887773
##$SWIBOX= (0..15)
0 0 2 0 0 0 0 0 0 0 0 0 0 0 0 0 
##$SW_h= 4990.01996007984
##$TD= 16384
##$TD0= 1
##$TE= 0
##$TE2= 300
##$TE3= 300
##$TEG= 300
##$TL= (0..7)
0 120 120 120 120 120 120 120 
##$TP= (0..7)
150 150 150 150 150 150 150 150 
##$TP07= 0
##$TPNAME0= <>
##$TPNAME1= <>
##$TPNAME2= <>
##$TPNAME3= <>
##$TPNAME4= <>
##$TPNAME5= <>
##$TPNAME6= <>
##$TPNAME7= <>
##$TPOAL= (0..7)
0.5 0.5 0.5 0.5 0.5 0.5 0.5 0.5 
##$TPOFFS= (0..7)
0 0 0 0 0 0 0 0 
##$TUNHIN= 0
##$TUNHOUT= 0
##$TUNXOUT= 0
##$USERA1= <user>
##$USERA2= <user>
##$USERA3= <user>
##$USERA4= <user>
##$USERA5= <user>
##$V9= 5
##$VALIST= <valist>
##$VCLIST= <CCCCCCCCCCCCCCC>
##$VD= 0
##$VDLIST= <DDDDDDDDDDDDDDD>
##$VPLIST= <PPPPPPPPPPPPPPP>
##$VTLIST= <TTTTTTTTTTTTTTT>
##$WBST= 1024
##$WBSW= 4
##$XGAIN= (0..3)
0 0 0 0 
##$XL= 0
##$YL= 0
##$YMAX_a= 769910
##$YMIN_a= -608286
##$ZGOPTNS= <>
##$ZL1= 120
##$ZL2= 120
##$ZL3= 120
##$ZL4= 120
##$ABSF1= 10
##$ABSF2= 0
##$ABSG= 5
##$ABSL= 3
##$ALPHA= 0
##$AQORDER= 0
##$ASSFAC= 0
##$ASSFACI= 0
##$ASSFACX= 0
##$ASSWID= 0
##$AUNMP= <proc_1d>
##$AZFE= 0.1
##$AZFW= 0.1
##$BCFW= 1
##$BC_mod= 2
##$BYTORDP= 1
##$COROFFS= 0
##$CY= 11.3945322036743
##$DATMOD= 1
##$DC= 2
##$DFILT= <>
##$DTYPP= 0
##$F1P= 16.9975609425685
##$F2P= -3.02152046262296
##$FCOR= 0.5
##$FTSIZE= 0
##$FT_mod= 4
##$GAMMA= 1
##$GB= 0.15
##$INTBC= 1
##$INTSCL= 1
##$ISEN= 128
##$LB= 0.24
##$LEV0= 0
##$LPBIN= 0
##$MAXI= 10000
##$MC2= 0
##$MEAN= 0
##$ME_mod= 0
##$MI= 1.114404
##$NCOEF= 0
##$NC_proc= 0
##$NLEV= 6
##$NOISF1= 3.799351
##$NOISF2= 2.8
##$NSP= 1
##$NTH_PI= 0
##$NZP= 0
##$OFFSET= 15.70392
##$PC= 1
##$PHC0= -9793.196
##$PHC1= 14.80086
##$PH_mod= 1
##$PKNL= yes
##$PPARMOD= 0
##$PSCAL= 0
##$PSIGN= 0
##$REVERSE= no
##$SF= 200.130013532006
##$SI= 16384
##$SIGF1= 3
##$SIGF2= 2
##$SINO= 400
##$SIOLD= 16384
##$SREGLST= <1H.CDCl3>
##$SSB= 0
##$STSI= 0
##$STSR= 0
##$SW_p= 3612.71676300578
##$SYMM= 0
##$S_DEV= 0
##$TDeff= 0
##$TDoff= 0
##$TI= <>
##$TILT= no
##$TM1= 0
##$TM2= 0
##$TOPLEV= 0
##$USERP1= <user>
##$USERP2= <user>
##$USERP3= <user>
##$USERP4= <user>
##$USERP5= <user>
##$WDW= 1
##$XDIM= 8192
##$YMAX_p= 0
##$YMIN_p= 0
$$ End of Bruker specific parameters
$$ ---------------------------------
##NTUPLES= NMR FID
##VAR_NAME=  TIME,          FID/REAL,        FID/IMAG
##SYMBOL=    X,             R,               I
##VAR_TYPE=  INDEPENDENT,   DEPENDENT,       DEPENDENT
##VAR_FORM=  AFFN,          ASDF,            ASDF
##VAR_DIM=   8192,          8192,            8192
##UNITS=     SECONDS,       ARBITRARY UNITS, ARBITRARY UNITS
##FACTOR=    0.0002004,     1,               1
##FIRST=     0,             0,               0
##LAST=      1.6414764,     0,               0
##MIN=       0,             -608286,         0
##MAX=       1.6414764,     769910,          0
$$ Real data points
##PAGE= N=1
##DATA TABLE= (X++(R..R)), XYDATA
$$ [...]
$$ plain form
2347 -5945 -5486 -2407 1685 5502 6087 4189 678 -3712 -5925 -5608 -2228 2020 5315 6109 4219 30
2363 30 -3688 -6032 -5543 -2242 1861 5283 5864 3645 136 -3883 -5523 -5510 -2506 2191 5176 6107 3642
2380 3642 238 -3583 -5742 -5130 -1836 1947 5182 5757 3710 -182 -3765 -5978 -4886 -1720 2188
2395 2188 4769 5712 3459 -288 -3759 -5557 -4806 -1604 2212 4991 5365 3120 -610 -4012 -5597 -4733
2411 -4733 -1629 2315 4969 5509 3278 -351 -3880 -5523 -4589 -1434 2276 4887 5314 3074 -553 -3886
2427 -3886 -5413 -4470 -1484 2394 4739 4783 2874 -601 -4029 -5395 -4193 -820 2272 4784 4946 2572
2443 2572 -872 -3981 -5282 -4077 -1155 2817 4727 4991 2686 -1020 -3621 -5154 -3978 -653 2377
2458 2377 4997 4773 2565 -689 -3855 -4965 -3852 -626 2819 4736 4880 1994 -972 -3642 -5039
$$ packed form
2347e945M59L079M092L817N85j898l511m390k213L17L380M248L295P94j890m189
2363C0l718k344M89L301M103L422N81k219l509m019j640J3L004M697K985R31k465
2380C642l404l821k159O12L294L783L235N75k047l892l583k213J092L166L908
2395B188K581R43k253l747l471j798P51L202L816K779L74k245l730l402j585Q64
2411d733L104L944K654N40k231l629l529j643R34L155L710K611M27k240l627l333
2427c886j527R43K986L878K345M4j909l475l428j366J202L373L092K512J62k374
2443B572l444l109j301J205K922L972J910K64k305l706k601j533J176L325L030
2458B377K620k24k208l254l166j110J113L226L445J917J44k886k966k670j397
$$ plain form
2473 -5039 -3722 -726 2684 4693 4485 2412 -934 -3746 -4631 -3542 -413 2126 4528 4642 2166 -1448
2489 -1448 -3983 -4762 -3530 -977 2817 4680 4319 2199 -935 -3637 -4757 -3644 -451 2840 4724
2504 4724 4302 2028 -1525 -3617 -4491 -3487 -429 2757 4528 4347 1781 -1268 -3740 -5015 -3139 -566
2520 -566 2775 4325 4160 1805 -1345 -3842 -4564 -2995 -459 2864 4455 3992 1409 -1180 -3854 -4183
2536 -4183 -2934 -255 2771 4319 3867 1712 -1552 -3862 -4378 -2772 154 2850 4295 3901 1512 -1604
2552 -1604 -3704 -4268 -2746 205 2977 4490 3474 1425 -1730 -4008 -4292 -2585 158 3106 4267
2567 4267 3570 1360 -1835 -3790 -4021 -2425 139 2633 4072 3776 1035 -1795 -3660 -4158 -2510 501
2583 501 2794 4145 3434 1087 -1611 -3482 -3924 -2390 247 2768 4003 3459 1202 -1587 -3686 -3899
$$ packed form
2473e039J317K996L410K009k08k073l346k812q85J089L129K539K402J14k476l614
2489a448k535p79J232K553L794J863l61k120l134k702j120J113L193L291J884
2504D724m22k274l553k092q74J004L058L186J771j81k566l049k472j275J876K573
2520e66L341J550j65k355l150k497p22J569K536L323J591m63k583k589k674l29
2536d183J249K679L026J548m52k155l264k310n16J606K926K696J445l94k389l116
2552a604k100n64J522K951K772J513j016k049l155k278k84J707K743K948J161
2567D267o97k210l195j955k31J596K564K494J439k96k741k830j865m98J648L011
2583E01K293J351p11k347k698j871m42J534K637K521J235n44k257k789k099k13
$$ plain form
2599 -3899 -2145 485 3480 4068 2990 849 -1826 -3442 -3931 -2173 591 3051 3897 3176 959 -2067
2615 -2067 -3667 -3677 -2038 1010 2918 3983 3018 520 -2031 -3654 -3737 -1488 573 3028 3904 2670
2631 2670 932 -1991 -3499 -3314 -1654 613 3173 3724 2719 678 -2089 -3258 -3402 -1722 845 3067
2647 3067 3621 2872 684 -1970 -3371 -3220 -1304 977 2826 3463 2563 221 -1836 -3454 -3153 -1419
2663 -1419 877 2898 3421 2283 70 -1843 -3590 -3326 -1373 980 2646 3538 2512 369 -2302 -3281
2679 -3281 -2920 -1748 993 2905 3163 2398 91 -2229 -3240 -3185 -1268 1119 3089 3310 2262 -208
2695 -208 -1986 -2800 -2668 -1200 1205 3152 3357 2300 86 -2296 -3369 -2848 -943 1498 2972 3084
2711 3084 2064 -315 -2091 -3274 -2873 -1219 1250 2968 3108 1992 -53 -2174 -3056 -2797 -963 1267
$$ packed form
2599c899J754K630K995N88j078k141k675j616m89J758K764K460Q46p21k217l026
2615b067j600j0J639L048J908J065r65k498k551j623q3K249K061K455Q76j234
2631B670j738k923j508J85J660K267K560N51j005k041k767j169j44J680K567K222
2647C067N54p49k188k654j401J51J916K281J849O37r00k342k057j618L01J734
2663a419K296K021N23j138k213j913j747K64J953K353J666Q92j026k143k671r79
2679c281L61J172K741J912K58p65k307k320j011N5J917K387J970K21j048k470
2695b08j778q14J32J468K405J947K05j057k214k382j073N21J905K441J474J12
2711C084j020k379j776j183M01J654K469J718J40j116k045k121q82K59J834K230
$$ plain form
2727 1267 2832 3190 1587 -313 -2394 -3071 -2776 -1137 1415 2926 3089 1676 -123 -2393 -3229 -2436
2743 -2436 -475 1409 2744 2908 1564 -59 -2234 -3068 -2427 -605 1131 3084 2707 1642 -210 -2190
2759 -2190 -2836 -2410 -515 1429 2574 2721 1549 -230 -2331 -3004 -2084 -428 1501 2873 2845 1242 -517
2776 -517 -2102 -2869 -1816 -474 1330 2898 2685 1455 -481 -2144 -2560 -2126 -380 1575 2582 2416
2792 2416 1199 -553 -2213 -2689 -1899 -617 1355 2642 2523 1256 -626 -1984 -2428 -1906 -268 1518
2808 1518 2597 2412 1279 -518 -1846 -2628 -1922 -576 1370 2798 2566 1282 -715 -2199 -2606 -1871
2824 -1871 -175 1506 2655 2264 1088 -832 -2406 -2531 -2077 -94 1435 2423 2229 667 -869 -2225
2840 -2225 -2756 -1726 -209 1530 2281 2134 905 -759 -2095 -2555 -1616 245 1441 2148 2267 846 -572
$$ packed form
2727A267J565L58j603j900k081o77K95J639K552J511J63j413j799k270q36P93
2743b436J961J884J335J64j344j623k175q34O41J822J736J953l77j065j852j980
2759b190o46M26J895J944J145J47j172j779k101o73R20J656J929J372k8j603j759
2776e17j585p67J053J342J804J568k13j230j936j663m16M34J746J955J007j66
2792B416j217j752j660m76P90J282J972J287j19j267j882j358m44N22J638J786
2808A518J079j85j133j797j328p82P06J346J946J428k32j284j997j484m07P35
2824a871J696J681J149l91j176j920j574j25M54J983J529R88j94j562j536j356
2840b225n31J030J517J739P51j47j229j664j336m60R39J861J196P07J19j421j418
$$ plain form
2857 -572 -2041 -2540 -1667 22 1323 2464 1825 799 -601 -1894 -2497 -1301 253 1603 2201 1986 561
2874 561 -790 -1779 -2227 -1264 154 1673 2321 2171 701 -764 -1917 -2333 -1325 125 1655 2358 1543
2891 1543 420 -862 -1742 -2158 -1540 29 1548 1982 1701 1039 -833 -2231 -2139 -1222 231 1359 2204
2908 2204 2029 547 -733 -2016 -2159 -1114 457 1728 1914 1692 541 -1025 -1684 -2013 -1339 -76 1545
2925 1545 2303 1712 589 -857 -2020 -2046 -1119 433 1729 1824 1544 343 -1130 -1948 -1766 -947 444 1865
2943 1865 2534 1534 153 -978 -1554 -2015 -1179 396 1685 1853 1243 392 -870 -1887 -1682 -671 505
2960 505 1652 2022 1273 59 -1121 -2000 -1652 -835 475 1198 1595 1385 248 -1203 -1998 -1922 -1081 455
2978 455 1458 1745 1563 -56 -1137 -1601 -1446 -838 501 1361 1796 1398 -5 -942 -1760 -1309 -825 450
$$ packed form
2857e72j469m99Q73J689J301J141o39j026j400j293o03J196J554J350N98k15j425
2874E61j351r89m48R63J418J519O48j50j470j465j153m16J008J450J530P03q15
2891A543j123j282q80m16O18J569J519M34k81o62j872j398R2R17J453J128Q45
2908B204j75j482j280j283j43J045J571J271J86k22j151j566o59l29O74J263J621
2925A545P58n91j123j446j163k6R27J552J296R5k80j201j473q18J82Q19J391J421
2943A865O69j000j381j131n76m61Q36J575J289J68o10q51j262j017K05J011J176
2960E05J147L70p49j214j180q79L48Q17J310P23L97k10j137j451p95P6Q41J536
2978D55J003K87j82j619j081m64J55O08J339Q60M35l98j403r37q18M51M84J275
$$ plain form
2996 450 1505 1559 1126 140 -864 -1544 -1541 -784 310 1652 1788 1138 116 -918 -1672 -1608 -457 588 1438
3015 1438 1476 949 311 -963 -1389 -1292 -537 686 1280 1752 1395 -21 -951 -1488 -1373 -745 471 1164 1626
3034 1626 1001 -313 -1246 -1567 -1387 -294 626 1375 1618 985 -29 -908 -1365 -1306 -335 458 1401 1608 1060
3053 1060 -198 -940 -1920 -1360 -345 773 1601 1612 1218 11 -974 -1506 -1124 -626 543 1514 1448 657 -42
3072 -42 -972 -1695 -1319 -51 763 1254 1482 648 -257 -1066 -1610 -1131 -652 589 1224 1460 563 213 -815
3091 -815 -1495 -1012 -531 777 1341 1139 674 1 -1073 -1492 -1265 -204 502 1202 1532 762 -228 -881 -1250
3110 -1250 -928 40 760 925 1427 725 -107 -928 -1312 -1353 -506 626 1302 1343 802 -112 -1003 -1052 -804 -287
3130 -287 503 1198 1224 930 -218 -782 -1607 -1065 -220 925 1186 1389 698 63 -650 -1424 -968 -268 603 1426
$$ packed form
2996D50J055N4m33r86j004o80LP57J094J342J36o50j022j034p54O4J151J045Q50
3015A438L8n27o38j274m26R7P55J223N94M72l57j416r30n37J15O28J216O93M62
3034A626o25j314r33l21J80J093R20P49K43o33j014q79m57N9R71P93R43K07n48
3053A060j258p42r80N60J015J118Q28J1l94j207r85n32L82M98J169R71o6p91o99
3072d2r30p23L76J268Q14M91K28q34r05q09n44M79M79J241O35K36q97l50j028
3091h15o80M83M81J308N64k02m65o73j074m19K27J061P06P00L30p70r90o53l69
3110a250L22R68P20J65N02p02q32q21l84m1Q47J132O76M1n41r14q91m9K48N17
3130b87P90O95K6k94j148n64q25N42Q45J145K61K03o91o35p13p74M56P00Q71Q23
$$ plain form
3150 1426 1302 692 -184 -886 -1192 -1161 -219 622 1163 805 616 -235 -1025 -1027 -872 -284 626 1021 1168 792 -520
3171 -520 -1091 -1137 -901 -378 851 1206 1033 664 -285 -1045 -960 -829 -73 608 1199 856 641 -464 -987 -752
3191 -752 -1051 118 522 1213 1038 497 -94 -1112 -989 -682 393 822 1254 1167 466 -442 -912 -921 -775 -215
3211 -215 676 814 892 499 -195 -969 -1053 -694 -154 416 890 979 460 -475 -913 -1126 -828 -36 402 1313 854
3232 854 533 -265 -693 -1192 -693 -65 831 1087 820 446 -453 -1056 -1075 -378 -188 873 1169 890 491 -290
3252 -290 -826 -1108 -704 40 614 1052 930 204 -511 -976 -943 -794 -14 1043 931 534 483 -467 -1198 -622
3272 -622 -424 261 493 485 901 341 -442 -888 -1010 -546 -260 571 1109 615 396 -659 -687 -1050 -507 -123 600
3293 600 1155 998 330 -527 -667 -873 -608 156 767 621 528 -17 -539 -811 -907 -576 -183 713 1201 650 291
$$ packed form
3150A426j24o10q76p02l06L1R42Q41N41l58j89q51p90kJ55N88R10L95J47l76j312
3171e20n71m6K36N23J229L55j73l69r49p60Q5J31P56O81N91l43k15j105n23K35
3191g52k99J169M04O91j75n41n91j018J23L07J075M29M32q7p01r08m70rJ46N60
3211b15Q91J38P8l93o94p74q4L59N40N70M74Q9n19r35m38k13K98P92M38R11m59
3232H54l21p98m28m99M99O28Q96K56k67l74q99o03j9O97J90J061K96k79l99p81
3252b90n36k82M04P44N74M38j22p26p15m65L3J49P80J057j12l97n1r50p31N76
3272f22J98O85K32qM16n60p83m46j22M64K86Q31N38m94k19j055k8l63N43L84P23
3293F00N55j57o68q57j40k06K65P64O11j46r3n45n22k72r6L31L93Q96M88n51l59
$$ plain form
3314 291 -475 -1008 -896 -575 223 594 1075 533 -52 -298 -842 -1082 -539 89 503 889 490 188 -541 -791
3334 -791 -919 -541 92 807 1038 721 399 -646 -937 -665 -344 158 790 1021 629 165 -403 -915 -592 -630
3354 -630 211 530 822 672 32 -322 -1034 -983 -293 242 882 850 737 168 -314 -735 -726 -350 162 621 907
3375 907 663 -12 -550 -799 -507 -288 -75 765 572 808 -34 -431 -541 -1087 -335 69 948 1040 568 230
3395 230 -503 -676 -714 -240 209 340 699 627 37 -471 -772 -590 -416 377 603 801 766 9 -581 -698 -924
3416 -924 -369 153 812 657 38 -65 -563 -716 -599 -320 353 739 788 639 72 -337 -626 -689 -401 299 420
3437 420 1030 705 50 -644 -716 -743 -125 313 477 754 316 65 -766 -713 -712 -173 128 631 556 216 101 -638
3459 -638 -879 -499 -547 212 689 707 509 -52 -506 -765 -362 -390 194 326 851 274 -263 -591 -939 -584 -109
$$ packed form
3314B91p66n33J12L21P98L71M81n42n85k46n44k40N43O28M14L86l99l02p29k50
3334g91j28L78O33P15K31l17l22j045k91K72L21N02O32K31l92m64n68n12L23l8
3354f30Q41L19K92j50o40l54p12N1O90N35O40l2j13n69m82m21RL76N12M59K86
3375I07k44o75n38k49K92K19K13Q40j93K36q42l97j10n46P52M04Q79R2m72l38
3395B30p33j73l8M74M49J31L59p2n90n08l01J82J74P93K26J98l5p57n90j17k26
3416i24N55N22O59j55o19j03m98j53J17K79O73L86M9j49n67m09k89o3K88P00J21
3437D20O10l25o55o94p2k7O18M38J64K77m38k51q31N3JN39L01N03p5l40j15p39
3459f38k41L80m8P59M77J8j98n61m54k59M03k8N84J32N25n77n37l28l48L55M75
$$ plain form
3480 -109 411 880 710 408 116 -485 -592 -525 -227 253 816 701 329 -270 -540 -910 -689 -127 320 526
3500 526 692 295 69 -439 -413 -515 157 409 694 769 209 98 -505 -719 -652 24 245 699 580 404 -239
3521 -239 -198 -721 -410 -297 309 674 616 453 5 -569 -792 -261 -311 139 602 721 432 -110 -704 -424 -325
3542 -325 -5 73 335 616 258 -346 -514 -620 -323 136 352 306 305 73 -52 -723 -577 -573 -222 416 652 510
3564 510 -18 -121 -587 -623 -250 -33 346 584 328 168 102 -288 -641 -73 197 387 509 621 -220 -77 -507
3585 -507 -676 -276 -114 255 194 435 80 -342 -245 -458 -292 134 339 360 699 269 -230 -488 -613 -292 175
3606 175 448 625 274 197 -244 -440 -476 -322 -220 279 243 414 575 -86 -239 -352 -319 -9 277 705 155
3627 155 -217 -135 -576 -572 -425 -13 76 87 433 146 -128 -534 -165 -178 138 374 395 305 -90 -278 -266 -178 131
$$ packed form
3480a09N20M69j70l02k92o01j07O7K98M80N63j15l72n99k70l70K21N62M47K06
3500E26J66l97k26n08K6j02O72K52K85P5n60j11o03k14O7O76K21M54j19j76o43
3521b39M1n23L11J13O06L65n8j63m48n74k23N31n0M50M63J19k89n42n94K80R9
3542c25L20P8K62K81l58o04j68j06K97M59K16m6jk32j25o71J46ML51O38K36j42
3564E10n28j03m66l6L73K17L79K38k56j60o6l90l53N68K70J90J22J12q41J43m30
3585e07j69M00J62L69o1K41l55m22R7k13J66M26K05K1L39m30m99k58j25L21M67
3606A75K73J77l51p7m41j96l6J54J02M99l6J71J61o61j53j13L3L10K86M28n50
3627A55l72Q2m41MJ47M12Q9J1L46k87k74m06L69j3L16K36K1r0l95j88J2Q8L09
$$ plain form
3650 131 -13 380 110 250 265 -70 -449 -345 -51 -100 132 400 181 -138 -588 -438 -347 -243 -71 356 249
3671 249 66 -164 -234 -169 -302 -540 69 163 319 141 140 -294 -161 -248 -351 59 193 496 259 188 -112 -99 -254
3694 -254 -285 -261 416 363 191 -309 -384 -253 -357 -155 -3 82 449 149 41 -237 -237 -169 -125 123 174 278 171
3717 171 -231 -140 -295 -300 148 -143 164 344 215 -261 15 -470 -185 87 -15 181 406 105 -198 -248 -359
3738 -359 -227 99 36 226 294 303 -15 -249 -158 -210 100 152 376 226 272 -139 -138 -23 -32 -27 297 229 27 -27 168
3763 168 -402 -167 -367 2 35 285 22 55 -71 -180 -24 99 -194 323 -18 43 11 -180 -240 -432 -396 420
3785 420 139 242 364 -97 -198 -97 -314 -69 83 271 417 209 122 111 -221 -356 -113 115 -34 -46 108
3806 108 -237 -14 -151 -34 -92 133 104 22 3 125 -128 -90 -280 -61 2 63 133 19 85 109 -183 128 64 -80
$$ packed form
3650A31j44L93k70J40J5l35l79J04K94m9K32K68k19l19m50J50R1J04J72M27j07
3671B49j83k30p0O5j33k38O09R4J56j78jm34J33q7j03M10J34L03k37p1l00J3j55
3694b54l1K4O77n3j72n00p5J31j04K02J52Q5L67l00j08k78%O8M4K48N1J04j07
3717A71m02R1j55nM48k91L07J80j29m76K76m85K85K72j02J96K25l01l03n0j11
3738c59J32L26o3J90O8Rl18k34R1n2L10N2K24j50M6m11JJ15rNL24o8k02n4J95
3763A68n70K35k00L69L3K50k63L3j26j09J56J23k93N17l41O1l2j91o0j92L6Q16
3785D20k81J03J22m61j01J01k17K45J52J88J46k08q7j1l32j35K43K28j49j2J54
3806A08l45K23j37J17n8K25k9q2j9J22k53L8j90K19O3O1P0j14O6K4k92L11o4j44
$$ plain form
3830 -80 -40 258 15 58 -263 -116 85 -52 188 83 340 139 -142 -263 -378 -78 -177 30 128 -73 175 -26
3852 -26 -138 -189 -420 62 208 206 213 330 -147 -217 -293 -128 264 -202 163 71 -17 -151 -295 17 -4 45 129 124 135
3877 135 36 -213 -149 -72 37 -242 -75 72 -54 369 12 -127 -177 -129 27 11 57 106 75 360 -143 -238 -159 35
3901 35 -45 -267 343 142 -137 -135 -179 -427 134 491 78 117 -92 -105 -63 -84 341 95 108 183 -164 -152 -74 5 147
3926 147 148 196 -280 56 -88 -280 -195 -15 -165 126 61 -199 219 15 -14 -80 -190 -94 -222 -97 -229 110 138
3949 138 -216 -116 -172 -290 -95 191 86 22 -71 290 -64 -324 -23 -56 -273 319 38 78 -283 38 -104 -86
3971 -86 -5 289 -113 -13 -85 -247 58 -62 153 -300 -48 262 162 292 160 85 8 -139 28 269 -3 18
3993 18 -75 -239 -189 -299 -93 -175 56 119 29 7 113 -24 -356 -249 69 -98 85 137 -185 -105 139 -249 92
$$ packed form
3830h0M0K98k43M3l21J47K01j37K40j05K57k01k81j21j15L00r9K07R8k01K48k01
3852b6j12n1k31M82J46kPJ17m77p0p6J65L92m66L65r2q8j34j44L12k1M9Q4nJ1
3877A35r9k49O4P7J09k79J67J47j26M23l57j39n0M8J56j6M6M9l1K85n03r5P9J94
3901C5q0k22O10k01k79Km4k48N61L57m13L9k09j3M2k1M25k46J3P5l47J2P8P9J42
3926A47JM8m76L36j44j92Q5J80j50K91o5k60M18k04k9o6j10R6j28J25j32L39K8
3949A38l54J00n6j18J95K86j05o4r3L61l54k60L01l3k17N92k81M0l61L21j42J8
3971h6Q1K94m02J00p2j62L05j20K15m53K52L10j00J30j32p5p7j47J67K41k72K1
3993A8r3j64N0j10K06q2K31O3r0k2J06j37l32J07L18j67J83N2l22Q0K44l88L41
$$ plain form
4016 92 271 163 473 149 -34 110 -223 -33 -379 85 279 -85 263 -15 -144 -55 -379 24 307 394 -92
4037 -92 168 58 -39 -218 -130 -167 126 481 274 153 325 -79 -32 69 -159 123 187 218 -187 -99 -140 -58 110
4060 110 83 8 157 -67 -9 -125 -300 94 171 -103 384 5 133 -38 -180 -64 -208 106 -218 71 -103
4081 -103 245 85 -227 -362 -314 -183 102 -414 127 258 -135 -236 -222 18 39 262 175 -59 219 -120 80
4102 80 -69 11 -243 27 232 305 -166 62 -335 -143 -51 -3 -268 177 -40 342 -38 -270 -226 -212 143 -43
4124 -43 127 158 25 -69 -295 -270 -105 -86 69 355 176 119 -351 -295 355 -108 -116 170 220 63 -129 107 -75
4147 -75 -246 69 117 -144 189 43 307 25 -182 -245 -51 -115 15 259 38 28 -5 43 -184 -141 76 40 -143
4170 -143 307 134 93 -128 -120 52 -169 70 62 237 55 -149 133 -53 -435 -251 44 332 -14 -120 21 -115
$$ packed form
4016I2J79j08L10l24j83J44l33J90l46M64J94l64L48k78j29Q9l24M03K83Q7m86
4037i2K60j10r7j79Q8l7K93L55k07j21J72m04M7J01k28K82O4L1m05Q8m1Q2J68
4060A10k7p5J49k24N8j16j75L94P7k74M87l79J28j71j42J16j44L14l24K89j74
4081a03L48j60l12j35M8J31K85n16N41J31l93j01J4K40K1K23q7k34K78l39K00
4102H0j49Q0k54K70K05P3m71K28l97J92R2M8k65M45k17L82l80k32M4J4L55j86
4124d3J70L1j33r4k26K5J65J9J55K86j79n7m70N6O50m63qK86N0j57j92K36j82
4147g5j71L15M8k61L33j46K64k82k07o3J94o4J30K44k21j0l3M8k27M3K17l6j83
4170a43M50j73m1k21QJ72k21K39qJ75j82k04K82j86l82J84K95K88l46j06J41j36
$$ plain form
4192 -115 30 -99 -82 -39 294 19 97 -174 -55 -70 -370 -69 117 193 14 61 -52 -320 -203 -352 262 169
4214 169 425 172 338 58 -54 -532 20 -47 -293 289 172 141 95 -226 -75 -283 140 28 -104 65 -97
4235 -97 -71 -143 178 -177 49 231 372 596 61 6 -198 -310 6 -34 21 204 507 -250 24 -220 -373 21
4257 21 -71 564 181 75 97 -382 171 16 -208 358 151 322 21 -47 -143 -298 -56 -271 -10 281 483 -11
4279 -11 255 -60 -336 -367 96 -60 160 -34 204 -85 -358 -177 -453 -20 -109 153 411 -41 159 -93 -34
4300 -34 6 -401 185 185 219 -138 -73 -277 -318 -458 -128 6 449 189 -130 89 -212 -357 -100 -164 148 -19 325
4323 325 209 -50 -226 81 -484 -114 7 444 431 75 161 -227 -71 56 332 145 147 -179 227 -122 -83 -314
4345 -314 -207 -56 95 115 213 209 -111 -17 -156 -231 -1 143 208 353 36 150 -141 -167 -484 -136 -81 110 219
$$ packed form
4192a15J45j29J7M3L33k75P8k71J19j5l00L01J86P6j79M7j13k68J17j49O14r3
4214A69K56k53J66k80j12m78N52o7k46N82j17l1m6l21J51k08M23j12j32J69j62
4235i7K6p2L21l55K26J82J41K24n35n5k04j12L16m0N5J83L03p57K74k44j53L94
4257B1r2O35l83j06K2m79N53j55k24N66k07J71l01o8r6j55K42k15K61K91K02m94
4279a1K66l15k76l1M63j56K20j94K38k89k73J81k76M33q9K62K58m52K00k52N9
4300c4M0m07N86%L4l57O5k04m1j40L30J34M43k60l19K19l01j45K57o4L12j67L44
4323C25j16k59j76L07n65L70J21M37j3l56Q6l88J56J27K76j87Kl26M06l49L9k31
4345c14J07J51J51K0R8ml20R4j39p5K30J44O5J45l17J14k91k6l17L48N5J91J09
$$ plain form
4368 219 195 100 -289 -172 29 144 272 386 245 -87 -374 240 -326 -107 215 448 318 329 108 -122 71
4389 71 -435 -194 -157 237 288 290 -89 -110 -520 -220 -139 160 140 170 316 126 -178 -475 -289 -118 43 187 628
4412 628 76 -184 -187 -191 -325 55 255 237 209 89 -239 164 -15 -415 17 0 217 397 305 520 -40 -180 -581
4435 -581 -366 -47 364 397 -31 -105 -159 -418 -62 -107 -97 471 422 432 -20 49 -557 -112 -41 340 528 136 264
4458 264 -309 -207 -450 -207 -52 69 388 207 232 246 -361 -525 46 -136 129 172 290 -17 -13 -202 -269 -321
4480 -321 249 222 273 367 -1 53 -287 -552 -208 -59 103 576 309 18 2 -168 -375 -56 -2 216 267 409
4502 409 391 -269 -423 -446 -386 47 249 317 192 260 -71 -98 -353 -259 212 95 427 149 420 209 -297 -504
4524 -504 -826 74 312 93 430 -95 -149 -256 -289 -264 -168 396 515 83 330 -85 -511 -174 -226 -160 232 316
$$ packed form
4368B19k4r5l89J17K01J15J28J14j41l32k87O14n66K19L22K33j30J1k21k30J93
4389G1n06K41L7L94N1Kl79k1m10L00Q1K99k0L0J46j90l04k97J86J71J61J44M41
4412F28n52k60lmj34L80K00j8k8j20l28M03j79m00M32j7K17J80r2K15n60j40m01
4435e81K15L19M11L3m28p4n4k59L56m5J0N68m9J0m52O9o06M45P1L81J88l92J28
4458B64n73J02k43K43J55J21L19j81K5J4o07j64N71j82K65M3J18l07Mj89o7n2
4480c21N70k7N1R4l68N4l40k65L44J49J62M73k67k91j6j70k07L19N4K18N1J42
4502D09j8o60j54k3O0M33K02O8j25O8l31k7k55R4M71j17L32k78K71k11n06k07
4524e04l22R00K38k19L37n25n4j07l3K5R6N64J19m32K47m15m26L37n2O6L92Q4
$$ plain form
4546 316 260 -34 69 -124 -307 -237 123 164 372 487 71 -356 -339 -167 -20 188 407 253 456 296 -129
4567 -129 -394 -597 -110 -84 218 363 167 88 -311 -210 -334 -258 -49 162 261 239 57 -196 -291 -433 -361 -41
4589 -41 426 391 243 -52 -317 -388 -106 -335 -142 237 575 348 349 -303 -308 -337 -334 33 251 486 238 -132 -295
4612 -295 -273 -487 -127 58 338 232 334 -3 -324 -399 -240 -33 24 425 401 346 141 -354 -293 -583 -18 13
4634 13 211 459 147 -70 -274 -413 -434 -73 160 659 306 338 56 -329 -472 -182 -203 69 445 572 -48
4655 -48 -208 -116 -480 -308 -317 171 266 409 322 108 -228 -483 -379 -76 296 275 546 460 238 -227 -519 -254 -352
4678 -352 53 474 584 245 -220 -367 -590 -439 39 341 440 510 167 365 -516 -655 -593 -246 257 420 309
4699 309 252 -294 -433 -554 -296 -255 281 276 377 410 -196 -217 -326 -503 -331 72 525 562 229 -191 -524 -662
$$ packed form
4546C16n6k94J03j93j83P0L60M1K08J15m16m27J7J72J47K08K19j54K03j60m25
4567a29k65k03M87K6L02J45j96p9l99J01j24P6K09K11R9k2j82k53r5j42P2L20
4589d1M67l5j48k95k65p1K82k29J93L79L38k27Jo52nk9LL67K18K35k48l70j63
4612b95K2k14L60J85K80j06J02l37l21p5J59K07N7M01k4n5k05m95O1k90N65L1
4634A3J98K48l12k17k04j39k1L61K33M99l53L2k82l85j43K90k1K72L76J27o20
4655d8j60R2l64J72rM88R5J43q7k14l36k55J04L03L72k1K71q6k22m65k92K65r8
4678c52M05M21J10l39m65j47k23J51M78L02R9P0l43J98q81j39O2L47N03J63j11
4699C09n7n46j39j21K58M1N36nJ01L3o06k1j09j77J72M03M53L7l33m20l33j38
$$ plain form
4721 -662 -77 -154 162 266 237 666 -293 -342 -463 -260 -88 299 172 401 249 -258 -650 -261 -317 -151 2
4742 2 394 399 109 -163 -478 -460 -236 -143 170 710 250 42 -186 -472 -562 -487 174 306 678 426 -96 -124 -154
4765 -154 -355 -9 -307 206 597 631 380 -313 -661 -431 -397 -69 144 653 581 145 85 -335 -475 -63 22 356
4787 356 712 549 420 -255 -371 -618 -454 -150 468 738 416 61 -245 -230 -652 -557 -91 353 558 443 325
4808 325 -396 -472 -485 -304 152 405 520 181 -310 -355 -449 -402 -136 -19 273 362 124 13 -193 -574 -331 -410
4830 -410 117 259 444 318 -51 -220 -486 -275 -318 256 344 519 282 351 52 -587 -553 -379 161 303 515
4851 515 406 -80 -4 -486 -387 -101 30 449 390 528 145 -266 -491 -321 -236 230 665 322 575 -90 -38 -635
4873 -635 -616 -27 -257 488 537 612 -147 -322 -430 -195 -214 82 653 583 253 85 -268 -539 -412 -100 -26 545
$$ packed form
4721f62N85p7L16J04k9M29r59m9j21K03J72L87j27K29j52n07l92L89n6J66J53
4742BL92Nk90k72l15J8K24R3L13N40m60k08k28k86r0P5O61J32L72k52n22k8l0
4765a54k01L46k98N13L91L4k51o93l48K30L4L28K13N09p2m36o0m20j40M12Q5L34
4787C56L56j63j29o75j16k47J64L04O18K70l22l55l06J5m22R5M66M44K05j15j18
4808C25p21p6j3J81M56K53J15l39m91m5r4M7K66J17K92Q9k38j11k06l81K43p9
4830d10N27J42J85j26l69j69k66K11m3N74Q8J75k37O9k99o39L4J74N40J42K12
4851E15j09m86P6m82R9K86J31M19n9J38l83m11k25J70Q5M66M35l43K53o65N2n97
4873f35J9N89k30P45M9P5p59j75j08K35j9K96N71p0l30j68l53k71J27L12P4N71
$$ plain form
4895 545 574 485 88 -400 -330 -540 87 144 666 329 111 -93 -295 -511 -340 396 13 566 687 218 -33
4916 -33 -391 -726 -359 -193 221 464 885 233 -265 -349 -758 -476 -4 235 617 373 505 -131 -277 -518 -486
4937 -486 -140 39 287 536 -11 -37 -152 -839 -660 -74 282 185 450 417 -143 -633 -474 -526 -214 231 395
4958 395 320 448 -6 -450 -561 -682 115 287 487 596 112 -285 -612 -233 -599 -15 92 432 475 225 101
4979 101 -376 -349 -544 -111 529 411 265 126 95 -409 -581 -544 -109 174 244 686 224 -87 -245 -358 -291 -149
5001 -149 260 253 231 106 -64 -208 -407 -288 -225 135 541 216 -116 77 -451 -422 -454 182 60 605 407 161
5023 161 -374 -630 -438 -306 -133 311 285 328 420 -587 -351 -414 -388 -15 417 742 471 371 -278 -827 -672
5044 -672 -295 151 418 526 403 286 -207 -606 -58 -351 -191 507 599 505 -60 -201 -493 -553 -312 -220 300
$$ packed form
4895E45K9q9l97m88P0k10O27N7N22l37k18k04k02k16J71P36l83N53J21m69k51
4916c3l58l35L67J66M14K43M21o52m98q4m09K82M72K39L82k44J32o36j46k41L2
4937d86L46J79K48K49n47k6j15o87J79N86L56r7K65l3n60m90J59n2L12M45J64
4958C95p5J28m54m44j11j21P97J72K00J09m84l97l27L79l66N84J07L40M3k50j24
4979A01m77K7j95M33O40j18j46j39l1n04j72L7M35K83P0M42m62l11j58j13O7J42
5001a49M09pk2j25j70j44j99J19O3L60M06l25l32J93n28K9l2O36j22N45j98k46
5023A61n35k56J92J32J73M44k6M3R2j007K36o3K6L73M32L25k71j00o49n49J55
5044f72L77M46K67J08j23j17m93l99N48k93J60O98R2r4n65j41k92o0K41R2N20
$$ plain form
5065 300 109 361 -70 -486 -604 -442 -190 117 337 707 584 231 -180 -551 -689 -298 145 193 571 381
5085 381 119 -94 -892 -288 -337 100 332 571 476 81 -24 -525 -627 -274 211 436 613 421 33 -116 -628
5106 -628 -603 -279 52 580 810 634 475 -150 -576 -406 -163 -91 201 560 384 54 -344 -431 -522 -340 345
5127 345 367 499 224 -339 -25 -370 -313 -536 29 716 342 80 -140 -408 -330 -282 -68 123 547 971 152
5148 152 -72 -291 -583 -390 -242 276 465 603 224 35 -123 -410 -316 -267 104 373 369 -14 163 -376 -706
5169 -706 -601 -180 98 258 315 495 159 -299 -432 -422 -138 283 318 648 355 -455 -306 -822 -692 -591 156
5190 156 424 503 201 251 -408 -162 -717 -114 58 253 665 504 -274 -553 -469 -704 47 189 481 282 -14
5211 -14 -78 -335 -527 -375 -27 222 491 671 284 -99 -237 -442 -606 -60 316 653 628 308 -8 -319 -398
$$ packed form
5065C00j91K52m31m16j18J62K52L07K20L70j23l53m11l71j38L91M43M8L78j90
5085C81k62k13p98O04m9M37K32K39r5l95j05n01j02L53M85K25J77j92l88j49n12
5106f28K5L24L31N28K30j76j59o25m26J70K43P2K92L59j76l30l98q7r1J82O85
5127C45K2J32k75n63L14l45N7k23N65O87l74k62k20k68P8M8K14J91M24M24q19
5148A52k24k19k92J93J48N18J89J38l79j89j58k87R4M9L71K69ml83J77n39l30
5169g06J05M21K78J60N7J80l36m58j33J0K84M21L5L30k93q10J49n16J30J01P47
5190A56K68P9l02N0o59K46n55O03J72J95M12j61p78k79Q4k35P51J42K92j99k96
5211a4o4k57j92J52L48K49K69J80l87l83j38k05j64N46L76L37k5l20l16l11p9
$$ plain form
5232 -398 -566 72 115 785 811 230 -93 -483 -606 -444 -188 254 951 559 231 -14 -513 -521 -614 45 356 533
5254 533 405 179 -51 -636 -689 -375 -169 312 654 306 367 12 -186 -584 -302 -94 106 346 800 552 -60
5275 -60 -438 -605 -610 -469 595 538 598 456 -177 -558 -229 -475 12 302 497 272 1 -270 -479 -583 -490 -166
5297 -166 138 687 662 403 27 -727 -385 -330 -47 -54 581 84 472 18 -384 -311 -336 59 675 778 318 395
5319 395 -116 -266 -416 -468 17 431 443 222 180 -141 -345 -133 -555 -207 212 549 690 118 29 -316 -780
5340 -780 -413 30 325 644 564 252 -49 -520 -444 -212 -15 119 271 380 219 -202 -510 -592 -494 -175 161
5361 161 397 501 335 -210 -543 -482 -207 112 347 256 668 257 -137 -265 -478 -381 34 314 389 598 228
5382 228 -376 -371 -463 -449 23 493 703 723 216 50 -707 -508 -504 147 307 603 603 104 -93 -397 -752 -448 274
$$ packed form
5232c98j68O38M3O70K6n81l23l90j23J62K56M42O97l92l28k45m99qr3O59L11J77
5254E33j28k26k30n85n3L14K06M81L42l48O1l55j98l98K82K08K00K40M54k48o12
5275f0l78j67nJ41J064n7O0j42o33l81L29k46M87K90J95k25k71k71k09j04R3L24
5297a66L04N49k5k59l76p54L42N5K83pO35m97L88m54m02P3k5L95O16J03m60P7
5319C95n11j50j50n2M85M14J2k21m2l21k04K12m22L48M19L37J41n72q9l45m64
5340g80L67M43K95L19q0l12l01m71P6K32J97J34J52J09j61m21l08q2R8L19L36
5361A61K36J04j66n45l33O1K75L19K35r1M12m11l94j28k13R7M15K80P5K09l70
5382B28o04Nr2J4M72M70K10K0n07j66p57J99MO51J60K96%m99j97l04l55L04P22
$$ plain form
5405 274 758 347 401 424 -423 -393 -390 -292 77 418 512 471 207 -272 -684 -396 -243 215 590 682 451 266 -220
5428 -220 -642 -452 -397 229 474 225 485 96 -301 -785 -393 -400 327 406 625 258 -43 7 -576 -367 -360 143
5450 143 632 654 534 181 -387 -564 -402 -280 -75 340 330 389 -208 -465 -429 -463 -265 357 403 501 340 174
5472 174 -227 -559 -653 -338 173 282 442 655 281 -497 -275 -521 5 -74 285 570 251 302 -288 -440 -344
5493 -344 -176 88 547 469 396 -83 -165 -330 -549 -37 123 678 500 338 46 -133 -652 -570 -306 113 413
5514 413 498 505 -14 -399 -368 -613 -304 133 667 622 181 51 -60 -710 -614 135 190 450 614 322 133 -239
5536 -239 -443 -575 -130 127 386 638 279 220 -351 -497 -558 -112 66 392 777 284 -234 -418 -665 -459 -174
5557 -174 143 488 762 370 162 -344 -588 -414 11 11 451 535 545 -369 -535 -347 -601 -255 29 644 468
$$ packed form
5405B74M84m11N4K3q47L0LR8L69L41R4m1k64m79m12K88J53M58L75R2k31j85m86
5428b20m22J90N5O26K45k49K60l89l97m84L92pP27P9K19l67l01N0n83K09PN03
5450A43M89K2j20l53n68j77J62J22K05M15j0N9n97k57L6l4J98O22M6R8j61j66
5472A74m01l32r4L15N11J09J60K13l74p78K22k46N26p9L59K85l19N1n90j52R6
5493c44J68K64M59p8p3m79q2j65k19N12J60N55j78j62k92j79n19Q2K64M19L00
5514D13Q5Pn19l85L1k45L09M37N34m5m41j30j11o50R6P49N5K60J64k92j89l72
5536b39k04j32M45K57K59K52l59n9n71j46o1M46J78L26L85m93n18j84k47K06K85
5557a74L17L45K74l92k08n06k44J74M25%M40Q4J0r14j66J88k54L46K84O15j76
$$ plain form
5578 468 580 -56 -504 -543 -446 -79 99 549 403 138 237 -474 -647 -423 -106 103 374 702 306 -62 -220
5599 -220 -775 -626 1 138 538 450 -30 45 -334 -437 -536 163 -55 429 632 458 -138 -480 -274 -445 -248
5620 -248 164 296 634 88 -143 -639 -614 -230 7 7 596 506 191 -149 -557 -534 -566 -197 395 615 444 177
5642 177 -18 -147 -224 -260 -68 509 727 475 150 35 -241 -582 -360 148 511 698 655 325 -186 -585 -491
5663 -491 -431 -93 342 464 599 395 -84 -671 -341 -414 79 238 625 258 63 -161 -393 -697 -188 -93 181
5684 181 821 428 224 85 -591 -593 -345 -193 306 346 301 -22 -415 -397 -359 -502 -9 352 660 553 257 -185
5706 -185 -300 -425 -388 290 137 863 465 212 37 -440 -388 -56 64 282 759 262 130 -139 -352 -467 -231
5727 -231 174 440 342 305 135 -173 -505 -578 -159 -10 610 355 409 70 -344 -546 -421 -199 287 408 457 334
$$ packed form
5578D68J12o36m48l9R7L67J78M50j46k65R9p11j73K24L17K09K71L28l96l68j58
5599b20n55J49O27J37M00q8m80P5l79j03r9O99k18M84K03j74n96l42K06j71J97
5620b48M12J32L38n46k31m96K5L84K37%N89r0l15l40m08K3l2L69N92K20j71k67
5642A77j95j29p7l6J92N77K18k52l25j15k76l41K22N08L63J87m3l30n11l99R4
5663d91O0L38M35J22J35k04m79n87L30p3M93J59L87l67j95k24k32l04N09R5K74
5684A81O40l93k04j39o76kK48J52M99M0m5l23l93J8L8j43M93L61L08j07k96m42
5706a85j15j25L7O78j53P26l98k53j75m77N2L32J20K18M77m97j32k69k13j15K36
5727b31M05K66r8l7j70l08l32p3M19J49O20k55N4l39m14k02J25K22M86J21M9j23
$$ plain form
5749 334 -28 -174 -367 -395 -63 12 129 505 188 -86 -205 -433 -214 -360 -93 274 736 298 442 -273 -321
5770 -321 -297 -75 414 514 392 444 -235 -306 -473 -347 -81 50 667 435 166 20 -395 -466 -303 -131 106
5791 106 156 609 303 21 -421 -483 -452 -290 229 305 393 120 134 -340 -686 -416 -385 396 428 537 377 2 -240
5814 -240 -409 -519 -41 216 148 256 588 87 -324 -546 -612 -215 52 397 558 443 196 -432 -492 -409 -77
5835 -77 136 392 331 473 241 -372 -857 -653 -327 127 538 316 224 40 -161 -314 -568 -409 74 558 602
5856 602 541 -12 -318 -302 -685 -277 -14 251 480 137 -39 -57 -463 -444 -314 -163 154 258 419 228 -456
5877 -456 -521 -810 -269 -30 475 600 161 159 -560 -600 -448 -162 133 459 689 349 58 -237 -574 -288 -310 316
5899 316 480 687 830 -147 -503 -274 -471 -308 -33 318 596 344 174 -41 -526 -485 -462 184 447 601 83
$$ packed form
5749C34l62j46j93k8L32P5J17L76l17k74j19k28K19j46K67L67M62m38J44p15m8
5770c21K4K22M89J00j22N2o79p1j67J26K66J31O17k32k69j46m15p1J63J72K37
5791A06N0M53l06k82m42o2L1J62N19P6Q8k73J4m74l46K70L1P81L2J09j60l75k42
5814b40j69j10M78K57o8J08L32n01m11k22o6L97K67L45J61j15k47o28o0Q3L32
5835g7K13K56o1J42k32o13m85K04L26M54M11k22r2j84k01j53k54J59M83M84M4
5856F02o1n53l06J6l83M08K63K65K29l43j76j8m06J9J30J51L17J04J61j91o84
5877d56o5k89N41K39N05J25m39kp19m0J52K86K95L26K30l40k91k95l37K86k2O26
5899C16J64K07J43r77l56K29j97J63K75L51K78k52j70k15m85M1K3O46K63J54n18
$$ plain form
5920 83 13 -186 -316 -663 44 178 317 408 430 169 -342 -578 -492 -223 328 491 540 274 -191 -408 -585 -184
5942 -184 -132 279 600 455 223 -21 -66 -430 -331 -135 86 393 363 368 -85 -440 -278 -412 -174 182 345 414
5964 414 168 -170 -223 -252 -571 115 506 448 178 -28 -26 -409 -396 -387 -164 176 360 414 266 -48 -360 -518 -518 31
5988 31 29 254 315 155 -91 -474 -343 -339 -42 639 529 539 293 -189 -322 -513 58 -37 304 184 287 439 -263
6011 -263 -359 -533 -532 -94 303 676 398 259 -68 -177 -412 -277 42 316 354 411 -352 -60 -497 -172 -320 -327
6033 -327 423 245 245 357 -403 -242 -206 -123 -76 181 287 326 74 82 -537 -366 -195 -236 335 22 579 -212 -288
6056 -288 -469 -232 -398 68 73 213 223 34 -81 -378 -443 -393 52 205 478 140 57 -118 -566 -244 -81 43
6078 43 201 340 176 -19 -325 -342 -248 -140 -79 575 208 -4 10 50 -470 -374 -126 269 174 707 275 361 -171
$$ packed form
5920H3p0j99j30l47P07J34J39R1K2k61n11k36Q6K69N51J63M9k66m65k17j77M01
5942a84N2M11L21j45k32k44m5l64R9J96K21L07l0Nm53l55J62j34K38L56J63O9
5964D14k46l38n3k9l19O86L91n8k70k06Kl83J3RK23L40J84N4j48l14l12j58%N49
5988C1kK25O1j60k46l83J31MK97O81j10J0k46m82j33j91N71r5L41j20J03J52p02
6011b63r6j74JM38L97L73k78j39l27j09k35J35L19K74L8N7p63K92m37L25j48p
6033c27P50j78%J12p60J61L6Q3M7K57J06L9k52Qo19J71J71m1N71l13N57p91p6
6056b88j81K37j66M66NJ40J0j89j15k97o5N0M45J53K73l38q3j75m48L22J63J24
6078D3J58J39j64j95l06j7R4J08O1O54l67k12J4M0n20R6K48L95r5N33m32Q6n32
$$ plain form
6101 -171 -262 -415 -306 75 43 575 404 103 -183 -481 -467 -201 14 290 506 328 41 -78 -392 -653 -378
6122 -378 132 177 127 326 -20 -190 -310 -391 -231 63 502 543 448 146 99 -194 -619 -355 -71 483 435 45
6144 45 -92 -255 -414 -594 -202 132 337 499 533 221 -483 -686 -241 -356 -19 273 517 357 206 -25 -241
6165 -241 -352 -156 97 119 616 299 354 -249 -325 -554 -144 362 123 130 433 251 -30 -395 -490 -224 62 179
6187 179 280 79 -337 -144 -427 -187 -2 -154 408 208 228 -293 -176 -540 -305 -330 -127 345 406 236 137
6208 137 -114 -298 -170 -59 -32 342 453 -38 -61 -338 -620 -271 -239 -39 333 278 281 50 -275 -152 -129 -473
6230 -473 -24 281 412 543 -157 -456 -344 -241 -20 161 209 139 167 -98 -203 -176 -422 100 -15 365 426 275
6252 275 -274 -302 -168 -433 -196 245 416 167 64 381 -293 69 -219 -157 515 235 474 135 -13 -229 -420
$$ packed form
6101a71r1j53J09L81l2N32j71l01k86k98J4K66K15K76K16j78k87j19l14k61K75
6122c78N10M5n0J99l46j70j20q1J60K94M39M1r5l02m7k93m25K64K84N54m8l90
6144D5j37j63j59j80L92L34K05J62L4l12p04k03M45j15L37K92K44j60j51k31k16
6165b41j11J96K53K2M97l17N5o03p6k29M10N06k39PL03j82k81l65r5K66K86J17
6187A79J01k01m16J93k83K40J85j52N62k00K0n21J17l64K35k5K03M72O1j70r9
6208A37k51j84J28J11K7L74J11m91k3k77k82L49L2K00L72n5Lk31l25J23K3l44
6230d73M49L05J31J31p00k99J12J03K21J81M8p0K8k65j05K7k46N22j15L80O1j51
6252B75n49k8J34k65K37M41J71k49j03L17o74L62k88O2O72k80K39l39j48k16j91
$$ plain form
6273 -420 -160 -196 178 262 60 419 -52 -296 -46 -193 -269 273 396 303 364 217 -161 -631 -130 -349 163 35
6295 35 221 -104 -290 -453 -447 -592 -164 231 281 473 176 56 -311 -315 -358 -232 97 393 455 176 -97 -290 -419
6318 -419 -99 9 141 276 132 217 -168 -387 -140 -136 55 155 201 282 338 -93 -205 -557 -196 -106 446 456 420
6341 420 337 245 -161 -404 -234 30 480 425 275 76 -102 -356 -254 6 -253 358 123 308 -4 371 4
6362 4 -445 -269 -7 507 65 483 -110 -431 -97 -53 -217 347 168 204 317 217 12 -371 -271 -331 -194 347
6384 347 434 17 -26 8 -376 -50 -136 -273 -13 235 93 82 -12 -175 -161 -130 130 116 290 180 -130 -169 -88 -621
6408 -621 10 199 130 199 79 393 -49 -214 -207 -242 177 211 419 298 562 -279 -401 -227 24 116 270 162
6430 162 9 207 -203 -115 -29 95 553 231 257 330 -84 9 -179 -292 -325 198 328 145 88 132 -316 -282 -153
$$ packed form
6273d20K60l6L74Q4k02L59m71k44K50j47p6N42J23r3O1j47l78m70N01k19N12j28
6295C5J86l25j86j63Oj45M28L95N0J92k97j20l67mm3J26L29K96O2k79k73j93j29
6318d19L20J08J32J35j44Q5l85k19K47MJ91J00M6Q1N6m31j12l52L61R0N52J0l6
6341D20q3r2m06k43J70K64M50n5j50j99j78k54J02K60k59O11k35J85l12L75l67
6362Dm49J76K62N14m42M18n93l21L34M4j64N64j79L6J13j00k05l83J00o0J37N41
6384C47Q7m17m3L4l84L26q6j37K60K48j42j1r4j63J4L1K60j4J74j10l10l9Q1n33
6408f21O31J89o9O9j20L14m42j65Pl5M19L4K08j21K64q41j22J74K51R2J54j08
6430A62j53J98m10Q8Q6J24M58l22K6P3m14R3j88j13l3N23J30j83n7M4m48L4J29
$$ plain form
6453 -153 122 170 -39 393 -125 283 -263 -195 -202 -172 -15 312 91 510 156 -227 -238 -122 -119 101 178 506 51
6476 51 -35 169 -306 -418 -302 10 82 8 283 -83 -197 -62 -466 -203 186 -28 383 106 -5 62 -189 -174
6498 -174 -133 -14 541 193 212 54 -262 -162 -238 26 -201 78 202 286 11 241 -468 -411 -88 39 243 428
6520 428 205 135 -134 -281 -181 -171 214 293 95 188 -77 -134 -399 -240 89 172 341 198 327 216 -424 -559
6542 -559 -284 171 479 596 288 146 -184 -372 -226 -80 -292 193 378 338 194 238 -165 -315 -356 -81 121
6563 121 162 340 213 32 282 -133 -217 114 463 641 2 142 343 -324 -342 86 105 -11 200 163 354 72
6585 72 -1 -516 -220 -210 77 73 101 139 -118 -58 -238 12 300 89 71 376 -140 -41 -265 -173 -317 204 244 -64
6609 -64 410 167 -125 -245 -218 -181 -115 23 361 390 139 141 -97 -377 -123 58 11 129 276 164 -12 -172 -63
$$ packed form
6453a53K75M8k09M32n18M08n46O8pL0J57L27k21M19l54l83j1J16LK20P7L28m55
6476E1q6K04m75j12J16L12P2p4K75l66j14J35m04K63L89k14M11k77j11O7k51J5
6498a74M1J19N55l48J9j58l16J00p6K64k27K79J24Q4k75K30p09N7L23J27K04J85
6520D28k23p0k69j47J00J0L85P9j98R3k65n7k65J59L29Q3J69j43J29j11o40j35
6542e59K75M55L08J17l08j42l30j88J46J46k12M85J85m0j44M4m03j50m1K75K02
6563A21M1J78j27j81K50m15q4L31L49J78o39J40K01o67j8M28J9j16K11l7J91k82
6585G2p3n15K96J0K87mK8L8k57O0j80K50K88k11j8L05n16R9k24R2j44N21M0l08
6609f4M74k43k92j20K7L7O6J38L38K9k51Kk38k80K54J81m7J18J47j12j76j60J09
$$ plain form
6632 -63 -260 25 410 278 194 126 -107 -44 -366 -119 51 44 282 337 3 -119 -180 -340 -108 -176 363 60 86
6655 86 245 72 -253 -518 -186 45 332 372 105 150 -204 -294 -467 52 -3 264 193 447 -68 -21 -236 -290 -106
6678 -106 237 25 270 34 68 -15 -291 83 134 -149 229 386 150 97 -70 -215 -325 -25 -199 408 301
6699 301 351 292 -374 -357 -218 -87 72 -8 263 -129 -271 -234 -286 -266 -191 28 212 379 269 -172 -209 -90 -116
6722 -116 -252 38 8 313 146 270 -370 -181 -288 -357 -72 223 175 225 -244 -236 -321 -338 11 149 0 426 210
6745 210 -133 213 -109 23 -363 225 224 436 174 149 -6 -335 -382 -131 305 -9 347 401 49 125 -430 60
6767 60 56 -24 31 130 214 98 -299 -99 -158 10 206 242 159 237 -166 -263 -170 -378 -95 -60 169 127 345 76 -225
6792 -225 -224 -153 -145 -153 30 212 140 -323 -603 -273 8 39 29 268 150 151 -137 -236 -149 -156 -205 208 107 262 324 150
$$ packed form
6632f3j97K85L85j32q4o8k33O3l22K47J70pK38N5l34j22o1j60K32o8N39l03K6
6655H6J59j73l25k65L32K31K87M0k67M5l54r0j73N19n5K67p1K54n15M7k15n4J84
6678a06L43k12K45k36L4q3k76L74N1k83L78J57k36n3j67j45j10L00j74O07j07
6699C01N0n9o66J7J39J31J59q0K71l92j42L7n2K0P5K19J84J67j10m41l7J19k6
6722a16j36K90l0L05j67J24o40J89j07o9K85K95m8N0m69Qq5j7L49J38j49M26k16
6745B10l43L46l22J32l86N88jK12k62k5j55l29m7K51M36l14L56N4l52P6n55M90
6767F0mq0N5R9Q4j16l97K00n9J68J96L6q3P8m03r7R3k08K83L5K29m2K18k69l01
6792b25JP1QqJ83J82p2m63k80L30K81L1j0K39j18Jk88r9Q7pm9M13j01J55O2j74
$$ plain form
6818 150 -30 -268 -247 -112 48 41 465 184 91 -187 -284 -311 75 263 45 230 400 45 -565 -79 -157 -13
6840 -13 199 -6 27 82 -141 -299 -361 -196 90 83 117 72 -65 -140 -52 -500 -168 -58 -103 446 119 199 -117 -384
6864 -384 -105 -309 36 300 -13 183 -33 -220 -310 -218 -284 -72 25 182 80 6 -48 -77 -320 -324 -96 96 38
6887 38 254 136 -37 -273 -145 -365 108 100 176 503 28 -267 -259 -128 13 -31 93 340 92 123 -114 -45 -180
6910 -180 127 56 38 173 56 270 -92 -404 -177 -354 -21 -243 382 222 261 -222 -140 -119 -109 -180 307 100
6932 100 -45 123 -30 39 -168 88 152 -77 150 89 -8 -106 -323 -273 -33 -47 -124 -64 204 337 -433 -302 -398
6955 -398 -125 -163 129 52 68 -42 -46 -200 -92 10 -108 -135 193 180 49 230 -165 -7 -409 391 59 -20 138
6978 138 -26 -37 -34 -139 -514 141 134 75 150 133 -150 -203 29 -26 -5 -3 -14 -15 32 -338 -267 -35 -209 10 -48 257
$$ packed form
6818A50j80k38K1J35J60pM24k81r3k78r7k7L86J88k18J85J70l55o10M86p8J44
6840a3K12k05L3N5k23j58o2J65K86pL4m5j37p5Q8m48L32J10m5N49l27Q0l16k67
6864c84K79k04L45K64l13J96k16j87r0R2o6K12R7J57j02p4n4k9k43mK28J92n8
6887C8K16j18j73k36J28k20M73qP6L27m75k95QJ31J41m4J24K47k48L1k37O9j35
6910a80L07p1j8J35j17K14l62l12K27j77L33k22O25j60L9m83Q2K1J0p1M87k07
6932A00j45J68j53O9k07K56O4k29K27o1r7r8k17N0K40j4p7O0K68J33p70J31r6
6955c98K73l8K92p7J6j10mj54J08J02j18k7L28j3j31J81l95J58m02Q00l32p9J58
6978A38j64j1Lj05l75O55pn9P5j7k83n3K32n5K1Kj1jM7l70P1K32j74K19n8L05
$$ plain form
7004 257 154 -80 41 -209 -374 -246 -250 199 281 161 -168 -48 -163 -14 -126 -158 298 276 60 63 5 -335 -9
7027 -9 -50 217 39 387 114 -109 8 18 -323 55 124 134 185 106 93 -448 -294 -461 -11 -40 100 37 -131 22
7051 22 -182 -213 -187 274 184 233 278 -16 -7 0 -53 -90 -112 78 105 160 20 -56 81 -351 -149 -174 222 294 159 183
7077 183 209 -192 -54 -236 -138 -20 173 217 245 66 250 -197 -16 -228 36 -148 314 -208 -226 -7 -223 -249
7099 -249 -240 298 550 338 229 4 -224 -145 -25 -194 208 75 166 189 192 -105 -312 -263 -74 -34 68 64 30 128
7123 128 24 39 23 -12 -12 281 203 -25 132 -310 88 -24 -69 3 479 234 206 -171 -44 -85 -189 -215 -156 241
7147 241 249 46 243 -339 -53 -268 -146 13 36 200 33 -57 -132 -214 -255 -22 -87 -119 35 19 -11 -18 18 -361 -292
7172 -292 -135 122 -7 419 -121 147 -150 -53 251 111 -24 -33 -77 84 -241 -303 -362 -192 120 99 55 -19 -48
$$ packed form
7004B57j03k34J21k50j65J28mM49Q2j20l29J20j15J49j12l2M56k2k16Ln8l40L26
7027im1K67j78L48k73k23J17J0l41L78O9J0N1p9j3n41J54j67M50k9J40o3j68J53
7051B2k04l1K6M61r0M9M5k94RPn3l7k2J90K7N5j40p6J37m32K02k5L96P2j35K4
7077A83K6m01J38j82R8J18J93M4K8j79J84m47J81k12K64j84M62n22j8K19k16k6
7099b49RN38K52k12j09k25k28P9J20j69M02j33R1K3Lk97k07M9J89M0J02ml4R8
7123A28j04J5j6l5%K93p8k28J57m42L98j12m5P2M76k45k8l77J27m1j04k6N9L97
7147B41Qk03J97n82K86k15J22J59K3J64j67r0p5q2m1K33o5l2J54j6l0pL6l79O9
7172b92J57K57j29M26n40K68k97R7L04j40j35rm4J61l25o2n9J70L12k1m4p4k9
$$ plain form
7195 -48 -66 -94 -284 -248 321 256 -13 237 -244 7 -206 -43 124 21 -24 135 49 39 -121 13 -36 -418 -103
7218 -103 332 -35 -65 -145 319 -245 -100 246 206 16 -101 73 -118 158 -108 -271 69 -97 32 142 64
7239 64 -149 87 -181 -54 217 72 236 -71 238 -56 63 29 56 -174 151 225 12 232 100 17 -212 -146
7261 -146 -239 338 179 355 383 -64 -6 -143 -114 -54 75 71 136 48 186 51 -114 147 -75 25 -77 431 157
7284 157 40 47 -170 -284 154 217 120 -29 -46 -48 -22 146 57 -355 -156 274 148 238 116 232 -215 68 -57
7307 -57 34 131 -59 -234 0 -199 96 -114 91 -271 233 114 139 129 -10 -157 142 82 -19 159 322 229
7329 229 -13 -20 -155 161 -15 65 326 -27 -102 137 -54 -282 -260 -87 65 203 24 -32 30 81 -138 -358 232
7352 232 -149 151 -114 50 -239 27 -126 -268 294 41 -101 53 -169 60 103 191 -216 -71 48 73 140
$$ packed form
7195d8j8k8j90L6N69o5k69K50m81K51k13J63J67j03m5J59q6j0j60J34m9l82L15
7218a03M35l67l0q0M64n64J45L46m0j90j17J74j91K76k66j63L40j66J29J10p8
7239F4k13K36k68J27K71j45J64l07L09k94J19l4K7k30L25P4k13K20j32q3k29O6
7261a46r3N77j59J76K8m47N8j37K9O0J29mO5q8J38j35j65K61k22J00j02N08k74
7284A57j17Pk17j14M38O3r7j49j7kK6J68q9m12J99M30j26R0j22J16m47K83j25
7307e7R1R7j90j75K34j99K95k10K05l62N04j19K5j0j39j47K99o0j01J78J63r3
7329B29k42pj35L16j76Q0K61l53p5K39j91k28K2J73J52J38j79n6O2N1k19k20N90
7352B32l81L00k65J64k89K66j53j42N62k53j42J54k22K29M3Q8m07J45J19K5O7
$$ plain form
7373 140 -64 90 -293 -324 213 -206 61 -147 -231 26 -59 -29 0 179 137 -93 59 372 239 84 12 -199
7395 -199 -244 69 95 182 -47 19 71 -142 254 166 -188 -239 -129 47 -275 -25 66 -232 96 -169 114 405 -7
7418 -7 -142 81 149 17 136 -160 59 50 -266 36 -97 64 -113 -161 146 307 86 83 86 -20 87 -140 62
7441 62 79 40 -81 -6 131 1 71 -30 -106 -95 125 113 -143 51 -84 -111 164 113 178 -91 276 310 107 14
7465 14 -78 -58 242 155 -103 64 44 5 -250 -80 -116 -52 38 113 254 0 137 -107 -292 15 -57 25 516 182
7489 182 -46 -18 -56 62 -27 28 -129 -4 478 167 27 57 -100 -1 34 27 209 273 -195 60 -69 -139 -279 -61
7513 -61 266 285 -136 16 274 133 -146 -242 -145 43 189 -213 59 149 113 35 127 148 -134 259 82 109 11 -240
7537 -240 -49 -156 22 139 -69 63 266 -288 -63 -461 149 317 -19 -1 26 21 8 -31 257 -105 85 184
$$ packed form
7373A40k04J54l83l1N37m19K67k08q4K57q5L0K9J79m2k30J52L13j33j55p2k11
7395a99m5L13K6Q7k29O6N2k13L96q8l54n1J10J76l22K50R1k98L28k65K83K91m12
7418gj35K23O8j32J19k96K19rl16L02j33J61j77m8L07J61k21lLj06J07k27K02
7441F2J7l9j21P5J37j30P0j01p6J1K20j2k56J94j35k7K75n1O5k69L67L4k03r3
7465A4r2K0L00q7k58J67k0l9k55J70l6O4R0P5J41k54J37k44j85L07p2Q2M91l34
7489A82k28K8l8J18q9N5j57J25M82l11j40L0j57R9L5pJ82O4m68K55j29p0j40K18
7513f1L27J9m21J52K58j41k79r6R7J88J46m02K72R0l6p8R2K1k82L93j77K7r8k51
7537b40J91j07J78J17k08J32K03n54K25l98O10J68l36J8K7nj3l9K88l62J90R9
$$ plain form
7559 184 -11 60 19 104 -135 66 -258 -75 112 -7 149 -195 59 -14 -12 228 180 0 215 -48 108 -53
7581 -53 181 -193 133 12 -32 -25 -77 6 -79 -207 -35 76 95 -45 290 -61 -136 -229 -62 98 7 126 186 152
7605 152 -104 35 28 229 -36 -52 -113 200 76 -301 -166 -77 -93 -76 -41 101 232 -27 -159 97 -180 17 -73
7628 -73 -63 88 -52 -231 125 -37 103 149 17 -253 166 242 -240 -178 36 -5 -178 55 -269 79 -200 -19
7650 -19 -138 37 -111 -169 -102 6 146 -61 119 57 -195 86 -100 164 14 -317 36 -221 50 144 -268 304
7672 304 -222 85 26 -85 68 168 125 112 63 -42 105 66 266 110 182 111 -185 -478 -43 -161 158 -63
7694 -63 214 -189 -179 -140 -25 -13 -14 182 -85 20 81 137 -16 193 131 -251 -47 114 -143 -141 -116 -73 24 372 -219
7719 -219 44 59 -366 118 24 203 56 386 -92 -9 5 -169 37 -302 -200 38 284 -209 208 85 78 -334
$$ packed form
7559A84j95P1m1Q5k39K01l24J83J87j19J56l44K54p3KK40m8j80K15k63J56j61
7581e3K34l74L26j21m4Pn2Q3q5j28J72J11J9j40L35l51p5r3J67J60r1J19O0l4
7605A52k56J39pK01k65j6o1L13j24l77J35Q9j6J7L5J42J31k59j32K56k77J97r0
7628g3J0J51j40j79L56j62J40M6j32k70M19P6m82O2K14m1j73K33l24L48k79J81
7650a9j19J75j48n8O7J08J40k07J80o2k52K81j86K64j50l31L53k57K71R4m12N72
7672C04n26L07n9j11J53J00m3j3m9j05J47l9K00j56P2p1k96k93M35j18L19k21
7694f3K77m03J0L9J15J2jJ96k67J05O1N6j53K09o2l82K04J61k57KK5M3R7L48n91
7719b19K63J5m25M84r4J79j47L30m78Q3J4j74K06l39J02K38K46m93M17j23pm12
$$ plain form
7741 -334 179 103 -184 121 46 -379 -129 61 -129 -34 -123 -91 244 -62 10 -71 291 202 -100 78 101 315 -314
7764 -314 -64 -2 159 -192 -181 258 -118 94 13 -242 -212 30 79 -40 44 -28 114 -74 19 -88 -156 90 233
7787 233 -44 -193 -35 73 -149 -99 37 47 -97 -11 212 -132 187 20 149 -48 -98 137 364 -55 48
7808 48 -104 -14 17 2 -216 -69 148 1 152 49 12 -15 -138 -29 36 67 275 -32 -14 -166 -193 286 -133
7831 -133 142 -2 65 48 -239 128 205 -51 -200 231 -284 1 -179 250 129 149 335 -7 201 -38 141
7852 141 -1 -12 -378 116 104 198 188 85 143 -87 -68 -80 145 155 -33 78 140 277 -86 50 303 -3 -145
7875 -145 -103 39 170 220 97 -196 52 146 -249 -128 -43 125 36 4 7 7 -79 38 -19 -57 17 276 -207 13 -134
7900 -134 -57 74 -385 221 -99 108 22 238 183 -110 29 -17 31 202 64 10 125 -177 -115 144 -84 -4 70
$$ packed form
7741c34N13p6k87L05p5m25K50J90j90R5q9L2L35l06P2q1L62q9l02J78K3K14o29
7764c14K50O2J61l51J1M39l76K12q1k55L0K42M9j19Q4p2J42j88R3j07o8K46J43
7787B33k77j49J58J08k22N0J36J0j44Q6K23l44L19j67J29j97n0K35K27m19J03
7808D8j52R0L1j5k18J47K17j47J51j03l7k7j23J09O5L1K08l07J8j52k7M79m19
7831a33K75j44O7j7k87L67P7k56j49M31n15K85j80M29j21K0J86l42K08k39J79
7852A41j42j1l66M94j2R4j0j03N8k30J9j2K25J0j88J11O2J37l63J36K53l06j42
7875a45M2J42J31N0j23k93K48R4l95J21Q5J68q9l2L%q6J17n7l8P4K59m83K20j47
7900a34P7J31m59O06l20K07q6K16n5k93J39m6M8J71j38n4J15l02O2K59k28Q0P4
$$ plain form
7923 70 -193 173 44 -79 -279 -197 -44 294 166 180 219 296 59 -253 -303 -119 -69 -140 94 173 6 3 117 39
7947 39 217 267 37 65 319 -34 -147 81 -28 -151 204 -3 -16 45 -82 136 -56 170 80 191 213 153 180
7970 180 49 114 103 184 -221 -196 41 -46 119 114 142 -6 -273 -89 153 10 104 64 136 143 -120 -157 15 -105 250
7995 250 132 83 -175 -139 -9 -277 -188 -129 35 61 202 287 -46 -164 -269 70 -43 287 344 -50 -111 -197 -147
8018 -147 -132 56 -47 -109 69 9 55 -258 -166 62 -50 -235 255 199 114 175 -172 -3 50 -157 -282 100 -207
8041 -207 -92 119 -12 -299 -100 -462 169 112 204 221 239 16 -256 98 -232 -48 142 211 137 34 34 146 -247
8064 -247 -96 -98 261 -171 153 29 147 -67 -267 29 148 364 -60 37 204 44 94 -350 -33 -24 192 -14
8086 -14 -118 121 -25 20 -236 -178 -221 173 35 88 -121 156 -151 -170 -173 -50 -67 193 -153 -291 23 -190 -74
$$ packed form
7923G0k63L66j29j23k00Q2J53L38j28J4L9P7k37l12n0J84N0p1K34P9j67lJ14p8
7947C9J78N0k30K8K54l53j13K28j09j23L55k07j3O1j27K18j92K26r0J11K2o0K7
7970A80j31O5j1Q1m05K5K37q7J65nK8j48k67J84K42j43R4m0P2Pk63l7J72j20L55
7995B50j18m9k58L6J30k68Q9N9J64K6J41Q5l33j18j05L39j13L30N7l94o1q6N0
8018a47J5J88j03o2J78o0M6l13R2K28j12j85M90n6q5O1l47J69N3k07j25L82l07
8041b07J15K11j31k87J99l62O31n7R2J7J8k23k72L54l30J84J90O9p4j03%J12l93
8064b47J51kL59m32L24j24J18k14k00K96J19K16m24R7J67j60N0m44L17RK16k06
8086a4j04K39j46M5k56N8m3L94j38N3k09K77l07j9lJ23j7K60l46j38L14k13J16
$$ plain form
8109 -74 18 -58 11 186 169 237 3 148 2 -388 -169 92 -71 116 147 -266 258 -168 -217 263 350 309 -47
8132 -47 -176 373 -70 168 -69 128 67 -148 107 -259 -114 22 159 24 62 45 -88 -35 220 71 16 127
8154 127 -1 87 -46 -5 -118 28 258 -347 18 261 -359 364 120 155 -63 -85 102 92 199 -89 309 158
8176 158 -70 200 -138 -8 77 155 265 112 -159 33 51 173 -178 -206 215
$$ packed form
8109g4R2p6O9J75j7O8k34J45j46l90K19K61j63J87L1m13N24m26m9M80Q7m1l56
8132d7j29N49m43K38k37J97o1k15K55l66J45J36J37j35L8j7j33N3K55j49n5J11
8154A27j28Q8j33M1j13J46K30o05L65K43o20P23k44L5k18k2J87j0J07k88L98j51
8176A58k28K70l38J30Q5P8J10j53k71J92J8J22l51k8M21
8191B15
$$ Imaginary data points
##PAGE= N=2
##DATA TABLE= (X++(I..I)), XYDATA
$$ plain form
0 0 0 0 0 -8 8 -8 16 -16 18 -25 29 -41 49 -58 75 -87 108 -127 148 -180 206 -241 281 -318 372 -420 482
27 482 -550 616 -703 788 -885 995 -1109 1243 -1382 1533 -1707 1891 -2099 2323 -2569 2848
43 2848 -3150 3492 -3876 4304 -4802 5365 -6023 6807 -7742 8900 -10364 12284 -14941
56 -14941 18846 -25207 37363 -69100 328621 769910 257622 -14031 -220603 -408812 -523402
67 -523402 -174289 299006 556773 526990 398071 82029 -292072 -479702 -365035 -134460
77 -134460 177874 496074 606096 365776 9545 -266421 -435219 -430998 -125391 276578
87 276578 471210 448157 343752 76850 -326823 -525606 -332803 -24646 178129 361247
97 361247 499105 346874 -53502 -358874 -422406 -346786 -136247 209057 460880 422091 204576
$$ packed form
0@%%%qJ6j6K4l2L4m3N4p0R0j07J33j62J95k35K75l28L86m47N22n99O90p92R02
27D82j032J166j319J491j673J880k104K352k625K915l240L598l990M422m892N417
43B848n998O642p368Q180r106J0167j1388J2830j4549J6642j9264K2648k7225
56a4941L3787m4053O2570j06463L97721M41289n12288k71653k06572j88209j14590
67e23402L49113M73295K57767k9783j28919l16042l74101j87630J14667K30575
77a34460L12334L18200J10022k40320l56231k75966j68798M221L05607M01969
87B76578J94632k3053j04405k66902m03673j98783J92803L08157K02775J83118
97C61247J37858j52231m00376l05372o3532P5620K10539L45304K51823l8789k17515
$$ plain form
108 204576 -40708 -311292 -503918 -401356 -49575 250784 367660 370649 235964 -76165
118 -76165 -385515 -475466 -349829 -110772 187111 414285 398242 162778 -113565 -341636
128 -341636 -481898 -411271 -100863 233811 383161 350333 185078 -106069 -396536 -479737
138 -479737 -333700 -98230 154801 374893 402763 162831 -159509 -355915 -414984 -359267
148 -359267 -134718 193795 398335 352654 141587 -114308 -342574 -439236 -327044 -71201
158 -71201 187923 351681 352950 161979 -126322 -340985 -392158 -292675 -72902 196979 368655
169 368655 337049 144336 -102178 -315064 -398152 -278088 -16479 224192 343133 325302
179 325302 163482 -101824 -325811 -366913 -226835 -2397 218614 357864 334420 145011
$$ packed form
108B04576k45284k70584j92626J02562L51781L00359J16876K989j34685l12129
118g6165l09350q9951J25637K39057K97883K27174j6043k35464k76343k28071
128c41636j40262P0627L10408L34674J49350l2828j65255k91147k90467q3201
138d79737J46037K35470K53031K20092K7870k39932l22340j96406n9069N5717
148c59267K24549L28513K04540m5681k11067k55895k28266r6662J12192K55843
158g1201K59124J63758J269j90971k88301k14663n1173R9483K19773K69881J71676
169C68655l1606j92713k46514k12886q3088J20064K61609K40671J18941j7831
179C25302j61820k65306k23987m1102J40078K24438K21011J39250k3444j89409
$$ plain form
189 145011 -107595 -295505 -342503 -226324 9431 249487 369267 321237 140391 -97894
199 -97894 -290800 -338109 -207285 31320 255740 366926 320950 137900 -101096 -283527
209 -283527 -321671 -196606 32508 255771 367638 317246 130871 -103650 -278599 -314101
219 -314101 -190828 35258 254931 360367 305227 122069 -106244 -277779 -309001 -181690
229 -181690 36792 240658 342814 297616 115302 -117748 -280202 -296571 -176759 24465
239 24465 229999 338337 279733 88764 -125005 -270457 -296639 -182703 31002 230477
249 230477 311714 250311 81768 -128374 -283917 -297171 -166705 31300 210899 299090 243373
260 243373 59876 -148808 -279632 -287110 -172670 28353 218160 289238 213620 45984 -145732
$$ packed form
189A45011k52606j87910m6998J16179K35755K40056J19780m8030j80846k38285
199i7894j92906m7309J30824K38605K24420J11186m5976j83050k38996j82431
209b83527l8144J25065K29114K23263J11867n0392j86375k34521j74949l5502
219c14101J23273K26086K19673J05436n5140j83158k28313j71535l1222J27311
229a81690K18482K03866J02156m5198j82314k33050j62454j6369J19812K01224
239B4465K05534J08338n8604j90969k13769j45452k6182J13936K13705J99475
249B30477Q1237o1403j68543k10142j55543j3254J30466J98005J79599Q8191n5717
260B43373j83497k08684j30824p478J14440K01023J89807P1078p5618j67636j91716
$$ plain form
271 -145732 -286793 -296627 -158977 42389 203698 270532 215580 41587 -167933 -291467 -276892
282 -276892 -153418 29280 206200 280580 200124 19585 -161972 -277984 -282655 -155346 47439
293 47439 211180 260848 191751 30827 -163502 -286721 -268805 -134108 44403 201424 268458
304 268458 194437 15416 -163336 -264097 -258049 -138895 54795 216731 258137 177453 24350
315 24350 -148508 -265856 -252911 -112974 66995 204249 254456 187760 20214 -158398 -249842
326 -249842 -226070 -108091 64853 218209 260314 170402 11574 -141506 -238186 -227270 -94566
337 -94566 87842 218392 245982 171686 18416 -149316 -239794 -206311 -77339 85335 219059
348 219059 255652 167095 4034 -146429 -224839 -202858 -76493 99706 226485 243373 158651
$$ packed form
271a45732j41061r834J37650K01366J61309O6834n4952j73993k09520j23534J4575
282b76892J23474J82698J76920P4380q0456j80539j81557j16012m671J27309K02785
293D7439J63741M9668o9097j60924j94329j23219J7916J34697J78511J57021O7034
304B68458p4021j79021j78752j00761O048J19154J93690J61936M1406q0684j53103
315B4350j72858j17348J2945J39937J79969J37254N0207o6696j67546j78612r1444
326b49842K3772J17979J72944J53356M2105q9912j58828j53080r6680J0916J32704
337i4566J82408J30550K7590p4296j53270j67732r0478L3483J28972J62674J33724
348B19059L6593q8557j63061j50463p8410K1981J26365J76199J26779J6888q4722
$$ plain form
359 158651 11106 -145063 -232963 -195554 -59164 99323 215055 244171 161809 -457 -153277
370 -153277 -221120 -185819 -64804 96630 221466 238189 144671 -3164 -144215 -222039 -189830
381 -189830 -56267 103064 208295 223036 143382 -5166 -154203 -221227 -176844 -53756 92840
392 92840 202746 219972 129990 -18574 -152993 -214982 -178265 -53714 96839 197624 204761
403 204761 120460 -21929 -159164 -218781 -170610 -47467 91592 190283 202083 111469 -36475
414 -36475 -162620 -211190 -168669 -51108 93888 192375 191931 98364 -38381 -160619 -215161
425 -215161 -169476 -43929 96447 184525 184682 96632 -41819 -165144 -212083 -161884 -41270
436 -41270 94210 182975 181348 90669 -45196 -162568 -207711 -157531 -36434 96921 180107
$$ packed form
359A58651j47545j56169q7900L7409J36390J58487J15732K9116q2362j62266j52820
370a53277o7843L5301J21015J61434J24836J6723r3518j47835j41051p7824L2209
381a89830J33563J59331J05231J4741p9654j48548j49037o7024M4383J23088J46596
392I2840J09906J7226q9982j48564j34419o1989L6717J24551J50553J00785P137
403B04761q4301j42389j37235n9617M8171J23143J39059R8691J1800r0614j47944
414c6475j26145m8570M2521J17561J44996R8487m44r3567j36745j22238n4542
425b15161M5685J25547J40376Q8078J57q8050j38451j23325m6939N0199J20614
436d1270J35480Q8765j627r0679j35865j17372m5143N0180J21097J33355Q3186
$$ plain form
447 180107 176242 87529 -47174 -162041 -201078 -147803 -30372 98521 179331 173485 81882
458 81882 -49979 -157163 -192779 -140777 -24132 103673 180244 168943 77201 -49518 -153729
469 -153729 -187912 -134054 -15762 108977 179745 165861 75981 -49639 -152939 -183825 -125316
480 -125316 -7700 111455 178595 165635 75150 -51594 -152360 -176765 -117619 -4435 112795
491 112795 180470 164687 71284 -52944 -148027 -171433 -113855 -540 115119 178789 159987
502 159987 68833 -51952 -145973 -167603 -108141 2481 114144 175703 156356 64274 -54446
513 -54446 -143013 -162637 -104938 5203 115574 171860 149024 59267 -55589 -143497 -160839
524 -160839 -98876 9866 113947 166797 144457 54301 -61296 -144093 -155824 -94645 9794
$$ packed form
447A80107l865q8713j34703j14867l9037N3275J17431J28893Q0810n846r1603
458H1882j31861j07184l5616N2002J16645J27805P6571j1301r1742j26719j04211
469a53729l4183N3858J18292J24739P0768j3884q9880j25620j03300l0886N8509
480a25316J17616J19155O7140j2960r0485j26744j00766k4405N9146J13184J17230
491A12795O7675j5783r3403j24228r5083k3406N7578J13315J15659O3670j8802
502A59987r1154j20785r4021k1630N9462J10622J11663O1559j9347r2082j18720
513e4446q8567j9624N7699J10141J10371N6286k2836q9757j14856q7908j7342
524a60839O1963J08742J04081N2850k2340r0156j15597q2797j1731O1179J04439
$$ plain form
535 9794 113458 165565 138365 45889 -65045 -142415 -154687 -94284 12636 115039 161615
546 161615 131187 40814 -67717 -144495 -154222 -91336 14857 113991 157954 126060 35080 -70822
558 -70822 -145071 -152651 -89450 16242 113293 153403 120541 30969 -73264 -145538 -151251 -86337
570 -86337 18629 112216 149827 115858 27125 -75746 -145108 -147755 -81491 20771 110089 145537
582 145537 111855 23203 -78133 -143149 -142980 -77781 22351 110394 143988 106894 18760 -78252
594 -78252 -141506 -139881 -72184 28284 111556 139706 103537 17426 -80041 -140704 -133523 -64971
606 -64971 30178 110335 140191 102441 13366 -80257 -136046 -129489 -63007 35217 114992 137974
618 137974 97136 13575 -78450 -135816 -125877 -54515 39073 112623 137158 98152 11053 -80857
$$ packed form
535I794J03664N2107k7200r2476j10934p7370j2272O0403J06920J02403M6576
546A61615l0428r0373j08531p6778r727O2886J06193R9134M3963l1894r0980j05902
558g0822p4249p580O3201J05692R7051M0110l2862q9572j04233p2274n713O4914
570h6337J04966R3587L7611l3969q8733j02871o9362k647O6264J02262Q9318L5448
582A45537l3682q8652j01336o5016J69O5199J00132Q8043L3594l7094q8134r7012
594g8252o3254J625O7697J00468Q3272K8150l6169q6111r7467o0663P181O8552
606f4971R5149Q0157K9856l7750q9075r3623n5789O557O6482R8224P9775K2982
618A37974m0838q3561r2025n7366R939P1362R3588P3550K4535l9006q7099r1910
$$ plain form
630 -80857 -130520 -118963 -53694 39529 117409 137746 92484 8949 -76831 -128826 -119138 -47663
642 -47663 46364 115107 132626 92526 8595 -80705 -126871 -109584 -43702 42466 114301 134427
654 134427 87680 2239 -77511 -120757 -110416 -43636 48412 115427 126381 83502 3907 -80799
666 -80799 -125136 -103860 -34488 46167 108941 126907 81494 -5231 -83834 -117938 -100304 -37877
678 -37877 47649 113234 120570 72113 -5636 -81774 -123058 -102346 -29892 51475 106115 115892
690 115892 72489 -10657 -89093 -119872 -94973 -31685 48434 109057 114484 61996 -14091 -82834
702 -82834 -119813 -101125 -28399 55521 104771 105715 63285 -12758 -90158 -122176 -92538 -25295
714 -25295 48682 103574 110108 58337 -21643 -86515 -113498 -93587 -29143 52777 105390 102462
$$ packed form
630h0857m9663J1557O5269R3223P7880K0337m5262q3535q5780n1995R688P1475
642d7663R4027O8743J7519m0100q3931q9300m6166J7287O5882Q6168P1835K0126
654A34427m6747q5441p9750m3246J0341O6780R2048O7015J0954m2879p9595q4706
666h0799m4337K1276O9372Q0655O2774J7966m5413q6725p8603l4104J7634O2427
678c7877Q5526O5585P336m8457p7749p6138m1284K0712P2454Q1367N4640R777
690A15892m3403q3146p8436l0779K4899O3288Q0119O0623N427n2488p6087o8743
702h2834l6979J8688P2726Q3920M9250R44m2430p6043p7400l2018K9638O7243
714b5295P3977N4892O534n1771p9980o4872k6983J9911O4444Q1920N2613k928
$$ plain form
726 102462 54237 -17617 -86243 -116521 -89283 -21966 50372 100067 104165 54822 -24564 -87220
738 -87220 -107304 -84134 -24394 52139 103855 99323 47491 -20948 -81784 -109080 -83131 -14768
750 -14768 56436 97281 96529 51859 -22701 -87813 -104953 -72682 -12408 54004 100475 98058 44914
763 44914 -26605 -81815 -100916 -73310 -8478 61174 99437 92122 45461 -24249 -84940 -101739
775 -101739 -67242 -4136 59978 100297 94898 42023 -29010 -81801 -96642 -68779 -4683 65584
787 65584 102145 88780 39248 -25101 -81077 -99543 -65808 500 63574 97505 89875 41058
799 41058 -29078 -82549 -94101 -62613 -2558 62012 98547 87147 35471 -29376 -78837 -92903
811 -92903 -62150 -781 61404 94234 83530 33578 -31486 -79368 -89369 -58716 -629 60186
$$ packed form
726A02462m8225p1854o8626l0278K7238O7317P2338M9695M098m9343p9386o2656
738h7220k0084K3170N9740P6533N1716m532n1832o8439o0836k7296K5949O8363
750a4768P1204M0845p52m4670p4560o5112j7140L2271O0274O6412M6471k417n3144
763D4914p1519n5210j9101K7606O4832O9652L8263p315m6661o9710o0691j6799
775a01739L4497O3106O4114M0319n399n2875p1033n2791j4841K7863O4096P0267
787F5584L6561j3365m9532o4349n5976j8466L3735O6308O3074L3931p630m8817
799D1058p0136n3471j1552L1488O0055O4570L6535j1400n1676o4847m9461j4066
811i2903L0753O1369O2185L2830j0704m9952o5064m7882j0001L0653N8087O0815
$$ plain form
823 60186 92821 78905 28103 -33105 -77424 -88712 -57435 2833 61643 88174 73217 25819
835 25819 -34267 -80469 -88030 -53146 5823 60574 85981 70881 22277 -37622 -81526 -87598
847 -87598 -51128 8251 61064 83912 69067 21132 -40365 -83575 -85997 -48769 8655 60748
859 60748 85234 68442 17541 -41960 -81925 -84892 -49247 9472 62985 84028 65941 17625
871 17625 -40821 -82314 -83962 -46060 10515 60758 83383 66558 15913 -42278 -78796 -79675 -45347
884 -45347 10303 61829 82399 62717 15179 -39326 -77022 -77916 -41096 13455 59892 79273
896 79273 62940 13760 -41847 -74428 -71607 -38182 13011 61779 80338 57809 9817 -39741
908 -39741 -71388 -71446 -35685 18762 62605 75951 56105 10436 -41759 -72795 -66936 -30528 18979
$$ packed form
823F0186L2635j3916n0802o1208m4319j1288L1277O0268N8810K6531j4957m7398
835B5819o0086m6202p561L4884N8969N4751K5407j5100m8604n9899m3904o072
847h7598L6470N9379N2813K2848j4845m7935o1497m3210k422L7228N7424N2093
859F0748K4486j6792n0901n9501l9965k967L5645N8719N3513K1043j8087m8316
871A7625n8446m1493j648L7902N6575N0243K2625j6825n0645n8191l6518q79L4328
884d5347N5650N1526K0570j9682m7538n4505l7696q94L6820N4551M6437J9381
896G9273j6333m9180n5607l2581K821L3425N1193M8768J8559k2529m7992m9558
908c9741l1647n8L5761N4447M3843J3346j9846m5669n2195l1036N859L6408M9507
$$ plain form
921 18979 62221 77530 54417 6456 -42102 -69829 -66394 -30904 23230 64788 74733 51846
933 51846 7687 -41805 -73188 -65672 -25911 23460 61666 75028 53168 4096 -44984 -69698
945 -69698 -62308 -27872 22512 64632 73759 48002 3940 -42233 -70641 -64635 -24858 25478 60818
958 60818 70501 49610 3424 -45914 -69664 -59468 -24383 21425 60624 71198 44976 -984
970 -984 -43510 -66693 -60973 -24705 24647 59791 65579 42767 -242 -45172 -68526 -56763 -20498
983 -20498 22602 57028 65898 40636 -5661 -45953 -64102 -55696 -22085 24657 59059 62014 35507
996 35507 -5064 -44881 -66452 -55389 -17304 26500 55852 60610 36606 -7864 -48651 -64377
1008 -64377 -51396 -16949 25906 57975 60383 32270 -8881 -46026 -63965 -53188 -15193 29190
$$ packed form
921A8979M3242J5309k3113m7961m8558k7727L435L5490N4134M1558R945k2887
933E1846m4159m9492l1383P516L9761M9371L8206J3362k1860m9072m9080k4714
945f9698P390L4436N0384M2120R127k5757m4062m6173k8408O006L9777N0336L5340
958F0818R683k0891m6186m9338k3750J0196L5085M5808L9199J0574k6222m5960
970i84m2526k3183N720L6268M9352L5144N788k2812m3009m4930k3354J1763L6265
983b0498M3100L4426Q870k5262m6297m0292j8149Q406L3611M6742L4402K955k6507
996C5507m0571l9817k1571J1063L8085M3804K9352M758k4004m4470m0787j5726
1008f4377J2981L4447M2855L2069K408k8113m1151l7145j7939J0777L7995M4383
$$ plain form
1020 29190 56604 57931 33343 -8280 -47903 -64116 -49115 -13102 27449 56559 59302 31941
1032 31941 -10472 -45844 -60720 -48881 -13536 29529 57288 56368 30557 -8075 -45299 -61640
1044 -61640 -46726 -10255 29284 55305 56758 30905 -9798 -44858 -57540 -44089 -10227 30060
1056 30060 56623 54655 27813 -9775 -42591 -57080 -43096 -7539 31721 54623 53016 28212
1068 28212 -10968 -44490 -55238 -39668 -6120 31424 54719 52872 25419 -12584 -43451 -53609
1080 -53609 -38606 -4536 32755 53984 50893 24415 -12855 -44568 -54172 -37041 -3093 32457
1092 32457 53684 50237 22702 -15013 -44659 -52686 -36704 -2628 33242 53278 48216 21201
1104 21201 -14826 -45007 -53273 -36056 -1667 32952 51686 46557 20650 -16251 -45154 -52329
$$ packed form
1020B9190K7414J327k4588m1623l9623j6213J5001L6013M0551K9110K743k7361
1032C1941m2413l5372j4876J1839L5345M3065K7759r20k5811l8632l7224j6341
1044f1640J4914L6471L9539K6021J453k5853m0703l5060j2682J3451L3862M0287
1056C0060K6563j968k6842l7588l2816j4489J3984L5557L9260K2902j607k4804
1068B8212l9180l3522j0748J5570L3548L7544K3295j847k7453l8003l0867j0158
1080e3609J5003L4070L7291K1229l091k6478l7270l1713r604J7131L3948L5550
1092C2457K1227l447k7535l7715k9646q027J5982L4076L5870K0036n062k7015
1104B1201l6027l0181q266J7217L4389L4619J8734n129k5907l6901k8903p175
$$ plain form
1116 -52329 -34716 -1083 32243 50831 45268 18496 -17442 -44590 -51116 -33558 -899 31813
1128 31813 49249 43668 17094 -17696 -44489 -50216 -32785 -573 31676 48555 41834 15103
1140 15103 -18639 -43988 -48919 -31207 886 31929 47222 39944 13398 -19199 -43704 -47739
1152 -47739 -29737 1756 31858 46866 39085 12499 -20287 -43936 -46760 -28307 3060 32455
1164 32455 46587 38013 11695 -21218 -43952 -45699 -26994 3523 32805 46355 37530 10675
1176 10675 -21301 -42656 -44741 -26048 4920 33625 46235 36663 9993 -20880 -42331 -43681
1188 -43681 -24727 6115 33655 45257 35924 9699 -21152 -41186 -42326 -23409 6853 33615
1200 33615 44968 35076 9516 -20687 -40649 -41034 -21802 7791 33484 44130 34462 8512 -21124
$$ packed form
1116e2329J7613L3633L3326J8588n563k6772l5938k7148o526J7558L2659L2712
1128C1813J7436n581k6574l4790k6793n727J7431L2212L2249J6879o721k6731
1140A5103l3742k5349m931J7712L2093L1043J5293p278k6546l2597k4505m035
1152d7739J8002L1493L0102J5008p781k6586l2786k3649k824J8453L1367K9395
1164C2455J4132q574k6318l2913k2734j747J8705L0517K9282J3550q825k6855
1176A0675l1976k1355k085J8693L0968K8705J2610r572k6670l0873k1451j350
1188d3681J8954L0842K7540J1602r333k6225l0851k0034j140J8917L0262K6762
1200C3615J1353r892k5560l0203j9962l85J9232K9593K5693J0646r668k5950k9636
$$ plain form
1213 -21124 -39884 -39368 -20371 8176 33628 44203 32858 7179 -21071 -38908 -38697 -19421 9447
1226 9447 34068 42795 31682 6590 -21375 -39150 -37805 -18217 9581 33565 42174 31025 5440
1239 5440 -21801 -38522 -37292 -17752 10055 33572 41185 29425 4385 -22182 -38833 -36510 -17233
1252 -17233 10457 33402 39943 28467 3498 -23104 -38301 -35804 -16853 10407 32652 39276
1264 39276 27123 2601 -22984 -38146 -35391 -15752 10933 32321 37982 25918 2011 -23696
1276 -23696 -37955 -34385 -15140 11155 31845 37134 25213 585 -24033 -37922 -33859 -14108
1288 -14108 11679 31740 36762 24148 315 -24446 -37027 -32652 -13368 11998 31525 35839
1300 35839 23224 -495 -24127 -36767 -32333 -12943 12328 31444 35286 22340 -970 -24014
$$ packed form
1213b1124j8760N16J8997K8547K5452J0575j1345k5679k8250j7837K11J9276K8868
1226I447K4621Q727j1113k5092k7965j7775J345J9588K7798K3984Q609j1149k5585
1239E440k7241j6721J230J9540K7807K3517P613j1760k5040k6567j6651K323J9277
1252a7233K7690K2945O541j1476k4969k6602j5197K497J8951K7260K2245O624
1264C9276j2153k4522k5585j5162K755J9639K6685K1388N661j2064k3907k5707
1276b3696j4259L570J9245K6295K0690N289j1921k4628k4618j3889M063J9751
1288a4108K5787K0061N022j2614k3833k4761j2581M375J9284K5366J9527M314
1300C5839j2615k3719k3632j2640M434J9390K5271J9116L842j2946k3310k3044
$$ plain form
1312 -24014 -36017 -31255 -12191 13011 31046 34401 21447 -1474 -23777 -35626 -30552 -10822
1324 -10822 13284 31007 34014 21254 -1862 -23997 -34608 -28841 -9845 13555 30936 33490
1336 33490 20218 -2126 -23930 -33944 -28203 -8933 14323 30721 32846 19601 -2567 -24091
1348 -24091 -33581 -26914 -7867 14437 30378 32582 19239 -3297 -23779 -32759 -26302 -7419 15308
1361 15308 30521 31839 18306 -3301 -23539 -32297 -25487 -6358 15319 30007 31472 17798 -4008
1374 -4008 -23910 -31673 -24596 -6102 15312 30468 30920 16652 -4445 -23353 -31472 -24411 -5473
1387 -5473 16249 30047 29450 15813 -5017 -23567 -30732 -23366 -5371 16053 29593 29134 14938
1400 14938 -5937 -23602 -30160 -23261 -5040 15885 28964 28061 14240 -6098 -24176 -29762 -22013
$$ packed form
1312b4014j2003M762J9064K5202J8035L355j2954k2921k2303j1849N074J9730
1324a0822K4106J7723L007j2760k3116k2135j0611N767J8996K3400J7381K554
1336C3490j3272k2344k1804j0014N741J9270K3256J6398K125j3245k2168k1524
1348b4091r490O667J9047K2304J5941K204j3343k2536k0482q980O457J8883K2727
1361A5308J5213J318j3533k1607k0238q758O810J9129K1677J4688J465j3674k1806
1374d008j9902p763P077J8494K1414J5156M52j4268k1097j8908q119P061J8938
1387e473K1722J3798n97j3637k0830j8550p165P366J7995K1424J3540m59j4196
1400A4938k0875j7665o558O899J8221K0925J3079r03j3821k0338j8078n586P749
$$ plain form
1413 -22013 -3711 15433 28701 27662 13621 -7341 -24018 -29256 -21539 -3690 16154 28374
1425 28374 26934 12403 -7837 -24000 -29405 -20811 -2820 16382 27831 25949 11537 -7991 -24381
1438 -24381 -29017 -20007 -2265 16430 27289 25070 11122 -8299 -24162 -28923 -19891 -1548 17018
1451 17018 27101 24518 10463 -8523 -24005 -28074 -18830 -1132 17452 27193 23773 10001 -8858
1464 -8858 -23652 -27864 -18724 -492 17417 26679 23632 9737 -9138 -23462 -27098 -17882 -191
1477 -191 17173 27043 23451 8837 -9104 -22904 -26146 -16992 425 17585 26417 22814 8565
1490 8565 -9551 -22881 -25268 -15773 857 17743 26040 22441 7625 -9996 -22810 -25184 -15538
1503 -15538 1467 18141 25710 21047 7620 -9972 -23045 -24794 -14102 2386 17758 25417 21571
$$ packed form
1413b2013J8302J9144J3268j039j4041k0962j6677n238P717J7849J9844J2220
1425B8374j440j4531k0240j6163n405Q594J7991J9202J1449j882j4412j9528j6390
1438b4381m636R010J7742J8695J0859k219j3948j9421j5863m761R032J8343J8566
1451A7018J0083k583j4055j8986j5482m069R244J7698J8584R741l420j3772j8859
1464h858j4794m212R140J8232J7909R262l047j3895j8875j4324l636R216J7691
1477a91J7364R870l592j4614j7941j3800l242R154J7417J7160Q832l603j4249
1490H565j8116j3330k387R495J6630J6886Q297l599j4816j7621j2814k374R646
1503a5538J7005J6674P569m663j3427j7592j3073j749J0692J6488J5372P659l846
$$ plain form
1516 21571 6868 -10644 -22832 -23702 -13545 2178 18292 25687 20198 5817 -10215 -22423 -24176
1529 -24176 -13315 3464 18401 24769 19963 5976 -10915 -22722 -23144 -12764 3342 17989 24817
1542 24817 19225 4777 -11009 -21832 -23386 -13194 4109 18584 23483 18140 4950 -11018 -22977
1555 -22977 -22956 -11729 3874 17563 23356 18483 3997 -11860 -21474 -22203 -12252 3925 18378 23093
1569 23093 16853 3602 -11375 -22094 -21856 -10771 4843 17426 22615 17605 2944 -12738 -21933
1582 -21933 -20884 -10500 4390 17899 22883 16001 2273 -12258 -21746 -21130 -9962 5585 18025
1595 18025 21917 16010 2485 -13170 -22340 -19966 -9160 5334 17709 22644 15547 1106 -13430
1608 -13430 -21081 -19717 -9314 5931 18287 21442 14641 1378 -12956 -21430 -19402 -8092 6375
$$ packed form
1516B1571j4703j7512j2188q70J0157J5723J6114P395n489j4381j6032j2208j753
1529b4176J0861J6779J4937O368m806j3987j6891j1807m22J0380J6106J4647O828
1542B4817n592j4448j5786j0823j554J0192J7303J4475M899n343j3190j5968j1959
1555b2977K1J1227J5603J3689N793m873j4486j5857r614p29R951J6177J4453M715
1569B3093o240j3251j4977j0719K38J1085J5614J2583N189n010j4661j5682r195
1582b1933J049J0384J4890J3509M984o882j3728j4531r488O16J1168J5547J2440
1595A8025L892n907j3525j5655r170K374J0806J4494J2375M935p097j4441j4536
1608a3430p651J364J0403J5245J2356L155o801j3263j4334q474K028J1310J4467
$$ plain form
1621 6375 17419 21455 14884 756 -13127 -20541 -18278 -7985 6461 18167 21062 13609 358
1634 358 -12229 -20343 -18846 -7376 7260 17782 20295 13761 353 -13419 -20251 -17219 -6477
1647 -6477 6714 17724 20570 12550 -428 -12986 -19499 -17377 -6763 8050 18199 19742 12256
1660 12256 -441 -13558 -20125 -16809 -5949 7630 17863 19690 11977 -1223 -13539 -19383 -16225
1673 -16225 -5674 8103 17870 19342 11462 -1265 -13688 -19759 -16531 -4793 8489 17676 19135
1686 19135 11799 -1925 -13965 -19362 -15716 -4819 8106 18015 18806 10480 -2418 -13790 -19317
1699 -19317 -15419 -4604 8699 17387 17867 10035 -2555 -13888 -18860 -14912 -4229 8897 17063
1712 17063 17307 9761 -2738 -13622 -18355 -14576 -3997 9001 17161 17014 9089 -3095 -14110 -18440
$$ packed form
1621F375J1044M036o571j4128j3883p414K263J0293J4446J1706K895p453j3251
1634C58j2587q114J497J1470J4636J0522K513o534j3408j3772o832L032J0742
1647f477J3191J1010K846q020j2978j2558o513K122J0614J4813J0149J543p486
1660A2256j2697j3117o567L316J0860J3579J0233J827p713j3200j2316n844L158
1673a6225J0551J3777R767J472p880j2727j2423o071L228J1738J3282R187J459
1686A9135p336j3724j2040n397L646J0897J2925R909P91q326j2898j1372n527
1699a9317L898J0815J3303Q688M80p832j2590j1333m972L948J0683J3126Q166
1712A7063K44p546j2499j0884m733L779J0579J2998Q160j47p925j2184j1015m330
$$ plain form
1726 -18440 -14275 -2949 9186 16865 16855 8902 -3591 -14111 -17733 -13326 -2833 9403 17075 16728
1740 16728 8383 -3969 -13836 -17687 -13325 -2153 9607 16857 16270 7907 -4052 -13959 -17443 -12567
1754 -12567 -1791 9708 16797 15889 7416 -4302 -14034 -17300 -12469 -1510 10323 16559 15607 7351
1768 7351 -4654 -14092 -17079 -11739 -1286 10027 16297 15184 7047 -4185 -13899 -16871 -11560 -807
1782 -807 10188 16047 15095 6548 -4617 -13756 -16272 -10828 -654 10054 16163 14243 5936 -5092
1796 -5092 -13776 -15872 -10964 -249 10117 15603 14019 5976 -5223 -13525 -15827 -10374 -29 10064
1810 10064 15719 13711 5313 -5721 -13928 -15613 -9931 24 10587 15844 13314 4753 -5702 -14227
1824 -14227 -15521 -9586 449 10374 15467 13331 4474 -6151 -14030 -14834 -9366 725 10545 15315
$$ packed form
1726a8440M165J1326J2135P679j0p953j2493j0520l622M407J0493J2236P672l47
1740A6728q345j2352r867l851M362J1172J1760P250n87q363j1959r907l484M876
1754a2567J0776J1499P089r08q473j1718r732l266M831J0959J1833O236r52q256
1768G351j2005r438k987N340J0453J1313O270j113q137j1232r714k972N311J0753
1782h07J0995N859r52q547j1165r139k516N444J0174J0708O109j920q307j1028
1796e092q684k096M908J0715J0366N486j584q043j1199q302k302N453J0345J0093
1810A0064N655k008q398j1034q207j685N682R955J0563N257k530q561j0455q525
1824a4227j294N935J0035R925N093k136q857j0625p879q04N468J0091R820M770
$$ plain form
1838 15315 12619 4216 -6310 -13844 -15056 -9180 1295 10509 15261 12447 4147 -6598 -13861 -14686
1852 -14686 -8766 1383 10568 14931 12477 3713 -6721 -13404 -14265 -8329 1767 10650 14359 11648
1866 11648 3595 -6730 -13546 -14057 -7727 2050 10546 14401 11400 2898 -7035 -13357 -13585 -7332 2188
1881 2188 10776 14447 10890 2337 -7153 -13162 -13402 -7001 2666 10822 13872 10958 1939 -7517 -13106
1896 -13106 -13145 -6623 2963 10976 13934 10157 1544 -7547 -13012 -12636 -6221 3128 11230 13826 9984
1911 9984 1836 -7520 -13333 -12491 -5885 2884 11086 13652 9953 1418 -7463 -12839 -12524 -5825 3334
1926 3334 11113 13297 9747 1187 -7481 -12958 -11792 -5382 3817 10963 13041 9177 1058 -7845 -12369
1941 -12369 -11340 -5233 3491 10841 12627 8455 500 -7246 -12295 -10944 -4742 4104 10824 12422 8560
$$ packed form
1838A5315k696q403j0526p534j212N876J0475R214M752k814q300j0745p263q25
1852a4686N920J0149R185M363k454q764j0434o683q61N936J0096Q883L709k711
1866A1648q053j0325o816n11O330R777Q496L855l001q502r933o322k28O253R520
1881B188Q588L671l557q553r490o009k40O401R667Q156L050k914r019r456n589
1896a3106l9O522R586Q013K958l777q613r091n465L76O415R349Q102K596l842
1911I984q148r356n813Q42O606Q769Q202K566l699q535q881n376L15O699R159
1926C334P779K184l550q560q668n477J166O410R199P146K078l864q119q903m524
1941a2369J029O107Q724P350J786m172p955p746n049J351O202Q846O720J598l862
$$ plain form
1956 8560 397 -7800 -12194 -10718 -4504 3847 10428 12438 8125 131 -7691 -12262 -10725 -4247 4469
1971 4469 10723 12106 7935 -252 -7885 -12094 -10607 -4250 4560 10497 12017 7488 -832 -7965 -12110
1986 -12110 -10497 -3787 4430 10878 11777 7177 -592 -8033 -11989 -9892 -3585 4625 10613 11155 6937
2001 6937 -632 -8229 -11800 -9967 -3377 4954 10503 11339 6667 -893 -7909 -11489 -9431 -2903 4883
2016 4883 10318 11086 6527 -1081 -8131 -11265 -9156 -2752 4854 10180 10854 6482 -1120 -7960 -11116
2031 -11116 -8875 -2343 5067 10180 10449 5825 -1572 -8219 -10906 -8369 -1836 5186 10104 10129 5282
2046 5282 -1736 -8022 -10847 -7987 -1652 5276 9841 9930 5251 -1861 -8009 -10746 -7852 -1623 5377
2061 5377 9948 9921 4935 -1964 -8230 -10487 -7761 -1313 5435 9854 9568 4653 -2282 -8255 -10116 -7667
$$ packed form
1956H560q163q197m394J476O214Q351O581K010m313p994p822m571J537O478Q716
1971D469O254J383m171q187p633m209J487O357Q810N937J520m529q320p133m145
1986a2110J613O710Q217O448Q99m600p769p441l956K097O307Q210N988N42m218
2001F937p569p597l571J833O590Q331N549Q36m672p560p016l580K058O528P786
2016D883N435P68m559p608p050l134K109O404P606N326O74m372p602o840l156
2031a1116K241O532P410N113K69m624p397o647k687K537O533P022M918K5m847
2046E282p018o286k825K860O335O928M565Q9m679p112o148k737K894O229P000
2061E377M571k7m986o899o266k257K726O448O748M419k86m915o935n973j861K449
$$ plain form
2077 -7667 -1189 5865 9757 9779 4656 -2024 -8313 -10240 -6919 -1008 5597 9701 9203 4137 -2655 -7868
2093 -7868 -9922 -6878 -1032 5618 9487 8959 3934 -2598 -7905 -9552 -7055 -894 5470 9243 8638
2108 8638 3707 -2713 -7837 -9535 -6702 -763 5735 8977 8171 3469 -2637 -7950 -9386 -6446 -577
2123 -577 5781 9474 8346 3071 -3155 -7965 -9195 -6041 264 5863 8776 7986 2904 -3214 -7707
2138 -7707 -8749 -5941 -82 5747 8866 7386 2935 -3096 -8045 -8948 -5359 152 5886 8408 7268
2153 7268 2953 -3470 -7514 -8669 -5320 170 5829 8697 7464 2510 -3526 -7795 -8449 -5086 895
2168 895 5760 8293 7022 2129 -3348 -7910 -8062 -4727 784 5979 8404 6813 2127 -3525 -7446
2183 -7446 -8132 -4746 727 6097 8236 6406 1915 -3512 -7661 -7728 -4425 1029 6410 7975 6487 1906
$$ packed form
2077g667O478P054L892K2n123o680o289j927L321N911O605M104m98n066o792n213
2093g868k054L044N846O650L869n28n025o532n307j647K497O161O364L773o05
2108H638m931o420n124j698K833N939O498L242q06m702o106n313j436K940N869
2123e77O358L693j128n275o226m810j230L154O305N599K913p90n082o118m493
2138g707j042K808N859N829L119j480m451o031m949r03L589N511N734K522j140
2153G268m315o423m044j155L349N490N659K868j233m954o036m269o54L363N981
2168H95M865K533j271m893n477m562j52L335N511N195K425j591m686n652l921
2183g446o86L386N473N370K139j830m491n427m149o7L303N454N381J565j488m581
$$ plain form
2199 1906 -3520 -7491 -7568 -4144 1189 5950 8068 6305 1380 -3691 -7603 -7544 -4099 1530 5763 7890
2215 7890 6060 1285 -3934 -7492 -7330 -3963 1422 5975 7654 5578 1235 -4045 -7163 -7427 -3505
2230 -3505 1505 5938 7548 5543 1316 -3825 -7149 -6904 -3367 1761 5788 7282 5196 960 -4044
2245 -4044 -7327 -6713 -3363 1754 5950 7154 5057 856 -4259 -7096 -6668 -3264 1868 5922 7213
2260 7213 5041 820 -4533 -7192 -6684 -3245 1906 6090 7371 5068 226 -4425 -7195 -6318 -2730
2275 -2730 2225 6148 7140 4541 324 -4138 -6963 -5937 -2708 1944 6026 6895 4566 66 -4324
2290 -4324 -6418 -6282 -2421 2017 5766 6527 4252 36 -3987 -6733 -5729 -2454 2193 5514 6685
2305 6685 4145 67 -4369 -6649 -5528 -2490 2858 5784 6514 3991 -619 -4470 -6534 -5561 -1944
$$ packed form
2199A906n426l971p7L424N333M761K118j763m925n071l912N9L445N629M233K127
2215G890j830m775n219l558J62L367N385M553J679k076m343n280l118k64L922
2230c505N010M433J610k005m227n141l324K45L537N128M027J494k086m236n004
2245d044l283O14L350N117M196J204k097m201n115k837M28L404N132M054J291
2260G213k172m221n353k659N08L439N151M184J281k303m842m651k770Q77L588
2275b730M955L923R92k599m217m462k825J026L229M652M082Q69k329m500m390
2290d324k094J36L861M438L749P61k275m216m023k746J004L275M647L321J171
2305F685k540m078m436k280J121L038N348K926P30k523m610l851k064R73L617
$$ plain form
2320 -1944 2711 5533 6473 4031 -630 -4388 -6634 -5369 -1798 2472 5759 6093 3668 -238 -4508
2335 -4508 -6319 -4859 -1662 2919 5710 6077 3916 -653 -4629 -6255 -4802 -1473 2966 5848 5744
2350 5744 3716 -430 -4447 -6323 -4566 -1491 2878 5564 5653 3408 -889 -4732 -6081 -4663 -1501
2365 -1501 2976 6075 5563 3028 -487 -4638 -5906 -4586 -1200 2817 5547 5373 2990 -1306 -4480
2380 -4480 -5778 -4423 -1047 2845 5695 5368 2824 -1089 -4362 -5651 -4283 -998 2985 5556 5419
2395 5419 2473 -899 -4394 -5842 -4232 -563 3211 5164 4987 2438 -1306 -4778 -5628 -4012 -869
2410 -869 3154 5352 5072 2156 -1006 -4609 -5421 -3898 -704 3341 5140 4823 2538 -1518 -4479 -5330
2426 -5330 -3780 -237 3044 5360 4932 2400 -1470 -4329 -5306 -3786 -514 3255 5051 4737 2106 -1561
$$ packed form
2320a944M655K822R40k442m661l758k246J265L571M270L287L34k425l906m270
2335d508j811J460L197M581K791L67k161m569l976j626J453L329M439K882j04
2350E744k028m146m017j876J757L075M369K686Q9k245m297l843j349J418L162
2365a501M477L099n12k535l515m151j268J320L386M017K730j74k383m296l174
2380d480j298J355L376L892K850l27k544l913l273j289J368L285L983K571j37
2395E419k946l372l495j448J610L669L774J953j77k549l744l472q50J616L143
2410h69M023K198k80k916l162l603q12J523L194M045J799l17k285m056k961q51
2426e330J550L543L281K316m28k532l870k859r77J520L272L769J796l14k631l667
$$ plain form
2442 -1561 -4433 -5120 -3497 -226 2922 5354 4603 1909 -1416 -4131 -4960 -3131 -225 3320 5044 4355
2458 4355 1970 -1689 -4655 -4766 -3289 -40 3399 5016 4383 1616 -1926 -4517 -4961 -3136 73 3159
2474 3159 4872 4220 1582 -1893 -4276 -4751 -3296 348 3340 4769 3876 1469 -2054 -4362 -4627 -3018
2490 -3018 63 3463 4841 4099 1691 -1698 -4130 -4911 -2915 482 3375 4776 3755 1197 -2096
2505 -2096 -4347 -4647 -2305 709 3187 4745 3624 1444 -1652 -4067 -4555 -2753 550 3107 4442
2520 4442 3680 923 -1952 -4335 -4331 -2387 402 3261 4356 3700 1028 -1907 -4046 -4464 -2419 481
2536 481 3492 4426 3423 695 -2049 -4239 -4335 -2443 825 3286 4259 3144 715 -2001 -4115 -3838
2552 -3838 -2162 758 3406 4180 3593 632 -2279 -4017 -4120 -1828 787 3436 4138 3064 527 -2317
$$ packed form
2442a561k872o87J623L271L148K432p51k694l325k715q29J829K906L545J724o89
2458D355k385l659k966j11J477L249L439J617o33k767l542k591m44J825L209L086
2474C159J713o52k638l475k383m75J455L644K992J429q93k407l523k308k65J609
2490c018L081L400J378p42k408l389k432p81J996L397K893J401j021k558l293
2505b096k251l00K342L014K478J558j121k180l096k415m88J802L303K557J335
2520D442p62k757k875k383MJ944K789K859J095o56k672k935k139m18K045K900
2536D81L011R34j003k728k744k190r6J892L268K461R73j115k429k716k114K77
2552c838J676K920K648P74n87k961k911j738j03K292K615K649P02j074k537k844
$$ plain form
2568 -2317 -4228 -3836 -1935 990 3293 3966 3315 612 -2394 -4102 -3778 -1839 1162 3070 3946 2736
2584 2736 342 -2216 -4165 -3625 -1949 1129 3644 4154 3026 216 -2140 -3967 -3308 -1744 1168 3273
2600 3273 3954 2550 300 -2256 -3593 -3274 -1581 1146 3479 3823 2570 112 -2469 -4018 -3273 -1366
2616 -1366 1261 3043 3829 2360 35 -2323 -3780 -3302 -1385 1378 3149 3557 2040 -113 -2466 -3782
2632 -3782 -3076 -1253 1525 3181 3846 2029 -203 -2303 -3821 -3040 -1082 1656 3214 3806 2379 -262
2648 -262 -2681 -3622 -3665 -1176 1454 3529 3595 2143 -50 -2442 -3642 -3018 -1017 1522 3191 3686 1949
2665 1949 -504 -2370 -3413 -2939 -897 1609 3102 3326 2048 -572 -2659 -3588 -2887 -747 1557 3582
2681 3582 3270 1800 -637 -2621 -3382 -2701 -826 1826 2935 3121 1486 -875 -2507 -3276 -2131 -620
$$ packed form
2568b317j911L92J901K925K303O73o51k703l006j708L24J939L001J908Q76j210
2584B736k394k558j949N40J676L078K515N10j128k810k356j827O59J564K912K105
2600C273O81j404k250k556j337L19J693K727K333L44j253k458k581j549P45J907
2616a366K627J782P86j469k325k358j457M78J917K763J771M08j517k153k353j316
2632c782P06J823K778J656O65j817k232k100j518P81J958K738J558N92j427k641
2648b62k419r41m3K489K630K075O6j452k193k392j200O24K001K539J669M95j737
2665A949k453j866j043M74K042K506J493K24j278k620k087r29P01K140K304K025
2681C582l12j470k437j984p61O81J875K652J109J86j635k361j632p69J145J511
$$ plain form
2697 -620 1783 3211 3200 1659 -620 -2458 -3498 -2602 -465 1905 3471 3067 1455 -663 -2592 -3112
2713 -3112 -2410 -359 1730 3105 2832 1295 -787 -2678 -3196 -2027 -391 1681 2997 2745 1701 -669
2729 -669 -2522 -3258 -2154 -484 1837 3159 2765 1043 -845 -2800 -3199 -2228 -359 1859 3035 2647
2745 2647 1279 -1011 -2822 -2872 -1897 -367 1739 2897 2750 1367 -919 -2626 -2867 -2028 -153 1851
2761 1851 2895 2609 1166 -882 -2493 -3088 -2019 251 1723 2818 2369 790 -1224 -2427 -2692 -1972
2777 -1972 -59 1921 2579 2725 927 -1199 -2753 -2780 -1982 443 2006 3031 2579 1084 -1098 -2357
2793 -2357 -2785 -1578 27 1969 2821 2350 659 -697 -2205 -3086 -1828 58 1791 2726 2672 579 -937
2810 -937 -2403 -2634 -1409 -86 1972 2620 2121 479 -1315 -2219 -2616 -1114 276 1855 2465 2047 442
$$ packed form
2697f20K403J428j1j541k279j838j040Q96K137K370J566m04j612k118j929n20
2713c112P02K051K089J375k73j537k082j891n18J169J636K072J316k52j044k370
2729f69j853p36J104J670K321J322l94j722j888j955l99R71J869K218J176l88
2745B647j368k290j811n0R75J530K106J158j47j383k286j707k41Q39J875K004
2761A851J044k86j443k048j611n95J069K270J472J095m49j579k014j203k65P20
2777a972J913J980O58J46j798k126j554k7P98K425J563J025m52j495k182j259
2793b357m28J207J605J942Q52m71j691j356j508q81J258J886J733R35n4k093j516
2810i37j466k31J225J323K058O48m99j642j794r04l97J502J390J579O10m18j605
$$ plain form
2827 442 -998 -2383 -2741 -1423 242 1980 2353 1911 548 -977 -2365 -2575 -1219 183 1678 2609
2843 2609 1690 467 -942 -2380 -2223 -1231 418 1870 2413 1988 470 -1406 -1973 -2156 -1289 461 1633
2860 1633 2643 2100 284 -1214 -2148 -2183 -907 331 1848 2527 1573 368 -941 -2452 -2396 -1222 471
2877 471 1831 2440 1579 202 -968 -2390 -1972 -843 724 1763 2094 1647 445 -1362 -1869 -1929 -842
2894 -842 600 1571 2262 1698 61 -1126 -2225 -1992 -1072 405 1644 2124 1699 199 -1140 -2000 -1939 -681
2912 -681 651 1730 1972 1457 509 -1053 -1786 -2058 -929 615 1643 2162 1490 -159 -1228 -2002 -2053 -819
2930 -819 631 1927 1950 1264 40 -999 -1681 -1630 -662 644 1620 1865 1374 18 -1244 -1908 -1388 -663
2948 -663 585 1625 2008 1030 -132 -1178 -2004 -1886 -887 543 1383 1803 1047 103 -1219 -1981 -1629 -654
$$ packed form
2827D42j440j385l58J318J665J738L73m42j363j525j388k10J356J402J495R31
2843B609r19j223j409j438J57R92J649J452N43m25j518j876n67j83Q67J750J172
2860A633J010n43j816j498r34l5J276J238J517O79r54j205j309j511N6J174J693
2877D71J360O09q61j377j170j422M18J129J567J039L31m47j202j807n07o0J087
2894h42J442R71O91n64j637j187j099K33R20J477J239M80m25j500j339q60O1J258
2912f81J332J079K42n15r48j562p33k72J129J544J028N19o72j649j069p74n1J234
2930h19J450J296K3o86j224j039o82N1R68J306R76K45m91j356j262o64N20P25
2948f63J248J040L83r78j162j046q26J18R99J430Q40M20p56r44j322p62L52R75
$$ plain form
2966 -654 507 1713 1841 1134 85 -1414 -1976 -1643 -456 893 1781 1719 915 -267 -1425 -1552 -1437 -490
2984 -490 819 1657 1606 1215 -216 -1346 -1589 -1110 -254 717 1975 1561 697 -255 -1394 -1518 -1497 -491 827
3003 827 1486 1636 813 -209 -1219 -1599 -1502 -526 917 1531 1444 1034 -393 -1452 -1732 -1260 -254 964
3021 964 1722 1688 875 -292 -1140 -1820 -1379 -261 885 1412 1707 512 -487 -1238 -1710 -1451 -222 559 1716
3040 1716 1542 953 -250 -1208 -1650 -892 -162 688 1231 1669 809 -169 -1284 -1594 -1062 -98 696 1653 1517
3059 1517 512 -422 -1312 -1658 -1534 -324 678 1443 1315 837 -327 -1369 -1449 -1242 -301 893 1450 1191
3077 1191 535 -94 -1195 -1483 -1252 -107 662 1357 1398 845 -179 -1412 -1249 -975 -174 753 1188 1049 298
3096 298 -388 -938 -1691 -1217 -57 872 1801 1410 637 -261 -1158 -1065 -606 66 789 1736 1206 212 -450 -1183
$$ packed form
2966f54J161J206J28p07j049j499n62L33J187J349Q88o2q04j182j158j27J15R47
2984d90J309Q38n1l91j431j130k43M79Q56R71J258m14q64r52j139j24K1J006J318
3003H27O59J50q23j022j010l80R7R76J443O14q7m10j427j059k80M72J006J218
3021I64P58l4q13j167q48o80M41J118J146N27K95j195r99p51m72K59J229P81J157
3040A716j74n89j203r58m42P58P30Q50N43M38q60r78j115l10N32R64P94R57j36
3059A517j005r34q90l46J24J210J002P65j28m78j164j042q0K07R41J194N57k59
3077A191o56o29j101k88K31J145P69O95M1n53j024j233J63K74Q01R27M35j39p51
3096B98o86n50p53M74J160R29R29l91p73q98q97R3M59O72P23R47n30r94o62p33
$$ plain form
3116 -1183 -1227 -943 -199 557 1412 1072 628 -274 -1293 -1193 -992 -62 1096 1483 983 661 -421 -1141 -1279
3135 -1279 -852 -62 882 1308 1073 531 -604 -881 -1265 -705 93 1021 1492 1250 593 -428 -1103 -1427 -1076
3154 -1076 256 751 879 1193 488 -503 -1271 -1092 -725 28 734 1393 1262 569 -600 -1241 -1152 -839 132
3173 132 1118 1522 1148 432 -563 -1159 -1104 -757 -50 778 1244 975 375 -279 -1370 -989 -705 215 1049 1195
3193 1195 1143 220 -922 -1124 -1250 -521 -124 781 1027 960 225 -396 -852 -1088 -512 44 857 802 902 63
3213 63 -431 -990 -990 -619 -197 589 1368 887 141 -503 -972 -1104 -522 14 730 1041 838 435 -443 -1008 -1105
3234 -1105 -518 473 867 1157 862 388 -443 -1134 -1174 -574 -53 842 757 585 344 -445 -1199 -1055 -190 259
3254 259 681 982 959 99 -548 -742 -1020 -461 269 775 885 617 -11 -538 -1048 -866 -473 8 880 1028
$$ packed form
3116a183m4K84P44P56Q55l40m44r02j019J00K01R30J158L87n00l22j082p20j38
3135a279M27P90R44M26k35n42j135k77l84N60P98R28M71k42o57j021o75l24L51
3154a076J332M95J28L14p05r91p68J79L67P53P06O59j31o93j169o41Q9L13R71
3173A32R86M04l74p16r95n96N5L47P07Q28M66k69o00o54j091L81K84R20Q34J46
3193A195n2r23j142k02j26P29L97R05K46o7p35o21m56k36N76N56Q13n5J00q39
3213F3m94n59%L71M22P86P79m81p46o44m69j32N82N36P16L11k03m03q78n65r7
3234a105N87R91L94K90k95m74q31o91m0O00N21Q95q5j72k41p89p54J44Q65M49
3254B59M22L01k3q60o47j94k78N59P30N06J10k68o28n27n10J82L93M81Q72J48
$$ plain form
3274 1028 444 112 -460 -636 -951 -511 324 877 1305 1072 242 -567 -641 -905 -449 110 801 796 759 -47 -461
3295 -461 -802 -894 -542 422 991 900 794 -81 -851 -906 -618 -268 402 565 858 760 -38 -359 -753 -968 -503
3316 -503 388 945 918 524 -52 -608 -1101 -1100 -388 218 700 1026 529 106 -531 -1068 -285 -528 472 874 906
3337 906 486 182 -151 -1097 -838 -367 294 646 1010 535 157 -682 -794 -779 -375 223 833 906 309 -123 -630
3358 -630 -1080 -762 -471 385 737 667 645 151 -192 -743 -976 -366 443 691 882 485 -94 -642 -740 -822 -407
3379 -407 183 469 775 481 21 -610 -847 -883 -146 560 760 1076 571 -16 -774 -739 -901 -47 439 786 750
3400 750 346 -319 -392 -828 -621 -402 409 588 680 688 76 -528 -855 -554 -128 477 688 765 311 -158 -489 -850
3422 -850 -632 -433 379 902 566 357 138 -631 -548 -620 -201 330 1028 1039 307 -311 -509 -780 -336 -20 351
$$ packed form
3274A028n84l32n72j76l15M40Q35N53M28k33q30q09p4k64M56N59O91nl7q06m14
3295d61l41r2L52R64N69r1j06q75p70n5K88L50O70J63K93r8p98l21l94k15M65
3316e03Q91N57k7l94n76n56m93JP12O06M82L26m97m23o37n37P83k43J000M02L2
3337I06m20l04l33r46K59M71O61L52L64m75l78q39j12J5M04N98O10P3n97m32n07
3358f30m50L18K91Q56L52p0k2m94l43n51k33O10Q09K48J91l97n79n48r8q2M15
3379d07N90K86L06k94m60o31k37l6P37P06K00L16n05n87p58L5j62Q54M86L47l6
3400G50m04o65p3m36K07K19Q11J79R2Qo12o04l27L01M26O05K11P7m54m69l31l61
3422h50K18J99Q12N23l36k09k19p69Q3p2M19N31O98J1p32o18j98k71M44L16L71
$$ plain form
3443 351 639 661 167 1 -520 -586 -748 124 608 820 785 405 -68 -551 -793 -1043 119 365 842 843 259
3464 259 -86 -669 -1098 -702 -221 341 798 613 292 -238 -445 -597 -451 -43 577 718 854 230 -143 -568
3484 -568 -760 -399 -247 620 721 460 0 -296 -502 -669 -546 131 467 565 393 335 -224 -529 -656 -669 -21
3505 -21 585 655 700 -85 3 -667 -784 -594 151 445 677 531 137 -102 -727 -606 -389 -120 162 388 627
3526 627 -26 -102 -889 -466 -226 95 580 763 484 251 96 -578 -599 -501 118 250 595 608 211 -357 -334 -726
3548 -726 -353 -155 455 231 199 -194 -165 -210 -928 -291 -66 249 269 234 -31 -307 -280 -323 -1 166 193 379 369
3571 369 192 -234 -622 -436 -456 -137 486 698 439 -83 -179 -500 -433 -273 142 51 443 473 34 -448 -262 -540
3593 -540 -373 11 312 585 558 235 -123 -619 -593 -204 -124 457 521 527 296 -381 -387 -488 -295 -78 449 640 442
$$ packed form
3443C51K88K2m94j66n21o6j62Q72M84K12l5l80m73m83k42k50J162K46M77Jn84
3464B59l45n83m29L96M81N62M57j85l21n30k07j52J46M08O20J41J36o24l73m25
3484e68j92L61J52Q67J01k61m60k96k06j67J23O77L36R8j72n8n59l05j27j3O48
3505b1O06P0M5p85Q8o70j17J90P45K94K32j46l94k39o25J21K17K69K82K26K39
3526F27o53p6p87M23K40L21M85J83k79k33j55o74k1R8O19J32L45J3l97n68K3l92
3548g26L73J98O10k24l2l93K9m5p18O37K25L15K0l5k65k76K7m3L22J67K7J86j0
3571C69j77m26l88J86k0L19O23K12k59n22r6l21O7J60M15r1L92L0m39m82J86k78
3593e40J67L84L01K73k7l23l58m96K6L89Q0N81O4Ok31o77oj01J93K17N27J91j98
$$ plain form
3616 442 -50 -338 -737 -647 -188 -12 598 395 -49 -122 -118 -410 -262 -154 15 398 433 180 132 -150 -195 -90
3638 -90 -309 -101 251 403 292 31 102 -326 -398 -125 6 189 535 190 131 45 -410 -548 49 214 153 543
3660 543 183 92 -273 -323 -432 -34 195 260 568 648 -9 -181 -403 -324 -133 430 121 374 203 85 -327 -663
3682 -663 -213 -341 -405 230 227 320 67 -292 -216 -231 -171 125 51 333 132 79 -169 -383 -543 -33 375 465 303
3705 303 264 -1 10 -368 -435 -420 511 677 213 152 -22 -37 -176 -104 115 -104 188 346 -43 -70 -97 -315 -250
3728 -250 43 210 321 89 11 -325 -190 -530 -370 237 -15 373 356 161 -142 -121 -174 -90 -157 192 33 252
3750 252 318 -278 -297 -296 -80 117 155 136 101 9 -212 -385 -294 -91 2 117 -98 392 57 146 -37 -113 107 -26
3774 -26 94 16 -50 -58 -94 -269 33 -114 17 -176 38 153 431 198 -74 -385 -113 78 39 362 228 187 -260
$$ packed form
3616D42m92k88l99R0M59J76O10k03m44p3Mk92J48J08J69L83L5k53m8k82m5J05
3638i0k19K08L52J52j11k61P1m28p2K73J31J83L46l45n9q6m55j38N97J65o1L90
3660E43l60r1l65n0j09L98K29O5L08Q0o57j72k22P9J91N63l09K53j71j18m12l36
3682f63M50j28o4O35lR3k53l59P6j5O0K96p4K82k01n3k48k14j60N10M08R0j62
3705C03l9k65J1l78o7J5R31J66m64o1j74j5j39P2K19k19K92J58l89k7k7k18O5
3728b50K93J67J11k32p8l36J35l40J60O07k52L88j7j95l03K1n3Q4o7L49j59K19
3750B52O6n96j9JK16J97L8j9l5r2k21j73R1K03R3J15k15M90l35Q9j83p6K20j33
3774b6J20p8o6ql6j75L02j47J31j93K14J15K78k33k72l11K72J91l9L23j34m1m47
$$ plain form
3797 -260 -114 36 -445 61 85 6 80 -205 11 -171 -58 -55 167 288 204 -62 29 -112 60 -182 -239 81 69
3820 69 84 -14 -307 20 -61 -99 -160 -24 -133 -179 466 6 14 16 -25 71 194 288 134 415 216 2 -29 60 162
3845 162 316 -3 233 16 -75 -135 40 19 245 106 158 253 25 -96 -41 -345 -558 19 74 23 240 -96 -371
3868 -371 -445 -513 -7 -158 57 -56 166 -167 -299 -104 -58 -195 81 315 319 318 109 -326 -130 -174 -388 -207 178
3891 178 185 436 -214 -137 167 60 -118 -20 109 163 19 37 -19 -373 -283 18 54 343 220 183 252 240 -256 -340
3915 -340 87 -170 -190 83 312 -1 -156 -54 -330 167 -133 -112 -2 154 9 223 -166 -31 240 -230 119
3936 119 71 -212 57 -88 99 113 -77 215 290 232 231 -287 -274 -51 -253 13 176 89 2 -38 213 2 -15 -159
3960 -159 12 -15 -95 -70 -145 259 -109 -123 -245 -23 167 44 -247 22 352 108 78 -64 -115 126 251 448
$$ packed form
3797b60J46J50m81N06K4p9P4k85K16j82J13LK22J21q4k66R1j41J72k42n7L20j2
3820F9J5r8k93L27q1l8o1J36j09m6O45m60QKm1R6J23R4j54K81j99k14l1Q9J02
3845A62J54l19K36k17r1o0J75k1K26j39N2R5k28j21N5l04k13N77N5n1K17l36k75
3868c71p4o8N06j51K15j13K22l33j32J95M6j37K76K34Mjk09m35J96m4k14J81L85
3891A78PK51o50P7L04j07j78R8J29N4j44J8n6l54R0L01L6K89j23l7O9j2m96q4
3915c40M27k57k0K73K29l13j55J02k76M97l00K1J10J56j45K14l89J35K71m70L49
3936A19m8k83K69j45J87J4j90K92P5n8jn18J3K23k02K66J63q7q7m0K51k11j7j44
3960a59J71k7q0K5p5M04l68j4j22K22J90j23k91K69L30k44l0j42n1K41J25J97
$$ plain form
3982 448 -35 -332 -94 -109 -167 17 177 113 287 -78 -271 -188 -237 123 15 -274 104 -74 13 265 -23 -127
4004 -127 -132 206 1 125 -4 207 -74 11 -298 -119 224 236 42 78 107 -174 -149 54 -124 69 -148 -67 -231
4027 -231 -256 -306 -212 -231 53 -53 239 16 88 -124 -216 -206 -117 69 -3 -148 -41 128 -73 -51 -83 -147 325 -9
4051 -9 274 245 34 -45 141 -196 -25 162 -184 365 2 46 6 -28 -114 71 114 479 26 252 226 -185 -2
4074 -2 -23 -51 -81 -111 -34 -74 45 232 -166 -305 -32 353 78 62 0 -16 -3 -205 -220 -165 52 92 12 326 24
4099 24 -431 -217 -277 -22 -109 254 325 -184 105 50 -340 -50 176 298 134 -156 436 -8 210 -209 -227 97
4121 97 55 192 262 -79 293 110 -152 -59 119 149 320 46 427 300 -109 -149 -252 161 -57 -124 343 172
4143 172 -166 45 -99 7 -183 16 85 267 88 -46 -257 -401 -230 -176 175 -17 96 83 -86 -40 -247
$$ packed form
3982D48m83k97K38j5n8J84J60o4J74l65j93Q3m9L60j08k89L78j78Q7K52k88j04
4004a27nL38k05J24j29K11k81Q5l09J79L43J2j94L6K9k81K5K03j78J93k17Q1j64
4027b31k5n0R4j9K84j06K92k23P2k12r2J0Q9J86p2j45J07J69k01K2l2o4M72l34
4051iK83k9k11p9J86l37J71J87l46N49l63M4m0l4q6J85M3L65m53K26k6m11J83
4074bk1k8l0l0P7m0J19J87l98j39K73L85k75j6o2j6J3k02j5N5K17M0q0L14l02
4099B4m55K14o0K55q7L63P1n09K89n5l90K90K26J22j64k90N92m44K18m19j8L24
4121I7m2J37P0l41L72j83k62R3J78L0J71k74L81j27m09m0j03M13k18o7M67j71
4143A72l38K11j44J06j90J99O9J82j79j34k11j44J71N4L51j92J13j3j69M6k07
$$ plain form
4164 -247 -182 58 -103 189 64 -206 31 -99 -152 113 34 -20 113 218 160 -17 100 -121 -40 -36 383 438 177
4187 177 400 -155 35 -335 -258 221 222 319 30 -119 55 -34 -63 -115 -170 100 239 103 280 47 -390 -179 -6
4210 -6 167 97 92 -144 -188 -389 -104 -277 -136 227 -186 385 -32 -198 -284 -184 -138 -42 -32 208 268 145 221 115
4234 115 -266 -73 -123 -56 290 100 177 -103 -273 -202 -210 68 44 180 344 79 56 -20 -337 -262 -116 279 223 236
4258 236 98 179 -266 -194 -87 -69 -45 215 455 231 -109 -507 -259 -115 18 46 -55 161 189 36 -253 -443
4280 -443 -158 -19 142 219 -64 -128 -235 -403 -339 -103 -27 114 175 376 149 238 -173 -267 -250 -73 102 279 352
4303 352 99 -206 -354 -480 -4 -114 -145 -17 -40 166 -171 -183 -160 -57 102 435 346 75 221 -34 -111 -271
4325 -271 -120 22 423 310 157 210 -393 -210 -363 -168 -33 -58 532 432 177 117 -225 -206 -213 -59 148 260
$$ packed form
4164b47O5K40j61K92j25k70K37j30n3K65p9n4J33J05n8j77J17k21Q1MM19N5k61
4187A77K23n55J90l70P7M79JR7k89j49J74q9k9n2n5K70J39j36J77k33m37K11J73
4210fJ73p0nk36m4k01K85j73J41L63m13N71m17j66q6J00M6R6J0K40O0j23P6j06
4234A15l81J93n0O7L46j90P7k80j70P1qK78k4J36J64k65k3p6l17P5J46L95n6J3
4258B36j38Q1m45P2J07J8K4K60K40k24l40l98K48J44J33K8j01K16K8j53k89j90
4280d43K85J39J61P7k83o4j07j68O4K36P6J41O1K01k27Q9m11r4J7J77J75J77P3
4303C52k53l05j48j26M76j10l1J28k3K06l37j2K3J03J59L33q9k71J46k55p7j60
4325b71J51J42M01j13j53N3o03J83j53J95J35k5N90j00k55o0l42J9pJ54K07J12
$$ plain form
4347 260 310 206 -40 -117 -223 -262 5 188 244 214 327 -111 -137 -371 -164 -220 41 619 174 220 -488 -295 -291
4370 -291 -62 54 156 347 194 118 -253 -214 -494 -178 108 170 216 299 242 -399 23 -379 -91 -98 91 354 140
$$ packed form
4347B60N0j04k46p7j06l9K67J83N6l0J13m38k6k34K07n6K61N78m45M6p08J93M
4370b91K29J16J02J91j53p6l71L9k80L16K86O2M6Q3n7o41M22m02K88pJ89K63k14
$$ [...]
8191d2
##END NTUPLES=NMR FID
##END=
