##TITLE=1H_LR-702-C1
 CDCl3, 8 sc, 
 20.11.2019
##JCAMPDX= 6.0         $$ Bruker NMR JCAMP-DX V2.0
##DATA TYPE= NMR FID
##DATA CLASS= NTUPLES
##ORIGIN= UXNMR, Bruker Analytische Messtechnik GmbH
##OWNER= root
$$ XWIN-NMR		Version 3.5
$$ Wed Nov 20 15:38:32 2019 Russian Standard Time (UT+4h)  she@DPX200
##.OBSERVE FREQUENCY= 200.1315
##.OBSERVE NUCLEUS= ^1H
##.DELAY= (6, 6)
##.ACQUISITION MODE= SIMULTANEOUS
##.ACQUISITION SCHEME= undefined
##.AVERAGES= 8
##.DIGITISER RES= 18
##SPECTROMETER/DATA SYSTEM= spect
##.PULSE SEQUENCE= zg30
##.SOLVENT NAME= CDCl3
##.SHIFT REFERENCE= (INTERNAL, CDCl3, 0, 15.7039)
##AUDIT TRAIL= $$ (NUMBER, WHEN, WHO, WHERE, WHAT)
$$ ##TITLE= Audit trail, XWIN-NMR		Version 3.5
$$ ##JCAMPDX= 5.01
$$ ##ORIGIN= Bruker BioSpin GmbH
$$ ##OWNER= she
$$ F:/spectra/data/she/nmr/H-F/1/audita.txt
$$ ##AUDIT TRAIL=  $$ (NUMBER, WHEN, WHO, WHERE, WHAT)
(   1,<2019-11-20 15:37:32.89 +0400>,<she>,<DPX200>,
      <created by zg, POWCHK disabled, PULCHK disabled
       configuration hash MD5:
       00 E9 B6 7A A2 85 ED C7 34 08 36 98 17 FE 4E 26
       data hash MD5: 16K
       65 CE B6 D6 E4 3C 3B 5E 05 6E D4 A1 EB D6 00 4F>)
$$ ##END=
$$ 
$$ hash MD5
$$ EA 5F 03 D4 64 2D 18 01 10 2A A2 21 D6 D3 BE 83
##$RELAX= 
##$RELAX= 
##$RELAX= 
##$RELAX= 
##$RELAX= 
##$RELAX= 
$$ Bruker specific parameters
$$ --------------------------
##$DU= <F:/spectra>
##$EXPNO= 1
##$NAME= <H-F>
##$PROCNO= 1
##$TYPE= <nmr>
##$USER= <she>
##$AMP= (0..31)
100 100 100 100 100 100 100 100 100 100 100 100 100 100 100 100 100 100 
100 100 100 100 100 100 100 100 100 100 100 100 100 100 
##$AQSEQ= 0
##$AQ_mod= 1
##$AUNM= <au_zg>
##$AUTOPOS= <>
##$BF1= 200.13
##$BF2= 200.13
##$BF3= 200.13
##$BF4= 200.13
##$BF5= 200.13
##$BF6= 200.13
##$BF7= 200.13
##$BF8= 200.13
##$BYTORDA= 1
##$CFDGTYP= 0
##$CFRGTYP= 5
##$CHEMSTR= <none>
##$CNST= (0..31)
1 1 145 1 1 1 1 1 1 1 1 1 1 1 1 1 1 1 1 1 1 1 1 1 1 1 1 1 1 1 1 1 
##$CPDPRG= <>
##$CPDPRG1= <>
##$CPDPRG2= <>
##$CPDPRG3= <>
##$CPDPRG4= <mlev>
##$CPDPRG5= <mlev>
##$CPDPRG6= <mlev>
##$CPDPRG7= <mlev>
##$CPDPRG8= <mlev>
##$CPDPRGB= <>
##$CPDPRGT= <>
##$D= (0..31)
0 1.2 0 0 0 0 0 0 0 0.06 0 0.03 0 0 0 0 0.0002 0 0 0 0 0 0 0 0 0 0 0 0 
0 0 0 
##$DATE= 1574249852
##$DBL= (0..7)
120 120 120 120 120 120 120 120 
##$DBP= (0..7)
150 150 150 150 150 150 150 150 
##$DBP07= 0
##$DBPNAM0= <>
##$DBPNAM1= <>
##$DBPNAM2= <>
##$DBPNAM3= <>
##$DBPNAM4= <>
##$DBPNAM5= <>
##$DBPNAM6= <>
##$DBPNAM7= <>
##$DBPOAL= (0..7)
0.5 0.5 0.5 0.5 0.5 0.5 0.5 0.5 
##$DBPOFFS= (0..7)
0 0 0 0 0 0 0 0 
##$DE= 6
##$DECBNUC= <off>
##$DECIM= 24
##$DECNUC= <off>
##$DECSTAT= 4
##$DIGMOD= 1
##$DIGTYP= 9
##$DL= (0..7)
0 120 120 120 120 120 120 120 
##$DP= (0..7)
150 150 150 150 150 150 150 150 
##$DP07= 0
##$DPNAME0= <>
##$DPNAME1= <>
##$DPNAME2= <>
##$DPNAME3= <>
##$DPNAME4= <>
##$DPNAME5= <>
##$DPNAME6= <>
##$DPNAME7= <>
##$DPOAL= (0..7)
0.5 0.5 0.5 0.5 0.5 0.5 0.5 0.5 
##$DPOFFS= (0..7)
0 0 0 0 0 0 0 0 
##$DQDMODE= 0
##$DR= 18
##$DS= 0
##$DSLIST= <SSSSSSSSSSSSSSS>
$$ [...]
##$SUBNAM2= <"">
##$SUBNAM3= <"">
##$SUBNAM4= <"">
##$SUBNAM5= <"">
##$SUBNAM6= <"">
##$SUBNAM7= <"">
##$SUBNAM8= <"">
##$SUBNAM9= <"">
##$SW= 24.9337058887773
##$SWIBOX= (0..15)
0 0 2 0 0 0 0 0 0 0 0 0 0 0 0 0 
##$SW_h= 4990.01996007984
##$TD= 16384
##$TD0= 1
##$TE= 0
##$TE2= 300
##$TE3= 300
##$TEG= 300
##$TL= (0..7)
0 120 120 120 120 120 120 120 
##$TP= (0..7)
150 150 150 150 150 150 150 150 
##$TP07= 0
##$TPNAME0= <>
##$TPNAME1= <>
##$TPNAME2= <>
##$TPNAME3= <>
##$TPNAME4= <>
##$TPNAME5= <>
##$TPNAME6= <>
##$TPNAME7= <>
##$TPOAL= (0..7)
0.5 0.5 0.5 0.5 0.5 0.5 0.5 0.5 
##$TPOFFS= (0..7)
0 0 0 0 0 0 0 0 
##$TUNHIN= 0
##$TUNHOUT= 0
##$TUNXOUT= 0
##$USERA1= <user>
##$USERA2= <user>
##$USERA3= <user>
##$USERA4= <user>
##$USERA5= <user>
##$V9= 5
##$VALIST= <valist>
##$VCLIST= <CCCCCCCCCCCCCCC>
##$VD= 0
##$VDLIST= <DDDDDDDDDDDDDDD>
##$VPLIST= <PPPPPPPPPPPPPPP>
##$VTLIST= <TTTTTTTTTTTTTTT>
##$WBST= 1024
##$WBSW= 4
##$XGAIN= (0..3)
0 0 0 0 
##$XL= 0
##$YL= 0
##$YMAX_a= 125039
##$YMIN_a= -50378
##$ZGOPTNS= <>
##$ZL1= 120
##$ZL2= 120
##$ZL3= 120
##$ZL4= 120
##$ABSF1= 10
##$ABSF2= 0
##$ABSG= 5
##$ABSL= 3
##$ALPHA= 0
##$AQORDER= 0
##$ASSFAC= 0
##$ASSFACI= 0
##$ASSFACX= 0
##$ASSWID= 0
##$AUNMP= <proc_1d>
##$AZFE= 0.1
##$AZFW= 0.1
##$BCFW= 1
##$BC_mod= 2
##$BYTORDP= 1
##$COROFFS= 0
##$CY= 11.3945322036743
##$DATMOD= 1
##$DC= 2
##$DFILT= <>
##$DTYPP= 0
##$F1P= 16.9975609425685
##$F2P= -3.02152046262296
##$FCOR= 0.5
##$FTSIZE= 0
##$FT_mod= 4
##$GAMMA= 1
##$GB= 0.15
##$INTBC= 1
##$INTSCL= 1
##$ISEN= 128
##$LB= 0.24
##$LEV0= 0
##$LPBIN= 0
##$MAXI= 10000
##$MC2= 0
##$MEAN= 0
##$ME_mod= 0
##$MI= 1.114404
##$NCOEF= 0
##$NC_proc= 0
##$NLEV= 6
##$NOISF1= 3.799351
##$NOISF2= 2.8
##$NSP= 1
##$NTH_PI= 0
##$NZP= 0
##$OFFSET= 15.70392
##$PC= 1
##$PHC0= -9785.046
##$PHC1= 10.80086
##$PH_mod= 1
##$PKNL= yes
##$PPARMOD= 0
##$PSCAL= 0
##$PSIGN= 0
##$REVERSE= no
##$SF= 200.130013532006
##$SI= 16384
##$SIGF1= 3
##$SIGF2= 2
##$SINO= 400
##$SIOLD= 16384
##$SREGLST= <1H.CDCl3>
##$SSB= 0
##$STSI= 0
##$STSR= 0
##$SW_p= 3612.71676300578
##$SYMM= 0
##$S_DEV= 0
##$TDeff= 0
##$TDoff= 0
##$TI= <>
##$TILT= no
##$TM1= 0
##$TM2= 0
##$TOPLEV= 0
##$USERP1= <user>
##$USERP2= <user>
##$USERP3= <user>
##$USERP4= <user>
##$USERP5= <user>
##$WDW= 1
##$XDIM= 8192
##$YMAX_p= 0
##$YMIN_p= 0
$$ End of Bruker specific parameters
$$ ---------------------------------
##NTUPLES= NMR FID
##VAR_NAME=  TIME,          FID/REAL,        FID/IMAG
##SYMBOL=    X,             R,               I
##VAR_TYPE=  INDEPENDENT,   DEPENDENT,       DEPENDENT
##VAR_FORM=  AFFN,          ASDF,            ASDF
##VAR_DIM=   8192,          8192,            8192
##UNITS=     SECONDS,       ARBITRARY UNITS, ARBITRARY UNITS
##FACTOR=    0.0002004,     1,               1
##FIRST=     0,             0,               0
##LAST=      1.6414764,     0,               0
##MIN=       0,             -50378,          0
##MAX=       1.6414764,     125039,          0
$$ Real data points
##PAGE= N=1
##DATA TABLE= (X++(R..R)), XYDATA
0 0 0 0 0 0 0 0 0 0 0 0 0 8 -8 8 -8 8 -16 16 -16 24 -24 32 -33 40 -48 54 -62 70 -78 89 -99 112 -127 142
34 142 -158 175 -195 218 -241 267 -295 328 -363 402 -444 495 -546 609 -681 763 -859 976 -1116
53 -1116 1291 -1519 1829 -2270 2968 -4231 7278 -34113 -1113 43010 -7913 -22233 -7544 -11916
67 -11916 -50378 -43608 -6856 1201 -27491 -31164 -20233 -30142 -43280 -8540 32550 17417 -30876
80 -30876 -37441 -14250 -13095 -21825 5904 37899 20553 -19547 -19307 5075 4293 -7001 14034 44094
94 44094 33313 707 -814 24334 34321 26016 24946 25664 10236 -2288 14913 40018 40254 30275
108 30275 39068 46382 23712 -3800 5667 36189 43757 27836 21034 27522 23488 12217 17442 32605
122 32605 31558 14708 10384 19039 16803 6387 14173 35343 33843 9304 -5256 657 3977 570
136 570 11058 29439 26852 5959 -1307 9610 9119 -4254 -1284 18323 19039 -3779 -12946 3852
150 3852 15522 8978 6799 14762 7555 -11557 -12613 5714 12494 3150 4808 15820 7455 -15839
164 -15839 -18466 2232 11396 698 -1670 7265 3067 -12573 -10297 6397 5384 -12296 -15449 -4252
178 -4252 -6540 -17795 -9548 10288 8574 -11177 -17593 -10740 -14149 -22755 -13763 3406 -282 -16441
192 -16441 -15995 -4210 -6577 -17967 -12911 -1501 -7890 -21805 -17189 -1884 -1231 -7479 -2834 2652
206 2652 -8681 -22586 -16425 -922 -787 -6800 -1133 6936 -113 -11409 -7018 2823 -849 -9050
220 -9050 -4489 2261 -1756 -6269 1651 10306 3969 -6168 -5762 -1715 -5541 -8926 -1463 6343 3680
235 3680 -3395 -2808 -134 -5430 -11000 -7451 -1344 -4136 -8267 -4588 1092 -1360 -6762 -6853 -4926 -8999
251 -8999 -14082 -10918 -4937 -3785 -5656 -3749 -770 -4246 -10347 -10662 -7285 -7851 -9658 -6652 -1058 -506
267 -506 -3394 -3006 -493 -2596 -7209 -6934 -3085 -1717 -2981 -357 4676 4893 471 -970 970 -26
283 -26 -3302 -1956 3295 5462 3322 4273 6998 5678 1302 -229 2433 2554 498 1937 6255 7488
299 7488 5377 5073 6380 4024 -396 -736 2813 3410 2370 4323 7905 7211 3446 2304 3420 2150
315 2150 -527 640 3726 4386 4253 5457 7320 5489 1910 1461 2418 1705 1036 3230 6937 7420 6070
332 6070 5708 6283 4466 1973 1830 3623 4139 4306 6360 8603 8419 6546 5359 4758 3255 1961 3000
349 3000 4951 6500 6920 7418 7675 6535 4729 2773 2514 2293 2792 4053 4992 5739 6193 5760 4658 3128
367 3128 1194 311 353 1282 2300 3390 3953 4314 3119 1225 -290 -1027 -1487 -1336 -804 244 1609 1868
385 1868 1032 149 -873 -2472 -3723 -4068 -3509 -2654 -1385 -467 -89 -731 -2464 -3805 -5054 -5946 -5731 -4968
403 -4968 -3792 -3116 -2587 -2471 -3319 -4363 -6043 -6630 -7193 -7162 -6459 -5310 -3772 -3457 -4152 -4563 -5530 -6740
421 -6740 -8226 -8249 -7178 -6557 -5012 -4082 -3494 -3898 -5128 -6037 -6723 -7588 -7628 -6140 -4909 -4031 -3348 -2765 -2921
440 -2921 -3720 -4975 -5521 -5623 -5041 -4374 -3380 -1841 -755 -820 -1337 -1960 -2715 -2926 -3340 -2711 -1326 33 734
459 734 1025 1711 652 -105 -810 -852 -586 -85 925 2794 3441 3203 2865 2649 2190 1124 926 1451 2340
478 2340 3042 3856 5205 5875 4338 2881 2939 2311 1393 1648 3838 5227 5246 5186 5248 5014 3408 2147 2360
497 2360 3079 2769 2913 4342 5236 4728 4802 4807 3867 1633 1016 2503 3252 3216 3607 5018 5151 3610 1994
516 1994 2520 2407 1370 1377 2407 3240 2619 2673 3772 3492 1657 439 1190 1047 -43 36 2481 3227 2448
535 2448 963 771 898 -1289 -2066 -700 1107 225 -189 982 1671 -84 -1866 -952 -600 -2323 -3872
552 -3872 -1740 -211 -823 -1328 192 699 -2423 -4717 -3698 -2570 -3473 -3900 -1459 226 -1995 -4125
568 -4125 -2772 -1624 -3924 -6002 -3400 -1954 -4053 -5434 -2235 481 -1888 -4263 -2738 -1792 -5368
583 -5368 -6514 -2831 668 -1270 -2892 -192 251 -3914 -5338 -1270 1141 -2029 -4081 -361 1792
598 1792 -1240 -2317 1502 3351 -1398 -4118 -1062 1144 -845 -742 4460 5499 -41 -3095 550
613 550 2394 -880 -1322 3281 4665 -80 -1645 2667 4941 1129 -167 2873 2507 -2244 -2843 2953
629 2953 5821 1998 214 2956 2511 -2958 -3326 1744 4620 778 -1058 1749 2574 -1524 -1942 2469
645 2469 3303 -1764 -3628 -7 1478 -904 -975 3537 4120 -1317 -4240 -1268 613 -1390 -1669 2429
661 2429 3764 -568 -3372 -222 1860 -897 -2426 896 1893 -1692 -3550 999 3883 857 -1542
676 -1542 671 1627 -2558 -5038 -135 3823 1537 -1426 844 2352 -1890 -4138 -208 2948 -537
691 -537 -2800 4 2404 -1201 -2861 1527 4110 -446 -4478 -1343 1741 -1544 -3165 2179 5261
706 5261 507 -3577 -805 1857 -1710 -2939 2571 4838 319 -3440 607 3503 107 -1734 2769
721 2769 4228 -1677 -4118 958 5044 1818 428 4038 4134 -2051 -3950 1517 4917 1899 91 3987
737 3987 4179 -1417 -2951 3150 5324 524 -1567 2098 2754 -1588 -1695 4681 5742 152 -2719 509
753 509 969 -2579 -1638 4328 5040 -920 -2989 484 1072 -2461 -1967 2535 2164 -3109 -3994 732 1906
770 1906 -1047 -1075 1883 571 -4787 -5174 -42 1750 -1212 -1427 1419 157 -4074 -4791 -330 1289
786 1289 -1993 -2945 43 113 -3655 -2872 1007 1448 -2177 -4156 -1575 -884 -3090 -2849 1581 2059 -2306
803 -2306 -4030 -1898 -610 -3533 -3508 100 1122 -2371 -4165 -1137 565 -2547 -3643 -514 -94 -3702
819 -3702 -5029 -1062 1264 -1637 -2667 250 534 -3732 -5438 -1349 978 -1473 -2731 333 1170 -2284
835 -2284 -3803 -18 1753 -1841 -3058 506 1781 -1849 -2301 1795 3326 -203 -1946 903 1564 -1386
851 -1386 -1398 3180 4820 1069 -1135 1953 3227 -175 -747 3456 4671 992 -257 2808 4464 1799
867 1799 1450 4610 4788 526 -633 2893 4477 2540 2425 5379 4600 649 -284 3079 4219 2131
883 2131 1454 4215 3967 855 518 3401 4005 1800 702 2117 2477 302 593 3654 4146 1412 251
900 251 1566 1306 -770 -331 2224 2764 463 -622 734 1296 -435 -328 1304 913 -960 -1598 -110
917 -110 438 -35 -411 817 358 -1564 -2370 -658 3 -785 -788 317 -122 -1971 -1946 -986 -649 -1623 -1933 -1134
937 -1134 -1097 -1623 -1821 -553 -223 -1595 -2404 -1548 -1870 -2713 -2461 -1068 -142 -1746 -2305 -1231 -1466 -2554
955 -2554 -2940 -1894 -1702 -2465 -2711 -1389 -940 -2224 -2204 -1451 -1589 -2517 -2895 -1855 -1057 -1510 -1350 -1002 -1065
974 -1065 -1930 -2325 -1408 -1126 -1659 -1400 -436 -248 -911 -1152 -249 -105 -1169 -1423 -119 -40 -908 -566 502
993 502 733 362 25 427 336 -568 -106 1009 1471 920 821 1876 1730 897 637 1372 1184 540 660 1539
1013 1539 1615 1397 1498 1933 1642 930 394 1265 1357 904 1544 1745 1709 1280 799 1130 916 489 569 853 1203
1034 1203 1279 1253 1523 1216 915 614 380 77 308 734 853 1064 784 474 340 220 -11 -207 -340 -191
1054 -191 86 -178 168 207 682 -167 -155 -485 -770 -412 -316 -420 -205 -466 -336 -193 -635 -1256 -1360 -996 -1059
1075 -1059 -965 -741 -757 -627 -584 -992 -1117 -1064 -1409 -1124 -730 -1010 -877 -1016 -601 -717 -773 -1161 -524 -488 -850 -712
1097 -712 -88 137 250 150 248 205 85 67 46 248 480 683 1415 1405 1360 1184 1387 1111 1077 1067 1441 1638 1833
1120 1833 1978 1655 2373 1802 1542 1377 1520 1473 1231 1401 1642 1568 1703 1362 1347 931 580 412 504 369 232
1141 232 320 259 484 319 -191 -433 -375 -627 -1134 -909 -636 -613 -620 -844 -1164 -1420 -1586 -1684 -1581 -1427 -1547 -882
1163 -882 -1032 -1091 -1333 -1239 -1436 -1174 -1481 -1567 -1297 -958 -1088 -852 -586 -539 -375 -857 -1103 -953 -510 -465 -45 209
1185 209 -16 -178 -87 -155 -224 -613 -541 -98 -76 -324 -59 -46 -68 -301 -418 -434 -677 -713 -617 -230 -434 -253 -482
1208 -482 -371 -782 -1077 -1173 -772 -662 -1156 -757 -507 -865 -1202 -721 -940 -892 -1353 -1046 -821 -311 -764 -391 -213
1229 -213 -209 -620 -616 359 -404 -581 183 510 152 88 538 949 931 139 645 1176 830 534 947 1580 1649 863
1251 863 1397 1722 1177 995 781 1419 1768 1279 1659 1891 1194 822 1212 1812 1267 960 1001 1694 1286 508
1271 508 1516 2065 1420 180 929 1341 775 296 1062 1692 993 415 366 822 744 287 647 1244 899 249
1291 249 659 1102 686 172 867 1275 264 -159 193 1002 575 404 739 991 -139 -508 365 633 -85
1310 -85 -631 -138 535 -337 -739 -366 406 -551 -1305 -1035 -657 -1095 -1547 -949 -275 -1065 -1920 -1530 -1278 -1897
1330 -1897 -2093 -1436 -1054 -1815 -2914 -2091 -1447 -1801 -2311 -1800 -1348 -2395 -2718 -2095 -1430 -1946 -1821 -1352 -1382
1349 -1382 -2037 -2792 -1952 -736 -1296 -1764 -1412 -185 -786 -1694 -1037 -227 -509 -1510 -435 54 -726 -777 170
1368 170 1191 536 -561 89 945 75 -581 895 1713 718 -296 537 1647 988 -218 1198 1873 1186
1386 1186 168 944 2099 844 496 1654 2158 775 -192 783 2071 1245 241 1266 2113 852 -444
1403 -444 782 1994 728 -27 922 1700 535 -192 899 1977 774 -528 773 1509 338 -519 731
1420 731 1847 651 -356 602 1144 262 -756 444 1825 639 -230 179 1023 -138 -205 435 1423 276
1438 276 -1057 -97 894 429 -235 399 1138 -24 -966 -390 809 -29 -361 403 565 -351 -1322 -165 679
1457 679 -2 -880 -513 414 -682 -1164 -557 681 206 -1138 -802 -377 -554 -1216 -444 376 -245 -1385 -928
1476 -928 -257 -774 -908 -414 258 -449 -1573 -1175 -226 -662 -865 -410 -18 -442 -1464 -677 89 -209 -487
1495 -487 -87 266 -219 -973 -227 560 255 -734 -81 781 -13 -508 185 1143 620 -218 412 741 -43 -498
1515 -498 672 1543 709 -95 634 930 336 -7 1087 1813 606 372 939 1100 742 101 712 978 294
1534 294 -354 413 968 414 -44 669 667 -428 -864 162 312 -709 -441 1 -16 -474 -955 -644 -43 -686
1554 -686 -996 -391 -322 -1167 -1393 -713 -537 -900 -1123 -228 -520 -1183 -1262 -636 -193 -884 -1150 -644 -400 -1396 -1402
1575 -1402 -386 -225 -862 -988 -377 -489 -750 -1006 -224 -87 -853 -952 -457 -301 -592 -654 -98 82 -617 -810
1595 -810 -369 -102 -488 -744 170 248 -234 -756 -152 317 -370 -376 -169 296 -124 -469 422 746 -61 27 317
1616 317 417 173 -230 449 900 359 103 547 1029 250 311 690 1448 811 562 1074 1172 1105 568 1399 1251
1637 1251 932 813 1159 988 989 770 1295 1434 1082 669 976 1506 963 783 1100 1116 832 618 1045 1404 578
1658 578 396 775 585 510 348 424 370 78 50 194 254 -86 -231 154 286 153 323 -35 47 -262 -476 162
1680 162 321 18 3 86 133 18 -116 420 544 201 223 515 -134 86 238 188 305 469 375 634 443 398
1702 398 11 229 218 -231 -254 23 22 36 -400 -418 -208 -748 -857 -754 -484 -1024 -1089 -1213 -1043 -1414 -1539 -1461 -1291
1725 -1291 -1686 -1471 -1758 -1619 -1719 -1797 -1973 -1794 -1566 -1979 -2079 -1818 -1859 -2028 -1763 -1613 -1718 -1583 -1247 -1510
1745 -1510 -1249 -1486 -1267 -1108 -1071 -1041 -747 -592 -488 -567 -303 -186 -217 -192 252 150 288 245 204 362 681 765
1767 765 804 861 968 899 816 1212 862 994 1050 851 1337 1062 1032 1064 960 990 1265 1213 1180 971 1074 1078 853 947
1791 947 730 1053 992 817 721 642 515 801 702 703 586 449 769 670 764 733 630 622 647 568 427 913 677 530
1815 530 594 740 927 682 597 476 598 288 492 277 293 441 174 88 -11 124 -18 7 -76 -418 -201 -418
1837 -418 -173 -194 -582 -823 -890 -517 -920 -1175 -935 -1077 -740 -862 -864 -1102 -1186 -1047 -1158 -1253 -1024 -1212 -1198 -1083
1859 -1083 -1036 -1173 -1192 -918 -677 -974 -791 -576 -462 -617 -48 -516 -329 -11 118 215 92 403 480 520 485 562
1881 562 681 1064 869 819 1018 829 1060 923 751 1056 1005 987 1026 922 1070 815 695 900 721 647 479 662
1903 662 674 563 682 199 399 162 -125 114 32 182 -84 -288 -308 31 -443 -693 -410 -363 -394 -380 -451 -564
1925 -564 -363 -485 -405 -456 -670 -641 -153 -618 -595 -391 -233 -338 -509 -62 -75 -469 -395 -168 66 -235 -183 -214 145
1948 145 -147 -224 0 135 -129 144 71 89 -45 -156 -11 128 -143 -309 -184 17 -77 -222 -30 -239 -263 -575
1970 -575 -485 -420 -325 -885 -490 -222 -521 -949 -627 -328 -829 -706 -905 -582 -518 -686 -273 -444 -355 -422 -272 -266 -632
1993 -632 -530 -505 -94 -118 -420 -542 -243 -129 -186 142 318 194 -101 -134 455 225 211 284 671 647 155 63 863
2016 863 670 524 725 894 763 486 553 819 956 1018 362 1017 775 318 716 940 596 436 310 810 704
2037 704 314 655 962 793 537 513 497 453 375 627 712 873 332 240 749 612 118 460 469 720 177 507 1266
2060 1266 633 152 713 870 670 321 151 451 575 419 300 850 340 -106 -36 391 204 3 -50 133
2080 133 -5 -543 -335 6 -58 -623 -604 -294 -483 -727 -542 -157 -498 -826 -832 -739 -768 -1287 -857 -741 -1014 -1266
2102 -1266 -1244 -725 -1180 -1328 -1164 -558 -1014 -1442 -1003 -825 -733 -1052 -691 -784 -1124 -1069 -958 -434 -702 -815 -680
2123 -680 -185 -447 -901 -603 -289 -240 -256 -107 111 -92 -543 -4 259 123 -48 40 164 -20 -542 108 489
2144 489 326 71 312 242 227 102 226 860 226 102 324 525 546 364 394 730 154 44 193 576 433
2165 433 231 620 622 604 38 294 754 455 123 504 585 587 358 236 707 349 427 447 796 338 -107 272 696
2188 696 662 315 378 976 438 -62 279 342 536 -148 398 613 486 -157 380 647 527 -198 21 234 125
2209 125 118 195 394 -295 -407 -314 83 19 -452 -47 203 -67 -493 -377 -16 -252 -282 -496 39 -412 -743 -415
2231 -415 -61 -358 -721 -350 -537 -392 -656 -160 -155 -151 -393 -186 -321 -588 -754 -617 -256 -362 -643 -532 -351
2252 -351 -454 -188 -481 -323 -79 -204 -501 -154 -116 -156 -135 -70 31 36 -273 275 -17 25 184 199 -135 -99 216
2275 216 501 376 129 340 388 349 136 386 334 78 337 563 387 645 473 413 527 588 402 537 307 325
2297 325 176 548 568 427 274 331 397 368 221 811 373 609 431 309 190 358 25 -92 438 443 67 202
2319 202 169 -36 203 -86 146 -160 64 -73 318 96 117 18 96 51 -203 -530 -219 -115 -285 -102 -346 23
2341 23 -456 -265 -400 -315 -449 -434 -418 -467 -660 -293 -256 -493 -514 -575 -479 -431 -947 -781 -346 -641 -568 -641 -336 -657
2365 -657 -611 -449 -669 -434 -363 -597 -387 -454 -354 -344 -417 -682 -503 -558 -404 -592 -217 -330 -56 -131 -469 -116
2387 -116 -13 -218 -332 28 269 172 40 225 139 -60 -94 288 182 372 14 201 405 202 209 142 144 312 249
2410 249 471 522 655 453 631 463 518 395 190 347 374 160 115 216 163 328 362 373 396 240 462 200 307
2433 307 333 444 358 311 441 290 335 392 232 509 50 273 33 210 293 278 42 259 206 86 48 170 366
2456 366 209 253 232 374 -75 453 -17 -39 71 379 126 206 143 377 -24 -73 -131 -120 -55 127 -187 -75 -433
2479 -433 -222 -328 -194 -583 -500 -324 -591 -191 -565 -439 -549 -464 -346 -486 -457 -647 -352 -539 -393 -651 -442
2500 -442 -622 -850 -230 -430 -558 -599 -390 -325 -376 -289 -483 -526 -440 -68 -403 -358 -240 -212 -114 -246 -295 320 -108
2523 -108 -327 -63 -163 392 -137 -193 18 -21 335 314 341 161 3 391 142 578 123 252 396 440 308 330
2545 330 374 407 330 541 107 218 755 447 329 284 345 556 359 301 348 376 145 392 492 149 369 216 254
2568 254 184 84 136 179 440 449 460 232 208 -98 162 270 229 90 218 -8 147 313 243 280 -58 -351 -69
2591 -69 11 -146 -191 -336 180 -202 -55 34 -379 -74 -237 -199 -410 -71 -294 -67 -46 -259 -683 -405 -252 -444
2613 -444 -704 -389 -295 -16 -131 -202 -423 -427 -338 -372 -449 -276 -382 -220 -179 -479 -569 -437 -230 -630 -276 -730 -270
2636 -270 -399 -420 -385 -511 -212 -611 -164 -337 -376 -296 -177 -167 -147 8 -330 31 -125 -217 -192 -124 -147 24 141
2659 141 294 133 361 8 -76 3 194 115 299 89 259 152 363 565 127 -125 175 417 172 282 422
2680 422 467 350 233 328 98 418 451 490 436 718 616 556 305 370 340 417 343 362 453 150 299 522 431 533
2704 533 221 464 110 269 -25 124 281 169 174 452 85 82 -108 195 263 28 -162 35 263 98 66 230
2726 230 207 115 -14 -47 -53 -298 5 -296 41 -150 -89 -407 -442 -306 -336 -395 -51 -336 -544 -394 -459 -435 -565 -466
2750 -466 -300 -499 -873 -195 -284 -413 -573 -513 -145 -490 -654 -681 -227 -114 -307 -519 -88 -346 -289 -303 -213 -253
2772 -253 -113 -33 80 -87 -153 6 169 254 208 141 -281 46 40 299 446 219 324 -30 535 302 199 326
2794 326 183 491 151 258 636 580 434 370 448 277 257 168 384 171 200 172 439 189 293 276 -136 30 286
2817 286 91 45 44 190 115 112 94 93 -182 -269 143 -267 -24 167 114 -143 3 111 146 -63 -204 285 -86 146
2841 146 -12 81 57 -62 72 -367 -248 -236 -336 64 -218 -26 12 233 232 -305 -216 -77 14 -153 -178 -251 182
2864 182 -64 -252 -55 -71 -236 -372 -353 80 -272 -512 -271 103 -331 -546 -213 -426 -635 -457 -140 -348 -317
2885 -317 -312 -538 -337 -494 -533 -356 -343 -522 -190 108 -219 -535 -256 -184 -155 -234 -24 177 -271 -15 160 91 -14
2908 -14 58 -55 45 -226 -8 37 313 143 -146 159 283 116 124 213 321 268 301 138 627 480 -27 46 202
2931 202 141 133 178 528 126 299 177 137 308 237 73 311 263 324 246 257 176 457 117 396 313 -6 291 255
2955 255 231 240 378 253 213 347 295 484 -11 321 363 363 542 232 489 399 456 383 359 312 398 77 236 252 500
2980 500 427 302 304 140 73 56 138 -37 -1 57 -79 -47 -373 -220 -255 -217 -354 -231 -466 -423 -357 -419 -647 -635 -788
3005 -788 -531 -688 -728 -382 -506 -609 -430 -623 -661 -491 -730 -550 -715 -537 -429 -480 -621 -479 -315 -438 -534
3026 -534 -121 -252 -431 -339 66 -122 -467 -28 -114 -333 71 -273 -351 -475 -66 200 215 335 -49 -53 -84 -86 184
3049 184 12 246 381 -49 77 90 266 62 322 316 -178 508 -107 206 23 -28 178 319 151 71 80 189
3071 189 131 -20 143 183 152 310 160 216 43 225 550 393 474 256 94 280 -76 784 304 433 167 15
3093 15 124 251 130 318 66 635 275 -44 157 303 220 60 74 -26 -192 282 -79 12 28 -16 -8 -140 -264
3116 -264 -186 -77 -213 -76 -106 -98 -68 -362 -289 -268 -315 -369 -296 -214 -339 -484 -132 -142 -178 -232 -460 -329 -458 -343 -232
3141 -232 100 -12 -379 -329 -181 28 -299 -231 -148 -124 -33 -186 -63 -146 -149 -76 90 168 -226 -83 -29 116 -91 -175
3165 -175 -175 30 120 -68 -22 124 235 31 268 67 252 -142 0 251 -2 281 250 415 188 -74 339 318
3187 318 246 33 63 92 281 182 364 545 585 347 130 90 414 328 330 203 300 579 684 62 437 380 332 219
3211 219 293 375 92 148 162 69 92 214 120 164 1 54 -101 279 289 304 109 49 396 115 53 -98 9 47 -85
3236 -85 -226 -294 -128 -109 -292 171 -52 -56 -166 -233 -342 -142 -99 -190 -314 -460 -285 -467 -348 -383 -276 -281 -268 -397
3260 -397 -115 -280 -326 -206 -192 -683 -33 -326 -360 -78 -99 -334 -353 -477 -334 -298 -210 -106 -256 -466 -326 -301 -328
3283 -328 -750 -356 191 -284 -145 -222 -92 -58 14 -284 60 -91 -419 -261 -238 139 -182 -25 153 -88 -40 45
3305 45 186 118 75 -80 315 286 -5 250 361 284 324 62 56 339 339 198 177 121 326 233 299 504 513 172 151 345
3331 345 158 420 113 299 295 305 374 188 -67 321 108 194 146 143 313 429 22 205 57 236 256 334 351 235
3355 235 -184 36 289 -157 311 -102 -59 -50 119 192 94 297 434 249 48 266 48 382 -415 199 102 144
3377 144 154 78 -61 -24 -178 182 -326 34 -170 21 -311 -125 -1 -355 -315 -182 -147 -253 -140 -160 -313 -206
3399 -206 -30 -254 -415 -504 -388 -372 -372 -305 -155 -772 -247 -372 -421 -250 -108 -373 -532 -629 -179 90 -97 -559
3421 -559 -287 -92 -25 -291 -32 -132 -153 -397 93 44 -298 123 -2 315 -74 -219 471 122 68 141 36 445
3443 445 35 91 201 305 494 249 367 421 371 167 107 63 222 263 52 370 242 229 373 119 -47 406
3465 406 191 342 106 381 318 371 495 332 53 255 191 178 241 384 72 -161 278 202 339 241 315 32 156
3488 156 251 136 -84 -7 24 324 126 82 -191 -27 -70 209 -218 -157 43 -102 -271 -117 -76 -248 -256 -155 -141
3511 -141 -268 -121 -23 -393 -277 -311 -147 -109 -454 -525 -303 -194 -173 -564 -310 -370 -277 -129 -319 -522 -281 -642
3533 -642 -156 -56 -361 -191 -333 -336 -263 -170 -355 -158 -144 -80 -107 -244 152 -297 262 -12 144 98 350 29 208
3556 208 24 130 242 3 223 -12 239 430 207 129 50 119 141 40 382 -17 568 93 275 57 -243
3577 -243 282 160 215 -66 215 313 268 143 506 181 -3 156 135 226 -1 287 -100 -24 151 279 428 79
3599 79 182 -157 184 269 89 350 5 -93 274 185 316 116 40 -138 142 -76 119 72 564 328 114 156
3621 156 218 31 -51 24 -52 -139 38 322 -5 -86 -157 139 45 159 -258 -51 -126 -96 -90 -230 -197 -269 -107 -97 -208
3646 -208 -268 -228 -409 -42 -139 -285 -412 -572 -276 -188 -214 -303 -214 -347 -75 -311 -496 -146 -64 -343 -356 -174 -225
3669 -225 -66 -51 -113 -493 -187 -347 -139 -45 14 -139 -236 -62 -384 -40 -176 -207 314 109 -176 -83 261 -88
3691 -88 129 65 331 -79 -163 467 156 323 5 460 217 45 -230 -81 280 397 193 323 158 199 101 -43
3713 -43 140 461 87 97 147 75 55 70 -100 41 216 107 557 245 402 351 279 385 210 259 222 229 230 349 240
3738 240 112 205 249 289 363 313 145 166 553 42 286 428 98 226 -100 58 109 -248 -52 14 52 -414 -157
3761 -157 197 -106 -105 -117 -102 -315 -187 -259 -87 120 -206 -154 -285 -274 -116 -533 -286 -273 -339 -293 -370 -295 -334 5
3785 5 -254 -278 -120 -436 -249 -363 -90 -380 -70 -331 -335 -359 -173 221 -19 -328 -40 76 -209 -106 -73 -128 -223
3808 -223 -104 90 128 183 151 141 -187 77 111 135 305 67 60 8 361 113 66 121 74 154 21 -319 -12 75 253
3833 253 92 344 277 291 -137 78 53 149 176 70 307 -151 292 278 414 -86 325 210 176 -14 80 93 20
3856 20 25 376 513 -22 -100 -57 -53 -9 216 72 462 -100 100 408 77 116 274 178 4 -59 -21 273 123 36
3880 36 47 27 66 159 232 -342 105 -170 -32 -179 -245 67 -5 -156 -117 108 -168 -262 -127 -92 -19 -439 31 -327
3904 -327 -190 -131 -185 -262 -58 -276 -62 -288 130 -212 -329 -365 -237 140 -233 -79 -250 -90 -252 -52 17 -237
3926 -237 -103 -368 -99 -105 -148 -204 -145 50 -304 -100 -274 -34 -41 294 -14 49 58 96 11 -13 -162 21 -122 -63 4
3951 4 -19 149 195 351 4 135 -330 239 319 128 251 321 296 -51 334 92 557 211 177 -53 -137 186 286
3974 286 -14 85 443 233 304 269 221 326 46 479 209 221 467 206 455 27 131 107 36 321 -11 416
3996 416 -152 178 216 61 -178 -261 -130 -54 -152 -221 14 -39 -84 -42 168 -94 -57 4 -159 -255 133 -122 -125 -34 -149
4021 -149 -317 -128 -15 -423 -53 -22 -320 -385 -76 -242 -74 -408 -269 -70 -249 -81 -238 -30 -319 -246 -42
4042 -42 -401 -191 45 -189 -458 -271 -258 -151 -166 -252 -148 168 -136 -367 257 61 -225 -66 -74 83 59 -62
4064 -62 -37 52 179 24 134 140 64 239 -95 4 -2 84 62 339 341 235 -88 188 6 268 66 45 -178 156 -39
4089 -39 -18 -40 320 273 4 109 121 118 -181 349 207 219 119 -148 -8 141 -34 -14 172 21 73 -54 172
4112 172 163 244 119 -182 116 169 411 -65 47 87 -196 216 34 387 52 197 216 72 -3 117 -156 303
4134 303 162 278 -55 -133 -127 -148 215 -303 -167 50 -172 101 -294 121 -36 -247 124 -76 -117 -422 -13 -172
4156 -172 91 -80 50 -261 -231 -148 -251 10 148 -55 -290 -514 -339 -363 43 -149 -153 -171 -107 -367 -158 -48
4178 -48 -133 -279 -225 -116 -207 -84 82 -104 -257 106 -142 -90 -275 -175 -310 -40 -86 225 99 -275 44 -65
4200 -65 192 52 61 -61 -345 135 114 63 228 267 165 77 8 -166 -186 39 317 70 183 299 -68 193 41
4223 41 89 199 73 320 373 271 46 -7 -53 158 -88 95 -118 204 71 276 283 341 481 123 239 131 294
4246 294 -41 130 107 133 94 195 -267 108 108 -159 136 389 84 3 136 1 -19 -31 55 118 -77 -2 -258 103
4270 103 -36 -377 -208 -39 -192 -8 -48 -198 128 -140 -166 16 -190 -196 -170 -96 -4 -87 -267 82 -349 -498 -162
4293 -162 -47 -142 36 -226 -356 -80 215 -45 -66 -38 -262 -208 -40 -113 -211 -111 -133 -145 -9 -137 -126 -25 -486
4316 -486 -141 -126 -63 318 85 -90 -204 38 25 15 -8 -150 -165 -83 -208 -59 279 -172 -87 -6 290 41 216
4339 216 -47 30 209 -140 -37 89 102 -140 217 -324 196 90 118 -62 207 -79 -34 130 292 -40 220
4360 220 205 -64 484 -125 156 319 162 159 -46 39 -68 104 -245 -63 249 -82 96 1 261 -125 287 70
4382 70 -205 116 -80 -84 -29 17 -88 18 137 102 141 -131 -69 -33 47 98 -245 251 -12 -163 -383 62 6 -264
4406 -264 9 253 -273 -59 -191 -184 97 -118 -284 -58 162 23 -280 -9 -27 -262 -346 -209 -70 -88 -125 -13
4428 -13 17 -400 -217 -192 -76 -359 -36 -47 -443 -260 -135 -245 -78 -410 -154 -119 25 -108 1 -84 -79 9 -161
4451 -161 47 -223 3 134 122 -222 13 -164 17 188 -184 -112 -115 246 256 101 157 6 -174 47 248 163
4473 163 346 7 284 335 257 272 161 257 286 247 59 315 -72 272 225 301 179 302 127 209 429 -134 -34
4496 -34 127 -16 74 -7 40 -157 27 1 105 -37 139 -144 -17 65 -114 115 -16 4 91 69 -102 13 324
4519 324 257 155 108 74 110 136 -38 -38 -143 -130 -318 -24 -531 71 -112 58 -126 -81 -31 78 -75 115 -22
4542 -22 284 16 -8 -117 -318 -28 -204 -79 -197 -118 -22 -34 -87 -100 -150 198 -204 17 -297 -161 29 -230 -249
4565 -249 -180 68 -308 -58 -169 86 -142 4 -159 -196 314 189 -60 -255 -94 -20 -48 143 136 -126 -271 19
4587 19 -77 -51 -120 36 55 135 -506 112 -6 -11 146 143 77 228 163 -84 -66 -4 -8 -1 42 -16 329 -32 247 24 216
4614 216 96 -13 122 -7 99 153 151 330 48 176 104 192 632 218 213 258 94 82 256 208 89 340 370 91
4638 91 289 36 120 423 105 -186 56 338 -51 327 -48 234 -46 -121 160 174 78 398 -183 11 244 309
4660 309 -164 253 97 -125 -213 -373 -162 30 231 -48 4 -97 -132 124 6 -45 -366 -148 -208 -29 -109 -232
4682 -232 -192 -311 -177 -153 -16 -124 119 -309 8 172 -144 -118 -113 -249 -271 -176 -74 88 -347 -180 -65 -65 66
4705 66 -260 -101 -267 -49 -220 -111 -301 -302 198 128 -38 -56 72 -232 51 140 123 107 283 90 -72 36 118
4728 118 -67 134 -187 318 -126 135 266 -20 314 62 70 61 21 -40 66 281 247 131 160 431 -180 -3 12
4751 12 249 -6 82 196 317 225 -125 310 50 291 198 105 371 278 343 137 -68 -19 217 321 172 -93 -172
4774 -172 -173 -20 -161 -73 1 -97 -177 128 -24 57 300 215 -170 77 138 104 104 -135 -50 -33 -39 102 -75 -96 -190 -18
4800 -18 15 -91 -272 -132 -118 82 -405 -81 -192 52 -59 78 -128 -310 93 210 -129 -60 -61 143 -211 -90
4822 -90 38 -80 -206 64 171 118 -37 -357 27 -110 -44 1 76 -18 -130 -345 -156 -354 -186 -195 -240 143 154
4845 154 -93 404 -37 -116 156 28 79 -143 -164 24 105 -206 -199 166 -173 -128 -270 176 157 -155 274 -117 -211
4868 -211 -86 22 127 96 -9 -89 335 269 -88 28 302 195 327 210 -80 44 54 394 16 34 2 215
4890 215 185 389 -164 273 -12 -6 276 87 -23 84 250 280 -78 44 -70 -15 -289 98 -93 151 -75 -131
4912 -131 82 -29 -26 267 210 -13 151 -93 -260 79 114 -156 -180 110 -39 -22 -252 -88 -259 -263 -321 -105 -50
4935 -50 -127 -92 26 -12 -244 79 95 -186 51 -138 -263 -64 90 -89 107 -354 -25 -167 -113 -149 -162 -305 143
4958 143 30 -74 -359 -2 132 7 -233 84 -182 33 -205 116 -130 -168 -33 -20 128 -89 121 -97 -247
4979 -247 -34 4 43 150 -94 47 4 80 178 314 -174 -68 -57 -77 61 340 -22 24 212 -140 -43 -37 164 5
5003 5 31 305 -193 227 13 331 386 16 -133 276 -190 -102 -17 100 343 -6 121 199 116 294 91 209 16
5026 16 1 228 -53 357 144 216 -75 360 203 112 -31 -148 162 -76 -107 235 97 -425 117 107 -195 -151
5048 -151 165 -176 147 270 109 -132 267 200 -25 -92 26 -296 -70 27 34 -454 24 -75 -148 -176 -384 -243 107
5071 107 67 -243 60 -195 -26 -174 -318 -255 -202 -291 -223 -51 -4 13 130 -27 -15 -376 -98 -155 -64 -14 -38 -87
5095 -87 124 -64 158 45 -177 145 130 302 30 -90 -159 19 -205 93 62 -16 396 140 161 -165 -124 -19
5117 -19 -69 52 164 206 106 -35 -80 161 -38 303 72 95 140 319 176 195 -28 126 89 245 -94 17 254
5140 254 170 98 141 -7 209 331 330 171 211 189 -15 452 -64 209 467 182 -79 176 -21 184 -10 -32 145
5163 145 37 174 135 -86 -8 129 -65 -19 149 99 -203 16 -90 -152 -163 71 152 -111 77 25 -23 220 -200
5186 -200 57 7 -302 12 -258 -60 -155 95 -140 -315 -138 -208 -335 -277 14 -272 -148 -6 -422 -123 -186 -181
5208 -181 50 320 -255 26 -373 -132 -94 -154 -140 -162 -247 -45 -68 177 122 -42 342 321 -147 -325 -126 -8 -61
5231 -61 -56 -33 14 -233 52 -159 274 123 -141 281 -78 308 83 40 32 95 -260 131 -15 264 203 98 173 158
5255 158 -51 -257 210 296 202 117 -116 350 -20 204 111 -121 -192 -78 -116 152 149 77 176 86 216 431 -11 57
5279 57 95 4 -214 58 139 265 3 -158 -110 108 240 -55 -147 -4 307 114 36 -66 67 92 -60 -7 -223
5302 -223 33 -133 18 62 -155 -4 399 -204 -13 39 -50 55 -67 91 -76 -173 -186 -120 -140 -19 -248 -125
5324 -125 77 72 -205 -134 -249 -260 -238 -81 -84 -363 -129 -71 59 -39 212 223 -156 140 -21 36 -92 -66 -2 -110
5348 -110 -190 -12 68 -177 -280 270 -129 -219 -297 -59 -162 122 -31 -14 127 95 404 -129 -9 -251 -279 -211 -128
5371 -128 71 -36 222 370 -125 173 -69 138 320 206 -4 181 229 105 53 132 287 -31 214 74 66 37
5393 37 359 66 216 -32 320 131 171 -86 -11 168 -115 243 35 17 -1 355 -82 -34 9 -44 1 97 162 238
5417 238 265 -100 119 195 10 -287 93 91 118 44 5 137 -194 -186 -166 67 -48 30 35 -195 85 -129 -35 180 -73
5442 -73 132 -172 -168 -113 -70 -140 -100 -65 -166 -70 -280 -203 -205 -325 -177 -206 -374 181 -131 -132 220 -125 -218 64 -211
5467 -211 -108 -346 -68 72 -128 -123 -56 -229 -153 194 95 -6 -11 36 -38 57 65 -32 -292 -190 33 77 26 -118 -63
5492 -63 386 -28 59 271 18 39 72 55 -179 83 175 204 157 -64 -176 79 -15 -167 -210 45 -188 4 235
5515 235 307 -45 250 32 125 107 243 -218 -187 -275 142 -14 462 166 20 17 145 119 -24 81 366 229 142
5538 142 -55 143 18 -33 87 149 83 110 167 252 165 -76 152 14 48 128 234 -105 1 22 -5 -51 37 -61 -135
5563 -135 -66 6 -16 266 -79 -196 63 -344 -221 -69 -240 -316 -87 -169 -199 39 -433 -30 -305 54 -257 -186
5585 -186 -352 -89 -358 -363 152 245 -194 -126 31 221 78 20 -144 -9 57 -111 -399 -321 -22 -226 17 -68 95
5608 95 -161 67 -135 -125 -59 -35 74 12 136 242 93 -44 -101 -178 100 -87 -32 128 -110 -83 212 349 221
5631 221 94 290 -239 221 -45 -143 87 -206 -52 61 161 -173 111 -116 156 219 -3 52 -46 114 243
5652 243 223 -244 506 -236 -30 -176 81 410 89 107 -41 182 -119 -264 -245 103 -300 10 -25 -188 310
5673 310 237 -23 191 -45 98 5 -5 164 -70 201 91 -173 274 162 -223 116 266 29 -174 -190 -60
5694 -60 78 -195 -116 160 91 245 -3 -46 -181 -197 -202 -144 58 -76 1 -335 75 -412 242 -55 -103 -217 51
5717 51 288 -101 43 -46 153 -102 -67 -1 -6 -356 -59 303 56 93 -78 -17 140 77 -243 -266 -373 193 -6
5740 -6 -78 229 -196 54 -229 -24 9 -148 -219 -113 44 -245 -56 -144 153 268 -169 109 -3 6 -54 -321 121
5763 121 -179 -17 -76 257 -55 127 19 119 -76 -5 131 168 207 138 110 123 48 239 120 -149 29 196 -16
5786 -16 -15 -15 25 -101 55 157 -82 -18 17 -32 -32 145 338 322 -45 -129 120 -199 -8 64 119 52 -316 -98 248
5811 248 106 104 -16 -133 -70 64 -139 118 4 -61 -158 236 -293 44 -86 15 -209 -36 -65 -140 -202 -265 51
5834 51 126 95 -132 -9 177 107 -59 0 -181 -303 -314 -49 -308 114 124 79 -216 -44 36 -210 56 329 1
5857 1 -222 -277 -382 280 92 168 -50 -83 -88 -44 -114 74 260 168 17 96 97 -140 71 -2 -119 -35 -122 -66 -74 -245
5883 -245 -52 -92 -36 -198 79 161 148 -301 -115 132 -117 457 -170 129 245 277 20 -117 -57 28 191 -45
5905 -45 -11 302 244 86 490 203 212 -184 -65 238 113 -48 141 20 -1 -232 182 -18 271 84 13 -82 -86
5928 -86 94 -134 -224 -85 145 208 85 -166 38 81 -28 97 235 -14 28 10 53 174 188 -23 129 -135 -306
5951 -306 -169 -128 -212 -366 -80 -154 -195 136 -62 339 -30 -146 -192 -493 -101 46 100 55 24 -102 27 -234 -262
5974 -262 -60 -286 -148 147 129 -163 36 235 189 -254 74 -260 210 -167 -237 -265 -85 75 8 168 92 -67
5996 -67 168 175 183 -211 -7 101 -75 -98 72 88 -158 227 -49 4 327 -57 69 252 -130 231 -51 154 360
6019 360 153 126 374 151 -197 163 -58 71 238 20 -150 -123 135 235 -28 152 172 8 369 -78 196
6040 196 -48 157 61 116 -240 -190 28 48 51 28 155 -61 67 68 150 127 25 174 34 65 263 38 115 67 -203
6065 -203 -49 -16 -11 -12 94 -49 -235 169 158 -83 -84 71 -16 -3 48 -93 87 -147 -201 -263 -146 279 -69 154
6089 154 -41 -291 108 -57 -2 -230 303 50 64 194 -220 -383 -20 97 -122 -3 173 21 8 -50 -341
6110 -341 -229 25 -190 114 -320 -246 -109 -45 -141 -40 36 71 90 -174 190 205 -143 -125 -73 312 74 348 -65
6133 -65 -20 -191 122 259 77 289 -254 215 -56 -56 179 4 -87 -118 115 -61 -34 -6 -318 55 -109 275 2
6156 2 -171 159 238 -77 64 42 131 97 268 241 470 91 235 200 99 -234 141 232 139 190 14 -81 428 -42
6180 -42 -224 136 -22 -124 65 -258 42 380 313 70 -128 -3 -128 146 94 -8 156 -148 -237 128 138 49
6202 49 178 -240 -41 -96 -128 -63 -56 -128 283 118 -26 76 -38 179 56 24 -529 149 -9 100 -20 -334 -219
6225 -219 112 -18 59 -83 -279 -254 -2 -83 -27 -64 -157 137 -14 -19 -172 48 -6 -369 32 -26 -276 142 -37
6248 -37 123 -149 -79 60 219 -350 -258 -114 95 -375 227 -6 -51 -87 -315 -37 -215 -28 122 -263 149 0
6270 0 243 -69 -83 -215 -200 210 76 -101 -22 171 24 17 7 -116 -58 -248 72 75 -324 308 84 -202 183 -149
6294 -149 -236 -182 232 -172 202 -21 -105 251 -29 -60 203 217 67 129 259 -71 156 207 44 113 -56 63 -44
6317 -44 -97 111 50 40 -154 311 139 44 -203 207 185 -53 73 195 37 160 -73 -85 -43 103 -157 120 62
6340 62 -64 -218 -385 -228 72 -121 -236 31 -132 210 1 -13 -195 -140 -4 -329 5 -187 -168 84 -326
6361 -326 -104 -112 56 -113 -63 -44 27 -142 -82 2 198 -412 -1 -316 46 -265 253 84 -250 -338 104 -167 -9
6384 -9 243 236 287 171 261 70 4 18 13 205 -30 -133 -34 -69 110 -108 -346 301 -19 -85 201 125 -151 -62 313
6409 313 351 171 307 66 63 -198 -121 194 -1 248 194 88 75 45 -33 -196 -189 -108 -29 171 -187 -341 169 -134
6433 -134 -144 324 -53 64 61 16 55 -17 238 -132 180 -162 -234 -38 -56 -121 -113 0 99 -76 -45 -21 260 -190 179
6458 179 228 7 103 247 61 55 220 -140 -101 -215 -116 -235 -19 126 -27 -148 -80 -114 -58 -1 -204 -103 -373
6481 -373 -118 -115 -109 200 -129 -213 -132 19 -94 -203 116 18 -153 -12 -300 34 281 18 53 43 -135 -217 77
6504 77 -144 -225 217 51 -59 84 -255 122 11 6 93 59 -14 -9 172 -265 -207 27 129 -104 102 218 5
6527 5 146 121 181 -113 -1 233 -83 -10 215 46 -108 303 115 72 59 -79 -128 121 -19 22 52 175 0
6550 0 117 75 58 -179 24 -45 217 -61 83 62 -11 37 141 -90 -447 12 129 4 148 23 170 -8 79
6573 79 -13 -277 33 -176 -29 159 -187 -148 -105 42 83 -59 325 -90 3 331 -26 126 -38 303 -79 34
6595 34 -98 1 -255 -44 -233 134 -106 -263 -157 79 217 -138 54 -136 21 -62 12 -38 -211 164 112 134
6617 134 -144 355 -305 50 116 -388 -275 -127 -14 144 99 -109 100 76 -136 -371 -99 7 -108 -2 63
6638 63 -257 74 -144 -81 168 134 128 61 -83 236 -160 -67 268 -73 -69 -5 29 -301 97 -81 -74 355 228 181 -113
6663 -113 279 -213 -200 155 355 271 -129 -163 -136 -32 -62 -186 -34 -258 12 -184 312 232 -54 -136 349 -120
6685 -120 44 -42 127 87 18 188 126 342 242 177 321 96 303 -109 183 98 -147 -214 122 214 317 330 378
6708 378 -195 105 237 -200 -29 -163 -122 -24 12 11 -91 49 40 40 192 276 131 -83 -73 40 215 -197 -127 129
6732 129 26 -151 -40 -221 10 -231 -26 169 308 -448 -154 -28 86 -194 38 133 -117 29 40 -18 -352
6753 -352 84 201 -217 96 -357 -97 -84 -16 -230 -119 -169 114 3 190 -148 -303 -132 126 63 179 -181
6774 -181 -219 -49 -73 -97 25 242 -332 -9 213 187 -41 329 -133 -51 -155 -269 -166 242 148 85 78 -82 -205
6797 -205 75 -127 -358 21 144 55 90 336 147 -205 206 -197 278 127 69 171 18 181 157 71 -112 299
6819 299 -72 311 -306 334 77 -75 -43 -49 105 86 297 -148 2 160 83 181 106 -64 -88 -221 -89 -176 225
6842 225 316 -151 -170 -81 -52 212 283 218 -84 -218 -36 -328 110 -213 97 -72 228 -129 175 291 74 -184
6864 -184 -153 -213 -162 -31 2 100 -65 -44 -158 -153 29 250 -201 -189 -142 -95 -145 -31 30 70 2 137 164 -155 71
6889 71 -100 -19 -26 3 -113 -59 -152 -142 -44 79 46 319 3 -82 154 -207 94 -344 -88 149 217 -243 68 -104
6913 -104 73 40 -84 -237 -26 47 17 15 -182 -146 -255 -7 41 -192 264 78 63 178 57 404 81 -9 102
6936 102 -254 69 117 -75 -49 -181 187 71 105 19 -312 264 9 -73 246 -300 128 211 -399 31 -122 204
6958 204 -61 42 318 50 36 169 359 183 66 -162 -74 -23 29 -17 197 -98 177 -23 136 137 9 46 117
6981 117 -141 44 137 -52 -248 -293 32 -12 94 79 2 -19 -192 -31 60 67 151 284 7 -136 -231 -143 -81 105
7005 105 32 -141 16 200 -314 -117 -69 141 -199 -328 -73 81 -188 -346 -309 -214 -306 -56 -40 -154 36 20
7027 20 -69 74 -107 212 -53 -61 54 -19 -167 142 249 -54 -60 99 19 -206 -127 -135 135 -53 -264 66 17 -561
7051 -561 304 -73 20 3 -97 -86 -126 157 -118 123 -2 96 57 -1 248 -21 -93 220 66 187 30 113 112 328
7075 328 91 -27 47 56 34 -132 -108 15 93 90 91 11 211 100 -43 -100 -72 -72 -148 118 169 25 217 -170 64 221
7101 221 270 45 96 -98 -33 -168 -223 -33 -235 -50 -529 -2 -391 -39 -65 -62 331 -105 -68 -159 -101 -294 -242 -328
7125 -328 -122 53 -26 -106 -66 -176 -146 169 25 212 263 -5 -107 -44 -10 252 -137 -91 -57 178 -2 74 45 75
7149 75 -26 144 -153 -56 -68 -164 256 -324 199 -94 31 -40 96 -64 15 -39 164 33 -95 242 48 -6 -16
7172 -16 -64 34 358 83 47 38 -74 122 -54 180 101 -13 -84 6 262 532 -125 56 -227 122 -125 12 199
7195 199 375 -241 -128 -143 158 75 -32 -145 232 118 -37 -44 95 -215 -223 240 290 -231 -176 223 -134 209 113
7218 113 -290 130 132 24 -44 103 40 316 49 28 138 -236 440 -54 -75 -295 51 19 75 154 31 -92 129
7241 129 -40 -18 124 107 -99 -181 -42 90 -78 -9 -116 -46 -188 -76 80 -302 168 301 -116 252 165 125
7263 125 -21 -171 7 -141 215 -103 201 193 -125 242 -393 -140 -206 92 321 -278 14 185 -68 230 -135
7284 -135 -59 -181 -415 -284 33 -87 18 -38 268 88 239 151 -191 36 -46 78 -29 85 175 46 25 -36
7306 -36 235 169 80 140 43 -92 -277 -112 111 -41 237 -18 31 72 75 188 -244 -64 -115 -239 -104 -69 27 -66
7330 -66 306 407 -3 93 205 -38 -179 -174 173 84 337 89 57 81 36 140 -77 167 -250 264 59 385 -55
7353 -55 159 136 -100 166 -126 -157 -249 14 -323 59 24 164 -146 333 -191 -389 -126 -28 54 23 -117 -101 11
7376 11 -37 136 158 67 23 -79 45 -118 62 192 -87 1 79 -138 -123 -69 197 -317 1 224 31 -15 -28 -4
7400 -4 20 -15 -145 215 72 -134 65 44 -48 464 123 -171 -26 -130 -98 -84 -423 41 -38 111 130 -175 55
7423 55 -71 19 -44 -33 211 92 128 -37 165 -17 -186 103 -87 -184 117 -275 -31 92 283 54 -66 -255
7445 -255 -48 208 80 -172 237 -99 -264 -341 315 -40 -102 11 20 32 248 82 -80 -131 -142 83 -190 -13
7467 -13 117 275 8 113 -349 184 208 218 -103 197 108 242 -133 -173 163 111 -52 -150 -53 77 -112 10 315
7490 315 -277 38 82 -206 -217 -142 -85 -174 -358 -154 -30 -202 -74 -30 6 -1 -174 206 -97 -142 144 56 -198 -146
7514 -146 -244 37 -125 -26 -46 115 1 28 -51 -209 -46 126 -135 219 -46 -163 213 388 18 -69 94 18
7536 18 396 -15 -21 107 -56 42 -219 -205 -77 23 -57 -152 110 -112 366 170 100 -71 0 -319 -11 127 135 215
7560 215 21 279 377 -22 -127 197 -351 157 89 142 104 -17 18 -207 113 -108 -18 -91 87 -174 -319 -100
7582 -100 257 6 -82 23 66 -226 -289 191 38 120 80 306 127 -173 37 -32 127 96 -232 3 -127 -121 -161
7605 -161 -13 -407 -22 -110 -221 -43 49 46 -164 148 -8 56 247 206 78 -224 67 -189 -127 -202 60 95 -153
7628 -153 189 22 106 -105 42 -128 58 -226 -342 40 -66 -120 -196 279 142 201 -194 40 116 -188 8 -47
7650 -47 -152 -131 -328 -36 124 62 -19 -149 89 -102 279 -77 156 338 -259 132 102 1 241 154 255 -74
7672 -74 -56 122 -84 -29 275 164 2 111 186 -295 -211 -145 -163 181 -176 249 123 221 -82 -70 159 66 -140
7695 -140 -60 274 144 206 -116 -65 -122 -145 284 243 -64 227 152 -104 -249 73 -38 90 -167 -223 3 -6 92 -162
7719 -162 30 42 14 -65 7 203 56 258 164 -32 302 181 46 55 5 33 172 -108 -59 324 42 -134 104
7742 104 -77 206 45 -126 -154 9 97 193 -17 -240 -42 -136 -33 50 -200 -79 -117 101 218 -237 -75 511
7764 511 -57 306 4 41 -193 0 67 -194 -172 175 -172 99 -60 4 72 48 -160 108 -207 -119 416 18
7786 18 -65 228 -130 -257 280 -62 -273 201 -91 -365 -59 -145 -30 211 55 145 79 18 -4 380 -366 14
7808 14 110 186 -166 -241 224 -2 -56 384 -106 141 80 -77 248 181 174 257 122 203 -36 137 -31 -94 173 310
7832 310 -150 74 7 -185 -143 102 -171 182 -95 129 -120 96 272 -191 -346 -239 -67 -219 -9 -319 -309
7853 -309 -109 93 4 226 174 -30 71 -141 -290 -189 95 160 -250 -140 65 -257 -113 21 112 -91 142
7874 142 240 -22 102 -128 -252 104 18 -33 225 -245 -113 -76 113 45 197 -78 -276 -103 6 -270 18 29
7896 29 193 57 -190 69 287 32 54 22 -201 -45 -172 0 -188 46 -262 -3 -213 256 -431 -101 -204
7917 -204 -91 -1 79 170 187 14 -232 243 -114 42 161 -153 -258 -94 19 -12 -85 -56 70 141 -103 47 -23
7940 -23 -203 54 208 -246 -263 -233 -26 182 25 298 269 -49 90 -202 263 -120 -31 99 27 54 -154 -54
7962 -54 -52 75 -56 -22 340 -292 -96 56 -160 -57 146 276 230 35 246 -127 140 159 38 -42 -78 -167 114
7985 114 209 -109 -346 62 168 213 320 -39 57 84 243 139 2 78 6 42 -66 81 -164 -313 6 -45 322
8008 322 -187 -62 -151 370 -85 104 32 44 -273 -44 -205 -32 178 -148 370 299 -89 -74 67 -39 -9 -148
8030 -148 -32 51 69 -48 80 -215 18 159 162 -55 -72 168 -218 -165 264 223 -50 22 124 -164 226 190 -193
8053 -193 -235 -60 79 120 -12 -90 182 -178 123 -281 -144 158 162 -97 -46 216 245 115 -157 -208 35 -54 -381
8076 -381 99 104 96 276 -101 -5 -158 91 262 -59 310 130 33 -47 -71 55 98 -162 -8 65 129 -319 81 -161
8100 -161 101 73 -37 62 24 -30 -18 57 60 242 -44 -48 -44 25 -142 65 -96 71 -247 128 -181 -93 -105 35 -107
8125 -107 -243 -90 -14 90 75 -137 -61 -98 8 130 -219 -146 -336 38 -165 296 -180 31 53 203 -60 -114
8147 -114 154 -373 -93 -10 185 27 -339 216 -64 -8 310 129 -236 109 -139 -18 -136 295 203 131 -226
8168 -226 -310 -269 27 156 105 -28 -213 58 -161 -39 -194 -98 12 -97 93 -214 128 217 -106 -31 5 -32 2
8191B
$$ Imaginary data points
##PAGE= N=2
##DATA TABLE= (X++(I..I)), XYDATA
0 0 0 0 0 0 0 0 0 0 0 -8 8 -8 8 -8 16 -16 16 -24 24 -32 39 -41 48 -56 65 -75 86 -97 110 -123 139 -157 176
33 176 -196 220 -244 274 -303 336 -372 412 -456 505 -558 620 -687 765 -851 951 -1070 1206
51 1206 -1373 1577 -1835 2176 -2644 3333 -4451 6583 -12131 57103 125039 34303 10179 24617
65 24617 31307 -1584 10105 44912 47791 9531 3147 19163 19045 8212 33444 56721 26799
78 26799 -25798 -24427 11028 19736 6710 21665 38141 10772 -30604 -23437 10022 13156 -1159
91 -1159 11349 30160 11503 -22738 -19025 11233 19061 1558 -5299 -2533 -9378 -12856 8212 30955
105 30955 23633 4384 5145 10078 -7298 -24430 -4892 27874 29533 5848 -3395 6224 6938 -912
119 -912 4624 18671 14797 -2957 -5392 6632 8339 22 5528 19489 11251 -14843 -23484 -8496
133 -8496 2696 916 6110 15733 6198 -17357 -22354 -7708 -4605 -15893 -13440 2983 906 -21686
147 -21686 -26760 -6331 4940 -6443 -14853 -10347 -14308 -28162 -23622 -2808 2665 -10892 -14407
160 -14407 -6160 -12686 -30415 -26074 -737 6975 -7583 -14513 -5951 -7599 -20309 -16260 680 -915
174 -915 -18491 -19417 -4792 -2866 -12586 -5622 9654 2901 -19451 -23727 -10650 -7719 -13662 -5031
188 -5031 8132 622 -17452 -16411 -2691 -4327 -15575 -11897 -1165 -6900 -18944 -12657 2844
201 2844 1868 -9596 -9252 -4321 -13353 -22671 -11850 4875 3572 -6078 -3929 2336 -4960 -14830 -8652
216 -8652 2503 310 -7881 -3225 5467 2412 -2183 4242 10774 3239 -6858 -3217 5119 4700 2574
231 2574 9722 16092 10626 2263 3185 7767 5153 1903 7097 13404 11453 6509 9402 14108 10214
246 10214 3358 3702 6767 4668 2160 6231 12161 12098 7239 6855 7552 3172 -2145 -806 4079 4635
262 4635 2390 4351 8214 6400 1480 -88 2179 412 -3256 -2100 2980 3952 2405 3343 5830 4156
278 4156 -1570 -2940 -3 419 -1403 1236 6350 7379 3979 3083 4647 3410 -493 -674 3459 5049
294 5049 3876 5224 9022 8706 4915 3861 5004 3423 1176 2392 7066 7962 6171 7202 9058 7116
310 7116 2832 1679 3762 3433 2116 3743 7138 7236 5343 4882 4928 2352 -1052 -783 1739 1979 1800
327 1800 3193 5721 4391 813 -447 -286 -1543 -3351 -2080 284 991 432 1167 1753 230 -3029
343 -3029 -4082 -3986 -4199 -4117 -2484 -234 713 -433 -1776 -2670 -4376 -5653 -6216 -5559 -4442 -3066 -1993
360 -1993 -1892 -2175 -2551 -4030 -5615 -7126 -7154 -6399 -5578 -3869 -3200 -2548 -3278 -4392 -6038 -7505 -7839 -7501
378 -7501 -6201 -5437 -4722 -4156 -3407 -4195 -5727 -6969 -7407 -7620 -7597 -6422 -5115 -3680 -2909 -3195 -3888 -4985
396 -4985 -6305 -6819 -6605 -5795 -4871 -3107 -1797 -1629 -1881 -2681 -3548 -4453 -5341 -4497 -3560 -2527 -1227 358
414 358 754 359 -925 -1621 -2043 -2800 -2439 -1044 565 1956 2356 2481 2210 1178 -119 -431 -308 127
432 127 917 2872 3940 4023 3899 3322 2910 1796 890 1542 2385 3367 4074 4924 5563 5596 4491 3257 2553
451 2553 2999 3092 3420 4622 5986 6704 6597 5412 5101 4015 2994 2911 3802 4775 5270 6070 6826 6575 5448
470 5448 3883 3877 3427 2475 2743 4345 5487 5302 5313 5438 4633 2933 1792 1756 2149 2029 2814 4257 4491
489 4491 3390 2408 2193 1654 114 -934 266 1106 970 933 2017 2134 544 -657 -927 -1652 -2844 -2804
507 -2804 -1036 9 -324 -745 -272 -1164 -3646 -4425 -3676 -3035 -3296 -3516 -1948 -1563 -2303 -3149 -2560 -3087 -4734
526 -4734 -5657 -4329 -3526 -3739 -3342 -1496 -1308 -2990 -4817 -4685 -4028 -4963 -4869 -2802 -1117 -2094 -2744 -1700
544 -1700 -1466 -3170 -4364 -3240 -1961 -3009 -3716 -1331 645 -285 -1430 -843 -427 -3073 -4447 -2070
560 -2070 278 -526 -832 1045 2144 -367 -2610 -998 720 -745 -2196 204 1779 6 -1283 1652
576 1652 3685 541 -2418 -743 889 -1287 -1729 2164 4646 1371 -1032 706 1391 -1823 -2918 1243
592 1243 3882 170 -1772 1821 3791 223 -1442 2072 3238 -1177 -3585 655 3750 1399 805
607 805 3947 4216 -1242 -3589 777 3446 467 -135 3865 4634 -275 -1941 2817 4892 629 -1507
623 -1507 1842 2479 -1131 -1041 4705 6697 1591 -1478 1299 1799 -1979 -1919 3686 5391 883 -1578 1482
640 1482 2407 -711 -1501 2339 3042 -1789 -3669 708 2869 9 -982 2534 2109 -3520 -5270 -967
656 -967 1623 -487 -1232 1890 2282 -2557 -4629 -831 1803 -1168 -3132 -310 1297 -2172 -3373 819
672 819 3338 -449 -3388 -953 334 -2529 -3662 1264 4519 1080 -2478 -553 1389 -1691 -3338
687 -3338 535 3755 405 -2423 623 3251 -182 -2218 1816 3745 -909 -4402 -186 3338 756
702 756 -1084 2795 4630 -438 -4552 -979 2956 -175 -1605 2763 4914 -217 -3730 152 3819
717 3819 -114 -2117 1266 3149 -1986 -3760 2016 5495 1162 -1677 1020 1400 -3673 -4385 2118 5162
733 5162 698 -1945 1227 1921 -3122 -3446 2253 4497 -1184 -3870 249 2375 -1703 -1784 3393 3642
749 3642 -2536 -4954 -951 906 -1949 -1426 3503 3053 -3450 -5476 -756 1066 -2751 -2756 1183 709 -4480
766 -4480 -4750 52 1547 -2016 -3293 -712 -1509 -5661 -5144 436 1961 -1945 -3368 -1076 -1542 -5422
782 -5422 -4466 171 1066 -2877 -3618 -812 -356 -3348 -2923 903 1060 -3247 -4663 -891 372 -1707 -984
799 -984 2588 2403 -2423 -3888 -463 1347 -261 -724 2787 2940 -508 -1582 1804 3426 585 -465
815 -465 2402 3182 -475 -739 3442 5358 1790 52 2962 3371 -293 -1165 3474 5519 2346 1109
831 1109 3378 4317 568 -758 3599 5107 1435 -208 3137 4653 1178 361 4091 5150 985 -1263
847 -1263 1871 3463 1088 563 4285 5277 955 -1184 1654 3011 399 -304 3591 4233 153 -1094
863 -1094 2273 3298 616 -328 2309 2542 -1371 -1922 1944 3601 1062 75 1620 1341 -2505 -2504 1246
880 1246 2590 -359 -1296 1056 744 -2299 -2137 571 1059 -1820 -2705 -558 -518 -1894 -1801 889 605 -2481
898 -2481 -3648 -1747 -1664 -3013 -2435 -75 -90 -2847 -3860 -1723 -1447 -2959 -3176 -1654 -1965 -3675 -3569
915 -3569 -1588 -946 -2584 -2823 -1874 -2811 -4242 -3920 -1769 -1239 -2038 -2308 -1987 -1720 -3460 -3270 -1871 -1355
933 -1355 -2234 -2705 -1361 -972 -1516 -1575 -278 -579 -1621 -2329 -1367 -522 -1114 -878 412 1118 -198 -1083 -256
952 -256 177 -271 -472 684 1193 675 441 1052 1361 652 161 1063 1403 437 541 1686 2547 1562 1139 1756
972 1756 1666 497 420 1658 1942 1307 1513 2220 2568 1048 598 1718 1834 768 817 1801 2109 1175 1306
991 1306 1809 2267 1264 548 1153 1313 868 846 1791 1818 958 838 1567 1218 351 310 1074 1254 438 436 1098
1012 1098 1237 831 289 771 367 -86 76 812 871 521 297 846 456 -343 -530 -266 299 -236 -383 9
1032 9 250 118 -343 -3 -397 -683 -869 -686 -620 -334 -292 33 83 -334 -824 -960 -909 -931 -960 -203 -518 -393 -527
1055 -527 -281 -211 -608 -897 -490 -827 -583 -766 -384 -12 -53 87 -215 -573 -373 -657 -425 -7 28 147 32
1076 32 512 124 45 -96 -6 -217 -200 -219 -74 236 478 253 72 -569 -368 -523 -299 -400 -71 -67 -147 57 -320
1099 -320 -473 -725 -295 -545 -782 -612 -579 -415 -212 -137 -208 -418 -641 -460 -194 -151 -206 268 378 425 159 523
1121 523 257 403 -109 334 431 604 996 615 994 799 1062 745 432 601 611 753 601 990 1093 1079 765
1142 765 833 789 343 64 152 157 140 11 559 53 -187 -364 -749 -931 -852 -1364 -1064 -1253 -1190 -1159 -1212 -1486 -1694
1165 -1694 -2204 -2079 -1809 -2332 -2029 -1716 -1496 -1722 -2050 -2072 -2251 -2146 -2002 -2376 -1567 -1901 -1709 -934 -1261 -1279
1185 -1279 -1214 -1178 -1333 -1350 -1226 -437 -502 69 50 65 300 330 343 316 528 730 1139 1581 1569 1592 1123 1425 1887
1208 1887 1246 1187 1581 1709 1774 1592 1859 2194 1852 1937 1799 2051 1944 1491 1657 2319 2040 1796 1976 2138 1494
1229 1494 1030 1312 1628 1390 1215 1478 1639 1291 985 1197 1504 1314 528 717 1059 872 609 885 1509 1465
1249 1465 160 653 821 577 197 459 1064 995 124 652 777 435 -420 226 501 53 -400 28 665 162
1269 162 -560 -345 289 -480 -1466 -1318 -488 -833 -1529 -803 -69 -1061 -1648 -1814 -1239 -1730 -2078 -1554 -903 -1873
1289 -1873 -2490 -1827 -1096 -1827 -2333 -2089 -1729 -2063 -2754 -1734 -1134 -1374 -2320 -1653 -1384 -2221 -2217 -1455 -1049 -1389
1309 -1389 -1795 -1308 -894 -1243 -1380 -590 -59 -817 -1405 -896 -367 -346 -476 190 708 -595 -677 -439 395 35
1329 35 -166 861 1009 266 -574 102 1040 541 24 571 1103 234 -347 616 1410 687 176 838 753 -77
1349 -77 -459 613 1498 683 -205 706 1543 384 11 535 1397 685 -263 297 1179 711 289 1053 1833 747
1369 747 -212 689 1366 652 165 1401 2446 1220 170 615 1902 1134 218 1550 2176 1084 280 1276
1387 1276 2018 1077 225 1364 2104 717 -431 934 2427 1181 90 775 1760 306 -548 652 1978
1404 1978 838 -196 344 1164 -171 -823 350 1256 -336 -1382 -359 501 -596 -971 216 941 -169
1421 -169 -2055 -1188 -221 -878 -1566 -196 200 -1002 -1846 -1205 -294 -960 -1608 -613 -298 -1277 -2146 -895 -107
1440 -107 -821 -1562 -589 -460 -1281 -2095 -987 18 -318 -1208 -580 -231 -1139 -1471 19 497 -246 -1151 -576
1459 -576 157 -413 -632 84 845 393 -1203 -485 361 162 -227 520 1253 274 -772 -129 675 386 142
1478 142 496 1282 374 -632 108 1162 604 -2 308 697 -8 -569 307 1174 695 -254 216 487 119
1497 119 -956 320 853 273 -415 -164 586 -203 -536 178 680 181 -804 -41 231 80 -594 290 821
1516 821 -243 -799 -200 434 -421 -481 383 1113 -89 -751 109 512 -164 -277 237 407 -150 -1184 318
1535 318 455 72 -354 461 438 -562 -469 79 390 -34 -408 391 505 -495 -858 -218 434 -757 -493 -10
1555 -10 201 -895 -1071 -82 241 -269 -1326 -523 -402 -1107 -1103 76 173 -815 -1050 -620 -332 -779 -1127 -77
1575 -77 53 -637 -812 -273 -8 -505 -496 177 558 -724 -458 -120 380 114 -17 823 677 184 -169 488 1111
1596 1111 868 315 838 1126 530 535 1154 1391 841 335 905 1268 712 933 1278 1452 1281 695 1007 1453
1616 1453 816 768 1544 1486 796 584 787 1242 792 490 1088 1009 873 459 1278 1242 647 653 996 1037 432 257
1638 257 788 924 766 339 630 757 309 89 562 820 546 334 358 459 398 -172 91 217 -265 -612 -299
1659 -299 -332 -73 -492 -355 -235 -834 -1106 -936 -854 -1324 -1413 -1466 -1212 -1340 -1658 -1627 -1418 -2217 -2172 -1672 -1889 -2247
1681 -2247 -2455 -1710 -1922 -2224 -2185 -2049 -1683 -2181 -2181 -1665 -1905 -1759 -2009 -1656 -1464 -1729 -1621 -1319 -1018 -1106 -1201
1702 -1201 -1044 -835 -954 -898 -57 -289 -345 -281 -162 477 390 265 570 572 320 641 1140 545 936 883 900 1197
1724 1197 987 1139 1125 1164 1067 981 1077 1209 799 698 862 881 709 597 849 788 709 749 635 690 591 336 386 422
1748 422 305 328 366 276 442 240 430 543 305 217 229 206 363 362 400 59 393 445 263 476 440 415 436 757
1772 757 738 697 416 776 811 860 899 534 723 692 748 543 485 412 349 711 229 251 767 560 553 179 177 130 366
1797 366 -25 117 -121 88 -161 -327 -314 -614 -67 -428 -562 -341 -567 -603 -173 -587 -686 -663 -438 -361 -431 -630
1819 -630 -294 -480 -233 -491 -306 -593 -458 -475 -91 -146 -231 -2 -256 -196 -329 -159 -180 263 -22 -47 -51 -109 37
1842 37 11 42 37 -115 263 -66 132 -254 -312 -41 -470 -324 -305 -99 -230 -270 -336 -871 -684 -427 -483 -788 -754 -568
1866 -568 -693 -617 -698 -660 -230 -744 -749 -632 -567 -652 -457 -712 -442 -106 -158 54 -243 235 105 47 -103 38 420
1889 420 491 595 565 495 476 461 934 507 765 766 893 891 1148 1274 954 560 1012 1100 1007 838 791 921 899 649
1913 649 455 414 284 228 316 338 116 -284 7 -57 -20 -530 -521 -412 -452 -891 -472 -625 -487 -1040 -894 -904 -1145
1936 -1145 -1057 -1222 -913 -888 -1190 -1004 -664 -980 -1201 -860 -878 -1025 -1031 -853 -767 -591 -798 -617 -424 -545 -607 -514
1958 -514 -371 -257 -142 -187 226 26 -148 43 400 70 105 155 505 523 441 670 992 638 413 375 564 517
1980 517 574 423 623 623 589 502 279 536 554 590 688 604 516 547 827 669 727 590 800 831 716 457 954 391
2004 391 586 400 833 503 210 797 680 413 527 319 1236 923 317 793 862 1000 288 779 921 734
2024 734 376 417 482 789 323 362 778 252 30 -4 218 416 -110 85 558 309 -465 -331 147 -154 -501
2045 -501 -424 -195 -442 -820 -782 -528 -852 -856 -791 -632 -713 -821 -1012 -340 -577 -939 -989 -811 -618 -1427 -1251 -519
2067 -519 -843 -733 -774 -603 -422 -942 -813 -178 -688 -839 -794 -450 -497 -930 -485 -636 -259 -752 -603 -234 -587
2088 -587 -389 -389 160 -369 -510 -349 -42 -148 -413 -294 -88 -337 -166 -127 183 171 -522 -62 198 18 -617
2109 -617 -54 42 274 -476 63 167 -308 -37 54 26 269 -199 155 263 55 -116 157 604 43 286 196
2130 196 555 562 72 472 996 539 222 522 580 581 454 838 1091 370 657 520 901 842 384 833 1060 773
2152 773 563 816 774 731 245 612 826 448 402 350 818 542 326 350 429 162 -71 62 299 412 -171 132
2174 132 247 8 -234 -193 445 -17 -512 -433 -225 -128 -614 -29 -47 -84 -288 -409 -296 -567 -627 -249 -205 -303 -531
2197 -531 -867 -269 -538 -917 -607 -320 -500 -997 -462 -49 -292 -741 -370 -51 -540 -440 -542 -129 -360 -764
2217 -764 -268 79 -507 -841 -202 -199 -362 -582 -275 178 -30 -423 -75 137 -196 -451 -196 306 -73 56 -123
2238 -123 501 -62 -333 -308 531 -55 -244 54 167 255 -351 92 348 162 -171 644 575 18 21 210 425 434
2260 434 297 497 472 212 -5 253 585 363 444 246 355 443 -62 321 251 320 221 330 97 433 213 195
2282 195 467 210 70 0 85 72 83 126 353 210 48 77 178 -20 -100 165 -364 85 -41 -72 -129 304 54
2305 54 -11 -226 -122 -261 -298 -190 -176 -310 -18 -333 -688 -426 -370 -258 -357 -559 -376 -756 -154 -586 -523 -75
2327 -75 -478 -261 -521 -498 -595 -223 -387 -390 -340 -497 -237 -440 -821 -639 -296 -252 -499 -518 -197 -191 -642 -416 -371 -204
2351 -204 -338 -361 -275 -129 -75 -60 166 2 -132 -125 9 40 215 -66 137 83 -118 -175 91 258 -156 149 84
2374 84 20 -1 58 -79 405 339 117 519 579 181 375 505 147 460 353 502 743 667 640 283 383 437 312
2397 312 627 627 490 352 498 437 613 240 496 685 676 607 530 646 261 505 847 488 400 524 298 480 384
2420 384 468 237 234 302 300 250 3 109 -59 118 127 172 -118 -76 -201 -79 -341 -546 -350 -193 -416 -561 -435 -537
2444 -537 -330 -332 -315 -438 -580 -710 -364 -318 -480 -491 -749 -421 -653 -612 -750 -598 -651 -825 -385 -419 -389 -376 -654
2467 -654 -622 -593 -439 -389 -589 -511 -230 -265 -232 -550 -363 -159 -188 -218 -78 -97 51 -96 -152 -175 -390 -64 100 -3
2491 -3 195 -265 299 20 76 301 534 -170 294 157 64 352 0 248 130 287 142 196 -9 257 457 260
2513 260 104 108 221 429 729 289 696 500 330 347 334 235 92 485 374 411 557 290 283 449 276 383 478
2536 478 256 401 784 225 197 458 345 265 267 339 453 80 228 410 185 224 225 346 145 59 68 8 144 125
2560 125 -58 121 31 -231 -87 -92 -157 -193 19 -92 -217 -150 -99 -422 152 -31 -402 -595 -450 -160 -47 -481
2582 -481 -511 -319 -335 -782 -191 -450 -326 -314 -408 -339 -395 -278 -466 -342 -846 -606 -677 -408 -425 -636 -221 -333 -404
2605 -404 -366 -89 -463 -406 -84 -254 -448 -463 -100 -67 -230 -129 -150 -42 27 -287 -164 -136 67 97 277 95 146
2628 146 102 270 360 39 321 123 298 300 263 195 457 -52 249 176 471 376 561 108 317 370 460 372 240 459
2652 459 265 596 180 420 551 298 359 423 99 434 117 94 574 599 117 481 472 155 338 276 279 106 231
2675 231 208 138 355 68 300 233 39 -17 89 161 71 -188 67 224 82 47 62 116 -35 -224 -213 -112 -113 38
2699 38 104 -17 112 -411 154 -382 -196 -377 -161 -145 -216 -354 -624 -399 -69 -464 -354 -102 -54 -546 43 -478
2721 -478 -165 -43 -486 -402 -499 -173 -386 -177 -207 -100 28 -26 -225 -346 -368 -187 -255 -148 -165 110 -358 124
2743 124 -255 -220 38 -374 -143 -203 -251 -5 -67 -38 -38 64 -18 107 120 -15 203 70 78 -14 190 32 272 171
2767 171 -4 307 212 253 83 2 33 141 -180 -5 110 198 -107 282 251 203 195 388 369 329 47 -28 218 76
2791 76 -119 452 450 446 476 316 576 416 440 214 490 519 462 177 291 450 230 368 495 224 320 329 351 -97
2815 -97 24 177 119 92 130 160 -2 37 -62 -164 -305 212 -333 48 -241 -276 -440 -238 -551 -257 -35 -183 -397
2838 -397 -324 -452 -589 -167 -514 -442 -829 -345 -625 -520 -400 -483 -536 -705 -500 -453 -461 -491 -587 -101 -44 -300 -398 -433
2862 -433 -218 -161 -286 -205 -98 23 -202 -307 125 103 270 349 -170 -169 -26 -136 219 -138 21 619 228 258
2884 258 296 116 229 186 340 143 320 240 296 609 470 -48 350 134 -4 96 421 529 527 264 479 687
2906 687 107 657 502 269 240 356 691 263 491 499 622 544 206 148 384 696 695 419 201 613 470 494 509
2929 509 312 294 233 191 383 298 212 121 257 307 -203 28 -107 -34 -112 97 -121 -47 -117 -155 -194 9 -259 -438
2953 -438 -76 -441 -484 -660 -174 -44 -345 -556 -558 -396 -549 -618 -486 -501 -371 -679 -234 -578 -585 -372 -538 -547 -659
2976 -659 -336 -101 71 -358 -169 -269 -120 -290 -134 -149 -47 -247 -137 -23 64 -194 9 159 -12 -149 -7
2997 -7 84 -37 65 -245 -49 -102 -254 -22 -74 19 -85 -79 327 -175 -183 -4 134 58 26 -168 -157 135 -47 2 221
3022 221 -171 -145 38 149 98 -110 52 227 -30 117 110 40 -45 -115 63 317 139 -45 356 -95 278 222 508
3045 508 216 328 228 346 207 505 399 233 390 29 539 329 244 573 457 195 346 527 141 494
3065 494 175 324 211 166 66 42 181 131 -9 120 175 110 192 -76 227 -418 -329 -155 -230 -85 -152 -82 -139 -80
3089 -80 -137 -223 -142 34 -244 -326 43 63 30 -113 -629 -448 -515 -504 -230 -63 74 -19 -98 -293 -353 -162 -342 -214
3113 -214 -242 -320 -219 -193 119 -198 -484 -200 -360 -183 -114 -183 -141 -210 247 -383 -49 -179 -154 -291 -202 -66 31
3136 31 -29 -121 -326 -188 81 -106 84 -56 -304 19 144 11 183 -15 407 164 -120 167 93 313 185
3157 185 197 186 358 127 358 502 172 195 177 232 -59 629 328 329 235 426 460 140 353 276 172 253 216 411
3181 411 364 210 64 214 248 195 146 221 98 405 -228 -140 89 -218 102 -104 168 127 -133 148 133 -134 91
3204 91 -136 -153 -38 47 -162 -138 -243 -324 -161 -200 -324 -35 -7 -300 -33 -262 -176 -19 23 -362 -397 -166 -458
3227 -458 -259 -394 -51 -231 -352 -330 -186 -552 -230 -192 -278 -383 -18 -353 -395 -382 -251 -60 -205 -285 -413 -136
3249 -136 -111 -319 -291 -301 21 -170 -523 -156 -328 -151 -271 -224 -134 47 49 84 255 242 3 -125 223 -273 122
3272 122 112 16 175 253 152 450 10 184 321 -37 234 265 114 135 382 834 89 39 197 484 360 200
3294 200 150 31 360 660 267 242 432 161 210 284 176 102 444 138 575 299 255 397 199 271 736 267
3316 267 155 351 275 236 530 253 274 237 292 -64 90 -15 564 -2 -1 246 280 297 53 -232 27 146 -261
3339 -261 -211 -68 64 0 -188 -18 -176 -323 -136 -116 -287 -128 -459 -369 -225 -291 -508 -387 -61 -473 -275 -435
3361 -435 -171 -365 -280 -348 -357 -311 -564 -144 -312 -606 -434 -61 -142 -456 -276 -385 -371 -324 -509 -40 152 -263 162
3384 162 -132 -413 -58 34 51 86 166 -199 134 30 194 67 51 -73 -191 54 94 104 -15 128 -20 280
3406 280 283 53 332 22 139 71 110 281 114 9 137 30 31 -4 377 255 143 283 -117 413 -29 49 104
3429 104 193 -293 -242 276 193 412 151 368 110 233 -105 138 349 366 116 162 39 268 354 11 -167 229
3451 229 -134 153 345 350 35 -69 69 -96 43 -13 206 28 -7 -7 -15 363 191 41 53 -60 14 -191 66
3474 66 -225 -424 -203 -270 129 -158 -106 -150 -54 -441 -180 -207 -377 -54 -255 -152 -117 -107 -176 -238 -333 11 -113 -210
3498 -210 -537 -143 -352 -27 15 -105 -171 -150 154 -149 -299 -157 24 -7 117 -176 204 -79 158 16 -94
3519 -94 92 -133 -89 -104 -415 -53 33 -206 -166 184 -459 -36 -243 -231 43 -113 140 160 92 -168 -108 53 273
3542 273 -96 126 33 101 163 437 201 304 16 -38 -23 343 -277 397 124 466 407 -4 433 497 299 262 467
3565 467 75 419 193 14 483 359 337 382 397 160 420 287 202 328 235 208 403 375 459 312 123 138 32
3588 32 -72 -49 -40 385 3 136 86 -168 -55 -103 -312 -168 43 -303 -367 -338 -265 -256 -392 -218 -159 -437 -508 -337
3612 -337 -221 -380 -549 -428 -111 -313 -369 -631 -404 -183 -69 -89 -402 -251 -352 -461 -14 -21 28 -190 -149 -126
3634 -126 -163 -438 -266 -155 -264 -168 -81 -56 -1 82 51 -75 -179 -4 -232 179 -52 122 152 107 99 10 226 18
3658 18 -102 -23 200 244 167 -52 201 121 -195 450 23 347 167 56 398 249 182 325 142 287 -101 192
3680 192 308 30 119 113 83 465 123 85 264 504 367 241 543 265 269 60 238 310 350 203 -30 80 216
3703 216 311 229 249 115 153 100 61 359 -25 125 214 -75 133 321 -152 16 -65 -84 46 -254 -210 -268 27 69
3727 69 -92 -61 109 -16 -106 -308 -173 -60 -104 75 -394 -184 -225 -227 39 -299 -128 -9 -291 -39 -349 -237
3749 -237 -137 -321 -288 -109 -23 -85 -274 -171 -238 -196 -154 -177 -115 -31 -85 -7 -213 -210 -371 98 73 28 -119 -218 -169 -371
3775 -371 21 -129 152 -27 -233 88 80 -140 -248 184 -160 -202 152 -264 -20 -167 197 189 -129 -97 129 150
3797 150 87 -236 -175 -42 119 -182 -137 1 107 283 272 -36 -49 156 77 362 290 157 -9 252 295 246 373
3820 373 380 345 49 184 175 195 276 325 469 211 306 110 293 372 341 155 278 81 108 196 59 -2 162 -162 -84
3845 -84 102 34 -167 101 158 -21 -45 -176 57 -57 176 -140 -221 -26 102 -30 -236 -425 -422 -425 -185 -217 -422
3868 -422 -167 -229 -43 -460 -294 -123 -95 -204 -30 -251 -211 -350 -132 -219 -162 -149 -368 -138 -212 -192 -6 -281 -238
3891 -238 9 -393 -66 -19 -73 74 -149 -160 -57 103 -242 -19 -64 -52 -150 -314 -462 221 135 -196 -125 -64 -27
3914 -27 -26 -18 130 -134 12 -80 -35 -149 146 -43 -156 132 201 78 -61 328 -211 -301 -35 555 185 149 103 88
3938 88 383 -49 -61 557 84 84 272 82 172 176 202 119 306 318 434 69 105 129 109 17 162 45 126 -228 244
3963 244 130 -48 -41 -41 199 354 -196 -124 383 -163 206 -43 -341 244 56 -360 -177 86 -11 -158 -220 75
3985 75 -156 -178 -210 -52 -192 31 116 17 -268 -303 -41 -86 28 -225 -250 39 6 -102 -193 -183 -204 -256 -478 112
4009 112 -170 -150 -404 5 -489 -148 -397 -244 -329 72 -231 8 -85 -460 -268 -154 -356 -139 86 -248 -264
4030 -264 -147 -63 -79 -237 -106 116 108 -267 -295 164 -270 -103 -186 -177 74 7 3 0 134 51 -39 146 -30 185 -110
4055 -110 -112 -72 195 420 16 -150 179 290 150 433 58 209 26 401 226 49 538 88 253 91 260
4076 260 158 281 257 446 130 529 -138 402 327 248 23 134 504 -23 30 23 116 358 21 247 439 373 112
4099 112 34 -55 231 38 -19 -5 16 -140 64 42 -169 -49 -59 -76 42 -26 -143 -405 239 -414 -182 194 -288
4122 -288 -51 -111 -219 -226 -332 -270 -268 -41 -69 46 -160 -427 -303 -358 -154 60 -14 -241 102 -175 -376 -252 -182
4145 -182 -322 -386 -236 -93 -192 -210 -401 -103 -127 -164 -142 145 -204 36 -199 55 49 -200 -196 -179 95 7 -87 -49 -302
4170 -302 114 67 208 273 90 196 84 209 232 9 33 73 16 -56 -236 115 -59 308 100 -474 95 423
4192 423 67 -140 297 276 258 -64 106 261 120 369 255 59 160 524 76 179 420 93 342 256 76
4213 76 122 235 127 128 176 -150 14 71 376 117 371 -33 254 -191 -159 -216 164 -25 -192 -25 -72 -254 -269
4236 -269 -172 -190 -19 -384 -537 -5 -24 9 101 -55 -116 -166 176 -308 -172 162 14 94 -85 -74 -179 233 -165
4259 -165 -2 -59 -305 -84 -256 -63 174 -65 53 -243 28 -75 -204 -211 -193 -219 -246 -203 -64 158 -57 -388
4281 -388 101 149 -403 21 -144 -318 88 115 49 -33 -164 -234 -200 -278 -80 173 -102 87 -18 -338 304 -141
4303 -141 -113 75 -192 247 384 -60 55 -18 -57 -62 138 -166 122 196 129 50 374 87 138 -34 208 105 66
4326 66 176 320 12 311 94 43 93 -74 84 43 140 -60 334 304 18 152 256 127 116 142 373 133 -92
4349 -92 58 18 82 101 144 -60 55 -59 -19 83 -43 190 257 -83 -277 -165 -26 -64 -115 -56 -140 222 -104 205
4373 205 -128 188 160 -46 -84 -324 -66 -196 -226 -232 -115 -159 -8 -368 -66 24 -282 -316 -256 -370 -514 -273 -121
4396 -121 61 -12 -204 -182 -54 -131 -244 -186 217 -229 -25 -304 -109 -198 -117 -164 86 -130 -18 -192 6 -43 -253
4419 -253 43 -190 -136 -100 -48 149 -116 -75 -94 -92 -51 -28 46 33 125 -169 205 -114 242 -115 73 53 172 65
4443 65 -12 -36 53 77 -193 199 29 -213 127 177 -77 -83 -218 196 -124 140 116 192 125 322 161 274 73 -169
4467 -169 99 353 223 75 317 213 0 238 355 315 249 205 338 275 67 23 139 -204 156 102 -106 177
4489 177 108 -79 25 -188 87 -103 -124 -123 -115 169 -29 56 -176 -35 42 -53 16 -259 -188 -45 -207 -192 -243 -68
4513 -68 -76 -57 -145 187 57 -377 -267 -532 -171 -201 -259 74 -239 -271 146 -117 -17 -225 125 -184 -268 281 -335
4536 -335 -333 -97 3 -53 -231 40 -85 -35 24 -179 124 -20 -134 -66 -55 -341 89 -390 -4 -19 -240 -226 -22
4559 -22 168 -170 -33 -78 297 233 -47 272 171 -61 73 -295 129 221 215 370 97 236 -44 -181 -124 61
4581 61 150 -80 199 414 5 124 191 172 -10 -68 321 138 335 150 237 -99 194 283 192 294 74 334 -106
4604 -106 255 99 199 262 63 33 -132 -254 52 198 -30 -150 100 67 90 329 -159 -96 -369 -169 -256 -55
4626 -55 89 142 -195 -265 33 -166 -186 -208 -375 152 52 171 -156 -376 -121 4 -49 -318 -205 -424 -307 -376
4648 -376 -145 -98 -238 -163 37 -114 105 56 -187 -103 -62 154 117 101 -45 186 -76 -46 -189 -193 66 -257 63
4671 63 -30 -417 230 62 -77 -55 249 233 -131 -17 137 82 -163 -259 -11 117 82 14 -137 55 21 -74 82
4694 82 -21 -136 50 116 -72 135 239 198 67 -59 189 -40 100 136 -125 15 -285 -50 50 74 183 22
4716 22 227 112 -120 386 83 -45 -88 149 65 83 -11 116 108 217 255 37 270 34 -206 83 -72 240 44
4739 44 -161 160 -6 224 -50 -60 -132 126 185 -138 2 -58 94 -111 -112 201 -46 -44 20 116 -204 129 -30 -245
4763 -245 -108 -220 174 -6 -290 -385 -34 -108 -196 -155 29 -10 -275 -122 -95 -98 221 27 -68 -252 -75 -94 -230
4786 -230 -77 -233 -94 -167 -97 -102 21 -320 -126 54 -219 -142 102 -96 -186 -282 -307 -184 -109 263 89 45 -8 -166
4810 -166 -63 -147 195 44 58 27 142 -39 -239 185 -82 18 109 -150 81 -54 147 35 -8 132 -154 191
4832 191 -191 -161 -248 143 270 214 119 41 241 467 215 173 176 19 189 208 -103 341 511 -31 102 234 139
4855 139 -81 293 4 244 136 300 28 188 198 145 15 34 96 44 162 513 252 99 -4 -129 -170 24
4877 24 117 -101 -188 -52 -370 26 34 43 -20 32 -394 -294 -126 -323 -280 -244 -9 -342 -38 -415 -94 -32 158 144
4901 144 -245 -49 -169 -75 -304 -399 -184 -6 -50 -279 -133 -326 -545 10 -3 78 -159 -248 37 157 -142 79
4923 79 -112 -166 -87 43 -128 -247 -89 -133 -67 -83 -32 -55 -117 -417 -146 -6 49 -295 -179 103 -60 -151 82 384
4947 384 -94 73 189 -1 137 -169 75 98 91 84 -27 18 -13 177 60 145 45 134 256 230 55 406 -5
4970 -5 122 230 165 31 122 86 202 -31 82 113 184 -20 128 166 143 414 213 271 -4 245 -5 -214 -100
4993 -100 87 322 185 -50 173 -99 250 312 7 -79 91 -96 -30 226 213 -7 366 26 168 201 193 117 -68
5016 -68 121 -4 -69 137 -45 -76 -58 164 78 -138 -94 -15 -138 -249 -58 -167 32 -56 -264 -120 135 -342 -94
5039 -94 41 -78 -36 200 -48 -264 165 -393 -185 183 56 -307 -238 -196 -99 -192 -134 34 -190 -103 -140 -169 34
5062 34 -130 26 -117 -322 -171 195 -162 31 -2 141 223 -284 -182 243 144 26 341 138 38 68 -96 175
5084 175 6 -168 116 224 101 260 208 160 -24 -323 -70 206 161 -119 188 -51 217 76 173 423 -42
5105 -42 132 188 84 76 -223 91 85 98 34 -136 -9 149 401 -202 181 -101 -97 49 109 93 9 -59 333 92 109
5130 109 139 268 -285 63 -62 362 -385 201 210 87 -67 -33 -141 -140 -3 -62 138 189 -52 23 9 -85 -15 84
5154 84 223 -392 -13 -520 -310 -335 -185 -149 -213 -465 -6 -200 -126 85 193 -120 -159 -337 -180 -123 239 -116
5176 -116 -174 160 -163 107 -167 -161 63 -54 191 169 155 10 -204 99 -363 68 120 164 -46 -339 -122 97
5198 97 -87 -32 6 342 -297 -18 39 -18 88 47 172 -65 -179 -113 -85 261 -49 -27 108 -35 360 7 309
5221 309 127 65 6 55 56 199 110 8 158 178 45 94 63 -102 -248 16 95 65 100 -255 190 -99 318 26
5245 26 203 324 104 40 345 -119 -34 358 9 317 161 24 98 172 26 -131 138 63 257 -331 -121 -21
5267 -21 65 271 5 -56 -424 -69 59 -140 62 121 358 4 -193 -174 -82 -441 -186 75 -270 -14 67 -228
5289 -228 176 -179 -48 365 -25 -216 93 -128 148 -182 -345 -349 79 202 -139 -360 -214 58 -79 -279 41
5310 41 -105 -234 -32 -263 29 232 -178 107 163 -155 -183 100 9 45 -12 -36 -200 60 387 -106 255 -110
5332 -110 118 153 -31 -179 -144 -113 143 240 -15 -214 95 42 -28 91 37 42 87 -6 34 -35 174 101 150 -64 243
5357 243 -183 102 133 -241 68 383 29 51 91 176 135 101 87 218 388 -49 71 10 341 524 -179 -34 102
5380 102 -35 209 141 -12 332 160 319 -89 -250 -27 -13 31 73 118 -30 119 69 -60 -317 -209 -159 207
5402 207 -107 -48 36 7 28 -259 81 43 -138 -121 10 95 -204 71 -256 22 76 -57 -50 181 -223 -87 131
5425 131 -239 100 -169 74 -222 28 287 37 -177 81 70 -117 -309 -127 85 116 72 -55 -201 -371 -197
5446 -197 -81 -145 0 -35 18 -157 -157 -82 -263 -56 -129 -104 142 -166 -126 -139 15 106 -180 43 -21 -23 -164 270 -52
5471 -52 4 -215 126 124 214 268 3 34 16 192 157 8 -112 38 -24 173 -78 110 50 164 312 240 254 181 -57
5496 -57 -275 206 0 50 -132 -132 -96 -125 100 -104 25 -26 236 -31 -311 -269 274 -26 296 177 136 17 -128
5519 -128 28 -125 54 -202 145 81 194 -3 182 162 -295 17 -77 -271 78 20 115 -9 -139 157 12 -37
5541 -37 78 -83 -234 -173 139 -186 -23 -95 -126 247 26 -268 36 -4 -36 -122 -174 9 -91 -18 -135 -213 77
5564 77 -384 -265 -215 -209 23 -239 101 -179 3 -37 222 -126 108 -138 72 -125 -32 -49 -38 -151 -133 -223 2
5587 2 6 93 171 -190 10 57 -133 -117 -35 82 -99 441 123 -143 81 -98 38 101 133 29 -78 -21 411 12
5611 12 56 45 2 -142 127 148 6 53 -23 195 0 257 173 223 243 432 -28 276 -107 81 173 40 92 -24
5635 -24 -9 -34 377 95 88 266 7 137 -31 -173 32 73 -31 -49 285 -75 279 -261 179 -147 144 -53
5657 -53 368 -217 -16 465 -581 -86 -185 -187 71 -171 91 -225 99 39 7 16 -449 7 33 37 143 -249 124
5680 124 -147 -91 42 -228 128 -140 60 -72 169 -170 -200 127 23 -212 -354 140 0 -131 -162 -17 -177
5701 -177 143 -14 42 -9 260 216 -131 -65 -160 -140 237 -76 57 -186 -5 -56 -160 72 272 -163 104 76 -112
5724 -112 -141 286 -30 -27 -16 131 121 118 167 414 -91 125 -14 -119 -46 -85 49 58 46 -82 144 -282 386 230
5748 230 12 0 185 -54 204 212 -63 313 -17 -205 -25 166 385 253 -16 240 -208 -225 -185 54 27 109
5770 109 231 -146 253 57 6 -88 236 68 -17 -147 -68 -236 -380 -230 -93 189 -116 20 44 24 -166 85
5792 85 -35 -204 -69 93 -133 198 156 -191 231 -45 184 -392 -180 188 -65 -93 -178 25 -17 -56 192 126
5814 126 -213 -93 99 37 -61 -66 30 -162 -59 -116 13 -54 102 -68 -81 -6 51 189 -207 -62 -153 -357 -243 -134
5838 -134 -246 66 208 -23 -238 -246 160 113 120 85 -202 -133 -31 -30 130 146 -58 -116 -55 -98 10 -5 -24 390 87
5863 87 -46 -127 242 29 141 315 203 175 335 127 -42 102 -26 -115 212 -240 91 234 122 303 179
5884 179 75 61 12 16 -65 -2 312 262 24 163 224 473 5 -165 -99 -49 172 -27 -55 49 252 -68 -298 33
5908 33 -121 -244 157 13 129 -56 -338 29 -33 -272 -189 -162 122 -226 3 -33 -277 -271 30 -11 -6 70 -8 -63
5932 -63 8 -322 -260 -171 -106 -16 -208 -153 22 135 -149 17 -172 20 -376 -68 12 149 247 77 85 -17 -73 -73 -359
5957 -359 -34 62 108 67 24 -265 -64 -90 -106 180 -94 -135 -288 -167 -45 68 -85 108 83 192 -426 -84 40
5980 40 -79 85 -207 -72 192 -42 61 117 -230 -65 -2 -40 -69 71 329 -135 117 251 194 -19 190 65
6002 65 134 154 231 335 65 -21 215 -100 -205 155 79 5 -31 153 -224 -124 335 -134 -9 96 251 83 -155
6025 -155 -252 135 185 84 120 -242 -271 -256 28 2 52 -49 178 -311 -23 38 -154 116 120 -296 -89 12 106 129
6049 129 56 -98 -17 -52 -152 263 -121 -4 -75 173 38 -217 -4 228 -125 -61 -139 30 92 -208 193 33
6071 33 79 -120 -46 133 -40 -167 -160 -191 -138 -54 -313 -277 -69 49 -204 -532 -160 -328 -319 -102 -113 -82 -239 13
6095 13 317 -65 38 -129 21 -54 62 5 -94 91 116 224 10 -46 -71 5 9 93 121 49 112 -28 -71 103 96 38
6121 38 -162 -83 236 194 -8 131 -83 -61 356 -125 319 139 69 7 -58 404 196 234 410 119 226 18 -87
6144 -87 -270 106 256 205 -241 225 267 -145 78 -71 47 -125 162 -39 254 -8 142 49 169 106 -68 123
6166 123 136 145 134 51 -125 30 7 -156 -57 -145 -223 103 -31 54 -234 -121 222 216 114 18 45 -269 12 -171 -126
6191 -126 28 -382 -105 -146 -154 -275 -300 -126 148 -212 -148 -19 -227 -185 -132 -60 -185 -172 17 -141 8 51 -224
6214 -224 171 -5 160 -125 211 -144 142 254 45 -173 3 156 -429 -91 -77 168 234 -73 -10 -28 52 -342
6236 -342 317 -34 79 -98 79 183 -184 161 -215 -2 193 -5 -11 -49 125 319 70 -122 -239 52 -86
6257 -86 -91 400 28 269 -160 76 -42 39 -133 -61 -2 70 121 227 -126 -75 54 -110 -29 21 -169 -116 192 -203
6281 -203 43 -39 61 -48 167 196 -30 10 -189 108 223 285 -109 328 -129 -276 -181 81 136 18 -157 -101
6303 -101 -25 234 32 -38 -271 -86 89 60 98 -278 44 -444 -191 190 3 -151 -103 -60 37 -151 42 130 -115
6326 -115 -151 92 31 130 113 -4 113 156 -258 -131 4 -9 80 -46 90 46 99 -226 183 -96 8 197 -323
6349 -323 118 -47 140 55 -89 -183 14 -311 -99 -231 -182 -6 -176 49 -67 -109 53 -66 -53 -72 117 235
6371 235 -53 356 -165 25 194 -13 -226 129 216 87 45 -195 93 82 -192 -160 -47 -54 -89 -369 -239 214
6393 214 167 29 186 166 375 42 0 29 128 -77 191 266 134 213 197 -224 178 106 63 -42 -48 75 -120 -48
6417 -48 106 179 233 -160 193 -1 21 -231 225 -262 -153 32 32 25 -272 -257 -32 -267 -57 98 7 9 -82 -190
6441 -190 -56 86 -183 142 37 -227 94 52 40 -74 142 -127 186 -317 78 51 -113 31 -46 -330 -134
6462 -134 -133 179 165 175 -58 -176 -139 -109 276 -74 127 -101 9 -307 -52 -270 105 -35 -86 167 -228 -69
6484 -69 -163 81 -328 317 62 -6 -169 -115 8 24 -133 123 165 -175 -174 -89 -150 -200 -60 70 -38 -296 448 -27
6508 -27 -37 -21 254 212 42 57 -121 120 -18 -50 -174 130 207 22 -66 -6 30 45 93 176 -161 -146 112 -192 -95
6533 -95 120 -177 281 15 35 12 -280 -56 226 182 -148 15 -301 -64 -41 120 185 234 -295 6 112 -111
6555 -111 200 83 15 -216 59 58 292 -60 -145 129 25 -176 116 561 29 17 -146 288 -16 -239 -114 -314
6577 -314 -336 -49 -20 316 66 -31 -204 48 423 -165 195 81 -243 -147 -190 -144 -120 112 -19 88 -144 -291
6599 -291 -60 -238 -73 9 -88 3 -2 234 298 -23 -256 1 186 156 -87 -74 -113 65 -48 -78 -246 253 -285
6622 -285 -6 91 193 285 -22 23 146 -32 124 257 41 -31 -320 21 -300 -275 168 83 -133 183 103 267
6644 267 34 110 -145 263 298 374 32 -112 -315 43 269 -29 262 33 59 103 208 -154 63 -193 -86 -97
6666 -97 -9 -174 -16 113 115 -8 195 173 -89 -250 -58 140 -22 -202 0 103 -136 330 108 -94 -22 -245
6688 -245 122 235 146 -19 -47 -230 19 234 -170 10 -118 -134 78 -175 -29 -13 -249 -292 40 -287 -138 -129
6710 -129 205 144 119 108 -228 89 -290 42 -143 -180 -136 374 -183 -125 -88 149 -109 204 22 -103 -179 101 -336
6733 -336 271 -132 -293 -135 131 -39 -43 -29 -7 103 253 70 88 382 -45 79 -304 37 -130 -84 41 118
6755 118 116 124 154 107 35 72 216 46 -233 49 33 227 -152 3 -6 -135 162 74 39 -242 -124 -36 303 -248 -135
6780 -135 -88 54 276 57 16 268 147 145 118 133 -83 212 -37 -12 138 158 -218 -31 211 -69 0 167 106
6803 106 -411 -28 273 358 116 -194 -63 365 328 -165 210 -141 137 -7 143 136 334 225 30 -444 -6
6824 -6 -135 56 -224 -10 -172 228 -41 -326 -134 -204 -183 -160 86 -24 -289 54 26 137 -97 -27 -109 -213 -14
6847 -14 -273 -118 -274 -108 69 108 -103 -96 47 25 114 -136 -63 -356 -40 71 -11 144 -57 106 110 93 -171 224
6871 224 -112 186 -149 23 77 -140 -76 147 58 -328 -86 -11 -189 -113 -65 -357 365 223 54 254 -228 -77
6893 -77 100 137 -53 180 -17 -75 293 -295 74 -84 -89 67 88 -52 -53 163 205 169 -212 180 -59 -37 -33 -54 -37
6918 -37 -9 153 -169 213 35 189 189 372 -146 -8 199 115 143 -231 -199 -74 47 72 -76 -5 -34 17 148 -159
6942 -159 24 30 -62 25 -321 178 332 -29 30 264 -103 -133 -108 -33 54 131 95 83 -316 -332 -160 112 65 85 225
6967 225 -133 245 48 61 -8 -102 -94 -93 -53 154 -3 -55 -68 304 -246 -279 43 -68 -48 -10 -153 83 18 -242 -98
6992 -98 -194 -162 -244 -433 -56 59 -250 -54 138 216 0 29 -24 -32 -130 20 102 -73 -60 150 -78 -235 -1 8 -50
7017 -50 0 308 -98 -18 -24 44 -1 151 -111 -362 -93 48 -71 82 186 125 36 126 14 -244 -44 -63 208 77
7041 77 133 -38 273 98 153 9 -93 273 -31 74 102 136 -108 117 -203 141 -234 -43 -7 -90 212 -239
7063 -239 114 216 -153 340 14 252 305 -177 57 -122 124 127 -35 -97 146 26 -252 -330 54 157 161 -96
7085 -96 31 53 -95 -113 121 2 50 -88 243 -113 -143 -83 305 6 -27 -7 -27 -214 -228 180 -121 166 -63
7108 -63 -19 155 115 -280 -129 104 -23 203 -118 44 -94 -207 -116 177 105 -74 -212 -12 209 165 325 -56
7130 -56 -97 -7 -134 105 100 71 -282 -123 -230 120 -291 -148 159 -108 182 69 -133 -163 -60 -139 171 44 201
7153 201 124 -200 -35 169 407 47 -60 -64 199 -77 -119 10 37 27 -204 -169 4 -145 145 122 60 245 373
7176 373 115 -182 188 107 -101 239 -40 180 -206 -168 -131 -17 -112 258 -27 50 70 215 157 -178 -69 -262
7198 -262 122 231 109 -165 -72 -75 181 -117 189 56 174 -118 -88 -64 -10 -89 -50 -201 -14 -40 149 84 -16
7221 -16 -5 -183 -38 -97 -229 -9 -37 -85 -296 -113 23 -205 -115 253 -64 -17 -100 -24 35 -320 -158 -282 49
7244 49 -179 -121 156 266 -147 21 -28 79 -96 137 -51 -163 334 2 316 197 183 239 -341 -50 -70 -15
7266 -15 -93 -170 -159 -135 80 46 -91 3 -146 -81 -42 115 162 -135 -5 93 -65 -57 193 -265 27 217 118 192 183 150
7292 150 75 -17 150 300 -83 -84 90 188 40 -37 -4 5 64 18 38 -239 109 263 -111 -249 41 89 47 95 33
7317 33 -296 -158 208 -449 -57 150 53 -34 31 85 -39 68 -241 249 -196 169 -14 106 333 -64 76 -205
7339 -205 26 -181 25 80 -396 78 87 -144 15 -79 -114 -205 -146 37 -430 -132 -155 -223 158 1 359 141 -38
7362 -38 107 -89 -165 -240 -17 -75 -12 129 121 -242 -237 -126 134 2 237 -202 -226 43 257 -13 85 -150 -17 134
7386 134 -232 239 68 28 105 99 -95 -283 297 -129 -27 -102 68 -11 100 250 -45 -44 -122 89 42 -38 -48 -195
7410 -195 272 -149 -30 -174 217 9 127 -30 140 133 151 -175 -99 154 317 -38 161 54 30 -220 301 172
7432 172 -203 -34 -233 -149 222 367 -11 -163 -152 -123 133 15 -25 -116 32 170 -115 -91 -21 -61 -237 105 -73
7455 -73 116 -266 -153 -325 111 130 169 119 -44 -192 -159 273 -252 -35 -148 -203 75 -170 -70 66 -8 262
7477 262 121 -81 -148 112 -3 -180 -61 178 -50 115 -190 -56 69 106 -31 1 4 -28 -114 -116 75 -364 -278
7500 -278 -50 173 -295 -40 -3 287 26 -11 136 -13 193 106 -9 179 -210 10 -93 37 52 -184 251
7521 251 -216 -197 138 -109 59 -13 -157 -34 -9 -56 -28 155 -228 48 248 -320 -90 51 -82 -119 -318 154
7543 154 159 185 216 233 -160 -130 -140 360 235 55 77 -201 126 -57 128 -190 158 292 -10 80 242 76 -172
7566 -172 -49 316 -42 248 140 45 44 137 -99 62 89 33 38 100 16 -50 22 10 -175 -238 -216 -448 11 -59 -30 12
7592 12 -28 345 -261 -229 147 -122 -244 96 -36 -157 103 -212 -18 -247 55 -120 55 -173 -157 -161 -34 125
7614 125 -10 -261 57 232 2 149 143 63 86 27 518 -9 -396 -151 4 -22 -126 -124 89 -141 -34 -45 102
7637 102 75 -180 -13 36 131 1 6 119 -77 46 -81 217 14 -69 189 88 165 146 -128 55 31 -136 -108
7660 -108 263 -65 -32 -108 -56 -84 271 244 -114 270 -201 -420 102 -7 -62 -266 -27 -216 124 -93 260 -240
7682 -240 -119 -42 61 100 40 7 -28 273 -74 66 116 97 -18 108 98 333 368 -7 -96 -100 -144 -259 215 -31
7706 -31 136 57 -84 407 -35 -37 -150 -26 16 -74 153 -226 367 -37 -73 -214 -319 -77 -162 14 -7 -89 -312
7729 -312 -316 84 43 -275 -251 -97 -158 10 -49 -349 67 -188 -467 -89 2 23 -195 -37 -91 47 -77 -88 -222
7752 -222 -159 -8 -102 -289 -144 -15 126 79 -113 20 1 114 -50 120 172 86 -192 -8 -10 -54 -84 70 233
7775 233 -72 135 -125 -294 -10 142 -4 139 70 7 57 108 235 62 66 130 -4 251 -258 155 150 149 69 -95
7799 -95 150 -220 165 37 -173 70 -84 6 -28 -62 -59 73 -129 200 5 70 176 65 -97 128 -60 -124 53
7822 53 -129 25 -104 -131 -81 58 -284 90 -475 -160 11 -24 -88 158 240 39 -195 -161 -60 -119 20 -129 129
7845 129 -117 -88 142 222 -220 20 112 -122 54 87 -52 -50 41 345 -204 -63 -84 -62 22 -70 31 -115 -248 -185
7869 -185 98 -48 -171 -97 -239 -18 43 -226 -129 -59 64 35 -200 -108 51 46 161 -231 147 -12 -112 -267 -247
7892 -247 -11 248 59 -144 -132 -43 56 15 87 49 89 -114 98 2 85 -85 54 177 289 133 13 -35 -133 83
7916 83 29 -28 74 -141 67 -85 13 -139 -179 80 -130 -251 -106 -50 -25 1 153 -147 -59 -190 142 131 154 85
7940 85 18 -183 -42 14 -87 -229 -87 243 -18 128 220 137 0 -148 116 -20 -229 -13 187 -390 -314 123
7962 123 375 -31 52 142 160 -159 30 84 -19 2 -90 -244 75 -60 1 17 -234 -139 -149 -30 21 -17 30 -127
7986 -127 76 -288 69 -97 38 -215 52 357 76 -263 -295 116 13 -51 -14 277 201 114 14 199 106 158
8008 158 71 303 181 -97 -141 -352 174 380 -82 -53 20 158 49 8 77 -53 -61 -10 46 -109 -57 -60 135 166 199
8033 199 -87 408 118 55 303 98 395 -47 -70 16 25 184 -42 61 57 145 395 234 -102 -172 -91 -20 -64 292
8057 292 -4 138 -143 -278 207 85 11 107 83 -60 -298 -19 -123 20 -62 -97 254 -52 -9 132 88 88 -62
8080 -62 336 14 -262 122 120 -276 -129 370 -33 -122 -53 -155 -143 61 -96 60 -347 -29 -118 -230 183 -49
8102 -49 -75 -162 -43 170 -15 -148 28 351 132 49 203 -184 89 99 -197 -341 -145 63 -124 44 -150 118
8124 118 408 -445 58 91 174 -76 -8 28 -67 -15 -125 -55 -44 165 -251 -6 -317 -237 -26 323 44 282 210
8147 210 29 -46 79 4 -226 250 116 8 26 -226 -130 -93 -97 -233 210 -94 44 204 -196 49 -334 125
8169 125 112 -66 14 77 -121 4 -140 -9 104 -25 -173 168 -34 -32 -97 -398 9 115 26 -210 -107 172
8191A72
##END NTUPLES=NMR FID
##END=
