##TITLE=1H_LR-701-C1
 CDCl3, 8 sc, 
 20.11.2019
##JCAMPDX= 6.0         $$ Bruker NMR JCAMP-DX V2.0
##DATA TYPE= NMR FID
##DATA CLASS= NTUPLES
##ORIGIN= UXNMR, Bruker Analytische Messtechnik GmbH
##OWNER= root
$$ XWIN-NMR		Version 3.5
$$ Wed Nov 20 14:37:27 2019 Russian Standard Time (UT+4h)  she@DPX200
##.OBSERVE FREQUENCY= 200.1315
##.OBSERVE NUCLEUS= ^1H
##.DELAY= (6, 6)
##.ACQUISITION MODE= SIMULTANEOUS
##.ACQUISITION SCHEME= undefined
##.AVERAGES= 8
##.DIGITISER RES= 18
##SPECTROMETER/DATA SYSTEM= spect
##.PULSE SEQUENCE= zg30
##.SOLVENT NAME= CDCl3
##.SHIFT REFERENCE= (INTERNAL, CDCl3, 0, 15.7039)
##AUDIT TRAIL= $$ (NUMBER, WHEN, WHO, WHERE, WHAT)
$$ ##TITLE= Audit trail, XWIN-NMR		Version 3.5
$$ ##JCAMPDX= 5.01
$$ ##ORIGIN= Bruker BioSpin GmbH
$$ ##OWNER= she
$$ F:/spectra/data/she/nmr/H-F/1/audita.txt
$$ ##AUDIT TRAIL=  $$ (NUMBER, WHEN, WHO, WHERE, WHAT)
(   1,<2019-11-20 14:36:08.32 +0400>,<she>,<DPX200>,
      <created by zg, POWCHK disabled, PULCHK disabled
       configuration hash MD5:
       00 E9 B6 7A A2 85 ED C7 34 08 36 98 17 FE 4E 26
       data hash MD5: 16K
       A0 46 C4 C2 6C AB 3F D2 2A A0 1C EE 29 C7 53 59>)
$$ ##END=
$$ 
$$ hash MD5
$$ 8F 3F 92 B5 26 34 3D 59 70 39 9E 36 5D DA EC B3
##$RELAX= 
##$RELAX= 
##$RELAX= 
##$RELAX= 
##$RELAX= 
##$RELAX= 
$$ Bruker specific parameters
$$ --------------------------
##$DU= <F:/spectra>
##$EXPNO= 1
##$NAME= <H-F>
##$PROCNO= 1
##$TYPE= <nmr>
##$USER= <she>
##$AMP= (0..31)
100 100 100 100 100 100 100 100 100 100 100 100 100 100 100 100 100 100 
100 100 100 100 100 100 100 100 100 100 100 100 100 100 
##$AQSEQ= 0
##$AQ_mod= 1
##$AUNM= <au_zg>
##$AUTOPOS= <>
##$BF1= 200.13
##$BF2= 200.13
##$BF3= 200.13
##$BF4= 200.13
##$BF5= 200.13
##$BF6= 200.13
##$BF7= 200.13
##$BF8= 200.13
##$BYTORDA= 1
##$CFDGTYP= 0
##$CFRGTYP= 5
##$CHEMSTR= <none>
##$CNST= (0..31)
1 1 145 1 1 1 1 1 1 1 1 1 1 1 1 1 1 1 1 1 1 1 1 1 1 1 1 1 1 1 1 1 
##$CPDPRG= <>
##$CPDPRG1= <>
##$CPDPRG2= <>
##$CPDPRG3= <>
##$CPDPRG4= <mlev>
##$CPDPRG5= <mlev>
##$CPDPRG6= <mlev>
##$CPDPRG7= <mlev>
##$CPDPRG8= <mlev>
##$CPDPRGB= <>
##$CPDPRGT= <>
##$D= (0..31)
0 1.2 0 0 0 0 0 0 0 0.06 0 0.03 0 0 0 0 0.0002 0 0 0 0 0 0 0 0 0 0 0 0 
0 0 0 
##$DATE= 1574246167
##$DBL= (0..7)
120 120 120 120 120 120 120 120 
##$DBP= (0..7)
150 150 150 150 150 150 150 150 
##$DBP07= 0
##$DBPNAM0= <>
##$DBPNAM1= <>
##$DBPNAM2= <>
##$DBPNAM3= <>
##$DBPNAM4= <>
##$DBPNAM5= <>
##$DBPNAM6= <>
##$DBPNAM7= <>
##$DBPOAL= (0..7)
0.5 0.5 0.5 0.5 0.5 0.5 0.5 0.5 
##$DBPOFFS= (0..7)
0 0 0 0 0 0 0 0 
##$DE= 6
##$DECBNUC= <off>
##$DECIM= 24
##$DECNUC= <off>
##$DECSTAT= 4
##$DIGMOD= 1
##$DIGTYP= 9
##$DL= (0..7)
0 120 120 120 120 120 120 120 
##$DP= (0..7)
150 150 150 150 150 150 150 150 
##$DP07= 0
##$DPNAME0= <>
##$DPNAME1= <>
##$DPNAME2= <>
##$DPNAME3= <>
##$DPNAME4= <>
##$DPNAME5= <>
##$DPNAME6= <>
##$DPNAME7= <>
##$DPOAL= (0..7)
0.5 0.5 0.5 0.5 0.5 0.5 0.5 0.5 
##$DPOFFS= (0..7)
0 0 0 0 0 0 0 0 
##$DQDMODE= 0
##$DR= 18
##$DS= 0
##$DSLIST= <SSSSSSSSSSSSSSS>
$$ [...]
##$SUBNAM2= <"">
##$SUBNAM3= <"">
##$SUBNAM4= <"">
##$SUBNAM5= <"">
##$SUBNAM6= <"">
##$SUBNAM7= <"">
##$SUBNAM8= <"">
##$SUBNAM9= <"">
##$SW= 24.9337058887773
##$SWIBOX= (0..15)
0 0 2 0 0 0 0 0 0 0 0 0 0 0 0 0 
##$SW_h= 4990.01996007984
##$TD= 16384
##$TD0= 1
##$TE= 0
##$TE2= 300
##$TE3= 300
##$TEG= 300
##$TL= (0..7)
0 120 120 120 120 120 120 120 
##$TP= (0..7)
150 150 150 150 150 150 150 150 
##$TP07= 0
##$TPNAME0= <>
##$TPNAME1= <>
##$TPNAME2= <>
##$TPNAME3= <>
##$TPNAME4= <>
##$TPNAME5= <>
##$TPNAME6= <>
##$TPNAME7= <>
##$TPOAL= (0..7)
0.5 0.5 0.5 0.5 0.5 0.5 0.5 0.5 
##$TPOFFS= (0..7)
0 0 0 0 0 0 0 0 
##$TUNHIN= 0
##$TUNHOUT= 0
##$TUNXOUT= 0
##$USERA1= <user>
##$USERA2= <user>
##$USERA3= <user>
##$USERA4= <user>
##$USERA5= <user>
##$V9= 5
##$VALIST= <valist>
##$VCLIST= <CCCCCCCCCCCCCCC>
##$VD= 0
##$VDLIST= <DDDDDDDDDDDDDDD>
##$VPLIST= <PPPPPPPPPPPPPPP>
##$VTLIST= <TTTTTTTTTTTTTTT>
##$WBST= 1024
##$WBSW= 4
##$XGAIN= (0..3)
0 0 0 0 
##$XL= 0
##$YL= 0
##$YMAX_a= 149554
##$YMIN_a= -55592
##$ZGOPTNS= <>
##$ZL1= 120
##$ZL2= 120
##$ZL3= 120
##$ZL4= 120
##$ABSF1= 10
##$ABSF2= 0
##$ABSG= 5
##$ABSL= 3
##$ALPHA= 0
##$AQORDER= 0
##$ASSFAC= 0
##$ASSFACI= 0
##$ASSFACX= 0
##$ASSWID= 0
##$AUNMP= <proc_1d>
##$AZFE= 0.1
##$AZFW= 0.1
##$BCFW= 1
##$BC_mod= 2
##$BYTORDP= 1
##$COROFFS= 0
##$CY= 11.3945322036743
##$DATMOD= 1
##$DC= 2
##$DFILT= <>
##$DTYPP= 0
##$F1P= 16.9975609425685
##$F2P= -3.02152046262296
##$FCOR= 0.5
##$FTSIZE= 0
##$FT_mod= 4
##$GAMMA= 1
##$GB= 0.15
##$INTBC= 1
##$INTSCL= 1
##$ISEN= 128
##$LB= 0.24
##$LEV0= 0
##$LPBIN= 0
##$MAXI= 10000
##$MC2= 0
##$MEAN= 0
##$ME_mod= 0
##$MI= 1.114404
##$NCOEF= 0
##$NC_proc= 0
##$NLEV= 6
##$NOISF1= 3.799351
##$NOISF2= 2.8
##$NSP= 1
##$NTH_PI= 0
##$NZP= 0
##$OFFSET= 15.70392
##$PC= 1
##$PHC0= -9787.368
##$PHC1= 14.60086
##$PH_mod= 1
##$PKNL= yes
##$PPARMOD= 0
##$PSCAL= 0
##$PSIGN= 0
##$REVERSE= no
##$SF= 200.130013532006
##$SI= 16384
##$SIGF1= 3
##$SIGF2= 2
##$SINO= 400
##$SIOLD= 16384
##$SREGLST= <1H.CDCl3>
##$SSB= 0
##$STSI= 0
##$STSR= 0
##$SW_p= 3612.71676300578
##$SYMM= 0
##$S_DEV= 0
##$TDeff= 0
##$TDoff= 0
##$TI= <>
##$TILT= no
##$TM1= 0
##$TM2= 0
##$TOPLEV= 0
##$USERP1= <user>
##$USERP2= <user>
##$USERP3= <user>
##$USERP4= <user>
##$USERP5= <user>
##$WDW= 1
##$XDIM= 8192
##$YMAX_p= 0
##$YMIN_p= 0
$$ End of Bruker specific parameters
$$ ---------------------------------
##NTUPLES= NMR FID
##VAR_NAME=  TIME,          FID/REAL,        FID/IMAG
##SYMBOL=    X,             R,               I
##VAR_TYPE=  INDEPENDENT,   DEPENDENT,       DEPENDENT
##VAR_FORM=  AFFN,          ASDF,            ASDF
##VAR_DIM=   8192,          8192,            8192
##UNITS=     SECONDS,       ARBITRARY UNITS, ARBITRARY UNITS
##FACTOR=    0.0002004,     1,               1
##FIRST=     0,             0,               0
##LAST=      1.6414764,     0,               0
##MIN=       0,             -55592,          0
##MAX=       1.6414764,     149554,          0
$$ Real data points
##PAGE= N=1
##DATA TABLE= (X++(R..R)), XYDATA
$$ [...]
2080A71l29K62j40j33L79K61n10j23k5l05j85P0k90J53J09j19J69k44l0l45J38
2101a066J38o43K5L21j53K98j59l8Oj86j73k87K21O6L0K35J07k57R8Q9J5k06k19
2124a738M85k22L53J17J45J27l80j08K80K18m66L53K74K24o8P9J07j02q6o6l13
2145g87L88j8K2L00K41Q7j59l63K65j41Q0K38L8j64K22J48j8j59j79N22l69O0
2167B54o0K24J91P1l84L87j06k47k23NM59k40N1J95L58m58k44K45j93P6J40j29
2189C72K03j1J91p82M26o7r0J03N1k6j46r7N00k06M3k49J4J85k60o9J78K32k44
2212B51K91k70P1Mk73R0q8P7j08J38Q5j31K02J47j65m2j73M1k40J96j38K39m5
2235A59J53l55j8j10K06o4J55k56k1J02Q5K78n63j02K27j17K54n28K79L55k20
$$ y = [171, -158, 104, -36, -169, 210, 471, -39, -162, -187, -492, -677, -607, -897, -744, -635, -754, -585, -829, -859, -1204, -1066, -928, -1571, -1546, -1225, -1378, -1080, -1239, -1277, -1271, -1457, -1630, -1917, -1696, -1630, -1600, -1365, -1258, -1515, -1417, -1328, -1313, -1519, -1738, -1253, -1475, -1122, -1005, -860, -733, -1113, -1221, -941, -723, -1189, -836, -562, -338, -406, -327, -220, -322, -408, -474, -787, -399, -417, -395, -95, 146, 233, 74, -289, -24, -165, -85, 153, 191, 27, 249, 397, 379, 220, 41, 563, 194, 254, 194, 418, 609, 680, 296, 683, 577, 330, 107, 112, 571, 331, 382, 577, 935, 477, 233, 478, 285, 361, 501, 372, 575, 564, 755, -27, 399, 332, 242, 345, 396, 370, 224, 127, 627, 421, 464, 215, 229, 414, 154, 85, 263, 495, 251, 542, 272, 343, 347, 74, 164, 76, 153, 45, 183, 268, 137, 339, 486, 321, 279, 106, 147, -93, 103, -35, 204, 159, 312, -43, -61, -171, 35, -29, 126, -130, -151, -49, 36, 314, -249, -351, -124, -241, 13, -515, -236, 119, -101]
2256a01p4L37m77K02Pq6k7L28k5K10l06L84k16k60k92M27l44k6L14L5K76l21K91
2279B56j27l71K72k6O3J92k04pL08q4n0R9j93M0l80K55j59M99j08l6J19p8J92
2302D72k79k77J34L31R4l32L82l85J08J49n32K60r1J46j10J4R7mop0l9m7J33k74
2326a26q8k47L52k7m5L9j93L12m56J33K44K74k59j79Q1N7l19L9r4l9L96l70K86
2349b29J05r2qj23O5J60j18j40J38l08N9k4J25K91j69j50K38K61k95J6j25J29
2371a94K5oP1O0K36l86M3Q8k10L13k07J31P2O8P3j93k04J97j29M30l48J20j86
2394a36Q9K33k58L23k13M70n15J89L54j51J88l75r9L64l73K66j20k3l3k00K95
2415B75k1k21J25J93j80P5J05p4K83j88o7k08L65k84n6J58l3j45m4Q8K86j85k80
$$ y = [-101, -175, 162, -315, -113, -106, -192, -219, 109, 84, 294, -12, 372, 156, -104, -396, 31, -313, -339, -25, 10, 286, -35, 256, 129, -242, 30, 4, 67, 259, 55, 48, 356, 272, 222, 321, 128, 168, -212, 43, -116, 383, 275, 239, 358, 280, 472, 193, -84, 50, 381, 475, 143, 525, 140, 248, 397, -135, 125, 34, 180, 70, 84, 181, 177, 171, 101, 62, 15, 148, -126, -214, -461, -109, -136, -181, -142, -335, -23, -479, -346, -102, 172, -87, -266, -185, -128, -447, -408, -502, -541, -145, -515, -229, -124, -216, -224, -347, -282, -122, -240, -380, -242, -550, -491, -515, -390, -99, -268, -418, -180, 81, -214, -198, -323, -194, -169, -175, -104, -44, 192, -194, -151, -63, -273, 40, -167, -36, 36, 104, 177, -16, -220, -23, -152, 278, -70, 50, -136, -47, 186, -72, 251, 38, 508, -7, 182, 536, 385, 573, 198, 99, 463, 90, 356, 236, 213, 180, -20, 275, 254, 33, 158, 351, 171, 246, 351, 277, 560, 372, 305, 97, 462, 178, 122, 280, 247, 102, 58, 146, 432, 247, -33]
2438c3r6N45k38r6j61q7L99o72Q08l96N1R9Ml8o3m10K50k26l28K88%L16j22k98
2462e04M08l64k2l44K27q2L13K13j13j40J18k22K83j41n9J27m00N07l15M20k23
2483c13o9K8j29J32M9K02k66J58j24j63K97K79j56j89Qr8L94r8j18K54j97J61
2505D2j18l5m6k54N29m64K57j39K77Kp1m8l9J84R4j85j36M70o8j82k36O51m84
2528AM63m76M01n0k04K93m4J62N1k33K08J21m3o8R9J4J15k20Q5J68o3j17P2j01
2552F34K22k55J89j45N6J98j34L09K36o94M65m37k17M8J29J22k4j01k75J99R7
2573F22J98j5l78J56k40J5j13K52M1p7k26J13r4m38J26L35k82j59J83M5k3m98
2595d57J92R8j01P5p5j16R8n9j11k08K78k62M9j51M9P6J5q7o8M6m22L61k6q0J63
$$ y = [-33, -129, 416, 178, 82, -79, -166, 233, -439, 369, -27, 24, 123, 127, 89, 26, -384, -134, -360, -688, -400, -400, -84, -206, -504, -96, -460, -482, -826, -599, -681, -368, -155, -268, -408, -290, -512, -229, -370, -429, -302, -702, -195, -510, -90, -313, -382, -354, -483, -351, -302, -100, -366, -208, -332, -495, -198, 81, -75, -264, -256, -354, 40, -58, -176, 78, -119, 42, -76, -111, -157, -411, 118, -346, -89, -228, 49, 51, -20, -68, -107, 77, 171, -14, -150, 320, 252, 70, -166, 485, 1, 464, -12, 389, 339, 135, 428, 384, 546, 597, 364, 572, 693, 650, 582, 681, 695, 810, 590, 675, 843, 780, 663, 735, 634, 856, 601, 790, 645, 701, 899, 765, 1074, 1310, 616, 1081, 644, 427, 475, 604, 726, 702, 601, 326, 525, 622, 820, 805, 427, 583, 343, 358, 245, 497, 538, 461, 235, 348, 254, -184, -58, 277, -5, -164, 19, 64, 41, -457, -265, -167, -268, -193, -268, -384, -286, -345, -456, -664, -386, -648, -599, -750, -701, -625, -610, -697, -765, -719, -1141, -780, -806, -886, -723]
2620g23k28l7n9K31J57L7J55j96j27N2l63J79J13Pl2L31P9l58K71j81j01K10j33
2643g16J69kJ28K00l74K83l8l58L72j27o2L08J20J51j29j12l06L28o6J32k64L36
2665b7Mm2K08mj57L21l29Mk07L21K86j41J9K50l57L24n25N56l24j78M20Q2q1L2
2689D55N0j5l8K8k47Nj8K80k0J48R0j24NJ40n40K66P7PK41r9k33K51p7N3j64k2
2715D99O6k52l8K96q0q2K0J61k15O0j79j94M07m63N18l11K47o5p9l45L49K6o2
2738B84m15L46L9j09J73j20m41N7m7K88j88J28k10R7JK30n0j42J03j02j9N7J8
2761b2j84J00L8M7k55J3K6j7K08M7l26K90j30j6q5J62k37k27K39lP7J28j74MJ38
2786a59K94j46k93K45l23n5L81j73j21L27k80N23m12m21K50j9J48L9M25p4j38
$$ y = [-723, -951, -988, -1047, -816, -659, -622, -467, -663, -790, -738, -1101, -922, -809, -802, -834, -503, -424, -782, -511, -692, -793, -583, -716, -547, -549, -421, -221, -595, -312, -350, -708, -336, -463, -525, -217, -97, 54, -75, -187, -493, -165, -231, -99, -363, -27, -23, -65, 143, 139, -18, 303, -26, -22, -229, 92, 378, 237, 256, 506, 149, 473, -52, 504, 180, 2, 422, 504, 423, 455, 505, 490, 452, 480, 233, 238, 220, 500, 480, 628, 718, 594, 599, 739, 199, 465, 542, 549, 790, 691, 458, 709, 632, 685, 521, 499, 565, 313, 275, 571, 491, 409, 429, 590, 375, 435, 256, 62, 469, 6, 524, 213, 460, 395, 316, -29, 320, 346, 284, -131, 215, 254, 145, 318, 198, -243, -186, -233, 55, -133, -5, -215, -118, -117, 113, 63, -79, 24, -78, -97, -40, -22, -206, -106, -68, -21, -276, -263, -237, -254, -46, 1, -325, -35, -165, -181, -266, -104, -341, -568, -329, -332, -255, -127, -301, -297, -159, 135, -11, -304, -59, -382, -437, -56, -229, -350, -23, -303, 220, -192, -613, -363, -382, -234, -195, 230, 156, 18]
2807A8j24k68K90k72j71O40p0J08q7j19j16M26j48m34P7M83k73R1J89K2k63L10
2829C09j76k33l2R3K38n7J84l17K58J62k36j69P8p2j0r5L26j73J45K02n96J08
2851f3L9k32j24M14j17O3R2m12K04l6j01J18l41l0K05j24K3P8ml76M27m59L54
2874d02j83K24N7r5M1J18L8j38j0J46k00k04j81L54K27m6N1l4r4J32K28j64j31
2897b66p4J2J65K99Nj74j22K51j10J41o5K86K2J35L2o42N46j25J55q9J39j64K12
2920E69j28J53m46O31n23K94k70P4J86l39J58j76Q9p1M21m00O2R3j73j35L0L04
2942D03o8L9nK10n02j26L15k07K79k81K30N2k33M7J84m29Q5j84M33k27K02k82
2964f5l5p6K50k02J13k74P6J84j27K95%l55j01M68l99J10M4j19N0qR2o8j09l85
$$ y = [18, -106, -374, -84, -356, -527, 113, 43, 151, 64, -55, -171, 255, 107, -327, -250, 233, -40, 51, 240, 262, -1, 309, 133, -100, -132, -39, 199, 142, 326, 9, 267, 429, 193, 24, 102, 30, 20, -75, 251, 78, 223, 425, -171, -63, -24, -256, -380, 34, -83, -20, 72, -340, -136, -172, -273, -155, -496, -526, -321, -445, -422, -344, -348, -724, -297, -756, -402, -585, -361, -304, -399, -358, -240, -202, -340, -350, -204, -404, -608, -789, -435, -208, -254, -203, -237, -331, -199, 29, -135, -266, -340, -328, -163, 136, 141, -33, -155, 96, -14, 127, 62, 348, 370, 505, 537, -105, 441, 316, 471, 382, 521, 357, 569, 441, 594, 148, 779, 256, 550, 280, 354, 540, 201, 359, 183, 272, 201, 622, 222, 284, 377, 204, 69, 99, 403, 335, 374, 369, 579, 77, -49, 266, 59, 338, 57, 287, 339, 106, 153, 337, -92, -7, -191, 242, 15, 217, -65, -100, -176, 74, -128, -15, -289, -213, -29, -156, 139, 139, -216, -317, 151, -248, -138, -94, -213, -163, -171, -79, -147, -256, -641]
2988f41J13J12m4K7n0l2M58j17k74K21k01P7m4p7J27j48L34P4k08r3k80O38k95
3011c23K6lL23j01j87nJ17J14n4k25Q1j8m8L67j20L5M2Q2k16R5R2k21K97o6K44
3036C28m2m2Q1k19MK81k65L28j38j59J24J85m3l0L78m12k81J30R4J22m69N13J1
3059D79m1j38o5l9M87m35m4M1L9J15k02J56J24k46K06j34k19J28K51j56J41k0
3081D28k03J20k95N08j93l66M21r6L3m5P9n9k43R4R9k45L44k03p0K33j21J30l82
3104c2P6M0K41l20J18L4k59M42p17M43Q8l49J21j25K11k52k18K23K36k95J01l
3126a96n48M43o5k11L83n06K85m0Q7j88L6J8l15L50q9K68m46J28N1K99k97j48
3148g01j04K15j11R1j48j39K07O47m11J26kk0J6l91J67J31j70L39K22k65M2p9
$$ y = [-641, -528, -416, -460, -433, -483, -515, -57, -174, -448, -227, -428, -351, -395, -472, -345, -493, -159, -85, -293, -386, -666, -28, -323, -297, -300, 23, -78, -265, -270, -153, -39, -93, -318, -237, -255, -303, 64, -56, -21, 21, 103, -113, -18, 74, -147, 150, 84, 328, 286, 244, 325, 106, 110, 391, 126, 454, 316, 157, 281, 466, 423, 393, 771, 359, 78, 208, 302, 424, -45, 468, 479, 438, 300, 235, 196, 683, 248, 204, 245, 284, 399, 197, 353, 477, 231, 437, 303, 84, 212, 463, 307, 448, 428, 225, 345, 50, 558, 365, -1, 420, 324, 357, 312, 391, 332, 89, 183, 282, 37, 381, 178, 108, 341, 220, 350, -32, 44, 84, 325, 5, 123, 157, -102, 340, -377, 66, 154, -195, -74, -199, 12, -240, -458, -235, 1, -294, -193, -196, -744, -301, -366, -577, -194, -700, -415, -455, -368, -556, -520, -502, -817, -467, -556, -288, -734, -606, -555, -256, -553, -701, -805, -590, -701, -610, -758, -897, -690, -43, -454, -328, -330, -350, -334, -725, -558, -427, -597, -258, -36, -301, -259, -338]
3170c38O5J57k02L37k78K63j8k39K74K20m18J11J68J78k6m36j2L01J5J40r0k4
3192A48R7j49K63l4j73M90k35j59J94l90L64j23MK06j99J3m19M22J18k35N96j93
3214F06j73jj29M79q3j80k12J50l76J07K71j0J27LJ8l79pK96k36O8K96m07J48
3237C76K24m35j09P5M18j07q3J49j54l3j99j17J66N7j2j2k05L78p7j15r9M8j66
3260c2l8K44o7j23j01L3k8Q1RL7K23m67L01j90q1J75j2j50K88k61J02Q3N9Kk12
3285a25m9k98M83j17O2j98L59j19o1o2o4jJ16q0o4j52J58k32L62J13O6p3j00j6
3309i2l2k5N6k48K82N6K8l57J42q7K08n2K6L20k89pK55j21Kq6k9M4N4o0J04l24
3335b32K52K20k40J68j55k58L28q8K92o88L58j13P3L1L1o6K26k57J69%m30K59
$$ y = [-338, -273, -116, -318, 19, -259, 4, -14, -253, 21, 241, -177, -66, 102, 280, 254, -182, -194, 107, 122, 262, 172, 148, 245, 96, 359, 325, 152, 642, 407, 248, 442, 52, 416, 293, 297, 503, 304, 317, -102, 320, 438, 203, 799, 606, 433, 432, 303, 782, 699, 519, 307, 457, 81, 188, 459, 449, 576, 579, 597, 218, 211, 507, 271, 339, 635, 228, 376, 600, 165, 56, 131, 549, 442, 359, 508, 354, 321, 122, 5, 171, 228, 216, 204, -1, 377, 300, 185, 86, 134, -32, -70, 174, 107, -16, -117, -84, -112, -31, -22, 15, 238, -229, 72, -118, -199, -24, -36, -186, 102, -159, -57, 26, 85, 87, -125, -174, -472, 11, -106, -44, -242, 117, -2, -63, -125, -189, -190, -74, -154, -218, -370, -212, -444, -82, 31, 97, 24, -76, -92, -124, -149, -93, -341, -59, -3, 25, -332, -190, -277, -69, -121, -95, 225, -64, -71, 184, 63, 65, -21, -50, -6, 48, -12, 92, -232, 20, 240, 0, 168, 13, -245, 83, -5, 287, -401, -43, -156, -83, -52, -21, -87, 139, -118, 51, 51, -379, -120]
3357a20J19j56k13N5K86kq1n7n7l3r7K31j84J59J40l82K38J43k87O4j07J01J71
3380f9m59K14J72mj10o9K93j01j40m1J39L1Q1n0j68J83k8O3p9k50K44K63j76j52
3404b13j24M44m30M12k89J95l35N08J54m13k33K60l9k75O45j38R3k75J67j94K93
3425B13k45k14N85k49P8J84j1n6J87m08J72m9j1J16J48k53J06l3j15J28j99L99
3447D73k86J8K16m6j50R9k45K65J31o1k30J49J75k14R3j6p9l71L12J41j8P2j91
3470B37J34l23J06L6j21J19J82k76OJ58l34k2J62j95j8N3J32l9j32j77K66O8j62
3493a40k64K14j22o9m8K28r0q4p1K15K0j55p7j8J80k26J17J04R9m09O6J64K84
3516h2k37m9j25N4j57L65J44j94Q5m2K42l83J74j07K28k40j12rN2J90O6J70m80
$$ y = [-120, -1, -157, -370, -315, -29, -31, -112, -169, -226, -259, -356, -125, -309, -150, -10, -392, -154, -11, -298, -234, -341, -240, -69, -528, -314, -142, -146, -256, -325, -32, -133, -273, -314, -175, -144, -63, -113, -281, -98, -126, -63, -142, -392, -148, 115, -61, -213, -337, 107, -323, 89, -200, -5, -340, 168, 322, -91, -324, -64, -103, -378, 267, 129, 222, -53, 114, -80, 213, -32, -246, 339, 90, 168, 352, 341, 285, 472, 64, 236, 187, 176, 292, 440, 187, 293, 260, 145, 273, 74, 473, 187, 205, 421, 375, 225, 324, 79, 344, 475, 414, 184, 333, 508, 294, 387, 371, 292, -79, 233, 374, 356, 428, 237, 371, 48, 154, 190, 69, 188, 370, 94, 100, 258, -76, -98, 64, -131, -149, -96, 36, -3, -135, -312, -46, 22, -140, -404, -190, -312, -381, -429, -201, -291, -375, -446, -231, -211, -366, -443, -461, -281, -507, -390, -286, -187, -596, -530, -366, -82, -319, -368, -493, -439, -596, -231, -87, -281, -196, -238, 4, -379, -205, -312, -84, -324, -436, -445, -393, -203, -137, 33, -447]
3539d47J99K10m69J49K55j13K96J57l41j63J97j51L08m66L68J56k34L30l98o6
3559b23J55j09K5M43n56L94n0j60J21k36J03J64L06k59j65O0J11R8j53p6K51k5
3581B19j55J4J12n4J77rN2P3N8J49j93k24K21j50J87k98P8L3J63rM8j89q7K36
3605D52m01K00loo8lK25J08K1n55J49J52j53j9R6K46k04m7k38J46j41J53q2p5
3629d7J87j16K8j40K05n06L91p0K36j48j92N97n83J00j6m6j56L44l47J54K25k37
3651a37P5l40J35K12l14j12K95n3J98j42q6j12J21m6O3K15l03J52j92K98k45J82
3673a36k29K14O8k00J2rn4P2j82L50k01K14l14l8J18N8J68k98L29m05N06l10K90
3696B3l78N9K64j71R2J02J49k79L03k30l4n1k64M56j42k33K11M45o2J46j40o2
$$ y = [-447, -248, -38, -507, -358, -103, -216, 80, 237, -104, -267, -70, -221, 87, -379, -11, 145, -89, 241, -157, -223, -68, -177, -152, 291, -265, 129, 79, -81, 40, -196, -93, 71, 377, 118, -47, 13, 124, 222, 69, -7, 244, 219, 64, 78, 190, 136, 313, 304, 356, 429, 487, 636, 443, 219, 440, 290, 477, 179, 257, 290, 453, 444, 492, 303, 216, 452, 51, 251, 248, 242, 174, 171, 396, 504, 525, -30, 119, 271, 118, 99, 195, 441, 237, 190, -48, 98, -43, 110, 28, -47, 140, 24, 52, -88, 117, -389, 2, -68, 168, 20, -172, 425, -158, -58, -74, -120, -276, 68, -279, -125, 100, -137, -62, -402, -267, -55, -369, -481, -186, -239, -41, -183, -269, -381, -260, -306, -243, -28, -331, -179, -371, -73, -318, -136, -365, -151, -83, -283, -271, -280, -334, -262, -444, -94, -295, -81, -395, -433, -315, -257, -89, -387, -58, -463, 43, -267, 23, -355, -296, -32, -203, -111, -9, 140, -139, 164, -66, -100, -151, -415, 41, -101, -334, -123, 322, 260, 406, 266, 204]
3718B04J86l19p7k38N43j13J79k4n19L93j0j29K39k38K24j02r8J24M1k73J61J6
3740A70j63J07R8l1M0j24J47J68l92l5J39K22k87P9p8O4l76K33j3O9j10R4k9j40
3764a48j23K98j76j07M16m44J38m8m2K37m1j12J12M1j09K9O5L02q9k10k45J48
3786a08j77K84lO2k49j0J89L9j51J03o0J6L5j81L18j92R1m9Q7j74K63o2Q1j51
3810AM4K81j50l3l22Q0N9J50j29Q8p0Q8K45k06j47R2J12r2K10k65o2K34m4J24
3834B88j92j93Q0K34k19J27O3j99J76n2j2K20l13r6K63OO3j38k45N90j80r4j02
3857G5P8kj04n9J56j74K87n39K99Q2o3L62m88K72l48J49l61L85L42n69O38l50
3879F8K70m51l9K95k47j21J67j31L39j42m33L62n18M82K4j23o0J20j56L44l7l08
$$ y = [204, 390, 71, -6, -244, 299, 186, 365, 341, -178, 215, 205, 76, 315, 77, 301, 199, 101, 225, 266, -7, 154, 170, 7, 114, 212, 181, 221, 97, 244, 412, 20, -15, 124, 346, 59, 138, 60, 124, -252, -19, -32, 37, -73, 21, -8, -148, -271, 27, -149, -256, 160, -284, -146, -194, -236, 1, -40, -152, -40, 1, -108, -79, -14, 288, 199, -11, -256, -108, -285, -1, -4, 58, -191, -201, -12, 27, -124, -21, -81, -65, -30, -211, 107, -85, 6, -43, 44, -130, 133, 71, 152, 1, 45, 326, 176, 143, -179, -99, -40, 110, -19, 69, -1, 87, 332, 126, -21, 71, 183, 91, 301, 36, -26, 208, 164, 288, 96, -97, -17, 217, -2, 125, 188, -11, 165, 113, 101, 321, 8, -88, 175, 181, 244, 106, -139, 451, 271, 177, 75, 153, 151, 47, -12, 144, -30, 257, -282, 17, 99, 36, 398, -90, 182, -166, -17, -378, 7, 349, -220, 418, 68, 338, -113, -152, 143, -104, -225, -58, -189, 150, 8, -425, -63, -581, -99, -75, -198, -258, -138, -294, 50, 13, -295]
3901b95L4K23k00P3J47j64J59N3k06j80J86R8ql67K13J70k12p0N01m30J76M8j30
3924a81l7n5K21mR5l14K36n2J89r9l70J95P6J64J25m23J33J25N8nj46J64m65O36
3948B66k08m0J48J51m94PM60J0j44L1k9j03m8K09L7k35p9K03r9L41k81M8J53j
3972C03k46n2L50k29QP2R0j56%Q0j12O3K04q6K2O8l60N19k85k15K08Ql54N03j16
3997B87jk41K19j30kk93L51k62L7j40K79R0k38j86K80j8j32Q7qj7P0l95L01J80
4021A18k94J17n1k9O0j97K02l51K00K6k04N2K31J47m7k33j7l0l9K20r2M58l49
4044a02j28j74Q7L7r7K5L17k24J12k9O5K08l46M01l87L2K57K26n81K30K9J49j80
4067g3N9ojk71K77M4J28J62n5j97O3M4j44J00J31J01k85j87L85k00P2k61O6J49
$$ y = [-295, -261, -38, -238, -165, -18, -182, -23, 30, -176, -356, -170, -72, -80, -447, -234, -64, -276, -346, 155, -275, -99, -51, -181, -218, -273, -52, -56, 39, -275, -39, -91, 98, -1, -371, -176, -100, 64, 189, -234, -101, 24, 82, 77, -69, 95, -370, 266, 58, 18, 166, 317, -177, -170, 290, 300, 156, 187, 158, 55, 7, 216, 253, 18, -61, 142, 43, 384, 103, 151, 304, 303, 57, 5, 355, 126, 134, 206, 296, 140, 140, 220, 108, 171, 375, 289, 311, 379, 19, 538, 253, 38, 246, 254, -100, 403, 287, 286, 45, 264, 134, 132, -161, 190, -72, -35, -175, 104, 194, -44, -230, 50, 32, -100, -13, -21, -38, 32, -363, -62, 118, -176, -59, -110, -139, -79, -276, -74, -425, -225, -199, -403, -351, -120, 27, -20, -253, -270, -300, -339, -119, -211, 247, -102, -230, -404, -317, -280, -377, -352, -35, -259, -147, -176, -111, 97, -249, 152, -235, -203, 54, 280, -301, -71, -42, 107, -73, -14, -20, -21, -292, -15, 29, 157, 319, 264, 67, 130, 174, 30, 130, 261, 362, 77, -110, 275, 75, 147, -114, -48, 101]
4091A01j78N2K1p2L89l34K29ol1P3l9j62L30O0k14K18l45N6j73N4jM8l16K06J37
4116A03j37J40N2K05k30j62L67m48J50r5O0M4J17j38n9J4K97k25k68J01P3n2J19
4139B8K13l52K97o2j41l2NQ4j39K19j93k29L21r0P3J82l6J27k74j79K04j89J77
4162A4n6j44k87K30M06l15l04K22o2J19k6K07Q8j88k81J36J12j9Pl82K41J4j13
4185c81M08q2q9K25l34k5K62r2j78L58l00l1K6pK02J33j12j66k08K93K65j47J4
4208C4k75J58P6L27l01j47J70N1R0k70K47k52L9K14Rk36L71j50O4m5k4l15K74
4231A09Nj13J36j94K36k18k0K34K42k65k37K66j33R4l7mk79K52j1MN2o2j00M53
4255D10l52J51o3l23M17n92M51j16L5K2q5K46m0q6K3l1k56J94j56M64j93J35k64
$$ y = [101, -77, -25, -4, -76, 313, -21, 208, 202, 171, 244, 205, 43, 373, 433, 219, 437, 92, 148, -25, 29, 28, 76, -240, -34, 103, -34, 106, 158, 363, 133, -29, 338, -110, 40, -55, 5, 49, 166, 28, -31, -17, 280, 55, -213, -112, -39, -91, 28, 241, -111, 186, 124, -17, -49, -44, 40, -99, 120, -73, -302, 19, -71, 2, 184, 148, 275, 1, -178, 26, -163, 14, -42, -186, -473, -243, 163, -152, -456, -234, -296, -177, -203, 4, 92, -96, -377, -241, -129, -148, -141, -523, -282, -268, -381, 27, -55, -144, 81, -253, -278, -16, -108, -286, 72, -228, -259, -233, -240, -38, 95, -17, -183, -391, -98, 167, 20, 34, -241, -83, -7, 320, 19, -128, 42, 93, 183, -87, 160, -92, -53, 161, 170, -66, 305, 155, 219, 174, 150, -165, 109, 114, 1, 137, -57, 179, -39, -59, 175, 417, 152, -85, 181, 48, 142, 105, 101, -178, 74, 63, 67, 119, 57, -43, 410, 58, 209, 146, -177, 240, -352, 99, -17, 18, 40, -45, 201, 161, 75, 98, 67, -189, 5, -151, 313, 120, 255, -9]
4278iO2J49K5r7q2l3k9R6J16j75o8J1P0j58K2N4k21K6Qj0K20m1%j70L37j50j8
4305f5J04J43k28l79K84R9oJ48m07K52q5L3r4J64k01K02l09J73j4o1K98l99J61
4328a87L15j05k4J42l76K44m04N45j63j52J77r5L77o7jk18k19K12K6K91l6k79
4350CO7p5J80q3j16J36J09j8k06q5k49M64j50j34K87k6k7j04o3L53j99ko0K20
4374B22j80j65M97l63q1K4K33j12Kr3J47j40j23R1R7pnP9k25L61l95M22l71J70
4398H5k45M7J64L3p8pL1j48K16n7J44l96J65M1J9K61l41L1j05K66k77J47r0q3
4422a77j64K09k7j39K55k33rJ40K94m02q8J66J6j26J91N7J7r5m0jKJ09O9J7m74
4447d33M93j04j5k2O1l22M49k05R0j00O2P6l0q1K89R7n59O82l44o2M1J8j90K52
$$ y = [-9, 53, 202, 227, 130, 48, 15, -14, 82, 198, 23, -45, -34, 36, -122, -100, -46, -267, -241, -233, -243, -23, -64, -64, -234, 103, -47, -65, 39, 182, -46, -425, -141, -42, -48, 100, -307, -55, -140, -107, -201, -37, -238, -36, -345, -172, -186, -247, 51, -348, -187, 128, 23, -1, 141, -235, 9, -395, 150, -13, -165, 12, -83, 294, 227, 226, 8, -211, 1, 27, 318, 282, 3, 70, -5, 175, 92, -24, 112, 221, 203, -3, -88, -337, 127, -23, -157, 130, 104, 77, -27, -90, 263, 64, 62, 2, 222, 42, -123, 374, 11, -70, -46, 187, 75, 77, -16, 131, -9, -132, -41, 56, 49, 44, 123, -102, 259, -136, 286, -85, 85, -160, -113, 51, 84, 6, -1, 30, -118, 98, 41, 185, -211, -46, -5, 14, 275, -66, -35, -140, 126, -151, -4, -94, -177, -341, -132, -159, -298, -43, -276, -285, -145, 149, -253, -341, -175, -159, -285, -94, -37, -20, -115, -155, -156, -154, -45, 24, 41, -433, 60, -44, -59, -81, -20, -342, 107, -98, -8, -108, -46, 30, 0, -81, 208, 305, -254, 428, 84, 22, 63, 81, -109, 143]
4471A43k18J58J76k6k9J01o5o5n0j2q5K34m1lk82L56K08k02n1N1o1k68J95o2j18
4496a6K28j71j87K92N1j19K34m88M00j03q5l5m6N7L31k80O0l96J02J50n0J02J98
4519B29j47L7j81j48j43N09o1j81K31k69L21k71K57k62R6m3o6o6o1L65J72m23
4541a05j58N4J53n7M0r6O7k38O76j1l74q6n5J34Mlj09J29K47n52J13L82j20k82
4565b47k5k7L16j60P5l00J90Q9r9L87k53J50k4j00n8K83q9j97R4J1L26l44k28
4588b30K65m08N01m09M82K44p9k87J58k72K14j52J43j55K11k06p9M59m29K4J06
4609A01Q8j14J77K72o13J06J54j16Q8M3K2J67j6l09L56k69j1j68L65k94J83k23
4631a1L29k59j06J09j03J24q0K89k94J4J59o3k2k14L85l65JJ35L60m72P2j05O6
$$ y = [143, -75, 83, 259, 233, 204, 305, 240, 175, 125, 113, 28, 262, 221, 218, -64, 292, 500, 298, 247, 298, 237, -31, 164, 102, -16, 212, 41, -146, 146, 197, 78, 312, -176, 224, 121, 36, 1, -45, 12, 343, 63, 123, -273, -171, -21, -71, 31, 229, 82, 119, -62, -210, -353, 156, 95, -86, 145, -124, 197, -74, 183, -79, 17, -26, -92, -158, -219, 146, 318, -105, -263, -209, -56, -113, -73, -169, -102, -340, 336, 325, -49, -135, -190, -56, -52, -55, -164, -35, 212, -340, -227, 155, 35, -247, -272, -299, 17, -143, -68, -368, -178, -89, -188, 199, -54, 96, 72, -28, -86, 197, 108, -89, 5, 16, 342, -2, -230, 35, -373, 128, -281, 201, 445, 366, 79, 237, -35, 179, 27, 170, 15, 226, 20, -59, 400, -29, -5, 101, 189, 75, 252, 524, -89, 17, 171, 55, 143, 186, 208, 375, 359, 50, 406, 137, 126, -42, 323, 29, 212, -11, 318, 59, -47, 62, -41, 83, 3, 292, -2, 12, 171, 108, 86, -128, 257, -108, -107, 28, 388, -84, -12, -117, -51]
4654e1J13p6j17j87J31K35J34J52k12j52O2m83K18K13l2j2k16j0K43J8j49k1J3
4677a86M7p1l6O5L7J83k17l9j11L17k4q3r4Q4J35k26K38q1k54J77Q6j78q1L08
4701dk60K85P1q4m8O3o6j62K52n4j11K12k87n6N90l79OJ20k85N12l25k37r1L80
4725D2l22K54J50l62O11l32l2J12J6K1j86nk59N75L0l32J41j03K7J85k93J69n6
4748E1Lq3J53l85N10q3J5j27q6K48q0P7j54R6n6Q8k70K86k26L6l58J95J49k8J94
4773A65l50J40O2K00m10K09M0R6M5l10j68L60J89l76Q4J33J81m17M6N6j74R3j34
4796b40L06n6J52Pj34J23k33K92o7j52O3j05L9o5n9M08j02k21K56j74K02k80r1
4819a31lP3j52L27j47p4K24j23l03M85k94r2J58m1mo7J59k13l3Q5o9K41J32k3
$$ y = [-51, 62, -14, -131, -318, -187, 48, 182, 334, 122, -30, 32, -451, -233, -20, -52, -64, -280, -290, -47, -29, -178, -199, -186, -139, -210, -246, -181, -144, 39, -178, -217, -328, -11, -35, -118, -212, -128, 7, -219, 19, -62, -316, -139, -53, -231, -312, -4, -264, 21, 92, 8, -40, 23, -43, -205, 47, -7, -118, 94, -193, -249, 341, -38, -32, 88, -197, 315, -10, -247, -338, 42, -280, -26, 124, -238, 373, 41, 9, 121, 137, 158, -28, -33, -292, 283, 313, -19, 122, 19, 46, 231, -62, 107, 51, 54, -29, 124, -261, 249, 166, 181, 54, -32, 216, 136, 213, 59, 155, 99, 187, -83, 203, -23, 13, -345, -150, -1, -29, 165, -185, -45, 17, 217, -193, 16, 56, 152, 197, -113, -281, 79, 268, -108, -24, 109, 290, -127, -81, -25, -199, -106, -240, 66, 10, 162, 169, 35, 158, -75, 217, 150, -2, 61, -44, -5, -70, -129, 279, 177, -44, 212, 38, 240, -40, -131, -134, -61, -213, 114, -33, -107, 117, -6, -309, 176, -118, -210, -52, -93, -97, -164, -5, -218, -251, -166, -235, 6, 138, 115]
4843A15k27j27K05R1n72K10L67J9J19n9k64L29j88l1k3p1M15l96K2J66N2k2j8
4866A12M7Jj15r9J12K88j50p6k51K61K20m26k4N84o18l2K17P8Kj20j93J14N7j41
4890a52L00q9m1r1M49k33k69L1L08j89K39k67r5J84r5K55j11j96J04k26J67K94
4912B77l23O5j10J58l5m4r9J79j49K27m06K14J21j63o9L9j50O6L16q0l35P0J29
4935a02J3j22O0J10J76j36k48L1L40m05J31pL12kl12J29K20j34n9lJ29j34j74
4958a87L31j58n8j6j68L93o4Q9j9j11l61K41j80L15k38J64j14k22M92m39L97L4
4980A21j8O1p1j91K46R6n0N1r3m0n5J50l65J08J02N6k26K5J02Q3j17L2l61N06
5004A52m06K67J30k4L10j82k55J3J69j84K19n1j38j15L96l17L15k98L45l35J08
$$ y = [115, -112, -239, -34, 57, -515, -305, 62, 81, 200, 141, -123, 206, 18, -13, -36, -107, 308, -88, -66, 100, 152, 130, 112, 159, 160, 45, -54, 58, 346, 196, 120, -131, 130, 350, -76, -100, 484, -134, -166, 51, 129, 131, 11, -182, -68, -11, -152, 148, 59, 18, -73, 376, 143, -126, -95, 213, 24, 263, -4, -99, 85, -10, 245, 134, -62, 42, -184, -17, 277, -46, 19, -91, 67, 32, -12, -111, 68, -81, 146, -260, -46, 75, -88, -157, -118, -268, -202, 114, 34, -301, -231, -102, -89, -211, -151, -41, 135, -1, -249, -218, 122, -283, -152, -159, 153, 151, -161, -32, 188, 54, -5, -8, 121, -13, -187, 144, -14, -72, -88, -256, 137, 73, 162, 143, 32, -329, -88, -268, 47, -191, -27, -141, -363, 129, -310, 87, 121, 103, 164, 93, -98, 148, 244, 194, 245, 152, 112, 57, 207, -158, -50, 52, 108, -118, -93, 9, 92, -25, 7, -354, 152, -254, 13, 143, 119, 429, 247, -8, 5, 174, -10, 209, 158, 20, -95, 301, -16, 299, 1, 346, 11, 119]
5025A19l61K34P1k71J96J5j0r6K87k91K8J86r1q0J93l38j4K92j74j01N6J9K53
5048A22m3J35j52j06o8M8k4k04K38K94l99Q8K49l91L0p6M6jM2r2J59R5O4m05K69
5073h2m1k3Q2K35m07K71n7l32M37p7l1j52m0J28j57JJ13l10N26l35L6K49m1k63
5097b70L2P6J72J49k90j08J95K17k44Rm3J47k7L1JO6l39K41K06J4p0L6M16m62
5121A55K69p25O20j12J33l30K82k49p6j80M86k23K3o2j17L32M9j34j91%K67k55
5143c8O3Q4j91j0P0Q8M1k00p7K86rMj7m0k13K55J6J8j35K2j31K97j44M8j61N2
5169b2j09O8K92k18K38l65J50J99j13k99K2J64lj55J05l9J76m03M60j47R0pq5
5192aM9j92J16O8kp1l53K68n2Q2K55j64r7j91J25J06%j37J65Mj90K94n9q8P5j04
$$ y = [119, -242, -8, 63, -208, -12, 3, -7, -103, 184, -107, -79, 107, 16, -64, 129, -209, -223, 69, -105, -206, -150, -131, 122, 79, 214, 62, -44, -112, -64, -88, -292, -54, 240, -159, -71, 178, -213, -183, -259, -213, -214, -172, -264, -105, -10, 54, -351, -82, -123, -146, -64, 171, -236, 35, -22, -354, 83, 6, -25, -177, -217, -89, -246, -245, -132, -442, 84, -251, -215, 34, -7, -270, -238, -162, 10, 159, -131, -239, -44, 173, -71, -62, -105, 42, 15, 46, 47, 113, -226, 15, 221, 235, 165, 201, 617, 155, 424, -301, 319, 207, 340, 10, 292, 43, -33, -213, 273, 50, 73, 11, -106, 226, 275, 141, -50, -50, 217, -38, 25, 109, -82, -92, -22, 66, 107, -93, -170, 116, 107, 111, 94, 54, -159, 96, 112, 130, -5, 17, -114, 183, 39, 87, -74, -22, -131, -63, 229, 11, 249, -116, 34, 233, 120, -179, -157, 7, 4, -151, -46, -85, 91, -312, 148, 1, 91, 84, -1, 48, -144, -28, 40, 38, -33, -386, -118, -170, -88, 167, 3, -94, -285, -160, -54, -54, -191, -26, -22, -212, 82, 23, -65, 10, -94]
5218i4n5j1J24J89j96q4J75l50O1K67k13L29j39j14q2R6J63j58J16K00K9l32j91
5241b70K67k53K52n6J94kj15j94P1J31J23j33l03K76j52J60q1j7K3j63J57L34
5263B49k16o1P7r0M27l54m38L75k10M21l29J18N8l41J89N9J70P1j58M76n26j07
5285a40j4J05K67j09k33J86J1J8k9K6J66m44L39j10K7j29Ml7J24j5J71o0kK6o4
5310H4j71J9n1J02oP0k03Q2L32l36J83J10m92L14K4k42J92k84J67j08N60m83J72
5333C5l09K50j05q7O0L48j64j47j16n3J55K11j15M4j28J08Q9k81M69l87l0O4n7
5356a46J75j09L4J30N7k10j05L8J58j26J61o6o4L19r3j70L02j49l41K11k5R8m4
5379C5kk21K26j67K74K9J34m56K31l28M26k37P5K42k95L6O5k8R1j49K2j31K29
$$ y = [-94, -149, -160, -36, 153, -43, -127, 48, -302, -241, 26, -187, 142, 3, -111, -193, -97, 66, -92, 24, 224, 253, -79, -270, -3, -256, -4, -60, 134, 132, 17, -177, -106, 25, 148, 15, -288, -12, -164, -4, -85, -102, -79, -242, -85, 249, 33, -28, 49, -41, 386, 32, -406, -31, -241, 180, -149, -31, 27, -314, -125, -66, 104, 175, 17, 493, -33, -140, -154, -49, 218, 109, -124, 62, 73, 91, 62, 88, 254, -190, 149, 39, 66, -63, -59, -96, 28, 13, 184, 124, 122, 148, 84, -87, -68, -119, -17, -23, 47, -156, -74, 258, -78, 105, 215, -277, 37, 61, -181, 11, -273, -106, -214, 346, -137, 35, -274, -24, -129, -216, -156, 192, 28, -119, -235, -288, -133, 78, -37, 7, -121, -13, 76, -205, 264, -123, -153, -89, -146, 29, -80, -46, 84, 141, -69, -174, -136, 22, -104, 57, -9, -73, 246, 153, -17, 285, 136, -205, 6, -19, 79, 35, 33, -188, 38, -129, 145, 174, 308, -148, 83, -245, 181, -56, 19, 261, -34, 2, 67, 39, 130, -19, 3, -128, 101]
5402A01N4K3j03R4j79J93l14K83j24j7j68K38pk59N44m44J27l6j87o2M19j6O5
5425B25m04J65j40M21k84j09K41K15l54K03l55J03M4J14l94K74K3n1J27l17K62
5446IL1k88K99J44j81k3k65J08K83J06k28P8k73r6O2L11k08R5J68n9j24j98M02
5469A53k46O2L0J62j69o4J4j50K30k51J88Q7J6j33K1n8L01l22l3K10j0K42m57
5492a77K91N1k55Q3J6j27J86o5K7j58P0q2J32J37r6k77M71j27k80L86l11N5k8
5515g8K05n9l3J3J75J20n89j1M23J0k79J63j49K63l5r6p7M0r8k63O85q9r3l58
5539b10Q1Q8j8K00k73M53l56o3R5o1lJ11j45P2K44k77k2q1N49l82k1J19J1j28
5563a7j70k1m5M90m55K36r1j37R8p8J90J87k50n5K41l13j0M30k68M0Ol5j8j15
$$ y = [101, 155, 178, 75, 169, -10, 183, -131, 152, 28, 11, -157, 81, 74, -185, 359, -85, 42, 6, -181, -243, 176, 160, 225, -179, -14, -154, 267, -17, -126, 115, 330, -24, 179, -176, -73, -29, 85, -309, -35, -12, -63, 64, -253, 9, 40, -248, 51, 195, 14, -9, -274, -166, 117, 223, -5, 73, -200, -296, -234, 77, -131, -36, 132, 73, -51, -249, 153, -93, -31, -1, 161, -8, -72, -58, -208, 22, -229, -41, 46, 62, -71, -50, -108, 193, -129, -162, 48, 38, 280, -177, 114, 165, -90, -7, 9, -118, 68, 3, 30, -128, -58, -140, -8, 129, 33, -244, 227, 100, -180, 206, -105, -50, -78, 127, 68, 35, 48, 223, 343, -246, -257, 166, 176, -103, 60, -89, 174, 139, 43, -34, 6, -92, -355, 330, 241, 148, -210, -129, -41, -59, 141, -132, 321, -35, -98, -3, -64, -67, 44, -101, -29, 215, -62, -84, -165, 384, 2, -19, 100, 111, -17, -187, -208, -253, 237, -218, 18, -73, -210, -112, -190, 0, 187, -63, -118, 123, -190, -200, 230, -38, 2, 8, -27, -45, -160]
5587a60j10O1J26j42J35m7k83N84m72K82N9j92j0J47Nj39J08K7l0j59R3r4M98
5610B87k86J69k83J70K9j23n1p7K52N2N3l89K17n7k53K26L3N3J76l85L61l3j77
5633c6K62k26R5j13J04L7j06rJ93L3n43M63q8j98j69L65Q4k50J46K31j80j11L91
5656C75k15j16r9K65k29M4K74l26PP6L27j30j60%J9P2j97j05J44N5l1J44m23J95
5680c4k51L24Qk61J95J70K8k62J3J25mJ77j88O5j04J3R4q8j05K08k12OJ07j80
5704a56J32o7j43L72l43K53r9j08J68K04k27j9K6M6k07O4K27l04J43J21N1l56
5726b22K01k23L89P7l39K07r2k15M09k74J43J1N4j87m6L08O1j06m7j77k9L01j14
5749I0m2k11Q2K9N5N1l55N37l40K65j26J35j19L0J37k20j99J08P3R8L4j59k40
$$ y = [-160, -270, -209, -83, -225, -90, -137, -420, 164, -308, -26, 33, -159, -169, -22, -17, -156, -48, -21, -51, -210, -117, -211, 287, 1, 170, -113, 57, 86, -37, -88, -165, 87, 139, 192, -197, 20, -37, -290, -64, -31, 22, 198, -187, 174, 141, -36, 226, 0, 95, -18, 86, 123, 17, 8, 201, 234, -309, 154, 66, -132, -301, 64, 148, -102, 44, 275, 95, -16, 375, 160, 44, -55, 210, -19, 25, 299, -27, -20, 56, 383, 253, 93, 93, 112, 184, -13, -118, 26, 81, 50, 194, -229, -34, -285, 39, 47, -214, -19, 151, 179, -83, -70, 55, 51, 228, 40, 105, 1, 14, 108, 20, -85, 123, -89, -83, 24, -156, -24, -91, -234, 138, -205, 48, -51, -159, 9, 213, -14, -33, -7, 39, -168, -104, 123, -181, -38, 83, 134, -222, -21, -244, 145, 222, -117, 90, -2, -217, 192, -82, 61, 72, 126, -61, -107, 201, 262, 156, 109, -68, -97, 204, 90, 48, -163, -81, -52, 3, 54, -301, 236, -104, 161, 35, 170, 51, 81, 218, -2, -201, -93, -20, 78, 112, -47, -287]
5772b87O7M86j63j80J77O7J53m03jN01o17J52J86K6m1Q5K00k55j83P8k46N20j92
5795A30K04k62j6K3k54L62r2j94J48n4j74K21O7j14J27p3l24L00k06L71l78O5
5817a23J65m14L52K66m72J14N8J%K78N5j24n44M29j1J23k13M2R4M3j17k02L24
5840A24j81r7J63L2k97J06P1J14o3j07K7o6J38j3j56N42k50k47J88k63j82M32
5862A5j44j6K9O5n7j97M1J72P3JM4q7k8N9P9J61l89K19J00k30o7j84K16M8K33
5887A56l18J49K36o7L2m7r0J83k81J48Lj67j8K26k25K88J5l89R0J28P8j25R3K2
5911A20j72K23N6K2l9j33k05K19j24L01k11J0k16J66l0l7M5N7J55k62J94j62j28
5934a51L76K27p69K28k9o0J30m9p7N72m29j88M84k5j01k34K2n5K33o7k51L46j29
$$ y = [-287, -220, 266, 103, -77, 100, 167, 320, -83, -84, 417, -200, -48, 138, 164, 123, 208, 408, 153, -30, 48, -198, 322, 130, 334, 72, 56, 79, -175, 187, 95, -99, 49, -5, -179, 42, 109, -5, 122, 49, -275, 25, -181, 190, -188, -123, 42, -372, -20, 246, -226, -112, -54, -53, -53, 225, 280, 156, -388, 41, 30, 153, -60, -18, 76, 119, 2, -200, 124, -57, -154, 9, 41, -256, -150, -79, 35, -28, -135, -108, -174, -36, -49, -205, 337, 87, -160, 28, -235, -417, 15, -129, -145, -116, -51, -108, -305, -264, -92, -19, -18, 26, -61, -89, -30, 49, 210, -179, 40, 140, -90, -157, -341, -125, -77, 156, -162, -13, 223, 156, 188, 141, 51, 234, -47, 101, 104, -63, -81, 145, -80, 208, 223, -166, -76, 52, 130, 5, 98, 120, -52, 171, 227, 249, 210, 77, -128, 91, -33, 268, 57, 67, -149, 17, -13, -50, -5, 52, 207, -55, 139, -23, -151, 225, 452, -317, -89, -118, -178, -48, -97, -174, 398, -31, -219, 265, 240, 139, -95, -73, -128, 105, 38, -213, 133, 4]
5957Dj15M50p12J67J47r8L36j54k2J50j25J1j35j91J62K76j95j7m3J21r3N1j65
5980a90M88j73P5l43J06O9j90PK95l60J30N7K0L14p14M48J00k76l4o3N1J70j58
6003a71N5K0J98k7J0n3J38k56K13r7L1lN6k27N5J15k17J05Lk03L93j59J15J6j89
6028g9M29l61J31R3k52o5K68l6r1P8j32O0k63L51p6j50L98k40j03J0L82m26L07
6051B33n1k26p1M9K31k24O6q4M9J32l49J83J53J3j80K32k23J85j70o2M23m01q4
6074a76K65q5k3J38k37J71o2Ml21J47K51l25K93K7k52J51p5M5R1m2O4j30J46p3
6098hkk93L29J11j83P4j42Q9j5Q0j80M2Q2k31J59J67k92M39l02j80M34P8k32j5
6122In3k52L07J91j28j54R3J32K3p4l00K52q2N1M8k69K89M8J3j69j98L81l11L51
$$ y = [4, -111, 339, -373, -206, -59, -157, 179, 25, 3, 153, 28, 39, -96, -287, -125, 151, -44, -61, -104, 17, -76, -25, -190, 298, 125, 200, -143, -37, 32, -158, -151, 144, -216, -86, -29, -9, 305, -409, 39, 139, -137, -171, -234, -183, -13, -171, -116, -96, 102, 75, 85, 32, 170, -86, 127, 30, 61, 58, 114, -113, -58, 57, -160, -55, -52, -255, 138, -21, 94, 110, -79, 350, -11, 120, 213, -39, -104, 164, 128, 37, 115, -17, 43, -220, 131, 55, -95, 303, 63, -40, -30, 352, -74, 233, 182, -44, -115, -66, 165, -59, 7, -77, -28, 104, -245, -62, 91, 104, -76, 156, -67, 118, -52, -114, 309, -92, -176, 89, 4, -19, 119, -118, 53, -9, -5, -326, -179, 72, -253, 40, 67, -185, -34, -109, -64, 27, -15, 49, -81, 65, -8, -10, -303, 26, 137, -46, 28, -114, -25, -40, 40, -140, -98, -16, -247, -88, 79, -213, 226, -76, -256, 178, 256, 24, 9, -44, -296, 11, 202, 74, -80, 13, 145, 168, 94, -206, 46, -36, 15, 63, -206, 83, 131, 144, -25, -223, 158, -153, 198]
6146A98Q1k74J58ML4k38J51qJ45K6k13l38N62k74J98m5J54k68K42m18R0n8J52
6169F1K5j40k14M20j56pN7K59k61j03J16n8J47l75N1R4N8k8L53l77KK95l09K59
6193A69Jm90N20j23k71J13L35N4k93k13L70O3k29J06l28L19q0Ql5j10j56k1L82
6216I1k43J70J96j22j67r4R0J63o18L08J98R1k22J67k31j61L29J7k12J69l7j87
6238c05L22l92M41J9l5n27M33Q7P6j25j28Q7L3k8O1k15R8P8O2J61j4j10j49j0
6262h0J56j73j88L17j52L33j31l05L05j74K55p2k0j48M6Q8N7k9Lk17L33m31K35
6285Hj69J98K17J06k94j57M9nJ46r2J9N1L7j18k20M01l22NK84J03Q7l31K56l42
6309h3q9M9J45m4J40j06k9j6r6m5K21J14J12l60L08l68J22J43j59P9M5j41L3J18
$$ y = [198, 279, 5, 163, 167, 201, -37, 114, 106, 251, 277, 64, -274, 288, 14, 212, 167, 321, 53, 295, -123, -33, -91, 61, 86, -54, -268, 152, -4, -11, 46, 305, 44, -59, 57, -1, 146, -229, -178, -84, -26, -54, 299, -78, -76, 219, -90, 169, 170, -320, 200, 77, -194, -81, 254, 308, 15, -198, 172, 235, 6, 112, -216, 103, 23, 31, -4, -114, -270, -291, 91, -152, 18, 214, 92, -75, -169, -79, 84, -534, -226, -28, 63, -159, 8, -223, -384, -55, -38, -250, -81, -118, -305, 17, -375, 66, 85, 50, -477, -44, 43, 119, -6, -134, -47, -14, -42, 19, -196, -98, -20, 42, 203, 189, 79, -70, -80, 76, -97, -285, 32, -120, 213, 82, -223, 82, -92, 163, 91, 71, -77, -31, 57, 114, 85, 88, -129, 204, -227, 8, -161, 37, 254, 360, 66, -91, -42, -47, 99, 7, 26, 77, 114, -4, -224, 177, -145, -140, 144, 247, 334, 3, 259, -83, -172, -123, 22, -22, 118, 12, -17, -33, -129, -174, 47, 161, 273, -87, 221, -147, -25, 118, -41, 38, 83, -58, -25, 93]
6333I3k20L01j26j05O7O1k00K45N1l70L1M0L97L5k97j72qQ3K49j84m0K6J36k54
6357a61K12l6lk32K33j84O4K62N7m49J53m8K01M4l8k81J88K70n54K89P5M4m02
6380b96K09J63Q7j83K00l08J60k46J58q0K47k21M75m96Q5j87K92j53J39k27K52
6401G0K03k53L7j36J12l04M39k86j0K22m3j74J7L00k40r5JJ33j27Q9J20k10J25
6424a0j3L01l51o5J08K8k67L11J52J71k07l51J97j50l1M61l96J68j41o6m7L89
6446A91k65K34j99j37J63P3J6K5j42j6K52M5j15l28K79k29L45mj54m4P5o2K75
6469B78n23J48J27l9R7J41l19L0j34r3L32p5q3L13l14p4O1K33j85j52L52k36K15
6492A00k43O3o4K39k39q2M5K6J56J42j95j24K02l39L66n7n3p2q0J78M0R9nl24
$$ y = [93, -127, 174, 48, -57, 10, 71, -129, 116, 167, -203, -172, -132, 265, 300, 3, -169, -177, -94, 155, -29, -69, -43, 93, -161, 51, 15, 12, -220, 13, -171, -107, 155, 212, -237, -84, -132, 69, 113, 75, -206, -18, 252, -302, -13, 62, 106, -296, -87, 76, 163, -20, 180, -128, 32, -214, -56, -136, 111, -110, 365, -131, -46, -233, 59, -94, 45, -182, 70, 273, 20, 57, -79, 33, -271, 168, -118, -128, 94, 51, -123, -106, 194, -46, -141, -140, -7, -134, -45, 75, -135, -10, -23, 278, -73, -138, -30, -2, -269, 42, 194, 365, 158, -193, 4, -146, -177, 284, -112, 56, -85, -151, -198, 191, -74, 160, -39, -176, -13, 60, 76, 101, -41, -57, 195, 240, 125, -203, 76, -153, 192, 188, 34, -10, 65, 3, 278, -245, -97, 30, -9, 88, 229, -90, -60, -194, -287, 45, -30, -113, 200, -114, -188, -127, 106, -79, -231, 121, -115, 100, -143, -80, -144, 95, -144, -226, -181, -155, 1, 143, -52, -176, 26, -313, 53, -4, -57, -129, -209, -31, 9, 108, 103, -221]
6516b21L41j20M1j29J39k89J75R5j18k86N13j33l10J11P8j00K82j80M2K48o5l23
6538b09K59J25l23K36K40j99K1j80J4J29k08L06j55J54j33N0k30PK62j78p1J43
6560F0j67PJ84j81K81k33K6L0O3N3J5j64K38q7m95N04l60L22k77L28m25K25J66
6583A13N0q7j30J25k01J04O3k97K73j30K43M8Mn7J31k03r8QJ41l45K41k18L23
6606A01j52l46N99j99K43k02Q0k87L09j26l05J63j82N05k48j04Q7o5J75J18o9
6627I5L2n9j37N9L80o95L45j09K9J05k74K68k14K25L1L0j31Q9J1j28j37K09PL36
6651C67j65j83j59J04j73K30l1K74l33k2N0J41j85L30m01K36P4m88L83j08J52
6672I3oJ56J1m53J65J38Mn8j81j10K05r9kP2K92l6l58k4k52L43P0K52l46J72k23
$$ y = [-221, 120, 0, 41, -88, 51, -238, -63, 32, -86, -372, 141, 8, -302, -191, -113, -213, 69, -111, -69, 179, 114, -209, 50, 175, -148, 88, 328, 129, 150, -30, -16, 113, -95, 211, 56, 210, 77, 127, -103, -96, 166, -12, -83, 60, -107, -100, 84, -97, 184, -49, -23, 7, 70, 123, 138, -26, 212, 125, -370, 134, -226, 96, -181, 147, -278, -53, 113, 163, 76, -54, 71, -130, -26, 37, -260, 13, -117, 126, 174, 178, 121, 252, 49, -49, -41, 100, -245, -4, -222, 101, -51, -397, 202, 3, 246, 44, 124, -163, 146, 20, -285, -122, -304, 201, -47, -151, -64, -129, 46, 164, 95, 127, 68, -69, -10, 370, -325, 20, -89, -60, 45, -229, 39, -175, 50, 81, 111, -20, 69, 80, -48, -185, 24, 31, 367, 202, 19, -140, -36, -209, 21, -10, 264, -69, -91, -41, 100, -85, 245, -156, 80, 154, -334, 49, -59, 93, 87, 243, 254, -199, -34, 104, 108, 50, -131, -241, -36, -135, -137, -65, 227, 191, -167, -191, -443, -100, -30, 222, -124, 48, -175]
6697a75L92k04n5r0L7K78j67j45k4N1P1j27L01j05o7k06L17N8m25L11j24J66k65
6720a97L25k0m3r6J52k00Q0k2p4K63l18k9L9J9K65j20L7o7k4O2n1n7l2O8K07L
6746A70J01m67nJ51P6j58o3J22J56m32M71j49J3J31l94K82j98K89L2q4J03j11
6768C6J23l11L74k26k39K58K3j2K26k13j45oL93k1l08K8k3K6J64m9l14L75o4J98
6792B93n00J19K56j48l2j33q8L44K19o78L07J0j79J25k10Q3M90k98J49O9k45J67
6814A20J33k78K53k9k22K37l83J91J7q1r5K99k04J38m40K0J74P3J67o0o1p1OJ17
6838B1j6J12j67L8k56J34J47k5M0k0N04m72l8j26p2R5J40K8J00k71k05M02Q3j33
6862D3l86l6L38J12k24K38j09j77J72n3L53k50j80K0M39m47L38l55j41L30Q2k3
$$ y = [-175, 217, 13, -42, -132, -95, 183, 16, -129, -153, -102, -31, -158, 143, 38, -29, -235, 82, 140, -285, 26, -98, 68, -197, 128, 108, 65, -31, 121, -79, 1, -21, -95, 168, -150, -179, -140, -121, 144, 24, 61, -6, -30, 32, -19, -76, -108, -40, 167, 170, 271, -196, -201, -50, 26, -132, -195, -73, 83, -349, 122, -27, -14, 117, -277, 5, -193, 96, 128, 44, 147, 36, 159, -152, 222, -4, -243, 15, 38, 26, 252, 39, -106, -112, 281, 260, -48, -20, -43, -17, 147, 98, -216, 159, 95, 293, -207, -88, 168, 20, -12, -145, -233, 111, 330, -348, -41, -31, -210, -85, -295, -212, 278, -20, 129, 198, -47, 120, 253, -25, 228, 199, -23, 214, -169, 22, 39, -42, -137, 162, -42, 96, -344, -324, -150, -77, 90, 30, -31, -102, -96, 21, 5, 117, -50, -12, -268, -134, 13, -12, 28, 8, 512, 40, 2, -124, -196, -101, 39, 67, 167, -104, -309, 93, 176, 43, -343, -379, -41, 71, -153, 85, -24, -201, -29, -82, 271, 21, -159, -139, 300, -147, 191, -164, -305, 25, 107, 84]
6884H4l26R7j02L01P1j8k08R2K17j57m0j91K58k4j57j50R3K09j05L17l41J24j44
6907a00O3K8J69M1m16j4L98j01J05l33L58q8j19J99k14J12k16J05jm6j85J60M6
6930d9n8P6M01k91j39L1n3o0P5o9K76m23N31n8k01q9M49n06K97j49j2o7P5J7J98
6955B02l11l4K83l06K76j44l3N23l21R0l86K8J96J06k56j63L13J27m67L03J67
6976A93j68j25k54K56k46M47k67q6J64K64l94K0J59j25N9l0R6P5Q3j01J44j83
6998a9j30k2M79m48N40n18K28M2L5k97L08m11K47j49j13K37k2J31j21K7k85K37
7020b4l24N47l3j97j7m71J26K52J54j33o9K76j55j59L10J03j55J37l01j21K73
7041A9R5q6l6Q6j29J57J33m51j3J72k0J30jk7J33k41j0M1K01l38K09K89o31K77
$$ y = [84, -242, -145, -247, 54, 125, 107, -101, -9, 208, 51, 11, -180, 78, 54, -103, -253, -160, 49, -56, 261, -80, 44, -100, -37, -9, 160, 201, -215, -229, 169, 68, 173, -160, 198, 110, -9, 190, -24, 88, -128, -23, -24, -70, -255, -95, -49, -107, -31, 370, 79, -60, -29, -82, -142, -67, -136, 140, -283, 248, 190, -11, -100, 349, -157, 140, -9, -21, -88, -13, 4, 202, -109, -143, 140, -166, 110, -34, -67, 456, 135, 225, -161, -133, 63, 169, -87, -250, 63, 190, -277, 26, 193, 25, -100, -354, -98, -344, 103, -164, -250, -86, 178, -216, -196, -37, -162, -103, -133, -37, 38, 121, 20, 164, -19, -149, -171, 308, -140, 400, -118, 110, 152, 187, -110, 198, -213, 34, -115, -228, 9, -13, 118, -3, 24, -261, -24, -348, 199, 166, -31, -48, -519, -393, -141, 13, -120, -189, 87, -68, -227, 83, 186, 31, 168, -133, -254, 19, 114, 28, -8, 78, -51, 106, 239, -212, -225, -53, -73, 57, 56, 29, 162, -79, -89, -48, 153, -185, 24, 313, -318, -41]
7065d1j43K52j59O4p3K5K8l0M6R5k11J57J84l37J15J09k69M7K04j55R7j89L10
7088A26K34k58P8r5j43K31R8j97r7j51L83k66j19M3K16L9P5j40n4j58j9J45K02
7111A73M2l65K28j98r5Q7K02j37q1J00J84k67M43k54q5N9j20l6R1R7j76J77k05
7134a36K18k07J04J11J06k55q5o3J60jJ32j49K74j75l97J73M00N6l34J89l94L33
7156F0j51J05j30L57q0l06J71o9J94j53j17L9J07Q0P6k81R0j4J0j85J14J16K43
7179B76l19j03K16J03r9M0M0J87n41K22J2Q7j17J83R6m43k54L43K44m07J20L8
7201g6j12J96K79n85L72J56j98K38K50m34j32J89p0j33J18J74O4l38j93L28j08
7222a5rr7k06N68l59J64l41N31m53K04J58Mj3K3j24j65l8j16L51j01K87j03k45
$$ y = [-41, -184, 68, -91, -27, -100, -75, -47, -77, -31, 64, -147, 10, 194, -143, -28, 81, -188, -141, 63, -92, 5, -184, 126, 360, 102, 180, 85, -58, 173, 271, 74, -23, -174, 209, -57, -176, -133, 83, 122, 197, 57, 3, -155, -174, -29, 173, 215, -150, 78, -120, -215, -128, 74, -63, -144, -44, 140, -127, 316, 62, -23, 36, -84, -120, -29, 68, -108, 69, -136, 82, -125, -21, 90, 196, -59, -144, -207, -47, -48, 84, -65, 209, 34, -363, -190, 210, 266, -68, 121, -273, 60, -91, 14, -116, 241, 161, -145, 26, -43, 151, -2, -119, -80, 27, 107, 183, -98, -8, -22, -12, -197, -83, 33, 276, -43, -146, 70, 173, 74, 114, 154, 341, -200, 22, 34, 121, 4, 187, 283, -160, -414, -71, 173, -234, -114, -76, -188, 8, 287, -298, 74, 230, 32, 270, 520, 86, -46, 143, 73, -60, 58, 232, 296, -42, -235, 93, -15, -24, -121, -327, 241, -118, 46, -295, 236, -217, -13, 145, 149, 136, 159, 35, -130, -168, -284, 67, -34, 253, 150, -95]
7245i5J51k5k02K65j15j37M2L27q9j5q1r3J73j98j36J14M87n77k6N75o69J73K7
7268a24K36o6L9j15k1k06K69p9O1J07J08k75J22P7m5JQ2l25K50Q2n63M61j14K6
7292a2p5R7j49PJ77j21J92k11j9K75k9M6m35K28p1O0J05j91n3J06K58l17J70O9
7316A07k54J79K2J70m8K1l5l44o1N90l44k32K39R8L4n4m34K90Mj62O17l14k33
7339a44K14k79L4L9K23K62k0k14n6P8j76o6J72k8k29P7r0L53q3P3j82Q3J23O6
7363B30m7k34p6L0K04j4p7l5k85K28j72K57J71k54o8M16l77j10J76j24K08J29
7385A76k91P6J45j55j81K88q5j09K72l64J30J09j18L42l81R9O0j0M5m4k21M20
7407B03j27j76qL21l57K13J62m22J5J90j49J96j07Mk2N1K04q6j91J17J13j40j43
$$ y = [-95, 56, 31, -171, 94, -21, -158, -116, 211, 122, 107, 26, -67, 106, -92, -228, -114, 373, -204, -230, 345, -324, -151, -124, 112, 46, 85, -30, -51, -257, 12, -67, -6, 101, 209, -66, 56, 133, 88, 89, 171, -154, 96, 178, -385, 76, -38, -12, -87, 10, -139, -132, 45, -76, 116, -95, -114, 161, 132, 178, -257, -29, -100, -40, 65, -126, -179, -73, 185, -132, 38, 107, -147, 32, 54, 224, 176, 197, 162, -182, -243, 347, 3, -229, 10, 108, 142, 88, -346, -56, -52, -214, 403, 89, -144, 70, -209, -175, -136, 87, 349, 329, 115, 59, 137, -39, -105, 67, 39, -190, -113, -203, 150, 67, 140, -42, 41, 164, 230, 183, -51, -127, -97, 107, 93, 16, -19, -304, -76, -248, 9, 180, -74, -142, 274, -103, -213, -37, -161, 47, 176, -115, -39, 106, -49, -230, 58, -27, -136, 136, -228, -98, 11, -107, 235, -146, -47, 13, 3, 48, 4, -217, 203, 76, -100, -108, 213, -144, 69, 231, -191, -176, 14, -135, 61, -46, -42, -64, -13, 191, 105, -86, 31, 144, 4, -139]
7430a39k8J72K68j21k89L3L14j04R3j56m8j85L21l25J24q5J37J22Q0j47j78K72
7452A31m3l01M43j10k78P9j37L13K5J89n31K78J01%l59L11m8J22p0j15L8L6k41
7475a67K47k34J38K22k96K7J91l2k69M5K80j32j38J09ro7j47K61k5R7k10J17j74
7498a66L90J0j82j88j7R1M24l62j29M06j67j58J96j02j61k03J54L72j92N0k35
7519a69L10q7qj42K77n1j67J01J31k72j49L49l91K21k42K92O4J82q9P6j10j63
7541c7o3J85k12K14m0j18K44m05K11J82Kp6j04K62l17l01Q35m89K88jk78j23J46
7564EK04j71j0O4j60o3L85k0n8k18J14j90N54l81N9L07m64L0j07r8O6kN8J92K7
7589A23j64p5M3q7K49r9J38j83R3j56N0K8K57k9j64M2k59o1K79Kj43P8L40k57
$$ y = [-139, -167, 5, 273, 152, -137, -104, 210, 106, 199, 43, -5, -190, 131, -194, -70, -155, -18, 104, 184, 37, -141, 131, 88, -213, 230, 120, -158, -79, -216, 97, 122, 311, -220, 58, 159, 159, -200, 111, 63, 185, 115, 0, 38, 74, -167, 80, -154, -16, 206, -90, -63, 128, 96, -173, -128, 152, 20, -118, -9, -18, -85, -232, 29, 4, 101, -109, 8, -166, 224, 234, 52, -136, -153, -62, 362, 0, -129, 277, 110, -48, 148, 46, -115, -318, -164, 208, 16, 66, -169, 141, 54, 46, -96, 181, 130, -37, 64, 195, -77, -226, 123, -268, -47, -289, 3, 67, 249, 160, 236, 126, -37, -100, 85, -127, 87, 47, -71, 173, -232, -21, 161, 163, 87, -17, 245, -72, -373, 462, -27, 261, 260, -18, -141, 5, 209, 38, 28, 92, -68, -131, 254, 234, 176, -42, 72, -118, 436, 55, 114, 421, -43, -13, -120, -218, -152, -154, -96, 96, 123, -41, -116, -73, -160, 89, -10, 128, -55, 38, -118, -68, -40, 217, 188, 24, 66, -193, -254, 25, 27, -116, -38, 302, 45]
7613D5o0j2l02N19q9J80l33L16k47K49k54J46n2o5j25Q7o4r5J50r4N9P9l33M13
7637A18R0k59J21j88o4k1J52j52L12l3Q1k00L11k05J33l31J02j18J44R2l01LJ12
7660a01j78K08J04p2J43q9k56JJ48N8Pj45N1Q9R3p7k5P5J96k26k65K83l8J69l76
7685b23M08q5R3k87M5K5K20j92j49l6K42J32j71q4j9O5M9M7n4l30K54O8n0j09
7709a41K42k49J17K96n8O3k42m3J3N2J71m59J32L31l25O6j76K74j02p5j48K53
7731hJ88k85JK27m22O93k60j87p5J16K91j56l54M10k75K5k85M16j21J15l04L12
7753F2j27j66O23m02J34j36K71k3j56q6k3J40r2j25K29j48J06N3m39J34K0M92
7775C41l20L8R1j57r1L16l57J72q6k34J63P7j35L58k08L1OJ32j29J08J14l09L22
$$ y = [45, -15, -27, -329, 190, 101, 281, -52, 264, 17, 266, 12, 158, 106, 41, -84, 3, -61, -156, -6, -100, -41, 38, -295, 118, 208, -51, 70, -118, -182, -203, -51, -203, 109, 76, 157, -43, 268, 63, 196, -135, -33, -151, -7, 85, -216, -213, -101, -279, -71, 33, -39, 104, 15, -241, -240, -92, -34, -27, -172, -121, -32, 61, -16, -41, 34, 230, 4, -261, 22, -16, 153, -223, 185, 100, 193, -94, -49, -24, 196, 4, -145, -181, 61, 193, 22, -62, -81, -16, 33, 80, 26, -304, -50, 18, -32, -141, 101, -148, -31, 265, 207, 270, 28, -15, -2, 50, 221, -238, -106, 225, -100, -34, -210, 64, -38, -113, -261, -8, 180, -105, -104, 123, -299, 394, 134, -53, -128, -12, 279, 123, -231, 179, -96, -71, -356, 60, -61, 54, -250, 62, -65, -231, 392, -10, 124, -12, 259, 236, 80, -6, -29, 111, 19, -106, 123, -25, 81, 134, -305, -171, -151, 341, 21, 59, 150, -7, -98, 218, -139, 33, -53, -287, -124, -47, -182, 176, -32, -1, 5, 137, 8, 116, 230, -79, 243]
7798B43J36k11m73M10l43J21L08j99J46l18L84k16Q6m0j48J71m4L9P6l73K62N9
7820G6j02J61k25J8lJ05K11j2k90j88K58k10L06j94J55K5R9JM3J4k15k0j83L61
7844A91l82J24N4l12J92N4j82K43j25l3L42m70J60q2K17K28J27l39l9j70n8J99
7866f1N0K07j03K1m14M29l52K86r6J08k18k7J62l5pl3K63j9p7m6l84M29rk74J05
7891i5k29L36r1j15K62j62K86j70%k8k8J31J15j8j54O3po9l41L85ok86J51O5j29
7916a34J7K36l56J13J29j2n3j6j3J85j31J31Kl7j67P7K6k63J09K5k2J38K40j92
7940C2l56K83P5L79l09k37J12R3k64J14N8J36j04NJ8J80k0Mj36m5l6M62k44l19
7964a19K36k96K20p4l6J24K23l09J96q2j23Q1k06q5L48j35J46j55J48l15j36K19
$$ y = [243, 379, 168, -305, 105, -238, -117, 191, -8, 138, -180, 204, -12, 74, 34, -114, 57, 13, 52, 128, -245, 17, 76, -26, 135, -90, -72, -75, 30, 241, 229, -61, -249, 9, -201, 105, -89, 66, 91, 190, 191, 234, 248, 33, 13, -170, 191, -191, -67, -13, -325, -133, -79, -261, -18, -143, -176, 166, -304, -144, -226, -9, 219, 346, 7, -32, -202, -260, -61, -11, 196, 93, 114, -300, 129, -223, 63, -33, 75, -143, -170, -8, -43, -50, -83, 180, 161, 84, 38, -346, 83, 74, -200, -95, -324, 12, -79, -194, 68, -94, 192, 22, 22, -6, -34, 97, 212, 194, 40, 103, 96, 27, -314, 71, 65, -221, -70, -5, -134, -117, 119, -237, -124, 5, -7, -60, -76, -89, 96, -35, 96, 98, 61, -106, -29, -3, -266, -157, -132, -154, -16, 224, 32, -324, -41, 34, 413, 104, -133, -21, 72, -192, -78, -20, 116, 12, 17, 35, 215, 195, 199, 63, 18, -18, 444, 200, -119, 117, -179, 41, -33, -69, 55, 278, -31, 165, 83, -40, 41, -165, -250, 98, -37, 109, -46, 102, -213, -349, -130]
7986a30K94l18K1K96m4Pk8k03P6K78m14L18j50kO9k98L85m5N7k28J6O8l7R1j59
8011h0J44R3j5r5j14k14L10J1%r8k5M2K35j48M5J21k42j12L9M3J71m67J30J28
8035i8kk47L70r1J31j96J8J44j91J58k8J61k88M3J09j5K52k5J01k59k07J64rM3
8059C8n2p9J39Q3j80p1K25n17O20l30o7M94l39J14l5j66J76k15P8k10K53J27j68
8082h2K23l71L29J62l60J98k04L48l33R0m9j26L16n05N25j97J76mk11Q8K10o02
8104c79L74K61k66k30N18k54p5J7j14L%O1l7j20L45j65K89k36o9k98O24k95j77
8127b23K60P8K8j45k09J96K29j93k47K11l18L80n2R6j27J72j49K07j26oj05J95
8149A52o8O8J04j23m38N26k32K27l43l2j6K15r3O9L69m39K73r5r0J25p2j60j07
$$ y = [-130, 164, -154, -133, 163, 119, 126, 98, -105, -29, 249, -165, 153, 3, 1, 70, -228, 157, 112, 169, -59, -43, 25, -12, 79, -80, 64, 157, 142, 47, -67, -281, 29, 40, 40, -58, -83, -41, 194, 46, 91, 212, -30, -142, -103, -60, 111, -356, -226, -98, -100, -347, 23, -68, 63, -133, -115, 29, -162, -4, -32, 129, -159, -116, -7, -22, 230, 205, 306, 47, -160, 4, -5, 38, -14, -93, 46, 129, -51, -122, 103, -414, 206, -124, -191, 303, -36, 78, 43, -123, 53, -162, -84, -294, -41, 86, -82, 141, -230, 99, 261, -99, 99, -105, 243, -90, 0, -49, -175, 141, -364, 161, -36, 140, 136, -75, 13, 223, -379, -5, 256, -10, -240, 278, 24, -51, -34, -148, -145, -145, -84, -121, -241, 104, -61, 228, -8, -77, -375, 249, -46, -223, 37, 115, 143, -2, -211, -15, 214, 21, -226, -15, -333, 47, -5, 91, -36, 136, -13, 194, 68, 62, -43, 152, 84, 152, 256, 133, -305, 221, -11, 216, -127, -159, -175, 40, -53, 16, 385, -54, 219, 124, 34, 159, 87, -73, -180]
8172a80L28j22p3P5K52o5k57j3j27l3N4M72n70L56k92J61P0K23k26
$$ y = [-180, 148, 26, -47, 28, 280, 215, -42, -55, -182, -215, -161, 311, -259, 97, -195, -34, 36, 259, 33]
8191C3
$$ Imaginary data points
##PAGE= N=2
##DATA TABLE= (X++(I..I)), XYDATA
0@%%%%%%%%JrJ6j6J6j6K4l2M0m8N6o4P2q8J04j20J36j52J73j97K24k56K88l22
32a70L61m04M51n04N61o24O92p64Q48r41J041j152J276j416J573j750J953k187
50a156K464k793L191l693M339n210O456q403J1905k0203P5636Q7021o4674k2250
64F2630r252N298k4014o876Q784K3757P599K159p178m817l669M459m054j2265
78D2561j3295P000J7447J1457j251l373r396j8483k0980n281O137Q140Q845J5489
92D5017J2585l324j9991j6682j210N950n312j1120n27J2631J0843J632l643m514
106B2335n002n965o467p403j166J1632J8390P112j0176j4514o410l307o517m760
120a2218O945J0231L062j16M083L0j0488q518M80j325j1096o814Q598J4339N638
$$ y = [0, 0, 0, 0, 0, 0, 0, 0, 0, 1, -8, 8, -8, 8, -8, 16, -16, 24, -24, 32, -32, 40, -48, 56, -64, 72, -80, 93, -104, 120, -136, 152, -170, 191, -213, 238, -266, 295, -329, 363, -401, 447, -494, 547, -605, 671, -745, 828, -922, 1031, -1156, 1308, -1485, 1706, -1987, 2352, -2858, 3598, -4805, 7100, -13103, 62533, 149554, 84880, 62630, 53378, 58676, 34662, 27786, 36570, 60327, 67926, 70085, 62907, 58090, 54421, 58880, 54826, 42561, 29266, 36266, 53713, 65170, 63919, 60546, 51150, 32667, 11687, 6406, 12543, 20683, 29528, 45017, 57602, 54278, 34287, 17605, 16395, 22345, 17033, 5913, 5386, 18017, 28860, 30492, 26849, 22335, 17333, 11368, 4901, -2502, -3668, 7964, 26354, 33466, 23290, 8776, 2366, -941, -7458, -12218, -5273, 4958, 8020, 7904, 11987, 12017, 1529, -6989, -6509, -7834, -18930, -25744, -17146, -2807, 2831]
135B831k129m392p430j0508q037j704J037L701J0053J1696J503j2189j1087j072
149b7727p33p758o876L682R192N772K841K102O38l686p164p937n787k626L086
164d2981R818J1486M977l313m593m371o504p112q31N081P330O737N679K518l042
179a9121n490m742l214m907k943N001J0024Q827K642Q78Q79m615r083n919O6K915
195b8802M723P858P895J283l426l538l267m463l089K316O770N764M084L954K412
210D74k318n772l411r50j075O09O396Q566M598J137J12k217m493m549pL564M249
227D913N415N462L515p09l743k627r03n46J91K777M953M317J925J330O95k646
243B4319m142k306j50P1J673M461N169K068k313k550k564k688k721O5L290K647
$$ y = [2831, 702, -3690, -11120, -21628, -29665, -31369, -30332, -26631, -16578, -4882, -3379, -15568, -26655, -27727, -28460, -36218, -43094, -39412, -30220, -24448, -21607, -19505, -18867, -22553, -29717, -37654, -43441, -46067, -42981, -33163, -21677, -16700, -20013, -24606, -28977, -35481, -42593, -43424, -38343, -31013, -24276, -18597, -16079, -19121, -24611, -29353, -32567, -37474, -40417, -35416, -25392, -16565, -13923, -13045, -12166, -16781, -25864, -31783, -31717, -28802, -24079, -16221, -8326, -7043, -10469, -14007, -17274, -21737, -24826, -22510, -15740, -9976, -5892, -1938, 474, -1844, -7616, -11027, -11977, -13052, -12443, -6047, 2519, 7117, 8254, 8366, 6149, 1656, -2893, -2900, 664, 4913, 10328, 15790, 19305, 18596, 14853, 12226, 11323, 10777, 10968, 13745, 18698, 23015, 24940, 26270, 26965, 24319, 20177, 17871, 17721, 17792, 19465, 23926, 29095, 31163, 28850, 26300, 23736, 21048, 18327, 18392, 21682, 24329]
259B4329L79M46N14k069l655k291o76j630j523L54L474J249l78n83k27k449n147
276A0117l112M45J308j74J649K009K07k908k428j086j586k295k56K209K99p48
292C650M37J559l24k695l065l38j16j367K93L150K462n48j255j217j571l435j190
309e570J216J600K1J141J790k89k381k235q65J11k104m80J852K280L27l37L68
326c555j665k951k416n60O33N92J472K392R05j910k683j411q12j207n80J980J948
343i828J114l84K19p12k330k015j93K13oJ105L014K350j207j969p21o41j655j405
361a5051J793L588J573L05Q81j93j373k661n98R86P56J099K684K436R2j170q07
378e660m41j710q89J557K693K034N34J611Q39j478k233j018Q43K16J286K473K951
$$ y = [24329, 24708, 25154, 25668, 23599, 19944, 17653, 16977, 15347, 13824, 14178, 17652, 18901, 18523, 17940, 17713, 15264, 10117, 7005, 7450, 8758, 8584, 10233, 12242, 12449, 9541, 7113, 6027, 4441, 2146, 1890, 4099, 4398, 3650, 4087, 5646, 5322, 2627, -438, -776, -892, -2259, -1966, 1184, 3646, 3098, 1843, 626, -945, -4380, -5570, -4354, -2754, -2733, -1592, 198, -91, -2472, -4707, -5572, -5461, -7565, -8045, -6193, -3913, -3586, -3923, -3555, -5220, -8171, -10587, -11147, -10514, -9922, -8450, -6058, -5153, -7063, -9746, -11157, -11969, -13176, -13756, -11776, -9828, -8714, -9098, -8879, -9591, -11921, -13936, -14129, -13916, -13922, -12817, -9803, -7453, -8660, -10629, -11350, -11991, -13646, -15051, -13258, -9670, -8097, -7792, -6911, -7104, -8477, -11138, -11736, -10750, -9994, -8895, -6211, -3775, -3683, -4853, -5660, -6101, -7811, -8700, -7143, -4450, -2416, -1882, -271, 568, -910, -3143, -4161, -3318, -3102, -1816, 657, 3608]
395C608M82j046p71j68j318j487L99K845K109Q67J340J127m17j913j437l2J11
412D299N86J766K752J300l98Q7r1j291k473j21J816J825K55J104J883J36j425
429A2010j652n25r31K4O16K074J149N29N68J97j759k605j140L59N68k94Q46K110
447A2144Q89j103j325p16j108k272o22P06O14K67R31J210o60k388j926p72j114
464B755r25l21J688J549k08o16o38j636k244k336j53j0N18J093J997J71j215j892
482b423j288j797k844q16J176K365N65O64M06m2k500l041j447m20j13P71J978
499h806J968J83p04p51j595l048j496M06J402J651J035K271J066j969k293j903
515a2583r56r23L85K487K894J526K93N70j250k845k077p54J147R37J984K752K161
$$ y = [3608, 4090, 3044, 2273, 2105, 787, -700, -301, 2544, 4653, 5520, 6860, 7987, 7570, 5657, 4220, 4188, 4299, 4885, 6651, 9403, 10703, 10305, 10392, 10301, 9010, 6537, 6416, 8232, 10057, 10312, 11416, 13299, 13435, 12010, 10358, 9833, 8902, 8926, 9542, 11616, 12765, 13294, 13862, 14059, 12300, 9695, 8555, 8914, 9482, 9188, 10034, 12144, 13033, 11930, 10605, 9889, 8781, 6509, 5887, 6593, 7207, 7474, 8405, 9615, 8955, 6567, 4641, 3869, 2755, 1830, 1509, 3197, 4746, 4538, 3922, 3284, 1648, -596, -2932, -3085, -3095, -2577, -1484, 513, 684, -531, -2423, -3711, -5508, -8352, -9168, -7992, -5627, -5062, -4398, -3992, -4034, -6534, -9575, -11022, -11442, -11555, -10784, -8806, -6838, -6655, -7359, -8110, -9705, -12753, -14249, -13843, -12441, -10790, -9755, -7484, -6418, -8387, -10680, -12583, -13539, -14462, -14077, -11590, -8696, -7170, -6877, -6307, -7557, -10402, -12479, -13233, -12086, -11149, -9165, -6413, -4252]
532d252k3j081j613j661j368n47J476K824K077J661J594k24k210k371q56M70P09
549e395R92K601K781J423o87q30j282j192j325O42J387J648K142J869J413r63
565E224j578r47m21j037p2K075L139J597k9L47k34j059j613j087O99J131J094
582G229K042J218M72n35m95q01j565j377Q87J763J281N78J174J146j321k083j134
599H479l61m58k75J344J703O80k48o1l49j815j921r01M21K12O43J039Q13M56j070
618H331j354j763j157j607M24J315R08j01P15L98j431k654j801J1k40n71P40J919
636B082R87r28r35q29j633k102r42P65Q67J43J531J237j93j833k090q04j048j362
654g087O23K466J437l49r2j74j017k785j910Q24R85N05Q15J447P93q36j187j342
$$ y = [-4252, -4275, -5356, -6969, -8630, -9998, -10545, -9069, -6245, -4168, -2507, -913, -1137, -3347, -5718, -6574, -6104, -5395, -4403, -1802, 979, 2402, 1715, 885, -397, -1589, -2914, -2272, -885, 763, 2905, 4774, 6187, 5224, 3646, 2699, 2278, 1241, 1169, 3244, 6383, 7980, 7951, 8298, 8064, 7005, 5392, 4305, 5004, 6135, 7229, 9271, 10489, 10961, 10426, 9931, 9130, 7565, 6188, 7075, 8838, 10119, 10697, 11871, 13017, 11696, 9613, 8479, 8118, 7660, 7385, 8729, 10432, 11112, 10864, 10803, 10454, 8639, 6718, 5817, 6238, 6450, 7093, 8132, 8945, 9401, 8331, 6977, 5214, 4057, 2450, 2874, 4189, 5097, 4996, 5711, 6109, 4678, 2024, 223, 234, -6, -577, 163, 2082, 3069, 2141, 1206, 377, -1256, -3358, -4300, -3535, -2668, -2525, -994, 243, 50, -1783, -3873, -4677, -5725, -7087, -6464, -3998, -2561, -2910, -3002, -3176, -4193, -6978, -8888, -8064, -7079, -6574, -5759, -4312, -3519, -4355, -5542, -6884]
672f884j476j305M92J425J505N72P39R09m90k422k101j04M72K53R82K157J056
689d220k00l70q64n60j931o51J225J631J166K85J146O35m32j723j645K56O77Q31
707d744J088J532P85j98M59m60j618j360J326J379J71J92J693J647K80j849p32
724d09Lj1m64M13J830J170N03O68l7p74j175k57K30PO03J005J315K37l14L7o12
745C968j277n29L48J036L77OR45J513n69j462p42j62m5m29M82N91J371M43j44
764E721m52j003j039n01j24l0P13R82J088n3k37k81j415n62q16r3O90J241J73
783D002L21Q72l76j580j697L0K82l55M21J169Q31Q9m57n36j208j250l27O51j74
802G08K89J094J135l38j204r69j020k18m66K68Q93O28L84L93m99j298j197p60
$$ y = [-6884, -8360, -9665, -9173, -7748, -6243, -5671, -4932, -4023, -4513, -6935, -9036, -9140, -8668, -8415, -7433, -5276, -4220, -4420, -4790, -5654, -6214, -8145, -8796, -7571, -5940, -4774, -4489, -3343, -2708, -3140, -4863, -6508, -6252, -5575, -4744, -3656, -2124, -1339, -1537, -1078, -1538, -3156, -4516, -3190, -1811, -1640, -1448, 245, 1892, 2172, 323, -409, -406, -417, -881, -468, 1362, 2532, 3035, 3703, 3666, 2892, 1717, 1460, 1690, 1697, 2300, 3305, 4620, 4857, 4543, 4580, 3968, 2691, 2162, 2510, 3546, 3923, 3929, 4874, 6387, 5818, 4356, 3614, 3452, 3407, 2978, 3460, 4051, 5422, 5865, 5721, 5269, 4266, 3227, 2726, 2602, 2572, 3285, 4267, 5355, 5302, 5065, 4784, 3369, 2807, 1991, 1898, 2588, 3829, 4002, 4323, 5195, 4819, 3239, 1542, 1572, 1854, 1499, 1920, 3089, 3920, 4009, 3552, 3016, 1808, 558, 231, 882, 708, 997, 2091, 3226, 2888, 1684, 715, -305, -523, -989, -721, 172, 800, 1184, 1577, 1078, -220, -1417, -2177]
820b177N31k16j47J019Q75O36o97p57q95j032m45q6Q27O91K15O42L98p49j296
839b663p33k37m41M70L58R24P05j83l94m66p67n82l71J91J184p9P84K53k81p56
859c084n28k90l56J28K65P88J237l50m91L56j95j306p65N03N91K03K97J195K38
878a564q63l11j5k60q29p4J182P54k07J17N14n1m83m70k4J26K79J28J131K48J92
899d80k60O9k13m61l84O70N36L15K17Q37L29J17q56Ol41J12J45M35J062L89P1
920B315J59P3j42o70l19L74N36m0P62J377N8o85m51m8m03m24J69R13R08J75N49
941E186K5m62j063k9j99j51q5P96J242K63m30o86P9p39j004l35M95J195L33m9
961D382Q72o97q84r47k53o11l44R32R83M02l62j86Q4o13k001m62M22J76N28M75
$$ y = [-2177, -1646, -1862, -2009, -990, -115, 521, -176, -933, -1828, -2860, -3305, -3391, -2564, -1873, -1658, -1016, -618, -1367, -2663, -3396, -3633, -4074, -3604, -3246, -2322, -1617, -1800, -2194, -2660, -3427, -4009, -4380, -4189, -3005, -3084, -2300, -2047, -2328, -3084, -3612, -3902, -4258, -4130, -3865, -3077, -1840, -2190, -2681, -2325, -2520, -3826, -4591, -4088, -3497, -3294, -2997, -1802, -1564, -2427, -2738, -2753, -3013, -3842, -3916, -2734, -1980, -2187, -2070, -1556, -1607, -2090, -2560, -2584, -2458, -2179, -2051, -920, -672, -480, -740, -671, -884, -1345, -1729, -1059, -523, -208, 9, 846, 1175, 1292, 436, 442, 101, 213, 358, 793, 1855, 2244, 2315, 2474, 2547, 2405, 1735, 1416, 1790, 2326, 2286, 3048, 4425, 4483, 3798, 3347, 3299, 2896, 2472, 2641, 3554, 4462, 4637, 5186, 5211, 4749, 3686, 3657, 3458, 3307, 3222, 4018, 5260, 5523, 5093, 4407, 4486, 3747, 2743, 2408, 2903, 4098, 4431, 4382, 5254, 4557, 3673, 2726, 2473, 1862, 1518, 2450, 3433, 3835, 3473, 3287, 3371, 2758, 757, 295, 717, 893, 1421, 1896]
981A896N14M1n73r50r43n00q28L14J017J002n81P3O15r66r92j295K60J21k5M67
1001a333P67N13j86q10m42j069l93o70O85N93K32M26o0K59r96r72o71M04m62l8
1021d223Q77O71j28j71l26l74r66q63K68J01M39K75N13L59l08q49k86l65m02j60
1041e918J72J192J71K47q6R2k93m57m69J5k89L95J393K28J02K61N92n20p83n42
1061d497N54J004L57O12P93M41K66l68k20k75J5k28J105Q97K53P91L46L78n96
1080A628o36K32K85J36L72R42O21O01J3m51j63m64l01M31K72O71K82P49q6M9o52
1101D531m17k09k80k8O77M55Q57J98n41m50n39m96n54M07q4N12P12N89n94m41
1121D305n64m84l64n57j04N96R21r6L16l88m76o93p52K72l16K78L36P59N1n98
$$ y = [1896, 2410, 2451, 1878, 928, -15, -515, -1343, -1029, -12, 990, 409, 482, 1097, 131, -861, -2156, -1896, -1775, -1800, -1333, -566, -53, -239, -1049, -1491, -2560, -2953, -3623, -2938, -2345, -2113, -1687, -1747, -1488, -2484, -3456, -4127, -3723, -4185, -4223, -3346, -2675, -2803, -2974, -3300, -3674, -4640, -5503, -5235, -5134, -4695, -4420, -3907, -3548, -3856, -4705, -4991, -5356, -5758, -5918, -5746, -4554, -4383, -4136, -4222, -4130, -4423, -4880, -5349, -5334, -5623, -5228, -3835, -3607, -3505, -3244, -2652, -3172, -3955, -4497, -3943, -2939, -2582, -1970, -1177, -736, -470, -838, -1058, -1333, -1318, -1546, -441, 456, 709, 1500, 1846, 2224, 1628, 992, 1224, 1509, 1645, 2017, 2959, 3580, 4181, 4194, 3743, 3580, 3116, 2815, 3246, 3518, 4189, 4471, 5220, 5134, 5183, 4531, 4114, 3905, 3625, 3597, 4274, 4729, 5586, 5784, 5243, 4793, 4254, 3758, 3204, 3611, 3527, 4039, 4751, 5340, 4746, 4305, 3741, 3257, 2893, 2336, 2232, 2828, 3749, 3653, 3969, 3581, 3105, 2412, 1660, 1932, 1616, 1894, 2230, 2989, 3040, 2442]
1141B442n15j24o34p99j18L85M85mlj05J62q68o33j53n62J08L50L57m0j48l25
1162g42l4k89n61o84K24M10M8n07N60k79k40k85m49l08K47l37M32L57j85K32J63
1183b227l84n92k38J19J3J95o6N67L28k35p4nk00o8r8K05J94K42M68K64k88j0
1205a890n75J89L15q4j55N85L79K13j85M3n6n90L93k65J55N3K64N57J04m34M3
1226i41j87K57m67l22J19P88J49J46L69j36j51o74j8l0k6K18O92M08k13j91o4
1247b74Rj23l24m7Q34K52K10N12K78k00o10r7j0J0j20P24L85O02K73j95J12o75
1269A526l17j27P85J93J66M21N23l70m11m98m9j63J6J86N25k2L40j74K95n36n87
1290A722k58J65R8k65M75L27J39q22k00m11J20p84n7N83N5L7J71N5o74m37k67
$$ y = [2442, 1927, 1803, 1169, 370, 252, 637, 1122, 1118, 1115, 1010, 1172, 304, -329, -482, -1044, -936, -586, -229, -269, -417, -742, -776, -1065, -1626, -2310, -2086, -1676, -1628, -2135, -1575, -1854, -2094, -2379, -2828, -3136, -2889, -3226, -2794, -2437, -2622, -2390, -2227, -2611, -3203, -3441, -3322, -3309, -3114, -3180, -2613, -2285, -2520, -2594, -2599, -2799, -2867, -2965, -2760, -2566, -2324, -1856, -1592, -1880, -1890, -2465, -2276, -1961, -2045, -2200, -1615, -1236, -1023, -1208, -1165, -1221, -1811, -1418, -1683, -1528, -1475, -1211, -654, -550, -984, -941, -1128, -871, -1338, -1660, -1541, -753, -604, -458, -89, -225, -376, -1050, -1068, -1098, -1124, -906, -214, 194, -19, -210, -274, -265, -388, -712, -759, 75, 327, 537, 1049, 1327, 1127, 517, 420, 410, 420, 300, 1024, 1409, 2011, 2284, 2089, 2201, 1526, 1209, 1082, 1867, 2060, 2226, 2647, 3170, 2800, 2389, 1891, 1842, 1679, 1695, 1881, 2406, 2384, 2724, 2550, 2845, 2309, 1722, 1464, 1629, 1727, 1462, 1937, 2264, 2403, 1581, 1381, 970, 1090, 306, 249, 832, 887, 924, 1095, 1150, 476, 39, -228]
1311b28M7j34n29O13L77K60n28j67k86J46k46m19P1M61qK54L94k27n41J91l47
1332h46l02L21j41N09K29p8K16j75L2k60k35j02m2M23J8N43l78M63k55l99m0l9
1354e38l59J88K24J41J71KJ29j68l64k68k87J23j95Q03m50N08q1j01q7m05l80
1375a394J20j2j43k4O89L54k78j29m31m22K67k68q9N11OL18M03l00m56o1k02j6
1397a557m17L73P01K82K06m6j57n32J04o91O70K07l52Q84M43jn02Jk62l13n5N48
1419d66L54K89K60K52j45J54k83Q3n76j53L90O98K56qO32l51J60p73q2j88N33
1440A036K01M68r8L48p1j44p1l25j89J24P5M90m4K77N8K11m51l48j61K82K78k44
1462A702%M86M00k50l91Nk31m20J51K41L79k73pK27L8l05k44k26J06m28P0K73
$$ y = [-228, -181, -315, -844, -231, 146, 406, -122, -289, -575, -429, -675, -1094, -1023, -562, -570, -316, 78, -149, -690, -499, -846, -1148, -827, -968, -459, -230, -308, -92, -267, -235, -495, -730, -832, -874, -451, -433, 110, -268, 195, -60, -459, -499, -538, -897, -709, -485, -344, -173, -171, -42, -210, -574, -842, -1129, -1006, -1201, -398, -848, -340, -421, -522, -609, -1014, -1394, -1274, -1286, -1429, -1453, -764, -410, -688, -817, -1248, -1670, -1403, -1671, -1760, -1249, -1243, -925, -522, -822, -1278, -1339, -1541, -1557, -1974, -1601, -900, -618, -412, -458, -615, -1147, -1043, -1734, -1064, -857, -1209, -325, 118, 117, -385, -384, -646, -959, -1014, -466, -112, 177, 437, 689, 544, 698, 415, 498, -78, -231, 159, 857, 1113, 1105, 1737, 1386, 1546, 773, 691, 503, 1036, 1237, 1705, 1607, 1955, 1884, 1740, 1669, 1344, 1155, 1279, 1354, 1844, 1800, 2077, 2135, 2346, 1895, 1547, 1386, 1668, 1946, 1702, 1702, 2188, 2588, 2338, 1947, 1952, 1721, 1301, 1452, 1693, 2072, 1799, 1792, 2019, 2057, 1752, 1508, 1282, 1388, 960, 1030, 1303]
1484A303N02k94m3J63l48j81m85P7j56J00k3L82j05N3k77J0J59q34j94j54L31
1505a4J02j85P8K05j4o06l45k39M7J23k97L28j46J15P1j36k26p89J2%m3m34N80
1528a813J83q6m44k62j25l4l29j20K57K36j29K27Q1r0o43k64J02l5m18K28N32
1549b946K94p7j52O3k60j32K35l68M56J96K85K36P9o79K34j8J32j42O9L84Q7Q9
1571a935L9p1L30J3j74nL68K33m7L3N31k30j57L92j91K79K1n3L23k4J45Q5J96
1594A01N98k13j29M43k60J17J44K99j62L08M37N3r3K89M3O7O7J14K34L17M79k16
1616C037r3K29K5L8k16O9J74j20L41K20L95j20K3l49l26k12K28K84j01j83L55
1637C698j23o7j19rm09o44K63L87j02p5O3J0m18k02l77l99k38M24j74k66L68o5
$$ y = [1303, 1805, 1511, 1468, 1631, 1283, 1102, 617, 694, 538, 638, 615, 997, 892, 945, 668, 678, 837, 3, -191, -345, -14, 88, -97, -19, 186, 172, -434, -779, -1018, -971, -848, -1145, -817, -963, -848, -777, -913, -1139, -1928, -1916, -1916, -1959, -2393, -1813, -1630, -1716, -2160, -2422, -2547, -2581, -2910, -3030, -2773, -2537, -2666, -2439, -2358, -2448, -3091, -3355, -3253, -3288, -3706, -3478, -2946, -2652, -2729, -2881, -2818, -3078, -3210, -2975, -3343, -2887, -2691, -2406, -2170, -2091, -2770, -2536, -2554, -2422, -2564, -2495, -2111, -2024, -1935, -1896, -1967, -1637, -1624, -1798, -1803, -1435, -1202, -1249, -1216, -685, -915, -1072, -680, -871, -592, -571, -624, -301, -325, -180, -95, 101, 699, 486, 357, 800, 540, 657, 801, 1100, 938, 1246, 1683, 1736, 1643, 1932, 1975, 2042, 2109, 2223, 2457, 2774, 3253, 3037, 2944, 3173, 3198, 3236, 3020, 3089, 3263, 3143, 3484, 3704, 4099, 3979, 4002, 3653, 3327, 3115, 3343, 3627, 3526, 3343, 3698, 3575, 3508, 3389, 3380, 2971, 2327, 2590, 2977, 2875, 2800, 2863, 2873, 2455, 2253, 1876, 1477, 1239, 1663, 1489, 1223, 1591, 1526]
1659A526l78n0l95k98m46K48l30R9K19r1J3j03m86p9k39k79j13J33J06M34l2r1
1681f32ll31O0j0j29m12K55M01J71j06j53J27k87j33K5l23L59k24N13k10L60q6
1703g68k22j67j79K56l89M7J81J71k73K49J66o8o92k51L45l76J47OK89L17Jl22
1725a532l45O4n55M19k71m6N06J70N7l1k70j7l09J83j24m9O78L2Q5J89k53J12
1747a307j05j40j31q6M40j83Q38J93p1m2k95O4m7l41L72O16L38J47oL82m81Rl41
1770a77k12K71q6K95N10R3O9o0l33p6l37J29K94j51K36M14J99n61m9O1m16l23
1792b10J12N78J76K5R9J77J77n42k14o9Q9k22L64L29Q3L74l94n7J3j43J39q0J23
1815I27rN00q9J88Mn70J78K7o1j97J55K20K06NM1K85o91j14k11O6l9J93M14j01
$$ y = [1526, 1148, 1098, 703, 405, -41, 207, -123, -24, 195, 104, 117, 14, -472, -551, -790, -1069, -1182, -1049, -943, -509, -541, -632, -635, -966, -906, -916, -1045, -1457, -1202, -801, -630, -736, -889, -762, -1049, -1182, -1157, -1480, -1121, -1345, -832, -1042, -682, -768, -990, -1157, -1336, -1080, -1469, -1422, -1241, -1070, -1343, -1094, -928, -996, -1688, -1939, -1594, -1970, -1823, -1817, -1528, -1211, -1210, -1532, -1877, -1813, -2368, -1949, -2220, -2266, -1760, -1590, -1533, -1564, -1834, -1851, -2160, -1977, -2101, -2150, -1472, -1440, -1355, -1166, -1419, -1307, -1412, -1552, -1683, -1769, -1329, -1512, -674, -481, -552, -594, -889, -825, -872, -1213, -841, -225, 113, 260, 254, 636, 155, 164, -177, -389, -118, -204, 91, 601, 694, 763, 703, 370, 294, -43, 86, 380, 229, 465, 879, 1078, 517, 468, 529, 113, -210, -98, 480, 656, 681, 780, 957, 1134, 592, 378, 309, 398, 176, 540, 869, 952, 1326, 932, 875, 888, 745, 884, 804, 927, 918, 1418, 1329, 1517, 1521, 951, 1129, 1156, 1095, 898, 1053, 1273, 1479, 1484, 1525, 1810, 1119, 1005, 794, 860, 821, 1014, 1428, 1327]
1839A327J73j67n40L89l87k29l99K43K4J24m4J14l79j3j93j23J45m72M67j4QJ74
1861B28j63K49p73K21j91j63K14p3K20K79L59l17M7k64j36k52L6K64L74o5M58
1882E52L06n04j24n02Q8J63k09k3M79O87l03J28l81l14j15k04j68L06J81K44n9
1903B28N8l06k58j88k90M5j09K70J33J07o5k03l26lm01k24k1NK52L16N2j88J01
1926a015l70l63Q7p76O12J57K24K77l43M26l35j84p1J64k28QJ73O66J39p1K66
1947e57l44k55M4M9L03j09K88P5M22R8j42l5l31J39J61J54L51K03J02M5J0l59
1969C12J35O6k26L16J75j7K07K15L2m79K89m00N9P0j87K87L76K75j08p4r1J05
1991A337j90k15l4J61L52P3l27Q46m16r4O5m90j37j85L08M89K10J09L22l49l97
$$ y = [1327, 1500, 1333, 793, 1182, 795, 566, 167, 410, 434, 558, 514, 628, 249, 236, 43, -80, 65, -407, 60, 46, 54, 228, 65, 314, -459, -238, -429, -592, -378, -451, -231, 48, 407, 90, 137, -127, -263, -515, -479, -215, 159, 94, 552, 858, 354, 230, -272, -184, -21, -230, -253, 226, 913, 610, 738, 357, 43, -72, -276, -444, -138, 43, 287, 228, 286, -20, -278, -466, -756, -711, -820, -550, -417, -310, -375, -578, -904, -907, -1308, -1532, -1553, -1548, -1296, -980, -928, -1116, -1015, -1385, -1748, -1661, -2437, -1825, -1668, -1444, -1167, -1510, -1084, -1419, -1603, -1674, -1510, -1738, -1730, -1557, -891, -752, -823, -557, -901, -1156, -1112, -1063, -760, -869, -581, -506, -84, 14, -128, -163, -494, -355, -194, -40, 311, 514, 616, 661, 671, 312, 447, 513, 287, 603, 778, 761, 968, 1183, 1215, 736, 1025, 625, 684, 754, 567, 854, 1230, 1505, 1397, 1323, 1232, 1337, 1147, 932, 898, 1059, 1411, 1484, 1157, 2003, 1587, 1493, 1558, 1068, 931, 746, 1054, 1543, 1753, 1862, 2184, 1835, 1438]
2012A438j79l89j06K45J50J84k11K81j0k1j74l94l33j3J56K70j33L97k30j7m73
2033D38l00j65R4m29J46M36j90M13k62l16j07l72j53k44P5p1M8J25L66l02j36
2054i06k28J61l56k24K64K15j02Q8N6l7l22j65k4J71o8l18O89J36M2k31m9kk01
2077a411j61j2K88K07J81j17M88k09J3l98m1K22j86J82M13k5q3K6N0N1j90o6N8
2100g20NJ21q5N98l27J39k61K02j47j67j75O18N4j79K06n9K56l18l06J68M33l84
2122c28nJ52N26n9j87jK33k37m8k5M1J66j64M26L1l7j59M2J07k58m0P08k44J61
2146H01n5K50K99l54k38k5J67j5J33K9M85j68m21M27m44J25m20K8O62k07j32J85
2168A112q0M6l67l6O4r6q9J15P2r9K29j60J11l15k01m38M99J77k98J93%j72k17
$$ y = [1438, 1259, 870, 764, 1009, 1159, 1343, 1132, 1413, 1403, 1382, 1208, 814, 481, 468, 624, 894, 761, 1158, 928, 911, 438, 138, -27, 67, -362, -216, 220, 30, 443, 181, -135, -242, -614, -767, -1011, -936, -1007, -959, -834, -468, -770, -906, -1134, -973, -1329, -1553, -1289, -1074, -1176, -1088, -1032, -1069, -1391, -1556, -1580, -1409, -1477, -1795, -1106, -970, -928, -1159, -1208, -1210, -1411, -1572, -1584, -1296, -1089, -908, -1025, -537, -746, -733, -1131, -1172, -950, -1136, -954, -541, -566, -649, -623, -573, -522, -712, -778, -720, -715, -594, -679, -81, -408, -269, -530, -328, -475, -642, -817, -199, -145, -324, -118, -177, 79, -239, -545, -377, 56, -328, -333, -181, 345, 286, 99, 98, 331, 94, 46, 21, 62, 228, 64, 490, 521, 484, 325, 367, 474, 216, 176, 884, 640, 801, 746, 996, 1295, 941, 703, 678, 845, 830, 963, 992, 1477, 1309, 888, 1315, 871, 996, 576, 604, 1266, 1059, 927, 1112, 1032, 1078, 711, 675, 739, 643, 554, 669, 741, 642, 871, 711, 822, 507, 306, -132, 367, 544, 246, 439, 439, 267, 50]
2191E0O8j51n8k20J24J78j25k9K41j08k83j71j07L34r4j31n5J63J87Qj93j46J19
2214c99j23jk4R3L2Q0j36M4K54K7p8l2l32J20K73L3j89K29L09k01j92J14l20L92
2238b7j84N5J99l30L32j20K42k37M5J82n7J27Oj45k3M19o6j44J8l11J69q7k18
2261a55J22L0n2J68j29J42j64j3q3J55j08J30J39j53O8j1j64R7k04p7K87o4K06
2284A67o2K1l02K68j22J90k73L4j47L14J22J0l77K00k53M4j57q6J12J35K28l84
2306c18K71j97P3O9o6k3K47k59NL63r1J43l33J8O4n0q3N8j0j23j71L12J4n3L78
2331B38j49j01m13M24j10k18K47p4J75j60j84J18R5J41j89j17M8K55l71J28L38
2352A21N3o42J06K21L64j54j34J52J81k16K1j20J09k3j22J33k39K68Q5O7l50M57
$$ y = [50, 118, -33, -91, -311, -187, -9, -134, -163, 78, -30, -313, -484, -591, -257, -351, -482, -537, -374, -187, -179, -372, -518, -399, -522, -523, -547, -454, -422, -342, -478, -434, -180, -153, -231, -263, -595, -475, -202, -169, -358, -129, 180, -21, -213, -99, -419, -27, -211, -156, 43, -287, 45, -75, 167, -70, -25, 157, 100, 227, 233, 88, 65, 484, 418, 274, 292, -19, 150, 63, -155, -33, -3, -55, 113, -16, 126, -38, -51, -134, 21, -87, 43, 182, 29, 97, 86, -78, 19, -185, -262, 25, -39, 167, 105, 126, -176, 92, -30, 160, -113, -79, -226, 88, 210, 220, -157, 43, -210, -166, -323, -409, -297, -162, 66, -318, -47, -244, -171, -102, -168, -191, 56, -203, -198, 165, 74, 217, -116, -98, -34, -84, -167, -109, -119, -242, -413, -101, -87, -140, 238, 89, -12, -425, -1, -111, -329, -82, -156, 19, -141, -325, -207, -112, 29, -160, -277, -229, 26, -345, -217, 121, 174, -468, -362, -141, 223, 69, -65, 87, 268, 52, 73, -47, 62, 39, -83, 50, -189, 79, 164, 231, -119, 338]
2374C38j72J4l67L65k31K12k71J27L08P0l17n6J30P2J59j4j80j78M80k37r2k14
2396e4o4L96r4j22J30L41l04J42j38j70J61l13k8K65l12K44P0K92k76j05Ll10
2418b46R4J78k61J1J74L8J76k56J62k80J52O2J01k16r5m4k9M73l63J14j80j90
2440d25J68qJ29m78J58O5J08K85l02m2J36p6j18K50k0l58K84j93O8j28j6L78n5
2463a90k37P6k09L23j15n8N09l81R0j03j76N51n99J22L77j18J51J4O9r0L6J13
2485A55j64K47k09K57r8j46M88j53J52m33L6M05q7J89J55l13M09j83r8k65N22
2506H66k20J05J14k59K38J0j17L19j81J22j36j07K16k14j5p2J35k88L28m15J69
2527E98L03l41J25r2j13P6L06j30k67K01l80J44q5k19J36J00m04j68L66j4K70
$$ y = [338, 166, 180, -187, 178, -53, 159, -112, 15, 323, 393, 76, 20, 150, 222, 381, 367, 187, 9, 489, 252, 160, -54, -118, 278, 184, 62, 192, 533, 229, 371, 233, 63, 224, -89, -117, 148, -164, 80, 150, 442, 166, 61, 64, -246, -152, 26, -235, -224, -50, -12, 164, -92, 70, -210, -58, 4, 105, -111, -206, -250, -279, 194, -169, -55, -235, -425, -257, -265, -136, -614, -456, -391, -283, 2, -300, -342, -206, -282, -400, -150, -170, -528, -244, -437, -369, -497, -513, -135, -190, -427, -351, -560, -237, -352, -410, 99, -282, -192, -295, -471, 80, -519, -397, -20, -138, 13, 27, 96, 6, 42, 155, -9, 238, 29, 286, 188, 42, 530, 377, 529, 96, 132, 537, 450, 639, 794, 481, 890, 707, 609, 344, 866, 646, 751, 865, 606, 844, 854, 737, 1056, 875, 997, 861, 754, 970, 756, 741, 669, 804, 516, 844, 429, 598, 901, 560, 685, 593, 480, 556, 862, 732, 465, 666, 286, 430, 345, 126, 262, 362, -42, -210, 156, 142, 412]
2548D12o67j2l8K72J54l86n8n5j1J70r0J66k23k24L40k70Q5MM24p00K43J47p5
2571c92k51J09o0k12J02K32J27l06J27l58%P4J38J40l72L23k55K49k84K65k86
2592h90N7m1J86J82j49P5k80J05k11L17o5J56l14lJ60J00J4j4j21L74j11j1O4
2615d20l70O09k07QK38j58L6j4O0p4M0j5k9jL23J3J18Nj78L59O1n72J57M65k82
2640A72J69R5o5k50K91j94L72j66j18M4K60p9LJ21l1K2N4mK5j33J91J07l66K14
2664G34L4R6J00Km73j19M29L3m45M90j45j73Q0J91j65j50J81o8j55O1k11J64L84
2687H75j40j85J7l46J39j34k40Q4K09k52N01m36l11L22n12J63K2L36%q5K82l13
2709dm46L66k57N7mp9J11k3M5J09J87n79K35j90j81L27r0O7N9p0K3o7o0p3L09
$$ y = [412, -255, -267, -305, -33, 121, -265, -323, -378, -389, -219, -309, -143, -366, -590, -250, -520, -435, -431, -7, -707, -464, -317, -392, -643, -534, -594, -806, -704, -472, -345, -651, -524, -882, -882, -808, -670, -530, -902, -579, -834, -585, -869, -604, -890, -833, -874, -688, -506, -655, -580, -860, -755, -966, -649, -714, -558, -872, -875, -715, -615, -601, -615, -736, -362, -473, -484, -420, -790, -181, -388, -380, -142, -300, -264, -278, -218, -292, -252, -267, -296, -297, 26, 39, 157, 162, -16, 343, 404, -168, -11, 454, 172, 341, 436, 371, 121, 412, 218, 590, 424, 306, 350, 610, 531, 534, 655, 624, 646, 700, 696, 721, 588, 779, 886, 520, 734, 768, 864, 964, 966, 493, 374, 803, 836, 391, 881, 736, 563, 643, 834, 669, 519, 700, 632, 477, 538, 327, 491, 875, 735, 550, 567, 221, 360, 226, -14, 70, 279, 27, 528, 92, -219, 103, -409, -246, -224, 112, 112, 27, 309, -4, -450, -84, -341, -284, -288, -367, -256, -279, -234, -125, 62, -517, -282, -472, -653, -326, -416, -349, -290, -360, -337, -404, -464, -537, -228]
2734b28J27l55L37k17j44K68j58R5j42J56j51M44n00J59J83l7k86o7K20J0J82
2755a04r7l5l27K64M28l70N4k6ORr1M3L15K9j19q4L53k33l85O9M78l93j66J30
2779b52J17J55J05Q8k10j32M8R2r9J34j4k59K31J98m02M72l2l17n8j27L18PJ88
2802B51l49M39k73n1N6l05K9j88M63Jj40N5K53l26j97J24m1r1J43L64l11J99l08
2825b03J10r1Q0l62J07j3l7J23K75k49p6R5L4p8M7J40L98l78J09j37J56P3j63
2848d0o6J55M1K29j76J32j20r1K97k3j38r7j7j76L53J47j98K21PLm27J79J69J5
2872C79l67K69K3q9J44j03j83L2R5J12n04K60o3K79l15J07N18n49J00l46J57j56
2894b00K30L89l03o6o7P7K89m11K20j11J92l95K01R3J43J05p5k17J59j87J40J13
$$ y = [-228, -101, -456, -119, -336, -480, -212, -370, -275, -417, -261, -412, 32, -468, -309, -126, -163, -449, -516, -296, -286, -104, -201, -236, -563, -299, 129, -241, -187, -213, -207, -198, -289, -246, 69, 98, -21, -105, 248, 15, -370, -301, 177, -216, -382, -252, -135, 20, 125, 213, 3, -129, -81, 11, -88, 46, 32, -227, 4, 202, -200, 272, 240, -77, -135, -262, 56, 63, 251, -98, 341, 68, 17, 73, -232, -203, -391, 72, 73, -67, -12, 241, -85, -282, -158, -199, -290, -147, 217, -94, 105, -203, -93, -184, -104, -466, -359, -372, -409, -286, -11, -260, -336, -241, -207, -285, -238, -98, 300, -78, 31, -106, 50, 123, -40, -106, 49, 90, 319, 143, 275, 155, 64, 361, 338, 200, 103, 86, -90, 263, 410, 212, 433, 440, 443, 16, 195, 364, 379, 12, 281, 304, 215, 359, 256, 73, 105, 200, 312, -192, 68, 5, 284, -31, 76, 594, 45, 145, -201, -44, -200, 30, 419, 116, 50, -17, 60, 349, -62, 158, 47, 239, -156, 45, 138, 281, 386, 311, 94, 253, 66, 206, 319]
2916C19o9k03J12J02r0l6M0j53J55j69N4L95j29K2J7k42RJ08m26J57L18l73J94
2939A12J53j11J4l8P0j68k56K37K72o8Rj47l23K22q7k30M1L4j39K25m9j70K11
2962a86j31L03k27j15k99K51rLK92M8k67J26p8m2L02k70l07J46M45j93r1P4N40
2985C15o85L15j13q8P4J76k59K12J12n43L13O9lJ82L2j72RJ48j44K93k60K23m1
3008A65pj8j37k52L51k79J01L90kj38k54M73j36R0k21K4Q4R6k61K63j6j11K3j16
3032A12K38L3M1k5k90R1K58R4r8l1j41M39j62kJ7K6j14j11Q0k77K18l50L74l5
3056C85j3K21rl28Q3l46M04q6l05J63j9k9j15p9J22J38l90j40J02M5J1J15J13
3079D3l40j01j97L62l28qL1R6p3J40j29p9J90l78J62j61J25k92N44m50O47k52
$$ y = [319, 250, 47, 159, 261, 171, 135, 175, 22, 177, 8, 62, 457, 328, 350, 367, 125, 134, 242, -184, -27, 291, -82, 112, 265, 154, 168, 130, 200, 32, -224, 13, 285, 217, 226, 79, -244, -22, -109, -339, -298, -264, -403, -178, -227, -397, -186, -317, -14, -241, -356, -655, -404, -413, -410, -118, -70, -337, -211, -289, -331, -29, -299, -606, -460, -15, -208, -299, -225, 315, -370, -55, -168, -256, -182, -6, -265, -53, 59, -484, -171, -102, -105, 77, 109, -63, -54, 94, -50, 243, -17, 206, 165, 158, 140, 3, -249, 102, -177, -76, 314, 312, 174, -80, 393, 257, 347, 126, 150, 234, 330, 69, 332, 316, 205, 228, 112, 350, 383, 424, 399, 109, 200, 458, 552, 454, 423, 282, 721, 559, 557, 574, 600, 486, 375, 455, 178, 396, 46, 420, 385, 372, 593, 584, 256, 339, -7, 397, 311, 6, 169, 150, 121, 6, -73, 49, 187, -203, -343, -241, -196, -185, -70, 43, -297, -398, -595, -233, -561, -569, -538, -442, -515, -375, -504, -583, -393, -771, -609, -770, -645, -937, -393, -843, -196, -448]
3101d48j68k91M16k3r1k6K24m9j94P8o3pk7O2K09rN8J42m9j77k0K21O6l14K87
3126a93k38K01J02l24J2N87j16j30k5k94N5L39j55J40n8Q6r0j40L81k74J94L0
3148I0L26l37l4J28K5Q9K15j41J46j76r8m4l20O32o0J4j0n4j09K88l91K49j01
3171C27L66K06k89l02K01r5j35K56o7J46l17K37j20O0R6K73m39J05k04L10M4n2
3193F07r2j14J30k96M46k94l1R3p7K29k90l0k72K14J50j4l84R5K31j02k8J88k17
3216A42J40N5o45L96N9k48k13L55q2L4P7j37j28ML01Mj39l65p7K83j58M7L7j92
3240d50L1O8J88L2l30J91Q1J88l32k33K26L8R2j34K13m9n2k7j44J31k5jl7J00
3264b35P7J7K49n06L16j18j86R9Q7l1j55L22j95J42Lj39J87P5k42M32k72r1J48
$$ y = [-448, -616, -907, -491, -514, -605, -631, -407, -456, -650, -572, -635, -642, -669, -607, -398, -407, -349, -207, -256, -433, -453, -232, -166, -480, -193, -431, -230, -128, -452, -440, 147, 31, -99, -124, -418, -363, -24, -179, -39, -97, -11, -101, -241, 140, -134, 60, 90, 416, 79, 45, 173, 198, 287, 502, 361, 507, 331, 233, 189, -131, 501, 441, 455, 445, 391, 282, 570, 179, 428, 327, 693, 899, 610, 308, 509, 414, 279, 535, 468, 614, 297, 534, 414, 474, 570, 843, 404, 509, 305, 615, 659, 607, 515, 401, 531, 235, 681, 387, 356, 449, 372, 601, 311, 281, 9, 223, 373, 359, -25, 70, 301, 199, 171, 359, 142, 282, 337, -308, 88, 147, -101, -314, 41, -41, -7, 70, -67, -195, -191, 110, 114, -25, -390, -467, -184, -342, -295, -258, -450, -419, -351, -163, -131, -461, -270, -189, -1, -333, -566, -340, -302, -210, -344, -131, -180, -232, -259, -403, -272, -297, -298, -335, -235, -158, -141, 108, -398, -82, -200, -386, -287, -200, -231, -386, -64, -259, -117, -114, -253, -66, 9, -233, 199, -73, -164, -16]
3287a6J00j30K24j90pm49J60M22m46K91j85J84j21J59J3L1J38k30J70k93K32k29
3309a72O2J61L32n99P5L58l65j39K03m2nJ14P0n2j98l8L32j35J61k21J10K0l9
3332gK41l68n8J59Q5l59j16K89J19k16K77o8r0J11N8k07j70K00L43l65M5J87p
3355H3N6m08K94k60K01K37p5j0J03l67J93lP1o7jJ06p0Pm0K07m10J97M8N8l33
3380a83M77j2k32N6J57k03l30J43J58M8k38L17OL3l51M25P7j7o6j79r9QM23l45
3404G3l5J90p9R6k31N48l04j06nL3J55l5k8k57J69L06k50q9K12q1L23k37l00R6
3428A64Mk45K23R6k53M22k35l9j31o9K60j9j94J19r4q3q8J89Q0M4q7q7j5J91j18
3453C5n4J1Q3l59K21j3R6l29J84J67l21K29J1k1j41j93K83j24r5J65k9K21k93
$$ y = [-16, 84, -46, 178, -12, -19, -468, -308, 114, -332, -41, -226, -42, -163, -4, 9, 40, 178, -52, 118, -175, 57, -172, -110, 51, 383, -216, -141, 217, -148, -287, -84, -126, -131, -17, 53, 1, -197, -235, 97, -38, 123, -98, 12, 32, -7, 234, -134, -192, -33, 52, -307, -423, -134, -15, -231, 46, -22, -112, -1, 57, -150, -320, -120, 223, -142, -97, 90, 83, 139, -269, 25, -235, -34, 203, 128, 118, 221, -146, 47, 44, 115, 48, 47, 153, 83, 90, 50, 257, -153, 44, 92, 150, -183, 294, 282, 50, 106, 263, 60, -270, -127, 31, 79, -159, 158, 164, 197, -154, 271, 348, 331, 265, 86, -13, -5, 418, 73, 38, 228, 149, 245, 14, 562, 258, 152, 147, 180, 335, 300, 272, 15, 184, 490, 240, 151, 363, 282, 605, 368, 68, 164, 168, -77, 146, 242, -11, 411, 176, 137, 6, -63, 197, 178, -16, 103, 9, -74, -162, 27, 107, 151, 64, -23, -38, 153, 35, -19, -8, 75, -284, -63, -76, 20, -309, -125, 42, -279, -50, -39, -60, -201, -394, -111, -235, -330, -165, -194, 27, -266]
3476b66P8l37O72l32j14M9M0J34J53l39k2K93k68mJ41q9N9j81J80k15N9n9p5Q9
3500c54K8k14J40k63K17j4O4J31%J73k2l06R0L5m3O7J02j47L11j44J27O9q2Q5
3524E0k46M57j81n1P6j4j61L40M3j29K18J44k41n7R5k3K41l26R3L74k65P1n2P5
3548E31j63O2K07k26k09K46n4O9k42K7L7M81j69p9J76j97R6k69p6jK29l07O9Q0
3572C18M0n4m3J44q3k48j61M25k86M8J10J56l80k8J58k29Rp7j02K18m9R7K61O6
3596C10r5m19K4J26J85l58J08J93l06l1m6J24K08j02k19J73j98J81k42K2l2r9
3618d93J80K8l15L27J25j40l33L19n1N1RJ19K40o51J10J61j99l4K35K57k85j44
3640d84K56L8k21P3J04l2j62J48J73j72J4j19J39K09K7j07J29k3p5J12J51k76
$$ y = [-266, -188, -525, 147, -185, -299, -250, -210, -76, 77, -262, -284, 9, -259, -263, -122, -211, -152, -333, -153, -368, -309, -368, -443, -354, -326, -540, -400, -663, -446, -460, -396, -265, -265, -92, -114, -420, -330, -295, -338, -271, -169, -316, -5, -149, -22, 47, -35, 50, -196, 261, 80, 29, 105, 91, -70, 270, 313, 184, 402, 546, 305, 248, 343, 320, 561, 235, 328, 702, 437, 508, 456, 531, 368, 430, 637, 411, 202, 448, 394, 463, 221, 248, 285, 766, 597, 518, 694, 497, 593, 324, 248, 247, 476, 169, 238, 318, 358, 304, 261, 405, 322, 74, -87, 338, 52, 100, 210, 366, -14, -42, 116, -113, -104, -181, -283, -65, -114, -17, 244, 310, 215, -204, -180, -54, 131, -227, -119, 74, -232, -263, -309, -185, 23, -79, -298, -125, -323, -142, -384, -362, -394, -493, -313, -285, -600, -273, -148, -288, -621, -302, -353, -302, -293, -174, 66, -585, -475, -314, -513, -547, -312, -55, -340, -484, -228, -190, -411, -338, -234, -266, -428, -280, -107, -279, -265, -384, -245, -36, -9, -116, 13, -10, -85, 27, 178, -98]
3662i8K77M0l5j84m0K32K07m81M21j65k05Q0M62l69j85J49J15j59J36J23l9P2
3684C54n16J30J14p3J86k41K93j07J48k38K64j73n0J56L9k56Q8l00J41J77j29
3705GL45n50L54l5j22Kj1J6m9p1L44k02O5j46n6p7N00J02k49Jk3Q6o8q4J16m34
3731b39M15K2j26OK86l67n0K15j48P3j5j37K64n2k4j58P2k17K57k29J29j23J74
3754B8r6K6mR5l22J64N9k2M3p8O9k5j53J34L4J53k97k99N93l12p7M46J35l72k51
3779c29J22k17L01k24J10L03j05K52k74O2J31j50J04p1q3K51l25M09k6k4k10J8
3801B5L5m8J0M57q7k20l3j6J21l19J53m2R1l26P0M5J1J34J91m25L65o4J21k58
3825ij69L32k36J75J23J86l29j89R2J05j40J5J95j18n4K30k42LK41l03K7K32m9
$$ y = [-98, 179, 219, 184, 0, -40, 192, 399, -82, 339, 174, -31, 49, 511, 142, -43, 106, 221, 62, 198, 321, 282, 354, -162, -32, 82, 9, 195, -46, 247, 140, 288, 50, 314, 141, 91, 247, 286, 30, 118, -182, -41, 136, 7, 352, -198, 156, 121, -1, 1, -10, 6, -43, -114, 230, 28, 93, -53, -109, -186, 314, 416, 167, 168, 145, 231, 163, 79, 195, -239, 176, 198, 72, 78, 364, -3, -53, 162, 14, 87, 72, -65, 199, 147, 123, -35, 37, -180, 77, -152, -23, -146, 28, -68, -42, -46, 49, -273, -109, -50, -72, -29, -107, -38, -63, -216, -82, -48, 105, -192, -491, 102, -210, -287, 159, 294, -78, -329, -207, -424, -123, -347, -237, 66, -39, 213, -61, 1, 132, -18, 86, 15, -68, 183, -142, 267, 241, 217, 7, 25, 60, 12, 22, 479, 392, 172, 139, 123, 244, -75, 78, 36, 127, -199, -129, -84, -73, 61, 252, -173, 192, 128, 249, -9, -178, 154, -82, 93, 216, 402, 73, -116, -24, 81, -59, -44, 151, 33, -21, 209, -33, -30, 211, -92, -65, 167, 118]
3848A18k67j57N14l72j66K21N2m2j22Q8J16l10L37lm08R3M46k20j00k22M73k28
3870a59k49K48J19l72L75k58Q2j81L18k85J81K8J10k53j20K46P0N2p4l2j75N49
3892B20l23r8L52qN6k36p4J6J32K15l97Mj9J97J17j02mkJ46l11L74k89L03l13
3916d4Qk4q8JK36J7l98L80j88K22J43l07O6o0K12K83j96j17J80k86L34J62l44
3939A92l8J78l60K8J55q5K76l75J55K39l63pL26k17K69l63J47J42j00n7l31K50
3961F1j36O9J99k59K04r7k27K81j17r0O4j88L09k50M91l04l40K02M18o03L44q7
3983e6m9j93K43K12m36O9O5J67j30q8j23m4K74k2K75l24n9j42K63K3j98K00J51
4006G8j36K1j67mJ33j09L59k39j76L9L46l25l5o4M40j56jK55l82P7j52m7QR5P1
$$ y = [118, -149, -306, 208, -164, -330, -109, -57, -99, -221, -133, -17, -327, 10, 7, -401, -308, 138, -82, -182, -404, 69, -159, -408, -160, -41, -413, -38, -296, -214, -395, -77, -362, -181, -153, -43, -296, -416, -170, -100, -48, -122, -154, -329, 220, -103, -201, 151, 143, 199, -37, -111, -95, 37, 252, -145, -141, -160, 37, 154, 52, 48, 46, 192, -119, 255, -34, 269, -44, -36, -60, -148, -147, 89, 106, -292, 88, -100, 122, 265, -42, 24, -36, 176, 459, 263, 146, 326, 40, 374, 536, 192, 154, 332, -28, 0, 155, 70, 346, -29, 126, 365, 2, -5, 321, 104, 373, 10, 157, 299, 199, 142, -189, 61, -75, -6, 193, -66, 138, 41, -186, 95, -22, -112, -48, -236, 73, -177, 314, 10, -330, -128, 290, -313, 31, -56, -105, -298, -55, 157, -279, -210, -145, 22, -108, -196, -319, -363, -89, -111, 164, -160, -219, -361, -98, -75, -273, -73, 78, -58, -37, -204, -208, -75, -184, 175, -64, -240, -201, 145, -180, -215, -279, 161, 5, 4, 259, -123, -46, -198, -245, -237, -142, -71]
4031g1o3P0kJ89L2k74j92J14PP4J00j4L18m61M33m70R8L15j02l64M72j07n8q0
4055c6N0j37M10J32m12O2J55j11M0J25k70K46n2k81K10l6J38k0j56J83j8n7j80
4078a5M39l28k2o9J06J46p8J77j98K9l5K26l32O1j3R6j36J73p2o5J28j58j28J13
4102D5J47j44l6k44N73k95k94L32K8L3k75r3K95l4j70n8K25m71J89p3M26j79j47
4125b20kK09j96k30K46j23M2J25MJ14l94J7J65J79k59K15K7k21P8J5K89j82P6
4148b6J97l57o7L24l75J2J89R8J1k65J27J90j93K8K15r0k1R0k04J34k73K71Q0
4171I5j63J61q0q8M32n00J71r9J72j46Q6rK44N1q7nl51L03jPJ7r5J39L0j19n3
4197A12p4Q1K99k62j89J55Q0l09L02J06l61O17m42r2K34l40M09l32L68p4q5n2
$$ y = [-71, -134, -64, -66, 123, 155, -119, -311, -197, -190, -116, -16, -30, 288, -173, 260, -210, -112, 203, 101, -263, 209, 102, 44, -36, 14, -123, 287, 419, 7, 69, 224, 113, 153, 278, 8, 254, 202, -79, 131, 95, 233, 213, 57, 240, 222, 165, -15, 424, 96, 74, 5, 111, 257, 179, 356, 158, 187, 152, 378, 46, 107, 94, 190, 54, 227, 155, 90, 218, 60, -68, 45, 192, 48, 12, -232, 341, 46, -248, 84, 112, 145, -130, -223, 72, 38, -132, -190, 35, -436, -247, -320, 106, -73, -220, -222, -13, -209, -439, -193, -316, -274, -149, -145, -31, -425, -408, -243, -64, -323, -108, -81, -302, -224, -209, 80, -102, -26, 171, -186, -253, 71, -304, -292, -103, -5, 6, -259, -132, 58, -135, -107, 108, 18, -3, 87, -117, 17, -256, 15, 95, -68, 93, 13, -75, 357, -143, 28, -71, 101, -45, 41, 32, 276, 327, 240, 235, -116, 187, 186, 193, 210, 115, 254, 284, 165, 112, 38, 119, 418, 156, -33, 122, 202, -107, 195, 301, -60, 557, 115, 23, 257, -83, 326, -6, 362, 288, 203, 151]
4219A51J72r4m26J59K69k26K59j71j39L91j50R5k61j63K7K39o3j5j8k05J88j83
4241a64K20j31j63n3J18K66k7j67l1j51L65K3m79L39j88q7K24qM5j56k14N12j33
4264d0l9j11K07l80K08J34K17n11J55m9K79r7r1K18k77l2J12P0R6k79O3j81M23
4287I5p0Q7k01l6J10K15k23q3K53k46K06R7n0m7j45R7j09L12j06n9j75j99K32
4310d5k17K77O8j59J38j05k4KJ52j97J01J30k09L88l88L01k01L2n4R6j95jJ78
4333F8k6J10l05K80k6k3q0j90K57j27R0j06J92n3K0L61m75R8J25k17k04O7Q4K14
4357A34j36N1J13k30j94N8j45K65m7J05j08O8l62K54J44M0k16K69j93O0j18R6
4379i2J45k98n1L39J18m62K25q0k2j82L21nk01J06K55m66J98M0j20K99M4m3m60
$$ y = [151, 323, 229, -197, -38, 231, 5, 264, 93, -46, 345, 195, 290, 29, -134, -107, 132, 69, 54, 36, -169, 19, -164, 56, -75, -238, -291, -173, 93, 66, -101, -132, -283, 82, 105, -374, -35, -223, -310, -86, -94, -49, -205, -419, 93, -40, -79, -190, 17, -363, -155, -21, 196, -315, -160, -209, 70, -27, -118, 100, -177, -209, -97, -27, 69, -210, -147, -328, 95, 25, 112, -89, -125, -15, 200, -23, -106, 147, -99, 107, 204, 154, 107, -38, 59, -50, 262, 156, 97, -78, -277, -45, -262, 15, 83, -76, 62, -43, -67, -65, 87, -110, -9, 121, -88, 300, -88, 213, 12, 44, -10, 86, -109, -110, 68, 42, 152, -153, 127, 101, 78, -2, -192, 65, -62, 28, -78, 114, 61, 81, 442, -33, 65, 190, -27, -231, -164, -80, 134, -2, 49, 162, -68, -262, -204, -349, -84, -131, -26, -134, -66, -428, -174, -30, 10, -206, 63, -130, -70, -188, -92, 53, -245, -296, 43, 161, -301, -76, -156, -178, -360, -39, -44, -245, -139, 116, -350, -152, -112, -232, 67, 111, 68, -392]
4402c92N09r5K0J1N7j93K5j33L00l49K86r7K40l16m5JJ22l9J76O4N1N9m24j0M09
4427B37j04L8l69O76k45l36M06l24M03k29j48J57L33o01K73J12P9k04q8P4j80
4448d0J97j83J21qL73j79k94R4N5J81j35n2K9k98Q3M21k30K84n18J57M0q1p2Q3
4472B8j23O3J74j49K15j37L0J22j23j31J47Q0R5k88J28L9j51J55K68n58l8J06
4494d8J40m50K17J66J65l46K38m14K48K31l17J69m9J41j67J0K08l31J46j03R4
4515e2K09p6l8j22o4J13j62K52pj12L3k01K14r3j56J25K1J01J13m55M39m6J05
4538A41MN3l07j26L8J61l67L05RL14l07l36J87N11k35j10q6J0K41k05K42p1J6
4561H2l00L33j00lo4O5j2L06o6j15L4j15O1k61L75J58k35l14L14j57%J12P8j95
$$ y = [-392, 117, 22, 42, 53, 110, -83, -58, -191, 109, -240, 46, -51, 189, -127, -172, -171, -49, -88, 88, 152, 203, 262, -162, -172, 237, 133, 171, -198, 478, 233, -103, 303, -21, 382, 153, 5, 162, 495, -106, 167, 279, 358, 154, 66, 140, -40, 157, -26, 95, 87, 460, 281, -13, 81, 136, 317, 182, 130, 159, -139, -56, 365, 135, 419, -99, 58, 98, 17, -55, 28, -95, -32, 142, -7, 208, 71, 101, 223, 100, -31, 116, 196, 291, 3, 131, 170, 19, 174, 442, -116, -154, -48, 92, -358, -141, 25, 190, -156, 82, -332, -84, 147, -170, -1, -50, 91, -76, -66, 142, -189, -43, -146, -52, 157, 81, 43, -79, -143, -30, -192, 60, 53, -59, -26, -227, -13, -106, -262, -137, -116, -15, 98, -357, 82, 36, 141, 145, 198, -109, -235, -197, -36, -403, -98, -89, 225, -82, -418, -231, 280, 45, -65, -151, -141, 100, -105, 137, 66, 82, -218, 115, 15, 12, -52, 13, 1, 307, 241, 126, 160, 45, 106, -155, 220, 378, 143, -171, 143, -14, -14, 98, 176, -19]
4585a9k4J96j60L37j57Lp5L4J03o3k86L8jJ67J6K06j5m10J45p9K5K03l1j34l9
4610b0r0L08O5l47L01J20m88K31K67j37k32l4R3J00q6j6K2k24J42k73M33m0Q1
4633A76j81k81K43j37K99j99M0J46mj25K3j5j55k5l0K66k56L4k4j79L07J13l05
4656b69K20j67k48K76nL49l13k05M00j60J8j19j68J85j2K14k31j57O12l28J93
4677H5j25P0p4j16J08l4j72J21K66j10k77K22R3M6l8p4J39j66J7k3J07j26J21
4700F0j55j3J11R8J7N9k01K31m2J31p9j30j89J16J99L4O0j90K22k0J11m07p3K2
4724b8J77J43j57o1j95L55R4n17J69L90m80P8J06Q6o3L3k45J56K04j56J19J49
4746C57m90M81l37R7o1m6L69n44M09l04j67P1K66J18l22k9J59J75K4k93O1m77
$$ y = [-19, -43, 153, -7, 330, 173, 176, 101, 135, 238, 175, -111, -73, -74, 93, 109, 315, 300, -110, 35, -44, -19, 184, 153, 19, -20, -110, 198, 263, -84, 217, 337, -151, 80, 347, 210, -22, -56, 37, 137, 51, 35, 57, -167, -25, -298, 135, 95, 176, -5, -286, -43, -180, 119, -80, -40, 106, 102, -23, 0, -15, -170, -195, -225, 41, -215, -181, -205, -384, -77, 36, -269, -49, -216, -464, -188, -193, 156, -157, -362, 38, -122, -104, -223, -391, -206, -218, -4, -235, -392, 220, -108, 85, -40, 30, -44, -160, -52, -86, -258, -137, 129, 19, -258, -36, 57, 103, 65, -9, 130, -36, -19, -42, 65, -61, 60, -95, -108, 3, 101, 118, 177, -24, 207, 165, 296, 217, 87, -102, 14, 213, 247, 307, 117, 339, 319, 430, 23, -50, -28, 149, 292, 135, 74, -121, 234, 328, -189, -20, 370, -110, -32, 74, 160, 97, 130, -115, 41, 245, 89, 208, 357, -133, 348, 11, 108, 47, 1, 370, -174, 235, -69, -236, -165, 101, 219, -103, -132, 27, 202, 226, -67, -6, -483]
4768d83N07J8K89o58J79J38m02K69p1J11j42L42K91n85j97K92K1K96k39j18O1
4789h1P2J5K03m77K72l3L5j47L19j31l31K26r8J20Mk36L84k87R7J53O8k01nK69
4813B10k11k35K61k38J49J04M3M2j81L45n45K50j64M70l16L72m54K71m7k75L70
4834B21m6K1m94K21K84l64N1J32j23R4O0l82K73J14k78L87k18K36j94J42j92K1
4856c4j54L71j13p8Kp4N2o3P8m8K00m20M32rl94M59m57K59J23m33K76j09P7K82
4880B25l11J15j75L09l45k05K62k23L35J0P0pm9J0j97K53Q4k34r4M61m34K01m05
4903c44K18m8p5L30K34l11j40k48M09j81Q7J01j34J57J57q6l9%k32j20J7K02k
4926d8K73M1j29j32o4O0j79J49Q5k37L21j62p4Q4J36k11R9J17J55k74N6l5M8L
$$ y = [-483, 24, 42, 331, -327, -148, -10, -412, -143, -214, -103, -245, 97, 388, -197, -394, -102, -81, 215, -24, -142, -81, -9, 6, 209, -268, 4, -29, 6, -141, 178, 47, -284, -58, -156, -36, -32, -268, 116, -171, -74, 79, 147, -54, -59, 210, -1, -236, 25, -213, -64, 40, 83, 125, -56, 289, -256, -6, -170, 300, -16, 356, -98, 173, 126, -149, 221, 175, 196, -298, -77, 207, -157, -106, 26, -97, -3, 57, -325, -52, 62, -216, 171, -47, 189, -5, 137, -55, -34, -188, 183, 70, -8, -6, -80, -28, -91, -13, -61, 139, -281, 151, 142, -252, 207, -250, 9, 132, -301, -25, -134, -57, 225, -86, 29, -146, 163, -182, -387, -125, -348, -13, -3, 67, 60, 11, 21, -176, 77, 161, -73, -167, 294, -140, 61, -344, -126, -174, -249, 81, 315, 4, -136, -384, 25, -156, -69, 32, -102, 55, 212, 126, 87, 87, -145, -265, -248, -46, -48, 225, 266, 137, 5, -59, 1, -178, -29, 56, -181, 140, -22, -96, -12, 124, -87, 12, 129, 284, 10, 66, 31, 79, 82]
4950H2j26nL25j90pJ95K6k41K10R0k33r9k29K53j23p6J12K87k25Q5M1j78J09K31
4974C14l1k87j33K78k96j6M33n26N18k54R1j04J60m7J24l47J37j57L76q4L6r1
4996I4l26L86j63K09j04M1%j82J15K54l11L47m95K37q9O1r0m7JK9j95P4m2r3K89
5021@k24K05N0j44k46K20K84k21j13rK20m2j38K02p2k33K74K22l31J78k39j96
5043c53L59r7p0J62k84J63J57oK10l77J53k01K89J18j12p5Mj41J56p9J62k58M0
5066h0J32m62O88m92J94L9r6N2K58k3J44j89k29L18M6m01K99j47J74J4lJ38k10
5089A64j93J61q1J99rj44j67N6k4J85j67K61l5k60k0J98l00Q7L17l6J87m56L48
5112B71Q2m07KJ4J24MK0o0k5M05m60M66k75j59j0J0K22r4L21m29M01o06mp8K14
$$ y = [82, -44, -49, 276, 86, 79, 274, 300, 59, 269, 359, 126, 27, -202, 51, -72, -148, -36, 251, 26, 111, 152, -26, 83, 314, 283, -4, -137, 141, -155, -171, 262, -264, 254, 0, 91, -13, 147, 100, 224, -123, 14, -143, 233, 149, 185, 94, -232, 154, -9, 200, 96, 137, 137, -45, 70, 324, 13, 360, -135, 102, 13, 74, -16, -63, -62, -33, -228, -154, -196, -289, 0, -224, -19, 31, -113, -359, -139, 145, -76, -189, -198, 22, -20, -158, 44, -28, -261, 13, 235, -96, 82, -157, -353, 6, -91, -161, 1, -283, -120, 37, 31, 241, -136, 17, -184, 105, 223, 111, 36, 40, -101, 55, -24, 138, -120, -80, 52, -410, 278, -214, -20, 19, -77, -25, 233, 210, 354, 165, -64, 254, 300, -101, 198, 51, 225, 239, 236, 374, 164, -29, 132, 51, 250, 241, 97, -70, -14, -38, 147, -20, 241, 206, -54, -74, 124, -176, -89, 228, 192, 379, -77, 271, 353, -54, -52, -38, 86, 90, 110, 50, 25, 430, -30, 436, 161, 2, -8, 2, 224, 130, 451, 22, 423, -183, -187, -265, -51]
5137e1K61k79J22K0R8j66M0n4j77L66k57q8K15k93J87P9j99J46L9j17q9Q5M5l43
5161d10L7K72j7M18l90K88l08J06Q2j14J29k67K02l27J62l8N6Q3M5j78K07p4l91
5184d27N2J55n3K65j98J31m7o8K65j63J57rpJ8P7Nj04Nq7J90l97K26Q5l06j4M64
5210B15k2K26k70l9M3j54m5R7k39K16N6Kj65k12L72k53J53L93j46l10r2O14n61
5233a21k1K07j27L07j45j51R6J1J29j5K7j08l7K13l62P8K98j35j83R1k99M45j95
5256Cj79J77J70k51l5K92j62j65J35L5K82j04m45J20j51M48k48K9q8O8L05k39
5278cK01q8L0k76K90l42L29M5j49qj55R9j70L14j47l27L92r1j35M3K9m1j0K85
5302A15k56j12J85J50m0J13j00pQ6m6j06J63q2l38J61j87J48K28k53L04j46m2
$$ y = [-51, 210, -69, 53, 73, 171, 5, 45, -9, -186, 180, -77, -165, 50, -243, -56, 23, -176, -30, 9, -108, -197, -112, -67, -410, -373, -101, -118, 300, -90, 198, -110, -4, 78, -36, 93, -174, 28, -299, -137, -175, -119, -36, 9, -169, 38, -36, -427, -375, -220, -273, -8, -206, -75, -122, -190, 75, -88, 69, 60, 53, 71, 148, 153, 49, 54, -33, 157, -240, -14, 71, -235, -249, 215, 193, 419, 149, 110, 153, -1, -46, 51, -188, 28, 84, 86, -79, -291, 81, -172, -19, 374, 228, -82, -174, 440, -121, -142, 65, -62, 245, 100, -51, 45, 56, 185, 170, 197, 89, 52, 265, -97, -19, 279, 144, -39, 52, -247, 198, 3, -176, 1, 171, -80, -115, 177, 15, -150, -15, 20, 302, 198, -247, -127, -278, 170, -78, -49, -137, -69, 236, -3, 198, 110, 140, -136, 154, -188, 141, 186, 37, 29, -126, -27, -197, 117, -30, -357, 35, -56, -191, -148, -119, -160, -170, 115, -141, -253, -68, 82, 42, 155, 55, 48, 134, 88, -18, 145, 63, -275, -114, -301, -153, 75, -178, 126, -20, -62]
5324f2l4L13k78o1J61j07K02J0o3k23L25k99M70l78K50L6l91N5J07J66O4j48l86
5347b71P7M20l79J03j2J63n9p8J82K51l83O4J9oK62j80Lk05O3L8l82L12K77k09
5371G0j84R9R4Q4k83k12N15J5j71P0l79M45l43P88q67K55R4r6K30k59l0L4K65
5394B34l35K0j70M51k2j74M6j75J04j45J64j27o1j62N63l34J65J85k61j9L17l19
5416e5j40K03J32k46j26P9J25J36k73j78M35K1k76J39K8j30L0M7k86M79j35n6
5438d7K9l62M19q5K16m77J11m4L15k22R9L6p6j20K00K3R1j53p3LL47k62l7r5L05
5463A41j2o9l54J10K62k51R0R6Q7j56j94K87L6k22O2J6K82k75J97l92N96k19P6
5486A94l10N16n86K86j04n7Q1M5R3R8l27j15L90o6K3J66k38k89J73K6N9Pj67R8
$$ y = [-62, -96, 217, -61, -122, 39, -68, 134, 144, 81, -142, 183, -116, 354, -24, 226, 262, -129, -74, 33, 199, 263, 115, -271, -194, 226, -153, -50, -62, 101, 42, -36, 146, 397, 14, 78, 97, 91, 353, 173, 176, -29, 34, 72, -310, 2, 279, 70, -114, -15, 79, 163, -120, -332, 183, 198, 27, 97, -282, 163, -180, 608, -259, -4, 90, -6, 224, -35, -65, -31, 234, -101, -81, -251, 200, 178, 4, 50, -125, -21, -166, -2, -129, -190, -352, 211, -123, 42, 227, -34, -53, 264, -55, -195, 8, 140, -106, -232, -153, -28, 108, -165, -343, 92, 113, -163, -24, 4, -126, -96, -49, -335, 144, 9, -47, -18, -380, 39, -46, 170, -307, -196, -240, 75, -147, -48, -12, -88, -208, -8, 15, 106, -47, -120, -117, 230, -32, -69, -164, 141, 129, 60, -294, -184, 78, -173, -83, 13, 100, -56, -250, 37, 73, -149, -87, -71, 211, -64, 133, -259, 337, 118, 194, -116, 400, -186, 100, -4, -61, 20, 65, 158, 256, -71, -186, 204, 138, 161, 327, 89, -200, -27, -1, 58, 65, -102, -4]
5510dJ33j65L59m08j5R5J67j12L4l8j36k5j76L46p0O5N7k52J09J2Ok06K63k99
5534b60L00j55P2J26k83J03J50q7p5r9Q8j56J06J4l2K95k93R3p0j04M50L5l12
5557i4k03J20N28j58k86L23j38M8J70l70Q7ro7j73K63K24j48j66K60k95O1K20
5579A97j76o0k28K64N0N8k60K08Q8j35J11j59r9J66P8j29NK7q7O0J56k07J62J17
5603B07k29J40KJ04l59P0J0j05L81m07L96j34o0K56j0m57L04k60J14k6L03j71
5625F9J1J17r6J49r5j65j1R3L8K22n11P3j31M52J09k79r3J71j0jmj68p8K92j53
5650AR2p1r1R8J1K9k57L35l18J56L4L63j15l54J4J7k50L18P9m0R8n27K31Q3Ok6
5676h4o4K01l6k92K20L51l94J25j56L21j34J66m25J23j79K78m1K1r2J76k9j23
$$ y = [-4, 129, -36, 323, -85, -100, -5, 162, 50, 84, 46, -90, -115, -291, 55, -15, 50, 107, -145, -36, -24, -18, -224, 39, -260, 40, -115, -43, 83, -200, -97, 53, -34, -109, -208, -120, -276, -170, -156, -188, 107, -186, -93, -163, -267, 183, 218, -94, -297, -177, 351, 193, -93, 230, 92, 140, 310, -60, 27, 18, -49, -222, 41, 265, 117, -49, 211, -84, -23, 197, 21, -39, -267, -3, 47, 105, -155, 53, 141, 6, 117, -42, -141, 25, 103, -26, -21, 6, -81, -21, 135, -72, 90, 207, -22, 118, 120, 224, -135, -65, -55, -160, 221, -186, 210, 76, 16, 272, 262, -195, 109, -151, -37, -63, 240, 69, 80, 197, 101, 250, 155, -10, -21, 72, 110, 332, -179, -106, -237, 215, 324, 45, -48, 123, 113, 112, 108, -60, -138, 154, 1, 93, 22, -69, 29, 40, 69, -188, 147, -171, -15, 19, 382, 267, -87, -73, -56, -306, 12, 91, 51, 149, -378, -147, -64, -58, -84, -148, 53, 17, -275, -55, 296, -98, 27, -129, 192, 58, 224, -201, -78, -257, 21, -20, 1, -91, 85, 56, -67]
5698f7J25k23j58L53r6j93K45k57K54R6j66Pj68K21K76k92j18J2P0K52m54J55
5720a26K96l85QJ91K55j91M5J35j12j73J29l31J18N21m44L31O4k54%J88Ql61K26
5743A38ML7J48k93J19l35J41M20m77kL10j60J56nk74K09Lj3J36L1k54k18J92K00
5767B13k76J84L4l73M84j00Nj43J09k18j05M85j01j20j2p9J31j78k5R7ql0R7k41
5791a70J85j50J19O1M9l12K62r0J87j99Q6k22J16j66L75l65K88l4k77J42m5P1
5813h9k24K58j94L19j22R0j01q4R3r1J23L44m49O8J57l30K35J90l15j29m7K32
5835f6K41k61K46m05J0o2K62K4M0K23k91k00J49M11l23k8o0P9P3M14n69J5R5J27
5859A44p2rp0J42k1k35M8O9J97Q6k45n0%K15j46j5M3k8J11j71QNM0L9M2Lk36m1
$$ y = [-67, 58, -165, -323, 30, -66, -259, -14, -271, -17, 79, -87, -80, -248, -27, 249, -43, -161, -149, -79, 173, -281, -126, 170, -215, -207, -16, 239, 48, 93, 228, 116, -57, 72, -259, -141, 380, -64, 267, 331, 77, 77, 265, 273, -88, 138, 142, 179, 327, 34, 153, -182, -41, 379, -98, -100, 210, 50, 206, 201, -73, 136, 139, 126, 262, 293, 39, -179, 13, 213, -63, 121, 155, -218, 266, 166, 171, 28, 137, -81, -186, 299, 198, 78, 66, -13, 118, -60, -85, 12, 4, -26, 71, -170, 15, -135, -16, 45, 94, -218, 44, -46, 141, -58, 28, -194, -78, -244, 131, -234, 54, 20, -257, -115, -160, -89, -313, -55, -249, 70, -52, 38, -63, -147, -54, -145, -22, 322, -127, -59, 98, -232, 3, 193, -122, -251, -298, -66, 175, -86, 160, -245, -235, -297, -35, -11, 29, 252, -39, -239, -90, 321, -2, -30, -90, -11, 62, 476, -93, -78, 17, 144, 72, 63, -7, 135, 114, -121, -73, -4, 193, 279, 34, -16, -16, 199, 53, 38, 81, 53, 164, -7, 1, 6, 46, 85, 127, 130, -106, -147]
5887a47L46k61k2N5r2N8L65k04k21J50k81K66k15M11j14K1L32m37J67k21l1l06
5909c81M42P3L1k07J26l34K84j7J65l20J10M20k66q0q8K58j41j37j1L51l65O5
5931b2L30m06j10P3o1L5j07J52R2r8Q3L6J36k30p2K2N3J06k62K17J26l04J04j27
5955b34R7P5k4r4L27n32M06m9p8j21J78O6J27J09l65K53k26P9J05N2K54m42J90
5978A53j60Nj01Q1Q3j39M5K10k95q9K43qK03q4j97K25j42o8J10M4l1L3J53k85
$$ y = [-147, 199, -62, -84, -29, -121, -63, 302, 98, -123, 27, -254, 12, -203, 208, 94, 115, 447, 10, 177, -44, -75, -381, 61, 134, 165, -42, 84, -250, 34, 17, 182, -138, -28, 392, 126, 46, -42, 216, 75, -62, -73, 278, -87, -22, 308, -98, -208, -135, -196, -161, -268, -116, -24, -122, -39, -3, 133, -97, -169, -147, -94, 12, -250, -33, 93, -211, -107, -234, -137, -62, -86, -180, 147, -385, 21, -28, -106, -227, -49, 17, 144, 253, -112, 141, -85, -6, 99, 151, 405, -37, 153, -7, -2, -103, -22, 61, -78, -33, 177, -118, -207, 36, 28, 231, 147, -50, 175, 33, -35, 75, 119, 88, 121, 274, -11]
$$ [...]
8191A81
##END NTUPLES=NMR FID
##END=
