##TITLE=1H_LR-700-C1
 CDCl3, 8 sc, 
 15.11.2019
##JCAMPDX= 6.0         $$ Bruker NMR JCAMP-DX V2.0
##DATA TYPE= NMR FID
##DATA CLASS= NTUPLES
##ORIGIN= UXNMR, Bruker Analytische Messtechnik GmbH
##OWNER= root
$$ XWIN-NMR		Version 3.5
$$ Fri Nov 15 15:25:40 2019 Russian Standard Time (UT+4h)  she@DPX200
##.OBSERVE FREQUENCY= 200.1315
##.OBSERVE NUCLEUS= ^1H
##.DELAY= (6, 6)
##.ACQUISITION MODE= SIMULTANEOUS
##.ACQUISITION SCHEME= undefined
##.AVERAGES= 8
##.DIGITISER RES= 18
##SPECTROMETER/DATA SYSTEM= spect
##.PULSE SEQUENCE= zg30
##.SOLVENT NAME= CDCl3
##.SHIFT REFERENCE= (INTERNAL, CDCl3, 0, 15.7039)
##AUDIT TRAIL= $$ (NUMBER, WHEN, WHO, WHERE, WHAT)
$$ ##TITLE= Audit trail, XWIN-NMR		Version 3.5
$$ ##JCAMPDX= 5.01
$$ ##ORIGIN= Bruker BioSpin GmbH
$$ ##OWNER= she
$$ F:/spectra/data/she/nmr/H-F/1/audita.txt
$$ ##AUDIT TRAIL=  $$ (NUMBER, WHEN, WHO, WHERE, WHAT)
(   1,<2019-11-15 15:24:31.15 +0400>,<she>,<DPX200>,
      <created by zg, POWCHK disabled, PULCHK disabled
       configuration hash MD5:
       00 E9 B6 7A A2 85 ED C7 34 08 36 98 17 FE 4E 26
       data hash MD5: 16K
       D1 AF E0 AC E7 7A BD 8D 2F 74 16 CE 29 38 FB A3>)
$$ ##END=
$$ 
$$ hash MD5
$$ 6E 5B B2 7C AA 57 89 B8 76 BC 6B 05 1C AA 5E E0
##$RELAX= 
##$RELAX= 
##$RELAX= 
##$RELAX= 
##$RELAX= 
##$RELAX= 
$$ Bruker specific parameters
$$ --------------------------
##$DU= <F:/spectra>
##$EXPNO= 1
##$NAME= <H-F>
##$PROCNO= 1
##$TYPE= <nmr>
##$USER= <she>
##$AMP= (0..31)
100 100 100 100 100 100 100 100 100 100 100 100 100 100 100 100 100 100 
100 100 100 100 100 100 100 100 100 100 100 100 100 100 
##$AQSEQ= 0
##$AQ_mod= 1
##$AUNM= <au_zg>
##$AUTOPOS= <>
##$BF1= 200.13
##$BF2= 200.13
##$BF3= 200.13
##$BF4= 200.13
##$BF5= 200.13
##$BF6= 200.13
##$BF7= 200.13
##$BF8= 200.13
##$BYTORDA= 1
##$CFDGTYP= 0
##$CFRGTYP= 5
##$CHEMSTR= <none>
##$CNST= (0..31)
1 1 145 1 1 1 1 1 1 1 1 1 1 1 1 1 1 1 1 1 1 1 1 1 1 1 1 1 1 1 1 1 
##$CPDPRG= <>
##$CPDPRG1= <>
##$CPDPRG2= <>
##$CPDPRG3= <>
##$CPDPRG4= <mlev>
##$CPDPRG5= <mlev>
##$CPDPRG6= <mlev>
##$CPDPRG7= <mlev>
##$CPDPRG8= <mlev>
##$CPDPRGB= <>
##$CPDPRGT= <>
##$D= (0..31)
0 1.2 0 0 0 0 0 0 0 0.06 0 0.03 0 0 0 0 0.0002 0 0 0 0 0 0 0 0 0 0 0 0 
0 0 0 
##$DATE= 1573817070
##$DBL= (0..7)
120 120 120 120 120 120 120 120 
##$DBP= (0..7)
150 150 150 150 150 150 150 150 
##$DBP07= 0
##$DBPNAM0= <>
##$DBPNAM1= <>
##$DBPNAM2= <>
##$DBPNAM3= <>
##$DBPNAM4= <>
##$DBPNAM5= <>
##$DBPNAM6= <>
##$DBPNAM7= <>
##$DBPOAL= (0..7)
0.5 0.5 0.5 0.5 0.5 0.5 0.5 0.5 
##$DBPOFFS= (0..7)
0 0 0 0 0 0 0 0 
##$DE= 6
##$DECBNUC= <off>
##$DECIM= 24
##$DECNUC= <off>
##$DECSTAT= 4
##$DIGMOD= 1
##$DIGTYP= 9
##$DL= (0..7)
0 120 120 120 120 120 120 120 
##$DP= (0..7)
150 150 150 150 150 150 150 150 
##$DP07= 0
##$DPNAME0= <>
##$DPNAME1= <>
##$DPNAME2= <>
##$DPNAME3= <>
##$DPNAME4= <>
##$DPNAME5= <>
##$DPNAME6= <>
##$DPNAME7= <>
##$DPOAL= (0..7)
0.5 0.5 0.5 0.5 0.5 0.5 0.5 0.5 
##$DPOFFS= (0..7)
0 0 0 0 0 0 0 0 
##$DQDMODE= 0
##$DR= 18
##$DS= 0
##$DSLIST= <SSSSSSSSSSSSSSS>
$$ [...]
##$SUBNAM2= <"">
##$SUBNAM3= <"">
##$SUBNAM4= <"">
##$SUBNAM5= <"">
##$SUBNAM6= <"">
##$SUBNAM7= <"">
##$SUBNAM8= <"">
##$SUBNAM9= <"">
##$SW= 24.0689530833862
##$SWIBOX= (0..15)
0 0 2 0 0 0 0 0 0 0 0 0 0 0 0 0 
##$SW_h= 4816.95568400771
##$TD= 16384
##$TD0= 1
##$TE= 0
##$TE2= 300
##$TE3= 300
##$TEG= 300
##$TL= (0..7)
0 120 120 120 120 120 120 120 
##$TP= (0..7)
150 150 150 150 150 150 150 150 
##$TP07= 0
##$TPNAME0= <>
##$TPNAME1= <>
##$TPNAME2= <>
##$TPNAME3= <>
##$TPNAME4= <>
##$TPNAME5= <>
##$TPNAME6= <>
##$TPNAME7= <>
##$TPOAL= (0..7)
0.5 0.5 0.5 0.5 0.5 0.5 0.5 0.5 
##$TPOFFS= (0..7)
0 0 0 0 0 0 0 0 
##$TUNHIN= 0
##$TUNHOUT= 0
##$TUNXOUT= 0
##$USERA1= <user>
##$USERA2= <user>
##$USERA3= <user>
##$USERA4= <user>
##$USERA5= <user>
##$V9= 5
##$VALIST= <valist>
##$VCLIST= <CCCCCCCCCCCCCCC>
##$VD= 0
##$VDLIST= <DDDDDDDDDDDDDDD>
##$VPLIST= <PPPPPPPPPPPPPPP>
##$VTLIST= <TTTTTTTTTTTTTTT>
##$WBST= 1024
##$WBSW= 4
##$XGAIN= (0..3)
0 0 0 0 
##$XL= 0
##$YL= 0
##$YMAX_a= 885896
##$YMIN_a= -724066
##$ZGOPTNS= <>
##$ZL1= 120
##$ZL2= 120
##$ZL3= 120
##$ZL4= 120
##$ABSF1= 10
##$ABSF2= 0
##$ABSG= 5
##$ABSL= 3
##$ALPHA= 0
##$AQORDER= 0
##$ASSFAC= 0
##$ASSFACI= 0
##$ASSFACX= 0
##$ASSWID= 0
##$AUNMP= <proc_1d>
##$AZFE= 0.1
##$AZFW= 0.1
##$BCFW= 1
##$BC_mod= 2
##$BYTORDP= 1
##$COROFFS= 0
##$CY= 11.3945322036743
##$DATMOD= 1
##$DC= 2
##$DFILT= <>
##$DTYPP= 0
##$F1P= 16.9975609425685
##$F2P= -3.02152046262296
##$FCOR= 0.5
##$FTSIZE= 0
##$FT_mod= 4
##$GAMMA= 1
##$GB= 0.15
##$INTBC= 1
##$INTSCL= 1
##$ISEN= 128
##$LB= 0.24
##$LEV0= 0
##$LPBIN= 0
##$MAXI= 10000
##$MC2= 0
##$MEAN= 0
##$ME_mod= 0
##$MI= 1.114404
##$NCOEF= 0
##$NC_proc= 0
##$NLEV= 6
##$NOISF1= 3.799351
##$NOISF2= 2.8
##$NSP= 1
##$NTH_PI= 0
##$NZP= 0
##$OFFSET= 15.70392
##$PC= 1
##$PHC0= -9449.826
##$PHC1= 11.40088
##$PH_mod= 1
##$PKNL= yes
##$PPARMOD= 0
##$PSCAL= 0
##$PSIGN= 0
##$REVERSE= no
##$SF= 200.130013532006
##$SI= 16384
##$SIGF1= 3
##$SIGF2= 2
##$SINO= 400
##$SIOLD= 16384
##$SREGLST= <1H.CDCl3>
##$SSB= 0
##$STSI= 0
##$STSR= 0
##$SW_p= 3612.71676300578
##$SYMM= 0
##$S_DEV= 0
##$TDeff= 0
##$TDoff= 0
##$TI= <>
##$TILT= no
##$TM1= 0
##$TM2= 0
##$TOPLEV= 0
##$USERP1= <user>
##$USERP2= <user>
##$USERP3= <user>
##$USERP4= <user>
##$USERP5= <user>
##$WDW= 1
##$XDIM= 8192
##$YMAX_p= 0
##$YMIN_p= 0
$$ End of Bruker specific parameters
$$ ---------------------------------
##NTUPLES= NMR FID
##VAR_NAME=  TIME,          FID/REAL,        FID/IMAG
##SYMBOL=    X,             R,               I
##VAR_TYPE=  INDEPENDENT,   DEPENDENT,       DEPENDENT
##VAR_FORM=  AFFN,          ASDF,            ASDF
##VAR_DIM=   8192,          8192,            8192
##UNITS=     SECONDS,       ARBITRARY UNITS, ARBITRARY UNITS
##FACTOR=    0.0002076,     1,               1
##FIRST=     0,             0,               0
##LAST=      1.7004516,     0,               0
##MIN=       0,             -724066,         0
##MAX=       1.7004516,     885896,          0
$$ Real data points
##PAGE= N=1
##DATA TABLE= (X++(R..R)), XYDATA
$$ plain form
0 0 0 0 0 0 0 8 0 0 -8 8 -8 8 -16 17 -22 26 -30 38 -47 52 -60 77 -90 100 -116 135 -159 177 -199 233 -260
31 -260 291 -330 368 -416 465 -513 575 -639 708 -782 869 -962 1066 -1175 1302 -1446 1603
48 1603 -1776 1985 -2218 2494 -2809 3195 -3668 4247 -4973 5872 -6800 6182 25105 725565
62 725565 599222 -235901 -214772 183148 -27559 -435770 -131148 324055 217153 -19441
72 -19441 103781 93968 -138807 55298 540091 345393 -301033 -247096 342835 259792 -263350
83 -263350 24461 840286 760964 -92248 -362162 55607 173888 24098 301700 664423
93 664423 407938 -5250 112918 314674 110648 71378 484392 528766 -49333 -209457
103 -209457 403498 711413 287345 102968 481087 475394 -107686 -241589 293267 549920
$$ packed form
0@%%%%%Qq%qJ6j6J6k4L3l9M8n6O8q5R9j12J37j67J90k16K51k94L36l76M32m93
31b60N51o21O98p84Q81r78J088j214J347j490J651j831K028k241K477k748L049
48A603l379L761m203M712n303O004o863P915r220J0845j2672J2982J8923P00460
62G25565j26343q35123K1129L97920k10707m08211L04622M55203j06902k36594
72a9441J23222r813k32775J94105M84793j94698o46426N3937N89931q3043n23142
83b63350K87811Q15825p9322q53212k69914M17769J18281j49790K77602L62723
93F64423k56485m13188J18168K01756k04026l9270M13014M4374n78099j60124
103b09457O12955L07915m24068j84377L78119n693n83080j33903N34856K56653
$$ plain form
113 549920 328708 375521 635542 365667 -173237 -97417 371567 399065 176584 329733
123 329733 505288 181826 -78897 277384 601821 299913 -13634 170696 261877 -51214
133 -51214 -37818 519325 703974 208519 -70293 196264 227057 -161684 -160130 353546 534472
144 534472 204874 58073 197530 99622 -118755 46265 313219 138081 -132100 33932
154 33932 244163 38191 -89995 262263 440076 -39026 -453865 -189423 176970 70269
164 70269 -60488 174801 293096 -17576 -258768 -144801 -69321 -159826 -60014 155769 40853
175 40853 -229294 -130578 124519 -14898 -297440 -164668 86055 -121815 -448764 -260249
185 -260249 145568 128715 -131516 -144031 -84967 -280505 -432021 -235286 -22393 -81748 -130283
$$ packed form
113E49920k21212M6813K60021k69875n38904P5820M68984K7498k22481J53149
123C29733J75555l23462k60723L56281L24437l01908l13547J84330R1181l13091
133e1214J3396N57143J84649m95455k78812K66557L0793l88741J554N13676J80926
144E34472l29598j46801J39457r7908k18377J65020K66954j75138k70181J66032
154C3932K10231k05972j28186L52258J77813m79102m14839K64442L66393j06701
164G0269j30757K35289J18295l10672k41192J13967P5480r0505R9812K15783j14916
175D0853k70147R8716K55097j39417k82542J32772K50723k07870l26949J88515
185b60249M05817j6853k60231j2515N9064j95538j51516J96735K12893n9355m8535
$$ plain form
196 -130283 -14739 -65867 -322694 -346233 -103645 -80441 -311103 -316124 -78616 -67753 -266965
207 -266965 -224128 422 -50801 -312114 -349034 -210608 -237274 -309258 -139190 57399 -46096
218 -46096 -243463 -230294 -183375 -302231 -344646 -150195 -26963 -152318 -226507 -100329 -62324
229 -62324 -212954 -249466 -111119 -117397 -295286 -294379 -80692 -287 -108001 -119771 -25159 -85248
241 -85248 -261808 -276426 -145801 -96705 -106191 -26696 38718 -48372 -142987 -100797 -72012 -160284
253 -160284 -176860 -33254 37504 -68931 -107163 33530 106820 -18973 -126348 -81668 -43805
264 -43805 -89739 -67617 57186 116939 69346 41769 41269 -24179 -88539 -31153 57216 38456
276 38456 7893 95984 182282 112126 1001 18079 83379 52081 -5117 33481 111492 131575
$$ packed form
196a30283J15544n1128k56827k3539K42588K3204k30662n021K37508J0863j99212
207b66965M2837K24550n1223k61313l6920J38426k6666p1984J70068J96589j03495
218d6096j97367J3169M6919j18856m2415J94451J23232j25355p4189J26178L8005
229f2324j50630l6512J38347o278j77889R07K13687Q0405j07714j1770R4612o0089
241h5248j76560j4618J30625M9096r486P9495O5414q7090r4615M2190K8785q8272
253a60284j6576J43606P0758j06435l8232J40693P3290j25793j07375M4680L7863
264d3805m5934K2122J24803N9753m7593k7577n00o5448o4360N7386Q8369j8760
276C8456l0563Q8091Q6298p0156j11125J7078O5300l1298n7198L8598P8011K0083
$$ plain form
288 131575 134393 162916 154265 86063 43150 53286 53088 54139 126333 214358 199897 124617 119797
301 119797 162798 131367 49401 45875 119544 160978 156425 172997 201573 182695 136403 115684
313 115684 107321 85699 85915 130507 170909 177469 188480 207632 176622 97484 55657 86699 123988
326 123988 124737 128628 162222 187393 175047 145828 116831 84490 61873 68517 93203 115559 139560
339 139560 161898 154935 114521 82394 78324 66946 33596 25195 72014 126918 134701 107401 84038
352 84038 68292 42680 14830 5263 16141 35611 55514 71378 77501 69126 44820 5849 -31372
365 -31372 -42243 -21753 5592 15529 16240 24883 33149 18583 -21398 -61302 -77105 -67931 -47615
378 -47615 -29131 -13669 -3182 -5852 -27479 -58560 -80971 -89900 -94653 -98471 -84858 -50055 -19906
$$ packed form
288A31575K818K8523q651o8202m2913J0136j98J051P2194Q8025j4461p5280m820
301A19797M3001l1431q1966l526P3669M1434m553J6572K8576j8878m6292k0719
313A15684q363k1622K16M4592M0402O560J1011J9152l1010p9138m1827L1042L7289
326A23988P49L891L3594K5171j2346k9219k8997l2341k2617O644K4686K2356K4001
339A39560K2338o963m0414l2127m070j1378l3350q401M6819N4904P783k7300k3363
352H4038j5746k5612k7850r567J0878J9470J9903J5864O123q375k4306l8971l7221
365c1372j0871K0490K7345R937P11Q643Q266j4566l9981l9904j5803R174K0316
378d7615J8484J5462J0487k670k1627l1081k2411q929m753l818J3613L4803L0149
$$ plain form
391 -19906 -24439 -59489 -91583 -103062 -106546 -117092 -123674 -109170 -79133 -57316 -56016 -68160 -84983
404 -84983 -108461 -134694 -147453 -135008 -107977 -88687 -83893 -82943 -78380 -79898 -100272 -132473 -152692
417 -152692 -145916 -120998 -96197 -81212 -76286 -77904 -86154 -99788 -115742 -129455 -133886 -123608 -104366
430 -104366 -83348 -64013 -52800 -61736 -89859 -113716 -113302 -101853 -99027 -98139 -79431 -48807 -33056
443 -33056 -41366 -59054 -75824 -89810 -93588 -82947 -64278 -47834 -32809 -21800 -21000 -28587 -35697
456 -35697 -45351 -63500 -72134 -52471 -17231 1678 2537 5467 6516 -8299 -26157 -27529 -21412 -23203
470 -23203 -14935 16834 44475 39972 21637 18384 18123 3645 -5517 8052 24398 28869 40239
483 40239 63796 70605 52014 36089 32080 21470 11919 33346 69768 77967 63669 69633 85940
$$ packed form
391a9906m533l5050l2094j1479l484j0546o582J4504L0037K1817J300j2144j6823
404h4983k3478k6233j2759J2445K7031J9290M794R50M563j518k0374l2201k0219
417a52692O776K4918K4801J4985M926j618q250j3634j5954j3713m431J0278J9242
430a04366K1018J9335J1213q936k8123k3857M14J1449K826Q88J8708L0624J5751
443c3056q310j7688j6770j3986l778J0641J8669J6444J5025J1009Q00p587p110
456c5697r654j8149q634J9663L5240J8909Q59K930J049j4815j7858j372O117j791
470b3203Q268L1769K7641m503j8335l253k61j4478r162J3569J6346M471J1370
483D0239K3557O809j8591j5925m009j0610r551K1427L6422Q199j4298N964J6307
$$ plain form
496 85940 71097 36897 31646 52574 61779 60205 73187 88823 86302 83264 90947 80010 46095
509 46095 38247 66714 79091 62646 75117 122052 126773 72981 40706 64790 80408 55967
521 55967 48866 83120 106847 94206 82668 83052 70474 57723 70919 78209 48804 32375 72740
534 72740 110963 90083 60938 78212 87421 39485 2074 36603 81629 73108 55583 71859
546 71859 78323 47251 30435 44200 38528 13929 30764 70481 56534 10156 22102 71375
558 71375 63535 10587 1665 21742 1114 -23485 20217 75670 53864 1593 1552 12876 -21713
571 -21713 -41466 5604 38991 -1137 -32489 4424 29590 -10646 -39292 -14306 -4829 -35744
583 -35744 -38164 -14112 -30951 -56563 -8276 51865 2165 -94450 -91114 -26436 -34921 -78270 -34852
$$ packed form
496H5940j4843l4200n251K0928R205j574J2982J5636k521l038P683j0937l3915
509D6095p848K8467J2377j6445J2471M6935M721n3792l2275K4084J5618k4441
521E5967p101L4254K3727j2641j1538L84j2578j2751J3196P290k9405j6429M0365
534G2740L8223k0880k9145J7274R209m7936l7411L4529M5026q521j7525J6276
546G1859O464l1072j6816J3765n672k4599J6835L9717j3947m6378J1946M9273
558G1375p840n2948q922K0077k0628k4599M3702N5453k1806n2271m1J1324l4589
571b1713j9753M7070L3387m0128l1352L6913K5166m0236k8646K4986R477l0915
583c5744k420K4052j6839k5612M8287O0141m9700r6615L336O4678q485m3349M3418
$$ plain form
596 -34852 35921 -2468 -94359 -95292 -32550 -23229 -55286 -58312 -57744 -78881 -63140 -12065 -25331
609 -25331 -92161 -78325 1625 -19739 -136087 -150671 -37087 11179 -56871 -80147 -17556 -19428
621 -19428 -110772 -142456 -74310 -22566 -29509 -39711 -61444 -110739 -100393 -7427 19676 -82595
633 -82595 -139764 -55728 -2934 -87306 -132897 -25383 55370 -26068 -113351 -73951 -29749 -77613
645 -77613 -102224 -34598 11076 -16608 -30625 -27194 -79088 -115375 -27998 65907 -3003 -120819
657 -120819 -86163 17489 2803 -55201 -1309 60817 -18533 -117565 -69921 16506 -154 -25403
669 -25403 35326 58178 -25284 -64563 1395 18477 -49566 -33103 76223 78099 -38059 -60804
681 -60804 32676 56972 3589 23310 72242 -1383 -96202 -20564 116160 98976 9756 33313
$$ packed form
596c4852P0773l8389r1891r33O2742R321l2057l026N68k1137J5741N1075j3266
609b5331o6830J3836P9950k1364j16348j4584J13584M8266o8050k3276O2591j872
621a9428r1344l1684O8146N1744o943j0202k1733m9295J0346R2966K7103j02271
633h2595n7169Q4036N2794q4372m5591J07514Q0753q1438q7283L9400M4202m7864
645g7613k4611O7626M5674k7684j4017L431n1894l6287Q7377R3905o8910j17816
657a20819L4656J03652j4686n8004N3892O2126p9350r9032M7644Q6427j6660k5249
669b5403O0729K2852q3462l9279O5958J7082o8043J6463J09326J876j16158k2745
681f0804R3480K4296n3383J9721M8932p3625r4819P5638J36724j7184q9220K3557
$$ plain form
693 33313 78475 -5460 -82091 10295 121975 78961 4482 44409 82194 20904 -8041 60084
705 60084 78328 13655 24503 100276 57317 -51823 6711 170632 156812 -5872 -37186
716 -37186 61210 53897 -30078 28963 165465 145455 17589 -8439 38870 24989 18052 95787
728 95787 114341 8363 -24015 90825 124448 2397 -25134 113854 144886 -16516 -86818
739 -86818 40964 116980 44288 28488 114220 98578 -27076 -53293 25469 38920 17666 87923
751 87923 132315 12365 -89982 10445 124211 43102 -56073 19768 91956 -8802 -83437
762 -83437 31567 131505 49837 -32427 14337 24139 -70147 -73032 53973 91302 3834 -4983
774 -4983 62088 7438 -115055 -71631 71686 61689 -50656 -38319 38753 -8292 -78109 3719
$$ packed form
693C3313M5162q3935p6631R2386J11680m3014p4479L9927L7785o1290k8945O8125
705F0084J8244o4673J0848P5773m2959j09140N8534J63921j3820j62684l1314
716c7186R8396p313q3975N9041J36502k0010j27866k6028M7309j3881o937P7735
728I5787J8554j05978l2378J14840L3623j22051k7531J38988L1032j61402p0302
739h6818J27782P6016p2692j5800Q5732j5642j25654k6217P8762J3451k1254P0257
751H7923M4392j19950j02347J00427J13766q1109r9175P5841P2188j00758p4635
762h3437J15004R9938q1668q2264M6764R802r4286k885J27005L7329q7468q817
774d983O7071n4650j22493M3424J43317r997j12345J2337P7072m7045o9817Q1828
$$ plain form
786 3719 91439 -1830 -115363 -60004 15285 -41695 -67450 50475 102370 -30465 -123782 -48963
798 -48963 -1510 -72539 -73368 38621 52208 -57564 -76259 4528 -14235 -99209 -50989 51239
810 51239 -12783 -139657 -86538 46620 20910 -72539 -27173 42511 -50741 -162567 -96015
821 -96015 18720 3958 -33962 14516 14190 -91333 -118732 -15648 11219 -80408 -80601 28359
833 28359 21922 -98612 -90750 40140 44205 -80883 -100610 -14363 -22840 -97288 -52996 53300
845 53300 37298 -42288 -35154 -15959 -89198 -121122 -8257 71491 -7822 -73943 -3867 35768
857 35768 -51845 -89140 6173 43239 -54099 -94995 -7121 37964 -14436 -15242 44343 15848
869 15848 -77016 -68434 6193 -7931 -54120 12583 97371 37679 -66110 -42065 23134 -13903
$$ packed form
786C719Q7720r3269j13533N5359P5289n6980k5755J17925N1895j32835r3317P4819
798d8963M7453p1029q29J11989J3587j09772j8695Q0787j8763q4974M8220J02228
810E1239o4022j26874N3119J33158k5710r3449M5366O9684r3252j11826O6552
821i6015J14735j4762l7920M8478l26j05523k7399J03084K6867r1627j93J08960
833B8359o437j20534P862J30890M065j25088j9727Q6247q477p4448M4292J06296
845E3300j6002p9586P134J9195p3239l1924J12865P9748p9313o6121P0076L9635
857C5768q7613l7295R5313L7066r7338m0896Q7874M5085n2400q06N9585k8495
869A5848r2864Q582P4627j4124m6189O6703Q4788n9692j03789K4045O5199l7037
$$ plain form
881 -13903 -58000 9084 67424 4351 -48202 16002 67344 11687 -27288 15365 15312 -53871 -44510
894 -44510 58523 87217 16099 -543 50526 28798 -51804 -41925 37352 44548 2414 31151
906 31151 81559 39947 -25697 1635 50735 17531 -23379 18004 55745 17698 2009 68443
918 68443 97094 22933 -33230 646 26994 -1698 8547 75002 86129 27676 11367 46918
930 46918 33987 -18693 -9382 45815 46988 14800 37274 76626 47385 254 18661 49616
942 49616 14208 -25864 7027 56356 50056 37732 61262 59247 1517 -29539 4952 30683
954 30683 12970 15701 54161 58460 22159 15435 36465 18077 -24601 -16600 27143 32169 10722
967 10722 25430 54084 37031 -851 -2886 6085 -15805 -30703 4068 43950 38978 19776 20369
$$ packed form
881a3903m4097O7084N8340o3073n2553O4204N1342n5657l8975M2653n3o9183R361
894d4510J03033K8694p1118j6642N1069k1728q0602R879P9277P196m2134K8737
906C1151N0408m1612o5644K7332M9100l3204m0910M1383L7741l8047j5689O6434
918F8443K8651p4161n6163L3876K6348k8692J0245O6455J1127n8453j6309L5551
930D6918j2931n2680R311N5197J173l2188K2474L9352k9241m7131J8407L0955
942D9616l5408m0072L2891M9329o300j2324K3530k015n7730l1056L4491K5731
954C0683j7713K731L8460M299l6301o724K1030j8388m2678Q001M3743N026k1447
967A0722J4708K8654j7053l7882k035Q971k1890j4898L4771L9882m972j9202N93
$$ plain form
980 20369 13496 -17347 -30138 -9495 816 -13009 -7093 25120 34818 10192 -5994 -4785 -18708
993 -18708 -40694 -33075 -5322 3055 -3364 6694 20830 6532 -22723 -35560 -35847 -39735 -33230
1006 -33230 -7351 11439 3523 -8687 -6694 -11070 -33088 -48428 -41631 -31633 -27907 -15392 6323
1019 6323 10030 -10553 -29860 -35889 -39756 -46393 -43538 -30230 -16422 -6040 2485 -504 -19612
1032 -19612 -40614 -48882 -46112 -43091 -34196 -16612 -3913 -3889 -9008 -12596 -22196 -41058 -54736 -50288
1046 -50288 -32397 -15049 -3721 451 -2989 -11679 -20688 -31125 -42367 -46662 -36780 -18160 -2630
1059 -2630 5302 6686 -56 -15071 -31092 -37386 -33629 -26255 -18456 -7246 6612 16058 12801 -3100
1073 -3100 -22000 -32494 -30446 -22009 -11512 -660 10995 19357 17209 6203 -6479 -17021 -24995
$$ packed form
980B0369o873l0843j2791K0643J0311j3825N916L2213R698k4626j6186J209j3923
993a8708k1986P619K7753Q377o419J0058J4136j4298k9255j2837k87l888O505
1006c3230K5879J8790p916j2210J993m376k2018j5340O797R998L726J2515K1715
1019F323L707k0583j9307o029l867o637K855J3308J3808J0382Q525k989j9108
1032a9612k1002q268K770L021Q895J7584J2699K4n119l588r600j8862j3678M448
1046e0288J7891J7348J1328M172l440q690r009j0437j1242m295R882J8620J5530
1059b630P932J384o742j5015j6021o294L757P374P799J1210J3858R446l257j5901
1073c100j8900j0494K048Q437J0497J0852J1655Q362k148j1006j2682j0542p974
$$ plain form
1086 -24995 -25171 -12210 7589 22331 25352 21015 14050 3425 -8162 -15485 -16422 -10068 4208 23856
1100 23856 35092 31912 20385 9567 -23 -9873 -12071 -2933 10067 20078 31095 39535 35664
1113 35664 18639 2760 -4946 -7822 -3878 10902 27173 33941 34365 36574 32786 13423 -7088
1126 -7088 -8178 3699 11031 18359 33547 44329 36958 24198 19095 11547 -4482 -9524 5662
1139 5662 22266 29075 37970 47557 36619 9748 -1281 5087 3392 -5008 6612 34230 44750
1152 44750 34206 27684 24169 7162 -9635 -4566 8641 8159 9722 30601 44297 30865 15852
1165 15852 16015 5491 -22892 -27177 9143 35649 26067 17416 30217 29133 1642 -14983 -7471
1178 -7471 -6460 -12979 4579 32348 29217 8730 11291 20249 -1616 -28546 -17911 3236 -7018
$$ packed form
1086b4995j76J2961J9799J4742L021m337o965j0625j1587p323r37O354J4276J9648
1100B3856J1236l180j1527j0818r590r850k198R138J3000J0011J1017Q440l871
1113C5664j7025j5879p706k876L944J4780J6271O768M24K209l788j9363k0511
1126g088j090J1877P332P328J5188J0782p371j2760n103p548j6029n042J5186
1139E662J6604O809Q895R587j0938k6871j1029O368j695q400J1620K7618J0520
1152D4750j0544o522l515j7007j6797N069J3207m82J563K0879J3696j3432j5013
1165A5852J63j0524k8383m285L6320K6506r582q651J2801j084k7491j6625P512
1178g471J011o519J7558K7769l131k0487K561Q958k1865k6930J0635K1147j0254
$$ plain form
1191 -7018 -15476 19629 51316 27524 -14355 -21411 -15725 -27031 -25421 5376 19855 2118 -771
1204 -771 20489 13533 -25056 -33251 -8533 -9937 -33492 -18021 22692 20439 -12601 -8308 15395
1217 15395 -5599 -50965 -49810 -17323 -8618 -5255 24501 34905 -11532 -51732 -32505 -7076
1229 -7076 -25845 -37513 -6606 10167 -15351 -20974 11733 13728 -31062 -47978 -20749 -17881 -43103
1242 -43103 -27745 19125 20379 -13671 -10810 6021 -30843 -79705 -53901 9729 19348 -7214
1254 -7214 -2971 5688 -25180 -46237 -13228 8495 -27470 -49672 -15198 7474 -16100 -13604 30361
1267 30361 25188 -42691 -66440 -20109 -754 -32349 -24900 31465 43153 -4182 -28915 -20736
1279 -20736 -33929 -45390 -3554 37089 7583 -32679 -7945 25365 -1916 -26003 9677 25918
$$ packed form
1191g018q458L5105L1687k3792m1879p056N686j1306J610L0797J4479j7737k889
1204g71K1260o956l8589q195K4718j404k3555J5471M0713k253l3040M293K3703
1217A5395k0994m5366J155L2487Q705L363K9756J0404m6437m0200J9227K5429
1229g076j8769j1668L0907J6773k5518n623L2707J995m4790j6916K7229K868k5222
1242d3103J5358M6870J254l4050K861J6831l6864m8862K5804O3630R619k6562
1254g214M243Q659l0868k1057L3009K1723l5965k2202L4474K2672k3574K496M3965
1267C0361n173o7879k3749M6331J9355l1595P449N6365J1688m7335k4733Q179
1279b0736j3193j1461M1836M0643k9506m0262K4734L3310k7281k4087L5680J6241
$$ plain form
1291 25918 -33942 -71916 -13243 51089 35379 3044 15572 13894 -31611 -47361 -8578 12300
1303 12300 -812 17361 53702 26982 -33280 -27508 22790 16792 -21253 -1921 38344 10211
1315 10211 -35494 -504 64249 52289 -3579 -15318 -7301 -28278 -25221 36842 74200 34643
1327 34643 -721 15668 13295 -30924 -29019 33740 52874 7455 -4748 34286 32175 -12048
1339 -12048 -2908 47091 37338 -19474 -23763 15748 16327 3510 44258 80686 30672 -42537 -37172
1352 -37172 6037 8705 8811 50534 65734 11096 -27754 2760 25346 -2148 -5406 36332 34327
1365 34327 -21002 -25684 35156 53856 9721 -1468 28617 11482 -45132 -39960 24264 50523
1377 50523 31708 30922 29144 -18827 -55676 -15833 33898 19727 -2686 24429 33947 -18366 -43319
$$ packed form
1291B5918n9860l7974N8673O4332j5710l2335J2528j678m5505j5750L8783K0878
1303A2300j3112J8173L6341k6720o0262N772N0298n998l8045J9332M0265k8133
1315A0211m5705L4990O4753j1960n5868j1739Q017k0977L057O2063L7358l9557
1327C4643l5364J6389k373m4219J905O2759J9134m5419j2203L9034k111m4223
1339a2048R140M9999r753n6812m289L9511N79j2817M0748L6428n0014p3209N365
1352c7172M3209K668J06M1723J5200n4638l8850L0514K2586k7494l258M1738k005
1365C4327n5329m682O0840J8700m4135j1189L0085j7135n6614N172O4224K6259
1377E0523j8815p86j778m7971l6849L9843M9731j4171k2413K7115R518n2313k4953
$$ plain form
1390 -43319 14787 55940 9414 -39136 -17421 7366 -11738 -11348 34264 47711 4928 -21633
1402 -21633 -14603 -27708 -45775 -4212 53966 38035 -17023 -16081 10521 -16056 -50499 -10738
1414 -10738 44623 18969 -39331 -32767 7261 6684 -3503 17397 18619 -31302 -58716 -23406 5470
1427 5470 -4841 5761 41956 23143 -45642 -61546 -11444 6640 -21464 -13686 27853 18769
1439 18769 -32787 -37445 337 4041 -17459 -7432 6600 -24647 -52189 -14576 32050 19315
1451 19315 -9940 -3430 -6880 -50681 -61657 -4243 38189 12524 -14242 -111 -1856 -37521
1463 -37521 -38211 3942 13568 -19645 -22565 7757 2245 -30083 -17367 23243 15063 -27573 -32075
1476 -32075 -11691 -20241 -27938 11216 45795 15328 -30574 -28192 -13959 -28178 -24538 20551 36329
$$ packed form
1390d3319N8106M1153m6526m8550K1715K4787j9104L90M5612J3447m2783k6561
1402b1633P030j3105j8067M1563N8178j5931n5058R42K6602k6577l4443L9761
1414a0738N5361k5654n8300O564M0028n77j0187K0900J222m9921k7414L5310K8876
1427E470j0311J0602L6195j8813o8785j5904N0102J8084k8104P778M1539r084
1439A8769n1556m658L7782L704k1500J0027J4032l1247k7542L7613M6626j2735
1451A9315k9255O510l450m3801j0976N7414M2432k5665k6766J4131j745l5665
1463c7521o90M2153R626l3213k920L0322n512l2328J2716M0610q180m2636m502
1476c2075K0384q550p697L9154L4579l0467m5902K382J4233j4219L640M5089J5778
$$ plain form
1489 36329 -8199 -35055 -4803 15577 -9786 -20715 5446 8574 -22203 -24486 6894 13409
1501 13409 -4724 4957 25669 523 -39722 -29396 5919 5346 -4468 21993 40470 405 -42673
1514 -42673 -22478 17021 12468 -6461 4123 12846 -6661 -10902 16613 25849 -875 -10890 6950
1527 6950 2893 -21299 -9183 30728 32366 1400 -449 20582 5452 -29071 -18614 22998 31572
1540 31572 11055 8280 13790 -1369 -10272 13243 28210 4304 -13910 5107 19433 4115
1552 4115 3542 31506 33751 -4048 -21231 4350 17769 1102 649 26631 31980 9242 1041
1565 1041 9039 1123 -9318 8808 30350 16646 -6334 4460 23634 13448 -337 12671
1577 12671 21176 -2751 -19574 3601 27586 18979 6967 14749 14725 -4793 -10294 7166 10874
$$ packed form
1489C6329m4528k6856L0252K0380k5363j0929K6161L128l0777k283L1380O515
1501A3409j8133R681K0712k5146m0245J0326L5315n73r814K6461J8477m0065m3078
1514d2673K0195L9499m553j8929J0584Q723j9507m241K7515R236k6724j0015J7840
1527F950m057k4192J2116L9911J638l0966j849K1031j5130l4523J0457M1612Q574
1540C1572k0517k775N510j5159q903K3515J4967k3906j8214J9017J4326j5318
1552D115n73K7964K245l7799j7183K5581J3419j6667m53K5982N349k2738q201
1565A041P998p916j0441J8126K1542j3704k2980J0794J9174j0186j3785J3008
1577A2671Q505k3927j6823K3175K3985q607j2012P782k4j9518n501J7460L708
$$ plain form
1590 10874 -1916 3825 24346 19339 -4642 -6508 10629 9058 -5982 -1677 11771 4051 -8913
1603 -8913 3469 21235 13345 -4217 -3917 -660 -10188 -11752 7595 17996 3382 -6583 3911
1616 3911 7381 -8278 -14955 -2768 3540 -5124 -4918 6413 3725 -8632 -6064 4888 -1153 -16045
1630 -16045 -13468 -1865 -3984 -9192 1838 11589 -1421 -18331 -15045 -4607 -7482 -12095 -5733
1643 -5733 410 -4530 -6809 -1269 -3273 -14773 -15947 -5540 -4424 -13444 -11890 -357 773 -8316
1657 -8316 -8866 -2732 -7479 -18986 -17580 -6483 -1716 -4464 -3619 -2918 -8595 -11694 -7317 -5921 -13755
1672 -13755 -15760 -5551 1525 -3545 -7769 -3489 -2117 -9413 -13272 -8486 -5345 -8321 -7579 -1381 1872
1687 1872 -853 -3959 -5770 -9913 -11892 -6021 -448 -2052 -5803 -1674 3827 1693 -4784 -6768 -5835
$$ packed form
1590A0874j2790N741K0521n007k3981j866J7137j571j5040M305J3448p720j2964
1603h913J2382J7766p890j7562L00L257r528j564J9347J0401j4614r965J0494
1616C911L470j5659o677J2187O308q664K06J1331k688j2357K568J0952o041j4892
1630a6045K577J1603k119n208J1030R751j3010j6910L286J0438k875m613O362
1643e733O143m940k279N540k004j1500j174J0407J116r020J554J1533J130r089
1657h316n50O134m747j1507J406J1097M767k748Q45P01n677l099M377J396p834
1672a3755k005J0209P076n070m224M280J372p296l859M786L141k976P42O198L253
1687A872k725l106j811m143j979N871N573j604l751M129N501k134o477j984R33
$$ plain form
1702 -5835 -6341 -6053 -1457 2622 2331 658 1131 867 -2439 -4559 -4084 -3880 -3974 942 7253 7242 1794 -1323
1720 -1323 138 564 -2051 -3142 -925 1811 4108 6980 7576 4494 650 -1109 -815 -232 582 3157
1736 3157 5243 5794 6620 7990 6797 1657 -2619 -2073 1984 4727 6419 6850 7314 6502 6515 5443 1826
1753 1826 -2022 -1007 3211 7002 8836 9323 8715 6324 3465 2738 3188 1092 -30 3121 8017 10689
1769 10689 10339 8871 4735 984 367 2799 3992 2643 3981 8557 11427 9745 7112 3822 -507
1784 -507 -2362 1418 6278 6820 5045 7221 10069 7735 4311 3290 1263 -3508 -2404 5912 11657
1799 11657 8684 4726 6166 6145 1566 -792 102 -755 -1786 4243 12471 11283 3336 425 2199 -455
1815 -455 -4132 311 4806 746 -2319 6094 13857 7208 -4009 -4470 -2517 -5215 -4444 4404 8097
$$ packed form
1702e835n06K88M596M079k91j673M73k64l306k120M75K04r4M916O311j1n448l117
1720a323J461M26k615j091K217K736K297K872N96l082l844j759K94N83Q14K575
1736C157K086N51Q26J370j193n140m276N46M057K743J692M31M64q12J3j072l617
1753A826l848J015M218L791J834M87o08k391k859p27M50k096j122L151M896K672
1769A0689l50j468m136l751o17K432J193j349J338M576K870j682k633l290m329
1784e07j855L780M860N42j775K176K848k334l424j021k027m771J104Q316N745
1799A1657k973l958J440k1m579k358Q94q57j031O029Q228j188p947k911J774k654
1815d55l677M443M495m060l065Q413P763o649j1217m61J953k698P71Q848L693
$$ plain form
1830 8097 1540 287 7032 5386 -6855 -10346 -2886 -1211 -5501 680 11002 5227 -8384 -5665
1844 -5665 5695 1438 -12411 -11672 -2226 -2691 -3612 7198 12465 -2219 -15436 -8331 -1802 -9761
1858 -9761 -11656 2625 6863 -5822 -7690 5725 3878 -16327 -19457 -1314 2854 -11036 -10540 4114
1872 4114 2444 -9029 -3027 6578 -8143 -27784 -17426 3582 1486 -6481 4969 10288 -11631
1885 -11631 -26062 -7559 6390 -9776 -19764 -920 9330 -7087 -12747 5241 5823 -16732 -19344
1898 -19344 1375 -93 -20677 -13379 14589 13966 -8720 -8041 3228 -13031 -31848 -10274 19810
1911 19810 9579 -13061 -3152 9940 -8218 -20777 2071 14938 -11550 -25606 1133 17126
1923 17126 -3290 -10142 14850 15857 -17397 -25242 1776 5418 -14351 -2470 29862 20074 -17095
$$ packed form
1830H097o557j253O745j646j2241l491P460J675m290O181J0322n775j3611K719
1844e665J1360m257j3849P39R446m65r21J0810N267j4684j3217P105O529p959
1858i761j895J4281M238j2685j868J3415j847k0205l130J8143M168j3890M96J4654
1872D114j670j1473O002R605j4721j9641J0358K1008k096p967J1450N319k1919
1885a1631j4431J8503J3949j6166r988J8844J0250j6417n660J7988N82k2555k612
1898a9344K0719j468k0584P298K7968o23k2686O79J1269j6259j8817K1574L0084
1911A9810j0231k2640R909J3092j8158j2559K2848J2867k6488j4056K6739J5993
1923A7126k0416o852K4992J007l3254p845K7018L642j9769J1881L2332r788l7169
$$ plain form
1936 -17095 -15986 8080 -1521 -20406 3050 30052 5945 -24424 -2307 26660 8255 -14350
1948 -14350 4505 15546 -14951 -27346 10841 32787 6878 -4726 18511 13602 -25732 -25725 16773
1961 16773 23603 -6273 -751 31572 16864 -24504 -14252 25720 16984 -16256 -4656 21808
1973 21808 2806 -19367 11856 42431 13088 -21207 -3575 11457 -15196 -19645 28494 47209
1985 47209 3517 -20588 8910 15830 -19214 -18361 26433 29846 -12336 -14298 22918 19235 -14752
1998 -14752 -2444 31587 10131 -32619 -15162 24027 11950 -10077 19583 43112 -1407 -42891
2010 -42891 -13300 21350 1615 -10129 25878 35426 -13168 -31841 10805 26918 -9563 -17153
2022 -17153 18405 14669 -26445 -16287 34134 31033 -13974 -12049 18026 -2826 -40763 -13182
$$ packed form
1936a7095J109K4066r601j8885K3456K7002k4107l0369K2117K8967j8405k2605
1948a4350J8855J1041l0497j2395L8187K1946k5909j1604K3237m909l9334PM2498
1961A6773O830k9876N522L2323j4708m1368J0252L9972q736l3240J1600K6464
1973B1808j9002k2173L1223L0575k9343l4295J7632J5032k6653m449M8139J8715
1985D7209m3692k4105K9498O920l5044Q53M4794L413m2182j962L7216l683l3987
1998a4752J2308L4031k1456m2750J7457L9189j2077k2027K9660K3529m4519m1484
2010d2891K9591L4650j9735j1744L6007R548m8594j8673M2646J6113l6481p590
2022a7153L5558l736m1114J0158N0421l101m5007J925L0075k0852l7937K7581
$$ plain form
2034 -13182 36320 23095 -10836 5963 23687 -15769 -44710 -1717 36042 5352 -22580 5775
2046 5775 20501 -15697 -22768 23263 32289 -18829 -37449 737 11128 -16542 -3971 38332
2058 38332 24181 -29004 -28193 8811 -1246 -31769 -3982 39983 16524 -27781 -13410 16436
2070 16436 -6267 -29215 3975 28574 -10318 -38749 -2952 25858 890 -10811 17483 11275
2082 11275 -40576 -45126 10264 28970 -5870 -9290 22837 10048 -36635 -30185 13488 9712 -22438
2095 -22438 -7460 23845 2464 -31085 -7894 24419 1190 -27084 -4997 11359 -22850 -35965
2107 -35965 13174 43844 5439 -26952 -7912 -670 -29723 -26248 20478 29184 -10475 -19915 9077
2120 9077 5882 -24972 -15010 18721 5173 -30036 -15094 20610 6977 -21340 15 28953
$$ packed form
2034a3182M9502j3225l3931J6799J7724l9456k8941M2993L7759l0690k7932K8355
2046E775J4726l6198p071M6031R026n1118j8620L8186J0391k7670J2571M2303
2058C8332j4151n3185Q11L7004j0057l0523K7787M3965k3459m4305J4371K9846
2070A6436k2703k2948L3190K4599l8892k8431L5797K8810k4968j1701K8294o208
2082A1275n1851m550N5390J8706l4840l420L2127j2789m6683O450M3673l776l2150
2095b2438J4978L1305k1381l3549K3191L2313k3229k8274K2087J6356l4209j3115
2107c5965M9139L0670l8405l2391J9040P242k9053L475M6726Q706l9659r440K8992
2120I077l195l0854R962L3731j3548l5209J4942L5704j3633k8317K1355K8938
$$ plain form
2132 28953 837 -37292 -21619 7348 -2515 -9261 20625 31210 -9305 -34494 -8209 9588
2144 9588 -10210 -11999 17744 16918 -18862 -19243 18779 21719 -13102 -17174 8309 3016 -22704 -9452
2158 -9452 24157 18338 -5884 2380 15767 -9563 -33823 -8164 23633 12120 -4523 12153
2170 12153 19176 -10067 -23152 6957 23479 -2478 -16917 4555 14165 -2570 347 24679
2182 24679 18612 -14126 -17363 6673 6114 -10661 2717 30914 21509 -6987 -5288 9569 -2014
2195 -2014 -16067 3421 25128 10920 -7454 4397 17497 3950 -5110 10331 13004 -10926
2207 -10926 -17182 9818 24936 9766 2854 15708 11299 -13429 -15491 6614 12241 11 5261
2220 5261 21126 12944 -7102 -4611 9779 3150 -8993 1656 14318 3486 -6952 8117 22250
$$ packed form
2132B8953k8116l8129J5673K8967r863o746K9886J0585m0515k5189K6285J7797
2144I588j9798j789K9743q26l5780l81L8022K940l4821m072K5483n293k5720J3252
2158i452L3609n819k4222Q264J3387k5330k4260K5659L1797j1513j6643J6676
2170A2153P023k9243j3085L0109J6522k5957j4439K1472R610j6735K917K4332
2182B4679o067l2738l237K4036n59j6775J3378K8197r405k8496J699J4857j1583
2195b014j4053J9488K1707j4208j8374J1851J3100j3547r060J5441K673k3930
2207a0926o256K7000J5118j5170o912J2854m409k4728k062K2105N627j2230N250
2220E261J5865q182k0046K491J4390o629j2143J0649J2662j0832j0438J5069J4133
$$ plain form
2233 22250 7833 -9534 -4303 1497 -8190 -7857 12111 20871 5838 -3050 5074 3190 -11275 -11049
2247 -11049 5354 7936 -2705 -214 12057 8012 -6279 -4375 5732 -648 -13249 -7585 5216
2260 5216 4225 103 8308 12260 -3092 -16739 -9787 -130 -4312 -5456 5632 10364 376 -6134
2274 -6134 -847 -576 -10067 -11219 -1701 868 -4836 -2059 7542 5112 -5697 -6905 -2321 -8048 -16012
2289 -16012 -8598 5458 7007 -20 -887 393 -6272 -13033 -8793 -3304 -5332 -5641 1845 5019 -902
2304 -902 -4881 -1758 -3390 -11699 -12890 -4059 211 -3033 -2007 4853 4889 -4465 -9974 -9345 -8666 -8414
2320 -8414 -2610 3463 2709 -1438 -582 -68 -4920 -10246 -8304 -4029 -4461 -3889 2230 6244 1538 -3520
2336 -3520 -4263 -4515 -7867 -8787 -4328 33 1645 3749 4906 1582 -5666 -8185 -5446 -4089 -4256 -2138
$$ packed form
2233B2250j4417j7367N231N800r687L33J9968Q760j5033q888Q124j884j4465K26
2247a1049J6403K582j0641K491J2271m045j4291J904J0107o380j2601N664J2801
2260E216r91m122Q205L952j5352j3647O952R657m182j144J1088M732r988o510
2274f134N287K71r491j152R518K569n704K777R601k430j0809j208M584n727p964
2289a6012P414J4056J549p027q67J280o665o761M240N489k028l09P486L174n921
2304i02l979L123j632q309j191Q831M270l244J026O860L6r354n509O29O79K52
2320h414N804O073p54m147Q56N14m852n326J942M275m32N72O119M014m706n058
2336c520p43k52l352r20M459M361J612K104J157l324p248k519K739J357j67K118
$$ plain form
2352 -2138 3064 4241 2845 1800 817 -3343 -7308 -6541 -2994 -458 1881 5295 5514 2602 -530 -1284
2368 -1284 -2827 -5862 -5985 -636 4882 6152 4957 3836 2242 -474 -2929 -3338 -2876 -1316 2316 5659
2384 5659 7094 6166 4345 1222 -2530 -4386 -1678 2202 3580 3705 5582 8334 7465 3026 -1968 -3279
2400 -3279 -1662 1223 3567 5608 7108 7752 6574 3692 1132 -258 -650 -579 713 5315 10132 10438
2416 10438 6228 2117 1680 1808 957 -857 537 4233 8186 9146 7919 5181 2309 495 -1021 -1031
2432 -1031 2107 5352 6398 5928 6033 7265 5797 890 -3508 -2777 1636 5386 5847 5649 5636 5253 4113
2449 4113 1522 -1259 -2587 -1279 1214 3639 5742 7111 6366 1368 -2322 -1922 95 -420 -2318 -236
2465 -236 3821 6036 4947 2580 -1271 -4487 -4558 -2704 -947 -549 1000 2639 2321 294 -487 -1436 -4965
$$ packed form
2352b138N202J177j396j045r83m160l965P67L547K536K339L414K19k912l132p54
2368a284j543l035j23N349N518J270j195j121j594k716k455m09M62J560L632L343
2384E659J435r28j821l123l752j856K708L880J378J25J877K752q69m439m994j311
2400c279J617K885K344K041J500O44j178k882k560j390l92P1J292M602M817L06
2416A0438m210m111m37J28q51j814J394L696L953R60j227k738k872j814j516j0
2432a031L138L245J046m70J05J232j468m907m398P31M413L750M61j98j3l83j140
2449D113k591k781j328J308K493K425K103J369p45m998l690M00K017n15j898K082
2465b36M057K215j089k367l851l216p1J854J757L98J549J639l18k027p81r49l529
$$ plain form
2482 -4965 -7877 -5596 87 2273 1139 150 34 -1792 -4505 -4566 -5015 -6878 -6079 -1147 2536 870
2498 870 -1588 -2171 -4313 -7781 -7307 -4060 -3525 -5481 -3730 1114 1664 -3003 -5470 -5468 -8170 -10108 -5329
2515 -5329 -144 -1231 -4030 -2240 97 -3663 -7790 -7189 -5738 -7673 -6314 -33 2091 -2692 -5312
2530 -5312 -1815 -2331 -7916 -8850 -3912 -2963 -5754 -2774 3945 2433 -4973 -6647 -3457 -4976 -7653 -3361
2546 -3361 2227 -286 -4001 144 3265 -3124 -7714 -3120 -344 -4623 -5569 2381 5554 -474 -3116
2561 -3116 2676 1830 -6654 -7503 -193 2322 -1973 1462 8318 4235 -5118 -3263 3045 314 -5131
2576 -5131 623 7377 2285 -3266 3421 9345 1252 -5040 1213 4443 -2748 -4186 7479 11867 2564
2591 2564 -1481 5119 4867 -4926 -4582 6547 7857 -81 2829 10653 5395 -4970 -184 9558 4479
$$ packed form
2482d965k912K281N683K186j134r89j16j826k713o1m49j863P99M932L683j666
2498H70k458n83k142l468M74L247N35j956J751M844N50m667k467Kk702j938M779
2515e329N185j087k799J790K337l760m127O01J451j935J359O281K124m783k620
2530e312L497n16n585r34M938R49k791K980O719j512p406j674L190j519k677M292
2546c361N588k513l715M145L121o389m590M594K776m279r46P950L173o028k642
2561c116N792q46q484q49P310K515m295L435O856m083r353J855O308k731n445
2576e131N754O754n092n551O687N924q093o292O253L230p191j438J1665M388r303
2591B564m045O600k52r793L44J1129J310p938K910P824n258j0365M786R742n079
$$ plain form
2606 4479 -5207 1502 9875 3280 -2906 7612 15174 3121 -7878 -698 6497 450 -355 11448
2620 11448 12867 -656 -3560 7404 6931 -5031 -2653 11191 9038 -4311 -535 12340 7041
2633 7041 -5654 760 12668 3741 -9480 -2113 10496 5759 -196 9284 12337 -4755 -13536 2008
2647 2008 11820 1218 -2994 9368 9620 -6608 -7077 10133 10041 -6546 -6641 8609 5930 -8384 -2962
2662 -2962 13115 7540 -7110 -1414 8870 -3150 -15753 -631 16680 7090 -6122 1128 5325
2675 5325 -9042 -12602 7785 14942 -4347 -12575 2670 7302 -6997 -6487 11150 7948 -13464
2688 -13464 -12602 6280 4905 -10615 -3332 13752 5445 -13472 -8144 3918 -5692 -13975 4616
2701 4616 17400 -2376 -19315 -5044 7832 -4594 -10195 6646 8467 -14808 -20178 3738 12666
$$ packed form
2606D479r686O709Q373o595o186J0518P562j2053j0999P180P195o047q05J1803
2620A1448J419j3523k904J0964m73j1962K378J3844k153j3349L776J2875n299
2633G041j2695O414J1908q927j3221P367J2609m737n955R480L053j7092q781J5544
2647B008R812j0602m212J2362K52j6228m69J7210r2j6587r5J5250k679j4314N422
2662b962J6077n575j4650N696J0284j2020j2603J5122J7311r590j3212P250M197
2675E325j4367l560K0387P157j9289q228J5245M632j4299N10J7637l202k1412
2688a3464Q62J8882j375j5520P283J7084q307j8917N328J2062r610q283J8591
2701D616J2784j9776j6939J4271J2876j2426n601J6841J821k3275n370K3916Q928
$$ plain form
2714 12666 -4411 -8147 5423 667 -18687 -13293 8257 5093 -12040 -3873 12310 -1545 -22253
2727 -22253 -10362 10025 1251 -12789 -530 9264 -9861 -21635 199 16197 -898 -14632
2739 -14632 -2369 490 -15830 -13627 12779 15495 -9631 -15616 2734 1637 -16400 -9301 13055
2752 13055 7464 -13986 -8388 8738 -2139 -17427 -1981 16865 1717 -18146 -6242 7617
2764 7617 -5156 -11529 10732 18600 -7409 -22282 -3596 8628 -4505 -4632 14237 10698 -14766
2777 -14766 -14980 8685 9165 -9338 -3922 15488 5224 -16836 -7355 15368 7720 -8790 1842
2790 1842 15224 -2315 -19461 -2293 17563 6617 -3856 8911 11142 -11021 -16594 9672
2802 9672 19866 -16 -6833 10023 9156 -10811 -7110 17324 16300 -6893 -6523 10882 5669 -10716
$$ packed form
2714A2666j7077l736J3570m756j9354N394K1550l164j7133Q167J6183j3855k0708
2727b2253J1891K0387q774j4040J2259R794j9125j1774K1834J5998j7095j3734
2739a4632J2263K859j6320K203K6406K716k5126n985J8350j097j8037P099K2356
2752A3055n591k1450N598J7126j0877j5288J5446J8846j5148j9863J1904J3859
2764G617j2773o373K2261P868k6009j4873J8686J2224j3133j27J8869l539k5464
2777a4766k14K3665M80j8503N416J9410j0264k2060R481K2723p648j6510J0632
2790A842J3382j7539j7146J7168J9856j0946j0473J2767K231k2163n573K6266
2802I672J0194j9882o817J6856q67j9967L701K4434j024k3193L70J7405n213j6385
$$ plain form
2816 -10716 713 21420 11601 -7977 -1596 10580 -1997 -11597 8410 23700 5520 -10767
2828 -10767 2118 11166 -3315 -6435 14170 18048 -5226 -12302 7355 12419 -2738 -794 16689
2841 16689 10589 -11610 -9444 10601 8950 -4371 4026 17788 4637 -13661 -4232 11799 3289
2854 3289 -5913 7062 14671 -3533 -14358 3734 15349 917 -7047 5436 8008 -9783 -11469
2867 -11469 9021 14109 -1545 -4501 6787 1577 -13299 -6868 11438 8009 -6601 -2129 8704
2880 8704 -1752 -13812 -1574 12863 2099 -11753 -3364 6208 -3546 -9552 4566 11622 -3334
2893 -3334 -12406 -2153 2182 -7652 -6550 8554 8874 -7937 -10338 1494 623 -10301 -5275 8414
2907 8414 3330 -11317 -7955 4657 1169 -7980 -2116 5343 -4327 -14293 -4402 6076 -484 -6226
$$ packed form
2816a0716J1429K0707r819j9578O381J2176j2577r600K0007J5290j8180j6287
2828a0767J2885R048j4481l120K0605L878k3274p076J9657N064j5157J944J7483
2841A6689o100k2199K166K0045j651j3321Q397J3762j3151j8298R429J6031q510
2854C289r202J2975P609j8204j0825J8092J1615j4432p964J2483K572j7791j686
2867a1469K0490N088j5654k956J1288n210j4876O431J8306l429j4610M472J0833
2880H704j0456j2060J2238J4437j0764j3852Q389R572r754o006J4118P056j4956
2893c334r072J0253M335r834J102J5104L20j6811k401J1832q71j0924N026J3689
2907H414n084j4647L362J2612l488r149N864P459r670r966R891J0478o560n742
$$ plain form
2921 -6226 1730 4106 -7943 -12996 -1714 3546 -4738 -6026 3871 3119 -8587 -8849 2256 2401 -7368
2936 -7368 -5631 2286 -1132 -9282 -3801 6856 2791 -7100 -5143 224 -4668 -9005 -109 6515 -208
2951 -208 -5887 -171 2136 -5680 -7894 303 3706 -3214 -5405 2102 3217 -4065 -4342 2962 2387 -5209
2967 -5209 -6105 34 1005 -2132 1019 5601 622 -6362 -3547 1956 -610 -3789 1397 5180 713
2982 713 -3200 1287 3848 -1347 -4222 361 3179 -733 -1602 2816 4353 707 -313 2378 681
2997 681 -4141 -1994 3606 4527 1027 1866 4015 1455 -1959 -183 3148 1552 -1311 1593 4800 3583
3013 3583 1613 2475 3156 88 -1369 1299 2688 1191 1431 4789 5587 2507 694 1536 792 -940
3029 -940 1187 4537 4668 1829 1988 3934 3459 990 197 1210 966 951 3448 5075 3986 2039 2018
$$ packed form
2921f226P956K376j2049n053J1282N260q284j288R897p52j1706k62J1105J45r769
2936g368J737P917l418q150N481J0657m065r891J957N367m892m337Q896O624o723
2951b08n679N716K307p816k214Q197L403o920k191P507J115p282k77P304n75p596
2967e209q96O139R71l137L151M582m979o984K815N503k566l179N186L783m467
2982G13l913M487K561n195k875M583K818l912q69M418J537l646j020K691j697
2997F81m822K147N600R21l500Q39K149k560l414J776L331j596k863K904L207j217
3013C583j970Q62O81l068j457K668J389j497K40L358P98l080j813Q42p44j732
3029i40K127L350J31k839J59J946m75k469p93J013k44j5K497J627j089j947k1
$$ plain form
3046 2018 2124 639 -66 1175 1777 1965 2880 4679 4496 1517 -381 205 883 662 1023 1630 2441 2537
3064 2537 2577 3034 1784 -338 -1113 -628 234 1338 2178 2515 1648 529 600 623 -921 -2615 -1660 489
3082 489 1457 1864 1528 882 -853 -1264 -1524 -1601 -1589 -1538 -777 593 1175 964 163 -1917 -3979 -3188 -1638
3101 -1638 -1317 -1393 -805 -111 230 -530 -1543 -2689 -3774 -4231 -2919 -1286 -422 -434 -881 -1573 -2359 -3047 -3055
3120 -3055 -3732 -4180 -3194 -372 281 -598 -1752 -2170 -2986 -3902 -4123 -2996 -2542 -2225 -1329 -269 -152 -1451
3138 -1451 -2572 -3370 -4127 -3911 -2178 -1059 -1318 -1268 42 -64 -1879 -3827 -3252 -2719 -2636 -1604 203 1059
3156 1059 -424 -1032 -633 -1429 -2800 -2808 -1379 -1292 -1155 724 2644 1162 -1645 -1434 -736 -1864 -2473 -356
3174 -356 2064 2026 865 1796 1664 -912 -1636 -94 637 -945 -40 2899 3754 1315 911 2334 972
$$ packed form
3046B018J06j485p05J241O02J88R15J799j83k979j898N86O78k21L61O07Q11R6
3064B537M0M57j250k122p75M85Q62J104Q40L37q67j119P1K3j544j694R55K149
3082D89R68M07l36o46j735m11k60p7J2N1P61J370N82k11q01k080k062P91J550
3101a638L21p6N88O94L41p60j013j146j085m57J312J633Q64j2m47o92p86o88q
3120c055o77m48R86K822O53q79j154m18q16r16k21J127M54L17Q96J060J17j299
3138a451j121p98p57K16J733J119k59N0J310j06j815j948N75N33Q3J032J807Q56
3156A059j483o08L99p96j371qJ429Q7J37J879J920j482k807K11O98j128o09K117
3174c56K420l8j161R31j32k576p24J542P31j582R05K939Q55k439m04J423j362
$$ plain form
3191 972 -1949 -1784 1514 2011 1470 2608 4968 3109 -120 146 1294 25 -846 2576 4790 2947
3207 2947 696 2681 4270 1753 -950 985 2212 32 429 4569 5876 2668 915 2585 1552
3222 1552 -1804 -483 3365 3613 1299 2910 5756 3465 -1471 -435 2599 1280 -767 2041 4193
3237 4193 1741 -193 3386 5683 948 -3122 -808 1666 254 675 5022 5396 119 -1920 1458
3252 1458 1610 -2418 -1937 2834 2996 -804 818 4478 1463 -3688 -1708 3770 1347 -4053 -1984 3138
3268 3138 2132 -76 2141 3178 -2916 -6517 -2101 2486 -21 -775 3054 2699 -2976 -4047 1652
3283 1652 2154 -5048 -5262 2008 3199 -2736 -2597 2137 1509 -3577 -2875 675 -2381 -6698 -1979 4317
3299 4317 2663 -2312 -539 407 -5417 -7416 -70 4701 -1246 -5340 -407 2916 -2131 -4400 128
$$ packed form
3191I72k921J65L298M97n41J138K360j859l229K66J148j269q71L422K214j843
3207B947k251J985J589k517k703J935J227k180L97M140J307l208j753J670j033
3222A552l356J321L848K48k314J611K846k291m936J036L034j319k047K808K152
3237D193k452j934L579K297m735m070K314K474j412M21M347L74n277k039L378
3252A458J52m028M81M771J62l800J622L660l015n151J980N478k423n400K069N122
3268C138j006k208K217J037o094l601M416M587k507p54L829l55n675j071N699
3283A652N02p202k14P270J191n935J39M734o28n086P02L550l056m317M719O296
3299D317j654m975J773R46n824j999P346M771n947m094M933L323n047k269M528
$$ plain form
3314 128 546 -5422 -5826 1091 2000 -3642 -2830 3303 1485 -5703 -5388 -585 -2504 -6621 -301 6605
3330 6605 1889 -6300 -4571 530 -2159 -5166 -92 2834 -3423 -6837 990 5268 -1242 -5507 -579
3345 -579 868 -5291 -5894 1939 3210 -2421 -2161 3799 1342 -7170 -6252 1410 839 -3761 96 5624
3361 5624 -37 -7502 -2440 5522 1213 -5951 -2586 2350 -1195 -3747 3020 6445 -877 -5680 -124
3376 -124 1829 -3921 -3511 4592 5338 -1901 -2026 4853 2374 -6433 -4335 5277 4913 -3103 -1823 4581
3392 4581 2234 -2752 1297 6056 450 -5988 -1065 5381 1687 -1012 5339 7192 -1926 -5660 2088
3407 2088 5256 -1504 -2525 6026 7315 -670 -2215 4574 4417 -2602 -1440 6318 3952 -3515 -611
3422 -611 7115 5353 -1298 1505 5671 -617 -6051 1397 8498 3468 -1288 3996 6516 -1386 -4477
$$ packed form
3314A28M18n968m04O917R09n642Q12O133j818p188L15M803j919m117O320O906
3330F605m716q189J729N101k689l007N074K926o257l414P827M278o510m265M928
3345e79J447o159o03P833J271n631K60N960k457q512R18P662n71m600L857N528
3361E624n661p465N062P962m309p164L365M936l545k552O767L425p322m803N556
3376a24J953n750M10Q103P46p239j25O879k479q807K098R612l64q016J280O404
3392D581k347m986M049M759n606o438M923O446l694k699O351J853r118l734P748
3407B088L168o760j021Q551J289p985j545O789j57p019J162P758k366p467K904
3422f11P726j762o651K803M166o288n434P448P101n030m756N284K520p902l091
$$ plain form
3437 -4477 3298 6255 -998 -2226 5215 6425 -1453 -1829 5461 4841 -2682 -2327 4200 2543 -3293 1018
3453 1018 8422 4231 -3331 -935 4517 -905 -5065 2197 7992 1514 -3955 1721 5264 -1459 -4583
3468 -4583 2319 4688 -2550 -4187 3464 4761 -2258 -1968 4330 2256 -6360 -4555 3173 2278 -3784
3483 -3784 -455 6092 1149 -6286 -3053 3220 -1412 -5559 170 5018 -1112 -5971 86 4067 -2275
3498 -2275 -5566 115 1728 -5079 -5315 2771 3751 -3123 -4085 1364 -957 -7361 -4482 3190 1193 -5112
3514 -5112 -2127 3941 -719 -6905 -2872 2393 -1564 -6160 -1514 2665 -2125 -4914 751 2782 -3820
3529 -3820 -6246 -717 413 -4770 -3811 3882 2936 -5228 -5021 1181 393 -5530 -3677 2552 842 -4721
3545 -4721 -1846 2927 -262 -5406 -1591 1989 -2311 -5476 -314 3291 -1576 -3215 1969 2965 -4103
$$ packed form
3437d477P775K957p253j228P441J210p878l76P290o20p523L55O527j657n836M311
3453A018P404m191p562K396N452n422m160P262N795o478n469N676L543o723l124
3468d583O902K369p238j637P651J297p019K90O298k074q616J805P728q95o062
3483c784L329O547m943p435L233O273m632m147N729M848o130m859O057L981o342
3498b275l291N681J613o807k36Q086R80o874r62N449k321o404K879P672j997o305
3514e112K985O068m660o186M033N265l957m596M646M179m790k789N665K031o602
3529c820k426N529J130n183R59P693r46q164K07O202p88n923J853O229j710n563
3545d721K875M773l189n144L815L580m300l165N162L605m867j639N184R96p068
$$ plain form
3560 -4103 -6269 223 2804 -2105 -2558 2853 2241 -3534 -2976 2479 1485 -4053 -2427 2667 1164 -2306
3576 -2306 147 4046 434 -3808 -479 2945 -1016 -3761 1380 4472 659 -2050 2130 2832 -2193
3591 -2193 -3274 1979 4079 -789 -1613 2917 3065 -705 -120 3038 1023 -2632 -388 3772 2120 -915
3607 -915 1399 4274 1128 -2695 765 3458 125 -1612 2472 4909 1391 -1079 1735 2826 -357
3622 -357 -494 2499 2408 -687 181 4269 3685 -381 208 3000 1609 -1701 502 4190 2964 -489 1058
3639 1058 4012 1759 -1189 608 2244 833 203 2621 3579 499 -418 2492 3262 -249 -932 2115
3655 2115 2281 78 771 3535 3120 -432 -828 1877 1293 -333 387 2620 1442 -118 1298 2637
3671 2637 437 -1300 389 1991 208 -545 1089 2064 281 -341 1138 890 -1408 -2040 474 973
$$ packed form
3560d103k166O492K581m909m53N411o12n775N58N455r94n538J626N094j503l470
3576b306K453L899l612m242L329L424l961k745N141L092l813k709M180P02n025
3591b193j081N253K100m868q24M530J48l770N85L158k015l655K244M160j652l035
3607i15K314K875l146l823L460K693l333j737M084K437l518k470K814J091l183
3622c57j37K993r1l095Q68M088n84m066N89K792j391l310K203L688j226l453J547
3639A058K954k253k948J797J636j411o30K418R58l080r17K910P70l511o83L047
3655B115J66k203O93K764m15l552l96K705n84j626P20K233j178j560J416J339
3671B637k200j737J689J602j783p53J634R75j783o22J479k48k298o32K514M99
$$ plain form
3687 973 222 42 1071 333 -1217 -838 701 57 -1803 -1427 335 513 -491 37 84 -1182 -2062 -718
3705 -718 -18 -1357 -2126 -474 511 -387 -1331 -1180 -1189 -1955 -1966 -1066 -246 -1025 -1678 -918 -869 -1726 -1765 -1608 -2385
3726 -2385 -2701 -1924 -198 -955 -2076 -1756 -962 -1425 -2443 -2275 -1397 -1655 -2184 -1344 -897 -1267 -1772 -1937 -1911
3745 -1911 -2069 -1788 -1175 -1559 -2161 -1423 -608 -859 -1930 -2157 -1543 -1285 -1588 -1776 -1132 -889 -1038 -1033 -812 -991
3765 -991 -1809 -1157 -1037 -1011 -878 22 -251 -878 -886 -619 -53 -1246 -1509 -758 -194 -115 48 420 -105 -655 -345
3786 -345 -357 -15 -456 95 673 529 194 669 681 121 -150 369 999 380 280 1146 1488 1089 999 915 939 506
3808 506 512 1457 1438 1251 1082 1737 1486 1121 1209 1429 809 619 1560 2225 1733 1096 1591 1877 1296 1121 1520
3829 1520 1549 905 960 2312 2907 1591 896 1542 1757 1109 948 2120 1723 376 909 2378 2183 951
$$ packed form
3687I73p51j80J029p38j550L79J539o44j860L76J762J78j004N28M7j266q80J344
3705g18P00j339p69J652R85q98r44J51rp66j1R00Q20p79o53P60M9q57l9J57p77
3726b385l16P77J726p57j121L20P94m63j018J68Q78k58n29Q40M47l70n05j65K6
3745a911j58K81O13l84o02P38Q15k51j071k27O14K58l03j88O44K43j49NK21j79
3765i91q18O52J20K6J33R00k73o27qK67N66j193k63P51N64P9J63L72n25n50L10
3786c45j2L42m41N51N78j44l35M75J2n60k71N19O30o19j00Q66L42l99r0q4K4m33
3808E06OR45j9j87j69O55k51l65Q8K20o20j90R41O65m92o37M95K86n81j75L99
3829A520K9o44N5J352N95j316o95O46K15o48j61J172l97j347N33J469j95j232
$$ plain form
3847 951 833 1851 1107 566 1344 2164 1210 428 1591 2543 1161 -691 548 1630 964 655 1755 1943
3865 1943 -239 -566 1401 1972 152 -476 975 992 -670 618 2272 1101 -1286 -424 1761 688
3881 688 -1531 -318 1653 379 -793 672 1534 -752 -2306 -29 1494 -577 -1307 401 737 -1423
3897 -1423 -1343 1498 1081 -2403 -2607 247 758 -1037 -798 1134 -298 -2925 -1254 1288 -611 -3248
3913 -3248 -980 1149 -204 -2433 -794 884 -1626 -3084 -38 1188 -2196 -3880 -425 1039 -1214
3928 -1214 -2157 638 -308 -3630 -2966 1453 1200 -2728 -2641 572 50 -3070 -1984 1329 -916 -4139 -1687
3945 -1687 1384 -735 -3232 -955 1183 -1525 -3332 -603 696 -3041 -3911 1114 3012 -1957 -3951
3960 -3951 -297 638 -2649 -2552 1687 1012 -3448 -2958 1449 882 -2860 -1779 1302 -801 -4239 -1350
$$ packed form
3847I51j18J018p44n41P78Q20r54p82J163R52j382j852J239J082o66l09J100J88
3865A943k182l27J967N71j820o28J451J7j662J288J654j171k387Q62K185j073
3881F88k219J213J971j274j172J465Q62k286j554K277J523k071p30J708L36k160
3897a423Q0K841m17l484k04K854N11j795K39J932j432k627J671K542j899k637
3913c248K268K129j353k229J639J678k510j458L046J226l384j684L455J464k253
3928a214r43K795r46l322O64M419k53l928Q7L213n22l120J086L313k245l223K452
3945a687L071k119k497K277K138k708j807K729J299l737q70N025J898m969j994
3960c951L654R35l287R7M239o75m460M90M407n67l742J081L081k103l438K889
$$ plain form
3976 -1350 2558 -363 -3433 -147 3012 -1001 -4241 -1186 2323 -882 -2494 1297 2784 -2197 -3550
3991 -3550 1144 2689 -1619 -2098 1826 1026 -2878 -1497 4076 2148 -2779 -1857 2643 758 -3124 -312
4007 -312 4130 1488 -2477 322 3332 -182 -3133 975 4544 300 -2281 1335 3339 -684 -1699
4022 -1699 3326 4184 -1809 -2840 1939 2954 -728 78 4885 2896 -3106 -1794 3715 2886 -1276 389
4038 389 4757 1910 -2649 410 4717 1930 -1693 1546 4279 13 -2704 2325 5298 1207 -724
4053 -724 2742 3553 -1521 -2502 3402 5270 159 -693 3394 2541 -2442 -876 4670 3351 -1303 -859
4069 -859 3567 1594 -2213 1122 5322 1583 -2838 -384 3197 245 -1991 2573 5154 132 -3370
4084 -3370 868 2841 -1302 -1839 3168 3812 -1502 -3175 1700 2366 -1813 -1288 3243 1823 -3706 -2770
$$ packed form
3976a350L908k921l070L286L159m013l240L055L509l205j612L791J487m981j353
3991c550M694J545m308m79L924q00l904J381N573j928m927R22M500j885l882K812
4007c12M442k642l965K799L010l514k951M108L569m244k581L616K004m023j015
4022a699N025Q58n993j031M779J015l682Q06M807j989o002J312N509q29m162J665
4038C89M368k847m559L059M307k787l623L239K733m266k717N029K973m091j931
4053g24L466Q11n074r81N904J868n111q52M087q53m983J566N546j319m654M44
4069h59M426j973l807L335M200l739m421K454L581k952k236M564K581n022l502
4084c370M238J973m143n37N007O44n314j673M875O66m179N25M531j420n529R36
$$ plain form
4100 -2770 2391 1919 -1538 -130 3071 -467 -4774 -1792 3138 888 -2535 247 2680 -1693 -4354
4115 -4354 -249 2618 -985 -3302 374 1615 -3036 -3808 1359 2715 -2245 -3315 256 -226 -4466
4130 -4466 -2557 2913 2054 -3005 -3106 317 -1433 -4229 -965 2899 -201 -4321 -1993 1415 -953
4145 -953 -3697 -272 1964 -2167 -4614 -1001 1298 -1720 -3141 1214 1639 -3507 -4728 -718 515
4160 515 -2218 -1435 2365 762 -4536 -3211 1143 709 -2726 -1433 1577 -662 -3822 -1365 2102 481
4176 481 -2671 -867 434 -1713 -3620 -212 2249 -530 -1916 701 1087 -2891 -3772 959 2707 -1006
4192 -1006 -2216 684 885 -2270 -1327 2440 1699 -2358 -2006 1011 459 -1445 576 2944 506 -2523
4208 -2523 -1330 1592 -264 -1796 1155 3479 454 -1564 244 1664 -744 -1011 1832 2355 -951
$$ packed form
4100b770N161m72l457J408L201l538m307K982M930k250l423K782K433m373k661
4115d354M105K867l603k317L676J241m651p72N167J356m960j070L571m82m240
4130d466J909N470q59n059j01L423j750k796L264L864l100m120K328L408k368
4145i53k744L425K236m131k447L613K299l018j421M355M25n146j221M010J233
4160E15k733P83L800j603n298J325M354m34l435J293L010k239l160K457L467j621
4176D81l152J804J301k147j907L408K461k779j386K617L86l978q81M731J748l713
4192a006j210K900K01l155R43L767p41m057L52L017n52j904K021K368k438l029
4208b523J193K922j856j532K951K324l025k018J808J420k408k67K843N23l306
$$ plain form
4223 -951 -1612 1352 2123 -57 -78 2051 971 -2161 -1069 2416 2186 94 603 2591 595 -1474 25
4240 25 2530 1307 -482 1263 2894 645 -1009 987 3366 842 -643 1028 1806 -144 -130 2687
4256 2687 3144 617 -110 1209 1119 -520 226 2780 2223 -182 197 2453 1544 -678 479 2060 1246
4273 1246 -287 620 2160 712 -86 1332 2281 407 -1092 575 1543 539 633 1998 2246 -715 -1221
4290 -1221 1045 1486 132 -216 1298 1214 86 24 1410 850 -611 -93 1261 -18 -1091 -140 1444
4307 1444 566 -671 246 781 -479 -1848 -359 1119 364 -530 78 284 -691 -779 394 5 -1360 -1200
4325 -1200 332 35 -945 -851 212 -209 -1453 -1492 -229 -466 -1192 -644 435 -96 -1438 -1053 -880 -1353
4343 -1353 -1384 -269 26 -1111 -1595 -502 -64 -1339 -1513 -807 -923 -1384 -1609 -598 -462 -1118 -935 -791
$$ packed form
4223i51o61K964P71k180k1K129j080l132J092L485k30k092N09J988j996k069J499
4240B5K505j223j789J745J631k249j654J996K379k524j485J671P78j950J4K817
4256B687M57k527p27J319r0j639P46K554n57k405L79K256r09k222J157J581q14
4273A246j533R07J540j448p98J418R49j874j499J667R68j004R4J365K48k961n06
4290a221K266M41j354l48J514q4j128o2J386n60j461N18J354j279j073R51J584
4307A444q78j237R17N35j260j369J489J478p55q94O08K06r75q8J173l89j365J60
4325a200J532k97r80R4J063m21j244l9J263k37p26N48J079n31j342L85J73m73
4343a353l1J115K95j137m84J093M38j275j74P06j16m61k25J011J36o56J83J44
$$ plain form
4361 -791 -1047 -1329 -1462 -755 -881 -1412 -685 16 -731 -1600 -1199 -1113 -958 -1562 -819 -871 -789 -718 -164 -246 -1458
4382 -1458 -1441 -1263 -636 -739 -701 -334 -124 -298 -633 -467 -353 -1073 -955 -704 -301 -173 -97 -147 -457 -500 -213
4403 -213 228 -430 -947 -407 633 332 54 304 142 179 -298 -119 201 92 224 549 616 379 476 429 93
4424 93 -347 15 743 786 153 469 1484 1205 491 260 607 294 401 659 926 935 1011 1091 766 560 394 929
4446 929 563 413 805 1417 1236 866 370 674 1226 810 349 871 1039 1106 1416 1270 1052 575 374 644
4466 644 394 792 878 1196 1019 869 723 1117 641 273 249 774 725 1028 738 699 365 638 860 304 6
4487 6 -295 555 655 751 700 726 94 -189 110 350 171 -305 150 456 626 388 238 -80 -40 -441 -76 208
4509 208 -39 -124 177 236 -232 -43 16 -173 -1099 -404 567 376 -153 249 6 -332 -868 -485 226 -702 -765
$$ packed form
4361g91k56k82j33P07j26n31P27P01p47q69M01Q6J55o04P43n2Q2P1N54q2j212
4382a458J7J78O27j03L8L67K10j74l35J66J14p20J18K51M03J28P6n0l10m3K87
4403b13M41o58n17N40J040l01k78K50j62L7m77J79L20j09J32L25O7k37R7m7l36
4424I3m40L62P28M3o33L16J015k79p14k31L47l13J07K58K67RP6Q0l25k06j66N35
4446I29l66j50L92O12j81l70m96L04N52m16m61N22J68O7L10j46k18m77k01K70
4466F44k50L98Q6L18j77j50j46L94m76l68k4N25m9L03k90l9l34K73K22n56k98
4487Fl01Q50J00R6n1K6o32k83K99K40j79m76M55L06J70k38j50l18M0m01L65K84
4509B08k47q5L01N9m68J89N9j89r26O95R71j91n29M02k43l38n36L83P11r28o3
$$ plain form
4530 -765 -409 484 -50 -343 -244 -325 -1076 -932 -333 -368 -532 -609 353 268 -750 -470 -397 -700 -1290 -499 457 -178
4552 -178 -1236 -661 -145 -506 -1154 -607 -363 -1206 -1302 -220 276 -646 -978 -89 -335 -1378 -1440 -292 -277 -1050
4572 -1050 -374 501 246 -1372 -1045 -396 -428 -956 -417 116 -873 -1454 42 839 -322 -1137 -586 -339 -1026
4591 -1026 -955 512 492 -954 -1364 -87 1 -1164 -990 292 74 -939 -453 847 -150 -1135 -253 835
4609 835 -112 -1567 -408 685 -448 -621 595 1581 -266 -1495 -190 583 -557 -544 680 1105 -685
4626 -685 -917 886 648 -1156 -312 1456 844 -1139 -347 1828 856 -559 176 1448 301 -1371 346
4643 346 1844 555 -385 960 1339 -360 -1094 978 1680 -95 -128 1428 1486 -586 -570 1908 1812 -454
4661 -454 -322 1773 1097 -830 266 2676 1644 -1037 314 1647 128 -1072 1101 2434 736 -756
$$ packed form
4530g65L56Q93n34k93R9q1p51J44N99l5j64p7R62q5j018K80P3l03n90P91R56o35
4552a78j058N75N16l61o48N47K44q43r6J082M96r22l32Q89k46j043o2J148J5p73
4572a050O76Q75k55j618L27O49l2n28N39N33r89n81J496P97j161q15N51K47o87
4591a026P1J467k0j446m10J277Q8j165J74J282k18j013M86J300r97r85Q82J088
4609H35r47j455J159J093j133j73J216R86j847j229J305P73j140J3J224M25j790
4626f85k32J803k38j804Q44J768o12j983P92K175r72j415P35J272j147j672J717
4643C46J498j289r40J345L79j699p34K072P02j775l3J556N8k072J6K478r6k266
4661d54J32K095o76j927J096K410j032k681J351J333j519j200K173J333j698j492
$$ plain form
4677 -756 1007 1674 -559 -779 1718 2249 -477 -1044 1628 1260 -381 162 2226 1429 -1260 -920 1469
4694 1469 1273 -774 392 2554 646 -1729 -345 1932 473 -1180 861 2079 -200 -1568 653
4709 653 1604 -609 -1377 1178 1385 -1399 -1431 1325 1856 -954 -761 1222 97 -2621 -1529 2162 1205
4726 1205 -1382 -948 1125 -41 -2220 -398 1959 -263 -1940 -408 1346 -955 -2274 554 1699
4741 1699 -1232 -2387 458 726 -1905 -1874 1526 1567 -1379 -2208 277 74 -2090 -906 1980 236 -2707
4758 -2707 -1488 1336 -76 -2121 -421 1595 -855 -2865 -506 1496 -692 -1763 351 1398 -1572
4773 -1572 -2771 341 1150 -1304 -1561 1253 837 -2112 -2077 1179 1172 -1556 -1229 1216 -218 -2537 -657
4790 -657 1929 273 -2398 -857 1228 -463 -2277 134 1969 -527 -2063 138 1449 -1217 -2156
$$ packed form
4677g56J763O67k233k20K497N31k726n67K672l68j641N43K064p97k689L40K389
4694A469j96k047J166K162j908k375J384K277j459j653K041J218k279j368K221
4709F53R51k213p68K555K07k784l2K756N31k810J93J983j125k718J092L691r57
4726A205k587M34K073j166k179J822K357k222j677J532J754k301j319K828J145
4741A699k931j155K845K68k631L1L400M1k946q29K485k03k164J184K886j744k943
4758b707J219K824j412k045J700K016k450k010K359K002k188j071K114J047k970
4773a572j199L112Q09k454k57K814m16k949L5L256pk728L27K445j434k319J880
4790f57K586j656k671J541K085j691j814K411J835k496j536K201J311k666r39
$$ plain form
4805 -2156 809 1881 -491 -1314 715 878 -1674 -933 1860 1411 -2130 -1324 1298 746 -1456 -155
4821 -155 2091 409 -2024 -649 1600 101 -1233 269 1775 8 -1514 353 1607 -419 -1020
4836 -1020 1299 1843 -1038 -1317 1355 1846 -517 -1005 1635 915 -1401 -1157 1633 1319 -1059 -233 1738
4853 1738 391 -1168 -175 2176 517 -1396 701 1842 46 -1609 895 2022 82 -1140 566
4868 566 1345 -395 -847 1476 1970 -277 -953 1192 1262 -902 -210 1950 1239 -1125 -270 1584 960 -907
4886 -907 -277 1598 693 -1247 230 1524 296 -813 768 1385 -290 -1217 346 1591 -122 -777
4902 -777 893 1376 -729 -815 846 1107 -413 -565 771 536 -929 -174 1561 550 -968 -348 1041
4919 1041 362 -1079 138 1157 37 -762 210 732 -446 -604 450 839 -226 -741 351 531 -856
$$ packed form
4805b156K965J072k372q23K029J63k552P41K793m49l541Q06K622n52k202J301
4821a55K246j682k433J375K249j499j334J502J506j767j522J867J254k026o01
4836a020K319N44k881k79K672M91k363m88K640p20k316K44K790l14k378Q26J971
4853A738j347j559R93K351j659j913K097J141j796j655K504J127j940j222J706
4868E66P79j740m52K323M94k247o76K145P0k164O92K160p11k364Q55J854o24j867
4886i07O30J875r05j940J477J294j228j109J581O17j675r27J563J245j713o55
4902g77J670M83k105q6J661K61j520j52J336k35j465P55J735j011j518O20J389
4919A041o79j441J217J019j120p99R72N22j178j58J054L89j065n15J092J80j387
$$ plain form
4936 -856 -687 377 767 -874 -1017 568 436 -661 -494 350 308 -966 -941 340 172 -928 -334 848
4954 848 -188 -1172 -365 278 -186 -1006 -173 344 -549 -1025 86 652 -436 -861 -59 -143 -727 -726 290 267
4974 267 -913 -601 97 -245 -827 -689 510 -14 -1094 -459 406 92 -1028 -213 168 -459 -832 -405 99
4993 99 -468 -814 -32 420 -454 -705 -374 86 -521 -794 13 322 -471 -444 -20 500 -281 -362 109 -156 -225
5014 -225 -391 134 21 -337 49 274 -50 -443 -277 69 346 -279 -15 321 118 -417 191 493 124 -295
5034 -295 -2 415 131 -64 291 476 23 -497 119 298 -41 -90 296 482 342 212 347 -115 -224 276
5054 276 486 346 346 162 469 525 -86 195 446 90 75 164 700 263 323 -48 207 122 393 631 88 130 229
5077 229 383 529 108 -54 278 477 368 277 157 194 132 80 118 390 251 229 56 -74 55 472 203 437
$$ packed form
4936h56J69J064L90j641j43J585j32j097J67Q44m2j274K5J281j68j100N94J182
4954H48j036r84Q07O43m64q20Q33N17q93m76J111N66j088m25Q02q4n84JJ016k3
4974B67j180L12O98l42n82J38J199n24j080O35Q65l14j120Q15L81o27l73M27N04
4993I9n67l46P82M52q74k51L31M60o07k73Q07L09p93K7M24N20p81q1M71k65o9
5014b25j66N25j13l58L86K25l24l93J66L46K77o25K64L36k03n35O08L02l69m19
5034b95K93M17k84j95L55J85m53n20O16J79l39m9L86J86j40j30J35m62j09N00
5054B76K10j40%j84L07N6o11K81K51l56j5Q9N36m37O0l71K55q5K71K38n43M2R9
5077B29J54J46m21j62L32J99j09r1j20L7o2n2L8K72j39k2j73j30J29M17k69K34
$$ plain form
5099 437 91 503 155 102 -125 -70 69 147 -205 -280 145 45 329 50 166 -247 -47 -313 103 14 -67 222
5121 222 184 -425 -243 127 97 -212 -275 81 25 -11 -288 -105 -116 -120 -371 15 -209 -247 -69 -148 -382 284 -90
5144 -90 -236 -351 -199 94 178 -235 -78 -72 -290 21 -3 -7 -433 -383 -152 65 -59 -207 108 -142 -160 -462 -148
5167 -148 -212 -365 -140 -72 169 -25 -281 -296 -104 -280 -125 -92 -149 182 -302 143 -59 -503 -412 -89 -36 -31 -43
5190 -43 111 -113 -291 349 -24 -406 -295 149 -296 -21 -192 36 69 116 -270 -201 194 -353 -155 124 296
5211 296 -128 -40 327 59 -150 -215 227 81 -179 -318 343 315 -198 81 603 -184 -517 141 236 23 -323
5232 -323 461 295 -229 -30 -34 243 -259 -313 289 451 -92 -319 496 105 -93 -211 277 -50 -71 115 494
5253 494 415 -36 155 548 96 -369 421 557 -85 -34 224 835 129 -185 447 610 -262 -360 141 513 -208
$$ packed form
5099D37l46M12l48n3k27N5J39P8l52p5M25j00K84k79J16m13K00k66M16q9q1K89
5121B22l8o09J82L70l0l09o3L56n6l6k77J83j1mk51L86k24l8J78p9k34O66l74
5144i0j46j15J52K93Q4m13J57Ok18L11k4mm26N0K31K17j24j48L15k50j8l02L14
5167a48o4j53K25O8K41j94k56j5J92j76J55L3n7L31m84M45k02m44R1L23N3Nj2
5190d3J54k24j78O40l73l82J11M44m45K75j71K28L3M7l86O9L95n47J98K79J72
5211B96m24Q8L67k68k09o5M42j46k60j39O61k8n13K79N22p87l33O58R5k13l46
5232c23P84j66n24J99mK77n02n4O02J62n43k27Q15l91j98j18M88l27k1J86L79
5253D94p9m51J91L93m52m65P90J36o42N1K58O11p06l14O32J63q72r8N01L72p21
$$ plain form
5274 -208 167 429 461 -6 -299 562 96 -116 184 899 316 -354 87 640 -132 -415 -100 560 165 -158
5294 -158 168 705 -234 -330 591 633 -287 -325 285 244 -67 -191 534 360 -573 -627 403 394 -235 21 571 362
5316 362 -166 -125 609 263 -703 38 701 107 -397 296 804 -148 -381 451 309 -349 -743 593 965 10
5336 10 -789 574 323 -961 -329 724 421 -570 -453 637 -16 -879 -300 481 -448 -874 -103 638 73
5355 73 -741 123 612 -441 -683 186 283 -537 -622 547 499 -557 -914 161 61 -891 -420 201 -35 -752
5375 -752 -400 760 198 -968 -253 736 -213 -1267 -188 506 71 -865 234 571 -265 -807 114 718
5393 718 -406 -445 728 559 -870 -661 775 763 -560 -367 721 18 -927 -190 810 82 -793 -277
5411 -277 367 -262 -983 29 973 -42 -764 307 650 -388 -770 378 729 -197 -674 500 714 -546
$$ packed form
5274b08L75K62L2m67k93Q61m66k12L00P15n83o70M41N53p72k83L15O60l95l23
5294a58L26N37r39r6R21M2r20l8O10m1l11j24P25j74r33n4J030ro29K56N50k09
5316C62n28M1P34l46r66P41O63n94n04O93N08r52k33Q32j42o58l94J336L72r55
5336A0p99J363k51j284O32J053l03r91J17J090o53q63N79P81r29m26P71P41n65
5355G3q14Q64M89j053k42Q69R7q20q5J169m8j056l57J075j00r52M71O21k36p17
5375g52L52J160n62j166P15R89r49j054J079O94m35r36J099L37q36n42R21O04
5393G18j124l9J173j69j429K09J436j2j323J93J088p03r45P37J000p28q75N16
5411b77O44o29p21J012R44j015p22J071L43j038l82J148L51r26m77J174K14j260
$$ plain form
5429 -546 60 744 538 -701 -550 563 410 -270 118 986 483 -760 -218 749 -102 -643 235 1130 214
5448 214 -534 314 534 -151 -578 268 816 -551 -786 494 625 -167 -319 744 552 -949 -476 670
5466 670 578 -626 55 1010 97 -716 -216 769 190 -676 294 919 -267 -963 92 873 195 -437 573
5485 573 434 -572 -785 491 1052 -317 -361 647 196 -827 -124 813 674 -672 -96 484 -136 -775
5503 -775 92 804 -16 -1095 147 472 -226 -580 353 618 46 -630 80 571 -387 -368 617 685 -812 -370
5523 -370 569 116 -676 -90 641 158 -500 -49 495 -126 -793 -66 695 -134 -863 -65 519 -246 -350 367
5543 367 554 -512 -613 129 625 -616 -647 361 450 -651 -306 573 108 -498 -320 748 133 -668 -146
5562 -146 556 -243 -655 21 395 -253 -593 285 1021 -286 -459 427 347 -436 -576 45 463 -359 -366 324 117
$$ packed form
5429e46O06O84k06j239J51J113j53o80L88Q68n03j243N42R67q51n41Q78Q95r16
5448B14p48Q48K20o85m27Q46N48j367k35J280J31p92j52J063j92j501M73J146
5466F70r2j204O81R55r13q13N00R85n79q66R70O25j186o96J055P81o78o32J010
5485E73j39j006k13J276N61j369m4J008m51j023P03R37j39j346N76N80o20o39
5503g75Q67P12q20j079J242L25o98l54R33K65n72o76P10M91r58J9R85O8j497M42
5523c70R39m53p92N86P31m83o58M51N44o21o67P27P61q29p29P98N84p65j04P17
5543C67J87j066j01P42M96j241l1J008Q9j101L45Q79m65o06J78J068o15q01N22
5562a46P02p99m12O76L74o48l40Q78P36j307j73Q86q0p83j40O21M18q22pO90k07
$$ plain form
5583 117 -325 -385 189 90 -617 -120 445 -320 -411 -56 584 -80 -308 -215 410 -319 -474 61 799 32 -316
5604 -316 175 245 -492 -284 237 594 -308 -566 557 314 -617 -137 359 214 -607 -226 445 351 -524 131
5624 131 783 -38 -383 14 481 119 -165 55 483 65 -312 333 403 -267 -384 74 159 25 -312 196 309
5645 309 -121 -56 213 235 -274 -208 728 438 -208 254 464 -443 -384 -251 370 -63 -328 134 397 -175 -220 154
5667 154 261 -89 -413 391 562 50 -200 331 472 -191 -141 159 289 -84 159 188 191 206 -391 -5 -27 -287
5689 -287 329 264 43 -335 196 240 -29 35 64 47 -125 -224 -69 226 -157 -80 -92 96 47 -166 39 133 144 -162
5713 -162 140 172 -146 219 342 -7 -307 -124 14 91 -333 -238 244 49 -184 15 142 -157 -171 -249 151 121
5735 121 -164 -45 -20 -68 -373 14 117 97 -212 -99 131 4 64 -40 -7 -439 -258 -34 -54 -39 87 197
$$ packed form
5583A17m42o0N74r9p07M97N65p65r1L55O40o64k28R3O25p29j55N35P38p67l48
5604c16M91P0p37K08N21L57r02k58J123k43r31M80M96j45q21L81O71r4q75O55
5624A31O52q21l45L97M67l62k84K20M28m18l77O45P0o70j17M58Q5j34l37N08J13
5645C09m30O5K69K2n09O6R36k90o46M62K10r07N9J33O21m33k65M62K63n72m5L74
5667A54J07l50l24Q04J71n12k50N31J41o63N0L00J30l73K43K9LJ5n97L86k2k60
5689b87O16o5k21l78N31M4k69O4K9j7j72r9J55K95l83P7j2J88m9k13K05R4J1l06
5713a62L02L2l18L65J23l49l00J83J38P7m24R5M82j95k33J99J27k99j4p8M00l0
5735A21k85J19K5m8l05L87J03k0l09J13K30j27O0j04L3m32J81K24k0J5J26J10
$$ plain form
5757 197 -41 -119 -123 -99 -68 -235 -198 -84 17 124 174 -88 -28 -39 -425 -18 -28 -25 -171 231 -61 -209 -127 87
5781 87 -126 -100 192 401 -42 360 271 27 -189 -35 172 -138 -141 69 74 212 -2 -167 410 146 -80 225
5803 225 90 92 -15 7 149 60 208 -5 135 29 -229 384 69 -14 211 73 40 -61 -123 -61 65 -194 119
5826 119 250 396 59 130 188 121 184 -29 -150 -333 -131 -109 117 -60 81 146 325 215 -107 78 185 -270
5848 -270 5 13 269 -13 -85 81 -52 -74 260 276 189 -73 306 -104 -21 -177 -287 -1 -213 223 269 323 -138
5871 -138 -426 -55 -120 51 -230 -117 116 -121 -251 342 261 -211 -333 130 -136 -104 202 225 -201 -443 1
5892 1 13 -140 -161 129 412 -167 -342 -10 192 -41 -271 149 184 -25 -131 66 108 6 96 234 -256 -262 -126
5915 -126 177 -73 -220 22 309 139 -402 -99 -11 -109 -304 298 222 -55 -335 185 153 83 -28 161 310 -235
$$ packed form
5757A97k38p8mK4L1j67L7J14J01J07N0k62O0j1l86M07j0Lj46M02k92j48Q2K14
5781H7k13K6K92K09m43M02q9k44k16J54K07l10lK10NJ38k14j65N77k64k26L05
5803B25j35Kj07K2J42q9J48k13J40j06k58O13l15q3K25j38l3j01o2O2J26k59L13
5826A19J31J46l37P1N8o7O3k13j21j83K02K2K26j77J41O5J79j10l22J85J07m55
5848b70K75QK56k82p2J66j33k2L34J6q7k62L79m10Q3j56j10K86k12M36M6N4m61
5871a38k88L71o5J71k81J13K33k37j30N93q1m72j22M63k66L2L06K3m26k42M44
5892AJ2j53k1K90K83n79j75L32K02k33k30M20L5k09j06J97M2j02R0J38m90oJ36
5915a26L03k50j47K42K87j70n41L03Q8r8j95O02p6k77k80N20l2p0j11J89J49n45
$$ plain form
5937 -235 -154 64 347 -290 -128 310 224 -363 -155 214 314 -93 -60 246 39 0 324 369 -149 -242 493 312
5959 312 -175 -316 33 410 -80 -574 152 550 -529 -298 424 466 -202 -520 366 198 -321 58 140 318
5979 318 -489 181 425 282 -291 -101 221 -6 -748 142 334 21 -365 51 571 -67 -374 365 322 -161
5999 -161 -547 424 470 -296 -301 456 301 -381 -357 270 238 -342 -4 686 -106 -510 -16 568 -88 -590 -76 780
6021 780 -19 -287 589 650 -217 -709 393 367 -105 -284 262 346 -357 -174 629 479 -418 -307 546 206 -265
6042 -265 -143 472 298 -409 -215 624 -10 -264 32 606 -4 -708 89 584 -69 -522 145 532 -303 -655
6062 -655 340 753 -222 -307 599 757 -473 -139 616 865 -675 -226 587 340 -273 -187 726 353 -948 -245
6082 -245 838 53 -789 -268 914 152 -677 60 485 -363 -516 377 914 -307 -840 507 617 -606
$$ packed form
5937b35Q1K18K83o37J62M38q6n87K08L69J00m07L3L06k07l9L24M5n18r3P35j81
5959C12m87j41L49L77m90m94P26L98j079K31P22M2o68l18Q86j68n19L79Q2J78
5979C18q07O70K44j43n73J90L22k27p42Q90J92l13l86M16N20o38l07P39m3m83
5999a61l86R71M6p66nP57j55o82K4O27l2n80L38O90p92m04M94N84o56n02N14Q56
6021G80p99k68Q76O1q67m92J102k6m72j79N46Q4p03J83Q03j50q97J11Q53l40m71
6042b65J22O15j74p07J94Q39o34k54K96N74o10p04P97M95o53m53O67L87q35l52
6062f55R95M13r75q5R06J58j230L34P55K49j540M49Q13k47o13Q6R13l73j301P03
6082b45J083p85q42N21J182p62q29P37M25q48j53Q93N37j221n33J347J10j223
$$ plain form
6100 -606 -520 232 351 -815 -405 638 411 -687 -421 649 65 -564 -122 759 352 -695 -176 646 45
6119 45 -615 -27 778 -347 -889 137 619 -396 -784 284 577 -654 -598 450 719 -591 -372 563
6137 563 476 -742 -278 848 319 -639 -293 587 202 -835 -45 603 -222 -886 225 494 -361 -737 95
6156 95 797 -350 -849 179 766 -236 -715 543 598 -474 -559 504 561 -691 -374 487 532 -652 -556
6175 -556 847 301 -539 -77 876 154 -830 -109 686 231 -614 243 566 -73 -691 -70 845 -604 -476
6194 -476 355 778 -530 -586 563 602 -283 -448 460 753 -534 -319 660 514 -220 -136 540 343 -701 -139
6214 -139 749 181 -479 77 739 -188 -390 278 931 34 -732 464 766 -276 -421 556 597 -345 -218 716
6234 716 556 -397 -255 565 334 -528 -56 659 -13 -666 -243 799 -204 -526 -41 463 25 -315 -39
$$ packed form
6100f06Q6P52J19j166M10J043k27j098K66J070n84o29M42Q81m07j047N19Q22o01
6119D5o60N88Q05j125n42J026M82j015l88J068K93j231N6J048K69j310K19R35
6137E63q7j218M64J126n29r58L46Q80l85j037P90O48q25o64J111K69q55l76Q32
6156I5P02j147m99J028N87j002m79J258N5j072q5J063N7j252L17Q61M5j184R6
6175e56J403n46q40M62R53p22r84P21P95m55q45Q57L23o39o18O21R15j449J28
6194d76Q31M23j308n6J149L9q85j65R08K93j287K15R79j46p34Q4O76j97j044N62
6214a39Q88n68o60N56O62r27k02O68O53q97p66J196L02j042j45R77M1r42J27R34
6234G16j60r53J42Q20k31q62M72P15o72o53M23J042j003l22M85N04m38l40K76
$$ plain form
6253 -39 689 -249 -608 126 551 -165 -192 117 498 -199 -271 616 338 -525 -334 880 113 -636 35 470 243
6274 243 -513 -46 338 -163 -605 10 390 83 -540 -14 645 -471 -782 273 473 -350 -444 -18 436 -88
6294 -88 -406 635 291 -499 -537 422 148 -364 -45 559 44 -505 -219 358 2 -505 -220 301 -144 -487
6314 -487 44 95 -282 -554 203 321 -378 -405 209 441 -191 -306 60 282 -485 -350 127 61 -673 -61 369
6335 369 81 -507 -294 161 67 -592 -96 193 5 -366 94 287 -137 -220 -39 355 -291 -406 129 286 -237
6356 -237 -288 27 139 -641 -229 119 171 -174 -48 379 -233 -4 -2 552 91 -302 -257 355 229 -395 21 438
6378 438 -92 -425 -43 106 69 -114 -138 177 42 -114 197 146 -317 -72 30 35 -235 159 114 271 -159 -222
6400 -222 -40 -17 -486 -42 250 173 147 195 -11 -21 -1 -253 142 -137 -160 295 37 -160 -21 404 228 -80
$$ packed form
6253c9P28r38l59P34M25p16k7L09L81o97p2Q87k78q63J91J214p67p49O71M35k27
6274B43p56M67L84n01m42O15L80l07o23N26O59j116l11J055K00q23r4M26M54n24
6294h8l18J041l44p90l8R59k74n12L19O04n15n49K86N77l56n07K85N21m45l43
6314d87N31N1l77k72P57J18o99k7O14K32o32j15L66K22p67J35M77o6p34O12M30
6335C69k88n88K13M55r4o59M96K89j88l71M60J93m24q3J81L94o46j15N35J57n23
6356b37n1L15J12p80M12L48N2l45J26M27o12K29KN54m61l93M5O12j26o24M16M17
6378D38n30l33L82J49l7j83k4L15j35j56L11n1m63K45J02Nk70L94m5J57m30o3
6400b22J82K3m69M44K92p7k6M8k06j0K0k52L95k79k3M55k58j97J39M25j76l08
$$ plain form
6422 -80 42 227 320 214 -85 349 223 159 -85 144 42 125 226 142 83 164 76 33 487 -33 76 405 264
6445 264 168 112 449 -52 -163 342 256 146 11 208 25 -28 -42 31 350 109 46 72 -61 63 -137 36 171
6468 171 -121 206 199 -56 -102 118 140 126 -135 -220 -1 57 37 201 340 -148 -156 123 270 -86 -118 -148 -142 -230 -115
6493 -115 239 -106 -373 -51 -90 -264 -284 -136 -35 -104 -97 40 52 -110 -81 -133 -4 124 -202 -273 118 -238 -47
6516 -47 16 -236 -380 -120 -87 65 -50 -143 45 -262 -392 -48 243 -293 -291 18 -81 -82 -130 -202 -33 -217 -278 94
6540 94 97 -293 -301 -170 -201 -236 -116 -58 14 -28 7 -101 89 -206 -163 73 -85 13 -64 296 -23 -133 196 82 -186
6565 -186 -349 35 148 -60 -44 172 410 -364 -537 30 83 -70 -109 331 72 -217 -41 138 30 -308 -116
6586 -116 67 182 68 343 449 202 -132 4 -64 18 -679 580 198 76 -229 338 500 -368 -157 150
$$ packed form
6422h0J22J85R3j06k99M34j26o4k44K29j02Q3J01q4n9Q1q8m3M54n20J09L29j41
6445B64r6n6L37n01j11N05q6j10j35J97j83n3j4P3L19k41o3K6j33J24k00J73J35
6468A71k92L27pk55m6K20K2j4k61q5K19N8k0J64J39m88qK79J47l56l2l0Oq8J15
6493a15L54l45k67L22l9j74k0J48J01o9PJ37J2j62K9n2J29J28l26p1L91l56J91
6516d7O3k52j44K60L3J52j15r3J88l07j30L44K91n36KL09r9jm8p2J69j84o1L72
6540I4Ll90qJ31l1l5J20N8P2m2L5j08J90k95M3K36j58R8p7L60l19j10L29j14k68
6565a86j63L84J13k08J6K16K38p74j73N67N3j53l9M40k59k89J76J79j08l38J92
6586a16J83J15j14K75J06k47l34J36o8Q2o97J259l82j22l05N67J62q68K11L07
$$ plain form
6606 150 57 -638 109 385 184 -346 245 524 -143 -307 -148 106 209 -452 -49 397 -54 -280 -13 -71 23
6627 23 -33 327 383 -221 -374 328 125 -729 -27 254 164 -269 -282 326 297 -306 247 461 -33 -347 -206 453
6649 453 194 80 196 237 -462 -612 276 434 -45 -383 631 376 -584 -150 581 539 -400 -247 592 88
6669 88 -854 -57 704 222 -236 74 347 -121 -961 170 724 -18 -390 -53 612 -287 -491 403 716 -432
6689 -432 -451 322 197 -471 -284 532 346 -552 -601 269 221 -274 128 932 309 -676 -374 364 -113 -595 166
6710 166 873 -97 -544 62 562 106 -581 475 718 -665 -695 388 635 -238 -253 659 169 -595 -532 199
6730 199 433 -653 -240 904 -221 -978 -243 487 -169 -837 -149 499 -669 -1157 -21 761 -612 -696
6748 -696 165 244 -807 -604 194 609 -419 -787 801 -48 -625 -329 580 374 -339 -458 349 23 -731
$$ packed form
6606A50r3o95P47K76k01n30N91K79o67j64J59K54J03o61M03M46m51k26K67n8R4
6627B3n6L60N6o04j53P02k03q54P02K81r0m33j3O08k9o03N53K14m94l14J41O59
6649D53k59j14J16M1o99j50Q88J58m79l38J014k55r60M34P31m2r39J53Q39n04
6669H8r42P97P61m82m58L10K73m68q40J131N54p42l72L37O65q99k04Q94L13j148
6689d32j9P73j25o68J87Q16j86q98m9Q70m8m95M02Q04o23r85L02P38m77m82P61
6710A66P07r70m47O06N00m56o87J056K43j383l0J083K47q73j5R12m90p64O3P31
6730A99K34j086M13J144j125p57P35P30o56o68O88O48j168m88J136P82j373q4
6748f96Q61P9j051K03P98M15j028l68J588q49n77K96R09k06p13j19Q07l26p54
$$ plain form
6767 -731 -70 972 -98 -971 -285 409 23 -788 484 705 -253 -884 -32 395 -434 -646 539 594 -494
6786 -494 -689 406 654 -615 -272 438 433 -956 -674 692 551 -566 -219 662 11 -883 -155 703 104
6805 104 -537 49 581 -347 -614 316 650 -114 -633 324 840 -465 -306 525 748 -441 -208 877 501
6824 501 -537 -122 1125 543 -381 -89 721 433 -787 -13 990 124 -313 -240 530 39 -736 164 873
6843 873 322 -539 446 749 -159 -542 866 572 -435 -380 278 584 -638 -22 701 568 -896 -311 448
6862 448 301 -790 -111 960 94 -581 -148 756 -240 -457 222 924 -168 -864 -105 631 -203 -277 418
6881 418 441 -531 -737 471 519 -260 -336 475 154 -859 -423 588 76 -482 -27 822 -50 -775 -72 1056
6901 1056 62 -672 24 777 -88 -731 -16 540 -192 -492 136 505 -445 -791 713 609 -434 -294 170
$$ packed form
6767g31O61J042j070q73O86O94l86q11J272K21r58o31Q52M27q29k12J185N5j088
6786d94j95J095K48j269L43P10nj389K82J366j41j117L47Q81o51q94P28Q58n99
6805A04o41N86N32r28k67R30L34p64n19R57N16j305J59Q31K23j189K33J085l76
6824E01j038M15J247n82r24K92Q10k88j220P74J003q66m37P3P70m91p75R00P09
6843H73n51q61R85L03r08l83J408k94j007N5O58L06j222O16P23j33j464N85P59
6862D48j47j091O79J071q66o75M33R04r96k17O79P02j092o96P59P36q34p4O95
6881D18K3r72k06J208M8p79p6Q11l21j013M36J011n12n58M55Q49q72p25P03J128
6901A056r94p34O96P53q65o43P15N56p32l00O28L69r50l46J504j04j043J40M64
$$ plain form
6920 170 433 -777 -450 636 172 -370 -416 445 318 -558 -329 636 433 -342 -135 948 306 -748 198
6939 198 802 -149 -510 -113 313 77 -472 250 684 -452 -470 293 346 -343 -551 464 353 -297 -392 452
6959 452 287 -344 -90 313 -114 -591 -490 360 -114 -283 292 709 228 -599 -213 168 55 -661 -153 586
6979 586 -91 -447 176 561 -322 -483 290 108 -569 -558 201 347 -180 113 238 -73 -698 -360 385 -127
6999 -127 -395 130 518 152 -361 -57 454 398 -437 -75 271 1 -237 280 250 179 -432 -137 140 -370 -168
7020 -168 218 211 -300 -527 467 261 -390 -144 83 -13 -615 -207 428 60 -151 299 70 109 -108 124 82 307
7042 307 -550 142 6 -222 -262 -286 624 183 -237 237 243 45 -383 472 538 -27 -252 54 -19 -88 260 247 266
7065 266 2 238 432 177 70 5 178 103 -190 152 389 136 -296 27 132 641 -194 -16 34 -233 -98
$$ packed form
6920A70K63j210L27J086m64n42m6Q61j27q76K29R65k03p75K07J083o42j054R46
6939A98O04r51l61L97M26k36n49P22M34j136j8P63N3o89k08J015j11o50r5Q44
6959D52j65o31K54M03m27m77J01Q50m74j69N75M17m81q27L86L81j13p16N08P39
6979E86o77l56O23L85q83j61P73j82o77J1P59J46n27K93J25l11o25L38P45n12
6999a27k68N25L88l66n13L04N11n6q35L62L46k70k38N17l0p1o11K95K77n10K02
7020a68L86pn11k27R94k06o51K46K27r6o02M08O35l68k11M50k29L9k17K32m2K25
7042C07q57O92j36k28m0k4R10m41m20M74Oj98m28Q55O6n65k25L06p3o9L48j3J9
7065B66k64K36J94k55j07o5J73p5k93L42K37k53m32L23J05N09q35J78N0k67J35
$$ plain form
7086 -98 265 54 137 155 284 353 -237 -164 22 62 -54 0 84 -6 -197 -38 233 83 8 -60 93 112 32 -58 194
7111 194 35 5 231 318 -139 -186 21 416 -62 160 145 235 -7 -138 204 402 -275 -273 47 -33 75 -8 179
7134 179 -49 -18 153 70 104 -177 -186 167 -164 -11 108 5 3 -312 -173 -1 -244 -411 118 -19 -58 -80 96
7157 96 -142 -67 3 116 159 -180 -20 27 -133 -8 -276 681 113 -309 -139 298 88 -278 60 52 -140 -296
7179 -296 8 9 52 -210 162 46 -20 -27 195 -205 -22 -300 216 -172 -212 -38 356 -57 -500 415 -80 123
7201 123 -412 227 69 73 -138 -87 -79 -128 -427 -36 372 -295 -310 213 122 -324 -258 282 369 -412 93 -240 -45
7224 -45 -242 -259 362 64 -109 -270 40 -136 -432 -120 251 -299 -185 263 263 22 -371 503 107 -312 -267 -240
7246 -240 414 -274 -322 291 386 -416 -318 287 -51 -315 42 193 -227 -645 193 153 -168 -29 244 469 -274
$$ packed form
7086i8L63k11Q3J8J29O9n90P3J86M0j16N4Q4r0j91J59K71j50p5o8J53J9q0r0K52
7111A94j59l0K26Q7m57m7K07L95m78K22j5R0k42j31L42J98o77KL20q0J08q3J87
7134A79k28L1J71q3L4k81rL53l31J53J19j03kl15J39J72k43j67N29j37l9k2J76
7157I6k38P5P0J13M3l39J60M7j60J25k68R57n68m22J70M37k10l66L38qj92j56
7179b96L04JM3k62L72j16o6pK22m00J83k78N16l88m0J74L94m13m43R15m95K03
7201A23n35O39j58Mk11N1Qm9k99L91M08o67j5N23r1m46O6N40Q7p81N05l33J95
7224d5j97j7O21k98j73j61L10j76k96L12L71n50J14M48%k41l93Q74l96m19M5K7
7246b40O54o88m8O13R5q02R8O05l38k64L57J51m20m18Q38m0l21J39K73K25p43
$$ plain form
7267 -274 -372 213 381 -83 -330 -26 494 -423 -383 60 568 136 -143 259 290 -234 -238 489 -52 -313 -109 436
7289 436 192 -284 243 553 -118 -219 205 508 61 -300 459 502 -22 -348 465 539 -394 -437 478 390 -306
7310 -306 -292 651 117 -333 -234 518 288 -289 -266 342 45 -171 200 444 -163 -455 224 566 -75 -180 244
7331 244 133 -375 -379 178 367 -359 -73 741 603 -305 -47 686 87 -611 -2 550 34 -472 204 477 -138
7352 -138 -387 644 451 -217 -550 173 287 -34 -396 553 660 -561 -701 41 522 -372 -169 274 440
7371 440 -563 -508 834 658 -586 -220 497 -205 -762 18 939 19 -658 440 380 -431 -724 222 804
7390 804 9 -592 110 110 -818 -526 409 284 -620 -582 -127 197 -605 -263 658 281 -686 -284 728 -70 -860
7411 -860 89 937 -189 -773 -278 544 -175 -702 688 811 -283 -827 214 514 -119 -377 678 291
$$ packed form
7267b74r8N85J68m64k47L04N20r17M0M43N08m32k79M02L1n24mP27n41k61K04N45
7289D36k44m76N27L10o71j01M24L03m47l61P59M3n24l26Q13P4r33m3R15q8o96
7310c06J4R43n34m50R9P52k30n77K3O08k97k16L71K44o07k92O79L42o41j05M24
7331B44j11n08mN57J89p26K86Q14j38r08K58P33n99o98O09N52n16n06O76K73o15
7352a38k49J031j93o68l33P23J14l21l62R49J07j221j40P42M81q94K03M43J66
7371D40j003N5J342j76j244L66P17p02n57P80R21r20o77J098o0q11k93R46N82
7390H04p95o01P02%r28K92R35j25r04L8M55L24q02L42R21l77r67M02J012p98p90
7411h60R49Q48j126n84M95Q22p19n27J390J23j094n44J041L00o33k58J055l87
$$ plain form
7429 291 -810 -646 790 546 -451 -91 640 -208 -1003 -334 605 -60 -618 74 635 -320 -734 347 840
7448 840 -134 -397 174 453 -726 -697 521 789 -394 -582 694 264 -780 -337 906 574 -685 -458
7466 -458 582 -12 -883 216 751 68 -537 91 789 -319 -552 475 664 -198 -833 303 330 -191 -269
7485 -269 379 481 -620 -674 511 301 -659 -105 691 348 -767 -363 364 35 -766 -112 383 -236 -1032
7504 -1032 -26 776 61 -729 288 695 -790 -951 386 834 -10 -314 493 358 -575 -459 426 158
7522 158 -758 -219 609 -81 -912 -202 882 34 -664 -41 636 -325 -663 207 556 51 -630 325 292 -242
7542 -242 -639 498 673 -362 -514 262 591 -444 -603 823 715 -606 -71 589 245 -340 -8 895
7560 895 24 -626 -32 797 -152 -398 378 765 -274 -431 111 526 100 -474 315 581 -406 -306 528 524
$$ packed form
7429B91j101J64J436k44r97L60P31q48p95O69R39o65n58O92N61r55m14J081M93
7448H40r74k63N71K79j179K9J218K68j183j88J276m30j044M43J243l32j259K27
7466d58J040n94q71J099N35o83o05O28O98j108k33J027J89q62o35J136K7n21p8
7485b69O48J02j101n4J185k10r60N54P96l43j115M04P27l29q01O54M95o19p96
7504a032J006Q02p15p90J017M07j485j61J337M48q44l04Q07j35r33J16Q85k68
7522A58r16N39Q28o90q31P10J084q48o98O23O77r61l38Q70L49n05o81R55l3n34
7542b42l97J137J75j035j52P76L29j035j59J426j08j321N35O60l44n85L32R03
7560H95q71o50N94Q29r49k46P76L87j039j57N42M15m26n74P89K66r87J00Q34m
$$ plain form
7580 524 -229 -430 656 7 -641 -344 590 424 -490 2 594 -122 -264 -65 705 127 -731 375 346 -351
7600 -351 -364 438 684 -304 -630 652 409 -351 -158 515 355 -390 -364 181 211 -416 129 504 383 -349 -385
7621 -385 539 -250 -336 211 675 9 -378 53 251 -427 -398 58 286 -390 -598 52 81 -329 -432 223 477
7642 477 -516 -255 164 271 -109 -383 707 247 -429 -281 385 215 -453 -101 351 -314 -417 -19 306 75
7662 75 -676 100 -61 -225 -323 99 149 -325 -515 332 181 -505 -316 84 202 -449 -160 228 39 -554 -81
7683 -81 248 170 -471 -155 -417 -158 -211 226 256 -243 -359 276 140 43 -92 -2 258 -311 -217 206 238 -353 -149
7706 -149 258 59 -116 174 249 91 -254 -63 301 208 -155 -69 325 162 -146 -120 464 35 -372 -143 162
7727 162 -120 -102 82 78 -156 -580 101 113 -231 134 57 252 -66 -199 166 410 -327 -97 52 42 -107 -134
$$ packed form
7580E24p53k01J086o49o48K97R34j66r14M92N92p16j42J99P70n78q58J106k9o97
7600c51j3Q02K46r88l26J282k43p60J93O73j60p45K6N45L0o27N45L75j21p32l6
7621c85R24p89q6N47M64o66l87M31J98o78K9M56K28o76k08O50K9m10j03O55K54
7642D77r93K61M19J07l80k74J090m60o76J48O66j70o68L52M52o65j03L98L25k31
7662G5p51P76j61j64r8M22N0m74j90Q47j51o86J89M00J18o51K89L88j89n93M73
7683h1L29p8o41L16k62K59n3M37L0m99j16O35j36r7j35R0K60n69R4M23L2n91K04
7706a49M07j99j75K90P5j58l45J91L64r3l63Q6L94j63l08K6N84m29m07K29L05
7727A62k82J8J84mk34m24O81J2l44L65p7J95l18j33L65K44p37K30J49j0j49k7
$$ plain form
7749 -134 30 177 -336 -22 168 115 -236 -72 202 -192 44 154 139 -39 -393 235 106 -90 -88 246 243 -60
7771 -60 -247 214 212 83 -351 -64 290 -205 57 57 202 139 101 75 -151 108 12 16 121 -117 255 239 139 -59
7795 -59 398 -62 38 -161 189 159 179 -219 -59 297 25 99 390 53 61 -52 388 205 37 -136 238 -111
7817 -111 172 -201 11 239 -142 139 -59 243 -272 182 61 -94 -122 -84 144 -35 -99 208 140 -335 -93
7838 -93 305 112 -434 40 21 377 -289 -200 -28 -275 -293 -94 -136 186 -315 0 71 44 -211 -359 128 108 -140
7861 -140 -15 -18 95 161 211 -85 -457 -154 -144 176 63 -560 -41 269 -60 -42 51 -262 -223 -202 184 -189 -147
7884 -147 -208 -85 -38 -67 -257 16 -119 -252 -295 116 35 -146 -143 50 97 -238 -114 59 -143 9 -5 7 10 -102
7908 -102 122 -243 -550 -24 -29 171 -378 290 102 75 -57 109 257 -346 -367 -85 -119 -227 -194 167 14 19 -28
$$ packed form
7749a34J64J47n13L14J90n3l51J64K74l94K36J10j5j78l54O28j29j96KL34ll03
7771f0j87M61kj29m34K87L54m95K62%J45o3l8k6k26K59r6MJ05k38L72j6j00j98
7795e9M57m60J00j99L50l0K0l98J60L56k72P4K91l37Qj13M40j83j68j73L74l49
7817a11K83l73K12K28l81K81j98L02n15M54j21j55k8L8K28j79o4L07o8m75K42
7838i3L98j93n46M74j9L56o66Q9J72k47j8J99m2L22n01L15P1k7k55j48M87k0k48
7861a40J25lJ13O6N0k96l72L03J0L20j13o23N19L10l29J8R3l13L9K1L86l73M2
7884a47o1J23M7k9j90K73j35j33m3M11q1j81LJ93M7l35J24J73k02J52j4J2Lj12
7908a02K24l65l07N26nK00n49O68j88k7j32J66J48o03k1K82l4j08L3L61j53Nm7
$$ plain form
7931 -28 209 215 -369 1 229 253 -33 93 589 251 -279 331 453 154 -277 82 270 -63 -227 188 419
7952 419 -347 -339 133 263 -354 -159 218 318 -214 -156 211 402 -256 55 510 483 -441 -257 528 208 -271
7973 -271 54 259 106 -627 -29 462 164 -203 46 377 -203 -417 337 700 -305 -253 284 307 -573 -454
7993 -454 281 527 -143 -181 226 -148 -358 -372 714 134 -609 -292 254 -36 -649 -116 582 -70 -652 -97
8013 -97 523 -149 -581 328 769 -373 -559 146 61 -273 -347 159 336 -164 -507 380 277 -460 -163 750 96
8034 96 -626 -474 393 84 -708 -30 850 -162 -618 -322 422 -356 -777 295 779 -160 -628 109 900 -292
8054 -292 -656 391 421 -639 -565 616 549 -245 -315 919 217 -1121 -605 742 385 -507 -360 814 -169
8073 -169 -859 17 968 93 -608 183 568 -506 -664 401 954 -288 -619 -1 764 -833 -544 768
$$ packed form
7931b8K37On84L70K28K4k86J26M96l38n30O10J22k99m31L59J88l33j64M15K31
7952D19p66QM72J30o17J95L77J00n32N8L67J91o58L11M55k7r24J84P85l20m79
7973b71L25K05j53p33N98M91k98l67K49L31n80k14P54L63j005N2N37K3q80J19
7993d54P35K46o70l8M07l74k10j4J086n80p43L17N46k90o13N33O98o52n82N55
8013i7O20o72m32R09M41j142j86P05q5l34p4N06J77n00l43Q87j03p37K97R13o54
8034I6p22J52Q67l09p92O78Q80j012m56K96P44p78m21J072M84r39m68P37P91j192
8054b92l64J047L0j060P4J181o7p94p0J234p02j338N16J347l57q92J47J174r83
8073a69o90Q76R51q75p01P91L85j074j58J065N53j242l31O18P65j597K89J312
$$ plain form
8091 768 771 -856 -384 686 49 -656 -194 992 175 -692 -125 464 -84 -1031 91 1099 83 -833 -43
8110 -43 773 -235 -489 447 858 -406 -935 282 661 -353 -591 688 708 -950 -532 565 189 -736
8128 -736 -464 1039 72 -1260 -435 618 54 -557 444 1016 50 -1104 311 1096 -94 -502 328 569
8146 569 -425 -1073 489 1195 -149 -335 575 390 -1077 -832 1147 1012 -334 -413 950 148 -1060 -55
8164 -55 1177 246 -1062 -314 733 181 -943 255 1274 124 -936 290 832 -498 -580 697 1059
8181 1059 -363 -729 394 513 -788 -644 869 584 -969 -634
$$ packed form
8091G68Lj627M72J070o37p05M62J186q17q67N67N89n48r47J122J008j016r16P90
8110d3Q16j008k54R36M11j264n29J217L79j014k38J279K0j658M18J097l76r25
8128g36K72J503r67j332Q25J053n64o11J001N72r66j154J415P85j190m08Q30K41
8146E69r94o48J562P06j344j86R10j85j467K45J979j35j346p9J363q02j208J005
8164e5J232r31j308P48J047n52j124J198J019j150j060J226N42j330q2J277L62
8181A059j422l66J123J19j301J44J513k85j553L35
8191f34
$$ Imaginary data points
##PAGE= N=2
##DATA TABLE= (X++(I..I)), XYDATA
$$ plain form
0 0 0 0 0 -8 16 -8 16 -24 32 -40 48 -62 80 -90 112 -136 165 -196 231 -268 319 -371 426 -490 568 -649
26 -649 739 -836 954 -1074 1206 -1357 1520 -1699 1898 -2109 2350 -2608 2893 -3204 3549 -3931
42 -3931 4353 -4817 5339 -5926 6586 -7334 8204 -9212 10405 -11839 13607 -15850 18790
55 18790 -22836 28796 -38450 56735 -103552 469054 885896 -223686 -130088 382636 333580
66 333580 -67328 271860 702863 522948 129628 235293 320094 166178 263336 622164
76 622164 383476 -200881 -87811 564000 526538 10284 201571 849053 591115 -316524
86 -316524 -454736 208582 468240 251091 347697 574335 244953 -196558 -37561 276703
96 276703 136411 30935 330591 350035 -161036 -254106 362011 604834 64606 -227728
$$ packed form
0@%%%qK4k4K4m0N6p2Q8j10J42j70K02k48L01l61M27m99N87o90P97r16J058j217
26f49J388j575J790k028K280k563K877l219L597m007M459m958N501o097O753p480
42c931Q284r170J0156j1265J2512j3920J5538j7416J9617k2244K5446k9457L4640
55A8790m1626N1632o7246R5185j60287N72606M16842j109582R3598N12724m9056
66C33580m00908L39188M31003j79915l93320J05665Q4801j53916R7158L58828
76F22164k38688n84357J13070O51811l7462n16254J91287O47482k57938r07639
86c16524j38212O63318K59658k17149R6606K26638l29382m41511J58997L14264
96B76703j40292j05476K99656J9444n11071r3070O16117K42823n40228k92334
$$ plain form
106 -227728 121743 176596 -307265 -339079 270043 504219 125380 -26462 141515 -79466
116 -79466 -501785 -306939 241872 253629 -88612 -52213 110131 -153832 -377332 -33204
126 -33204 255570 -95269 -443547 -217086 -3693 -219018 -221942 222968 278374 -304962 -591351
137 -591351 -238219 -74256 -365590 -334983 148391 236819 -220626 -433334 -234554 -217744
147 -217744 -381657 -230584 23060 -148899 -422961 -253269 -6603 -183975 -353190 -91470
157 -91470 26493 -422276 -724066 -321175 119447 -28130 -269636 -123151 -40242 -352463
167 -352463 -549969 -327961 -136710 -201373 -165859 -11634 -132686 -389766 -290295 -29797
177 -29797 -149071 -418104 -281532 -11168 -171256 -437988 -210400 177760 72786 -288648
$$ packed form
106b27728L49471N4853m83861l1814O09122K34176l78839j51842J67977k20981
116g9466m22319J94846N48811J1757l42241L6399J62344k63963k23500L44128
126c3204K88774l50839l48278K26461K13393k15325k924M44910N5406n83336k86389
137e91351L53132J63963k91334L0607M83374Q8428m57445k12708J98780J6810
147b17744j63913J51073K53644j71959k74062J69692K46666j77372j69215K61720
157i1470J17963m48769l01790M02891M40622j47577k41506J46485Q2909l12221
167c52463j97506K22008J91251o4663L5514J54225j21052k57080R9471K60498
177b9797j19274k69033J36572K70364j60088k66732K27588L88160j04974l61434
$$ plain form
187 -288648 -322926 -184332 -268238 -340031 -99303 119493 5497 -135881 -74401 -99503 -293656
198 -293656 -269781 -6 41933 -179993 -181483 64485 80956 -133181 -118718 85299 26056
209 26056 -226335 -216178 4955 43610 -28239 89696 221222 62175 -161367 -119458 6911
220 6911 -36115 -49026 135098 232449 73758 -32653 84282 134002 -6132 -41512 107187
231 107187 130272 -12544 11968 227909 278874 113344 51048 132874 94930 -40045 -859
242 -859 180961 240343 186668 201214 224034 120822 25554 85124 151938 101180 96164 227264
254 227264 278615 154958 97374 213848 258202 110900 10696 96798 182383 157184 168127
265 168127 263667 277928 175163 108740 113806 87789 62553 138870 231120 204650 149294 197853
$$ packed form
187b88648l4278J38594q3906p1793K40728K18796j13996j41378O1480k5102j94153
198b93656K3875K69775M1939k21926j490K45968J6471k14137J4463K04017n9243
209B6056k52391J0157K21133L8655p1849J17935J31526j59047k23542M1909J26369
220F911m3026j2911J84124R7351j58691j06411J16935M9720j40134l5380J48699
231A07187K3085j42816K4512K15941N0965j65530o2296Q1826l7944j34975L9186
242h59J81820N9382n3675J4546K2820j03212r5268N9570O6814n0758n016J31100
254B27264N1351j23657n7584J16474M4354j47302j00204Q6102Q5585k5199J0943
265A68127R5540J4261j02765o6423N066k6017k5236P6317R2250k6470n5356M8559
$$ plain form
277 197853 242951 145749 31035 67165 156004 138406 85567 130459 205852 197603 151714 139005
289 139005 113293 48466 24027 66905 100788 111569 157345 198526 141993 40973 27610 73825
301 73825 54377 -7738 13500 101885 132620 94234 73218 73738 37790 -15385 -26165 -9373
313 -9373 -5320 8401 50790 74799 51235 23389 9919 -29925 -92258 -100655 -38486 11431 4416
326 4416 -9311 3113 2622 -35738 -79362 -100544 -107607 -102001 -74048 -40664 -25819 -26808 -36139 -65751
340 -65751 -113172 -137597 -125127 -114247 -122647 -111058 -61188 -26214 -51221 -105796 -136786 -143038
352 -143038 -149160 -153647 -139043 -110134 -86572 -77847 -80577 -95601 -120068 -147203 -170157 -176794 -155246
365 -155246 -114526 -85176 -84135 -97258 -103254 -108245 -129863 -161380 -175750 -157973 -121864 -90661
$$ packed form
277A97853M5098r7202j14714L6130Q8839j7598n2839M4892P5393q249m5889j2709
289A39005k5712o4827k4439M2878L3883J0781M5776M1181n6533j01020j3363M6215
301G3825j9448o2115K1238Q8385L0735l8386k1016N20l5948n3175j0780J6792
313i373M053J3721M2389K4009k3564k7846j3470l9844o2333q397O2169M9917p015
326D416j3727J2424m91l8360m3624k1182p063N606K7953L3384J4845r89r331k9612
340f5751m7421k4425J2470J0880q400J1589M9870L4974k5007n4575l0990o252
352a43038o122m487J4604K8909K3562Q725k730j5024k4467k7135k2954o637K1548
365a55246M0720K9350J041j3123n996m991k1618l1517j4370J7777L6109L1203
$$ plain form
377 -90661 -76374 -75751 -83353 -100617 -125543 -145633 -146770 -130433 -112313 -97500 -76270 -49905 -41559
390 -41559 -67477 -108953 -129388 -118072 -98758 -88536 -78398 -54686 -27803 -21080 -38508 -62078
402 -62078 -77951 -86855 -87904 -73774 -41600 -9048 3047 -4460 -14988 -19687 -26079 -41562 -56448
415 -56448 -49891 -19025 17125 36871 36238 25811 12707 1003 -7597 -10975 -6269 8246 31150
428 31150 53850 66446 67923 59685 38805 13740 5673 24389 49805 60912 64725 79561 97260
441 97260 93664 68567 45201 37388 40660 53636 75271 95449 104836 105233 100049 88196 72861
454 72861 64773 62132 59760 66618 94217 124199 126807 107751 93166 86109 72150 60010 68182
467 68182 84720 90667 98305 118684 127857 103846 73357 66834 72034 66049 64330 83239 100706
$$ packed form
377i0661J4287O23p602j7264k4926k0090j137J6337J8120J4813K1230K6365Q346
390d1559k5918m1476k0435J1316J9314J0222J0138K3712K6883O723j7428k3570
402f2078j5873q904j049J4130L2174L2552J2095p507j0528m699o392j5483j4886
415e6448O557L0866L6150J9746o33j0427j3104j1704q600l378M706J4515K2904
428C1150K2700J2596J477q238k0880k5065q067J8716K5416J1107L813J4836J7699
441I7260l596k5097k3366p813L272J2976K1635K0178R387L97n184j1853j5335
454G2861q088k641k372O858K7599K9982K608j9056j4585p057j3959j2140Q172
467F8182J6538N947P638K0379R173k4011l0489o523N200n985j719J8909J7467
$$ plain form
480 100706 99419 96978 103109 94009 65011 46720 50597 54018 56225 77697 104245 97058 67275
493 67275 58737 66262 49613 20344 24620 55716 66210 56891 58489 64297 51640 35055 33084
506 33084 23036 -334 1811 35546 49108 29323 28563 55344 42365 -17320 -42679 -5896 19608
519 19608 -1373 -9604 21176 34938 6469 -17972 -18693 -24072 -32593 -20317 -11419 -31797 -41483
532 -41483 -4311 22141 -12734 -53600 -42670 -29966 -65026 -86136 -39769 6141 -13618 -47821
544 -47821 -41597 -36373 -65489 -80224 -59047 -51808 -68310 -54757 -21842 -38981 -84174 -73486 -27884
557 -27884 -41257 -97412 -100949 -64239 -65796 -81291 -43951 -3898 -41591 -104417 -100429 -70573 -84760
570 -84760 -94649 -48435 -19560 -63263 -97416 -60680 -34095 -74662 -102533 -70075 -49451 -75397
$$ packed form
480A00706j287k441O131r100k8998j8291L877L421K207K1472K6548p187k9783
493F7275q538P525j6649k9269M276L1096J0494r319J598N808j2657j6585j971
506C3084j0048k3370K145L3735J3562j9785p60K6781j2979n9685k5359L6783K5504
519A9608k0981q231L0780J3762k8469k4441p21n379q521J2276Q898k0378r686
532d1483L7172K6452l4875m0866J0930J2704l5060k1110M6367M5910j9759l4203
544d7821O224N224k9116j4735K1177P239j6502J3553L2915j7139m5193J0688M5602
557b7884j3373n6155l537L6710j557j5495L7340M0053l7693o2826L988K9856j4187
570h4760r889M6214K8875m3703l4153L6736K6585m0567k7871L2458K0624k5946
$$ plain form
582 -75397 -79228 -48982 -52140 -73229 -39493 -533 -56890 -140650 -113430 -25481 -21680 -67616 -38658
595 -38658 15421 -31938 -117974 -99051 -16797 -6192 -51316 -57217 -39326 -44080 -32303 6160
607 6160 -8645 -68428 -55741 16236 -2291 -98765 -88252 36730 76372 -13343 -53527 5168
619 5168 10486 -65981 -74250 16424 66939 31798 -2918 -15018 -33096 -11561 64228 72475 -27947
632 -27947 -71788 23661 84855 8186 -35086 64474 126437 26039 -64666 -6727 62966 27808
644 27808 2766 67718 105197 53687 16112 25322 7846 -4564 73275 140638 59032 -50783
656 -50783 2517 120091 102105 22771 52380 104869 31716 -49698 20821 124081 100752 47018
668 47018 80610 96170 16542 -17281 59415 93010 32583 37064 125681 113143 -5549 -20028
$$ packed form
582g5397l831L0246l158k1089L3736L8960n6357q3760K7220Q7949L801m5936K8958
595c8658N4079m7359q6036J8923Q2254J0605m5124n901J7891m754J1777L8463
607F160j4805n9783J2687P1977j8527r6474J0513J24982L9642q9715m0184N8695
619E168N318p6467q269R0674N0515l5141l4716j2100j8078K1535P5789Q247j00422
632b7947m3841R5449O1194p6669m3272R9560O1963j00398r0705N7939O9693l5158
644B7808k5042O4952L7479n1510l7575R210j7476j2410P7839O7363q1606j09815
656e0783N3300J17574j7986p9334K9609N2489p3153q1414P0519J03260k3329n3734
668D7018L3592J5560p9628l3823P6696L3595o0427M481Q8617j2538j18692j4479
$$ plain form
680 -20028 87265 115327 41638 33909 77841 28108 -38562 46027 169402 122173 -1017 6278
692 6278 63951 9043 -44709 53901 155057 86066 -13959 18833 69016 16543 -16103 49897
704 49897 74358 7649 1182 67906 39906 -49913 4962 141084 96769 -79474 -97254 33676
716 33676 54141 -25403 14516 121869 70967 -76608 -89763 -1455 12488 -6654 40655 49019
728 49019 -48518 -77436 32504 65271 -54067 -87137 39403 63368 -91826 -141350 10277
739 10277 92189 -5351 -57178 10368 -1803 -114584 -118867 -7105 24757 -18736 5866 27571
751 27571 -78262 -155930 -42128 71236 -18475 -127908 -52706 31979 -54041 -122912 -10538
762 -10538 76533 -28695 -130008 -73682 -28465 -91593 -86471 34132 56502 -56422 -91029
$$ packed form
680b0028J07293K8062p3689p729M3932m9733o6670Q4589J23375m7229j23190P295
692F278N7673n4908n3752R8610J01156o8991j00025L2792N0183n2473l2646O6000
704D9897K4461o6709o467O6724k8000q9819N4875J36122m4315j76243j7780J30930
716C3676K0465p9544L9919J07353n0902j47575j3155Q8308J3943j9142M7309Q364
728D9019r7537k8918J09940L2767j19338l3070J26540K3965j55194m9524J51627
739A0277Q1912r7540n1827O7546j2171j12781m283J11762L1862m3493K4602K1705
751B7571j05833p7668J13802J13364q9711j09433P5202Q4685q6020o8871J12374
762a0538Q7071j05228j01313N6326M5217o3128N122J20603K2370j12924l4607
$$ plain form
773 -91029 -23779 -51189 -142580 -83656 58331 34560 -96175 -90285 2269 -25801 -95453 -29498
785 -29498 45595 -48125 -152286 -74980 29059 -16168 -60516 25253 54951 -82341 -162382
796 -162382 -56080 24079 -36948 -52601 41001 44053 -73869 -94935 -1276 2111 -75885 -39123
808 -39123 54724 -1993 -114353 -51168 85362 48306 -68226 -40053 33719 -38527 -124247
819 -124247 -31474 94981 61764 -17402 3978 12476 -69012 -79235 32554 67469 -24918 -36631
831 -36631 63186 58937 -56631 -48505 78133 74447 -57462 -71336 37339 50398 -21079 12271
843 12271 104088 68479 -34185 -31888 14167 -20179 -33547 71147 132300 32893 -47051 21871
855 21871 72263 -5837 -42152 51467 90181 -5384 -41323 55570 103217 33635 6230 55250
$$ packed form
773i1029O7250k7410r1391N8924J41987k3771j30735N890R2554k8070o9652O5955
785b9498P5093r3720j04161P7306J04039m5227m4348Q5769K9698j37292q0041
796a62382J06302Q0159o1027j5653R3602L052j17922k1066R3659L387p7996L6762
808c9123R3847n6717j12360O3185J36530l7056j16532K8173P3772p2246q5720
819a24247R2773J26455l3217p9166K1380Q498q1488j0223J11789L4915r2387j1713
831c6631R9817m249j15568Q126J26638l686j31909j3874J08675J3059p1477L3350
843A2271R1817l5609j02664K297M6055l4346j3368J04694O1153r9407p9944O8922
855B1871N0392p8100l6315R3619L8714r5565l5939R6893M7647o9582k7405M9020
$$ plain form
867 55250 34241 -44659 -22707 68832 67018 13536 54991 114819 41960 -61025 -22179 65712
879 65712 41855 -6095 49649 100739 33317 -24894 37261 87762 25120 -24140 22111 42806
891 42806 -7396 5586 97555 106780 13071 -18898 34048 27344 -36443 -14357 73372 77850 18108
904 18108 24867 64795 22391 -39917 -6805 52095 24343 -18205 21455 62840 24780 -2687
916 -2687 45346 60521 -17917 -65668 -10368 37703 15052 12393 60124 54888 -15328 -36795 5108
929 5108 5897 -36428 -20843 38486 37647 -5544 2031 31950 365 -47192 -26548 11639 -13648
942 -13648 -45707 -6073 42982 24122 -10697 -4174 -8089 -54649 -69290 -18248 17468 -3285
954 -3285 -12696 13128 9666 -33847 -45226 -20311 -27898 -57856 -39784 8995 11542 -20575 -18711
$$ packed form
867E5250k1009p8900K1952R1539j814n3482M1455N9828p2859j02985L8846Q7891
879F5712k3857m7950N5744N1090o7422n8211O2155N0501o2642m9260M6251K0695
891D2806n0202J2982R1969R225r3709l1969N2946o704o3787K2086Q7729M478n9742
904A8108O759L9928m2404o2308L3112N8900k7752m2548L9660M1385l8060k7467
916b687M8033J5175p8438m7751N5300M8071k2651k659M7731n236p0216k1467M1903
929E108P89m2325J5585N9329q39m3191P575K9919l1585m7557K0644L8187k5287
942a3648l2059L9634M9055j8860l4819O523l915m6560j4641N1042L5716k0753
954c285r411K5824l462m3513j1379K4915p587k9958J8072M8779K547l2117J864
$$ [...]
8191F79
##END NTUPLES=NMR FID
##END=
