##TITLE=1H_LR-699-OST
 CDCl3, 8 sc, 
 14.11.2019
##JCAMPDX= 6.0         $$ Bruker NMR JCAMP-DX V2.0
##DATA TYPE= NMR FID
##DATA CLASS= NTUPLES
##ORIGIN= UXNMR, Bruker Analytische Messtechnik GmbH
##OWNER= root
$$ XWIN-NMR		Version 3.5
$$ Thu Nov 14 16:00:58 2019 Russian Standard Time (UT+4h)  she@DPX200
##.OBSERVE FREQUENCY= 200.1315
##.OBSERVE NUCLEUS= ^1H
##.DELAY= (6, 6)
##.ACQUISITION MODE= SIMULTANEOUS
##.ACQUISITION SCHEME= undefined
##.AVERAGES= 8
##.DIGITISER RES= 18
##SPECTROMETER/DATA SYSTEM= spect
##.PULSE SEQUENCE= zg30
##.SOLVENT NAME= CDCl3
##.SHIFT REFERENCE= (INTERNAL, CDCl3, 0, 15.7039)
##AUDIT TRAIL= $$ (NUMBER, WHEN, WHO, WHERE, WHAT)
$$ ##TITLE= Audit trail, XWIN-NMR		Version 3.5
$$ ##JCAMPDX= 5.01
$$ ##ORIGIN= Bruker BioSpin GmbH
$$ ##OWNER= she
$$ F:/spectra/data/she/nmr/H-F/1/audita.txt
$$ ##AUDIT TRAIL=  $$ (NUMBER, WHEN, WHO, WHERE, WHAT)
(   1,<2019-11-14 15:59:49.06 +0400>,<she>,<DPX200>,
      <created by zg, POWCHK disabled, PULCHK disabled
       configuration hash MD5:
       00 E9 B6 7A A2 85 ED C7 34 08 36 98 17 FE 4E 26
       data hash MD5: 16K
       55 4B D8 3B 39 0E 65 CC FB 5E 60 AF C4 39 5B 25>)
$$ ##END=
$$ 
$$ hash MD5
$$ C6 C0 69 69 48 79 42 C3 64 02 32 C0 D0 90 90 E5
##$RELAX= 
##$RELAX= 
##$RELAX= 
##$RELAX= 
##$RELAX= 
##$RELAX= 
$$ Bruker specific parameters
$$ --------------------------
##$DU= <F:/spectra>
##$EXPNO= 1
##$NAME= <H-F>
##$PROCNO= 1
##$TYPE= <nmr>
##$USER= <she>
##$AMP= (0..31)
100 100 100 100 100 100 100 100 100 100 100 100 100 100 100 100 100 100 
100 100 100 100 100 100 100 100 100 100 100 100 100 100 
##$AQSEQ= 0
##$AQ_mod= 1
##$AUNM= <au_zg>
##$AUTOPOS= <>
##$BF1= 200.13
##$BF2= 200.13
##$BF3= 200.13
##$BF4= 200.13
##$BF5= 200.13
##$BF6= 200.13
##$BF7= 200.13
##$BF8= 200.13
##$BYTORDA= 1
##$CFDGTYP= 0
##$CFRGTYP= 5
##$CHEMSTR= <none>
##$CNST= (0..31)
1 1 145 1 1 1 1 1 1 1 1 1 1 1 1 1 1 1 1 1 1 1 1 1 1 1 1 1 1 1 1 1 
##$CPDPRG= <>
##$CPDPRG1= <>
##$CPDPRG2= <>
##$CPDPRG3= <>
##$CPDPRG4= <mlev>
##$CPDPRG5= <mlev>
##$CPDPRG6= <mlev>
##$CPDPRG7= <mlev>
##$CPDPRG8= <mlev>
##$CPDPRGB= <>
##$CPDPRGT= <>
##$D= (0..31)
0 1.2 0 0 0 0 0 0 0 0.06 0 0.03 0 0 0 0 0.0002 0 0 0 0 0 0 0 0 0 0 0 0 
0 0 0 
##$DATE= 1573732788
##$DBL= (0..7)
120 120 120 120 120 120 120 120 
##$DBP= (0..7)
150 150 150 150 150 150 150 150 
##$DBP07= 0
##$DBPNAM0= <>
##$DBPNAM1= <>
##$DBPNAM2= <>
##$DBPNAM3= <>
##$DBPNAM4= <>
##$DBPNAM5= <>
##$DBPNAM6= <>
##$DBPNAM7= <>
##$DBPOAL= (0..7)
0.5 0.5 0.5 0.5 0.5 0.5 0.5 0.5 
##$DBPOFFS= (0..7)
0 0 0 0 0 0 0 0 
##$DE= 6
##$DECBNUC= <off>
##$DECIM= 24
##$DECNUC= <off>
##$DECSTAT= 4
##$DIGMOD= 1
##$DIGTYP= 9
##$DL= (0..7)
0 120 120 120 120 120 120 120 
##$DP= (0..7)
150 150 150 150 150 150 150 150 
##$DP07= 0
##$DPNAME0= <>
##$DPNAME1= <>
##$DPNAME2= <>
##$DPNAME3= <>
##$DPNAME4= <>
##$DPNAME5= <>
##$DPNAME6= <>
##$DPNAME7= <>
##$DPOAL= (0..7)
0.5 0.5 0.5 0.5 0.5 0.5 0.5 0.5 
##$DPOFFS= (0..7)
0 0 0 0 0 0 0 0 
##$DQDMODE= 0
##$DR= 18
##$DS= 0
##$DSLIST= <SSSSSSSSSSSSSSS>
$$ [...]
##$SUBNAM2= <"">
##$SUBNAM3= <"">
##$SUBNAM4= <"">
##$SUBNAM5= <"">
##$SUBNAM6= <"">
##$SUBNAM7= <"">
##$SUBNAM8= <"">
##$SUBNAM9= <"">
##$SW= 24.0689530833862
##$SWIBOX= (0..15)
0 0 2 0 0 0 0 0 0 0 0 0 0 0 0 0 
##$SW_h= 4816.95568400771
##$TD= 16384
##$TD0= 1
##$TE= 0
##$TE2= 300
##$TE3= 300
##$TEG= 300
##$TL= (0..7)
0 120 120 120 120 120 120 120 
##$TP= (0..7)
150 150 150 150 150 150 150 150 
##$TP07= 0
##$TPNAME0= <>
##$TPNAME1= <>
##$TPNAME2= <>
##$TPNAME3= <>
##$TPNAME4= <>
##$TPNAME5= <>
##$TPNAME6= <>
##$TPNAME7= <>
##$TPOAL= (0..7)
0.5 0.5 0.5 0.5 0.5 0.5 0.5 0.5 
##$TPOFFS= (0..7)
0 0 0 0 0 0 0 0 
##$TUNHIN= 0
##$TUNHOUT= 0
##$TUNXOUT= 0
##$USERA1= <user>
##$USERA2= <user>
##$USERA3= <user>
##$USERA4= <user>
##$USERA5= <user>
##$V9= 5
##$VALIST= <valist>
##$VCLIST= <CCCCCCCCCCCCCCC>
##$VD= 0
##$VDLIST= <DDDDDDDDDDDDDDD>
##$VPLIST= <PPPPPPPPPPPPPPP>
##$VTLIST= <TTTTTTTTTTTTTTT>
##$WBST= 1024
##$WBSW= 4
##$XGAIN= (0..3)
0 0 0 0 
##$XL= 0
##$YL= 0
##$YMAX_a= 612541
##$YMIN_a= -513173
##$ZGOPTNS= <>
##$ZL1= 120
##$ZL2= 120
##$ZL3= 120
##$ZL4= 120
##$ABSF1= 10
##$ABSF2= 0
##$ABSG= 5
##$ABSL= 3
##$ALPHA= 0
##$AQORDER= 0
##$ASSFAC= 0
##$ASSFACI= 0
##$ASSFACX= 0
##$ASSWID= 0
##$AUNMP= <proc_1d>
##$AZFE= 0.1
##$AZFW= 0.1
##$BCFW= 1
##$BC_mod= 2
##$BYTORDP= 1
##$COROFFS= 0
##$CY= 11.3945322036743
##$DATMOD= 1
##$DC= 2
##$DFILT= <>
##$DTYPP= 0
##$F1P= 16.9975609425685
##$F2P= -3.02152046262296
##$FCOR= 0.5
##$FTSIZE= 0
##$FT_mod= 4
##$GAMMA= 1
##$GB= 0.15
##$INTBC= 1
##$INTSCL= 1
##$ISEN= 128
##$LB= 0.24
##$LEV0= 0
##$LPBIN= 0
##$MAXI= 10000
##$MC2= 0
##$MEAN= 0
##$ME_mod= 0
##$MI= 1.114404
##$NCOEF= 0
##$NC_proc= 0
##$NLEV= 6
##$NOISF1= 3.799351
##$NOISF2= 2.8
##$NSP= 1
##$NTH_PI= 0
##$NZP= 0
##$OFFSET= 15.70392
##$PC= 1
##$PHC0= -9456.188
##$PHC1= 18.60088
##$PH_mod= 1
##$PKNL= yes
##$PPARMOD= 0
##$PSCAL= 0
##$PSIGN= 0
##$REVERSE= no
##$SF= 200.130013532006
##$SI= 16384
##$SIGF1= 3
##$SIGF2= 2
##$SINO= 400
##$SIOLD= 16384
##$SREGLST= <1H.CDCl3>
##$SSB= 0
##$STSI= 0
##$STSR= 0
##$SW_p= 3612.71676300578
##$SYMM= 0
##$S_DEV= 0
##$TDeff= 0
##$TDoff= 0
##$TI= <>
##$TILT= no
##$TM1= 0
##$TM2= 0
##$TOPLEV= 0
##$USERP1= <user>
##$USERP2= <user>
##$USERP3= <user>
##$USERP4= <user>
##$USERP5= <user>
##$WDW= 1
##$XDIM= 8192
##$YMAX_p= 0
##$YMIN_p= 0
$$ End of Bruker specific parameters
$$ ---------------------------------
##NTUPLES= NMR FID
##VAR_NAME=  TIME,          FID/REAL,        FID/IMAG
##SYMBOL=    X,             R,               I
##VAR_TYPE=  INDEPENDENT,   DEPENDENT,       DEPENDENT
##VAR_FORM=  AFFN,          ASDF,            ASDF
##VAR_DIM=   8192,          8192,            8192
##UNITS=     SECONDS,       ARBITRARY UNITS, ARBITRARY UNITS
##FACTOR=    0.0002076,     1,               1
##FIRST=     0,             0,               0
##LAST=      1.7004516,     0,               0
##MIN=       0,             -513173,         0
##MAX=       1.7004516,     612541,          0
$$ Real data points
##PAGE= N=1
##DATA TABLE= (X++(R..R)), XYDATA
$$ [...]
201 49610 219744 64980 -76051 -24250 -33095 -130640 -26100 202550 154381 -110566 -148381
212 -148381 41079 72614 -51782 -22147 96642 29470 -93640 -11522 97250 -24354 -147686
223 -147686 1188 180428 88539 -81806 -65399 -6473 -53913 -23492 141037 143975 -85773
234 -85773 -189626 -22434 105968 36860 -7829 50347 15311 -96181 -48160 99296 65444
245 65444 -91066 -73609 77110 77485 -49218 -63138 10044 -3554 -29333 62836 115336 -24275
257 -24275 -154708 -60786 92742 78966 -11109 -20900 -20445 -69964 -40970 83312 99916 -36048
269 -36048 -102043 -7963 62481 16059 -22017 -1342 -16631 -48358 7173 77187 15379 -93494
281 -93494 -65305 51326 75160 10482 -21657 -26269 -53046 -33272 61033 90152 -18407 -107832
293 -107832 -50991 43721 49470 13593 2400 -19438 -49913 -12390 64846 51966 -44942 -76149
305 -76149 -4697 49343 27543 -6658 -20565 -35603 -25068 38575 78437 18578 -67541 -62109
317 -62109 11829 51944 34203 753 -34239 -53276 -15464 56157 65814 -5993 -59257 -28963
329 -28963 28827 43887 23073 -7876 -40100 -41879 11480 63394 37939 -36086 -59112 -8830
341 -8830 44667 49614 18878 -21353 -47280 -26073 33824 61990 15763 -50158 -54301 995 47882
354 47882 45045 5923 -33661 -39528 644 48242 47701 -6301 -53168 -41582 11265 48189 34217
367 34217 -13959 -47609 -31010 22641 55749 32015 -22842 -50185 -25149 23564 45497 18864
379 18864 -31293 -52847 -19960 34075 50865 13929 -35146 -44755 -6385 38300 42399 2137
391 2137 -43592 -47323 -5085 38759 38746 -5351 -46016 -38470 10091 47902 35415 -13446 -47474
404 -47474 -33432 12118 41758 24791 -22715 -51469 -29661 22064 49037 23380 -26951 -47265
416 -47265 -16196 31963 45734 10102 -37180 -47805 -12727 31081 40032 6167 -36666 -42733
428 -42733 -1007 45095 43822 -3624 -43280 -33990 7292 37213 29093 -8394 -43172 -36512 12984
441 12984 52547 34202 -20409 -45125 -16287 26300 41386 21446 -18076 -45958 -27320 25271
453 25271 50610 15879 -32475 -35703 -277 30203 35630 15240 -22196 -41178 -7119 44434
465 44434 41500 -14171 -46898 -22550 15840 33725 33331 8725 -36573 -46425 10980 64729 36653
478 36653 -29403 -43830 -10697 10327 17884 26867 7488 -38803 -35981 32152 62039 3016 -49938
491 -49938 -24477 17969 18873 13668 15965 -18814 -62218 -23077 63812 64426 -21085 -57102 -12697
504 -12697 15689 8228 23379 31138 -27984 -73546 -9665 69191 32347 -48368 -36241 20095
516 20095 12800 -9755 20240 24150 -43229 -57543 34370 76330 -14825 -81712 -22414 37702
528 37702 11702 -762 34240 2673 -80435 -50866 73728 86454 -28966 -72940 -6679 13670
540 13670 -25305 3124 59515 8286 -73755 -23601 70780 27463 -69223 -35794 55103 36469
552 36469 -26917 -6328 13922 -53667 -70212 51288 122500 13335 -95172 -47373 23560
563 23560 3657 3202 65529 42307 -75424 -86088 33821 68542 -22853 -43242 40038 47303
575 47303 -32062 -33912 27257 1772 -54443 11374 102797 34426 -96494 -79147 26203 42905
587 42905 12971 41164 40598 -59192 -100344 13355 102383 34302 -45224 -15442 11576 -31687
599 -31687 -28816 44803 45401 -32643 -30456 46369 33738 -55391 -51536 36276 53279 4856 749
612 749 4941 -57266 -80317 26618 118073 52822 -53321 -56144 -21772 -24781 8877 85430 65898
625 65898 -52384 -86811 -5281 27604 -19057 -5994 59489 38777 -37949 -33710 8528 -28892
637 -28892 -56477 40745 122729 32740 -94643 -82213 -14438 -8771 21103 108666 82682 -80677
649 -80677 -139123 -13928 69947 16392 187 58017 18067 -95428 -71365 49819 39743
660 39743 -50007 611 105322 31324 -114010 -78184 45505 33426 -18174 53527 84789
671 84789 -69356 -167346 -14742 135398 57288 -47405 4944 27746 -80711 -83236 84633
682 84633 123133 -43547 -101626 33236 62408 -69082 -69414 81582 84929 -56646 -50439 66583
694 66583 13814 -118410 -30270 151381 90461 -99805 -90700 29903 -377 -53968 71441
705 71441 156252 -19144 -179185 -53567 108083 39868 -43992 50137 85390 -74947 -138297
716 -138297 28075 108414 -22780 -56424 92256 97763 -97810 -142276 31367 92573 -7773
727 -7773 8233 106028 3444 -186468 -111086 123434 136600 -16137 -23098 42799 -50536 -141183
739 -141183 4809 161260 57033 -90225 -19743 64669 -46758 -122072 24248 132311
749 132311 23843 -57137 26423 30321 -113030 -106414 99895 162109 -6534 -96192 -18556
760 -18556 -13200 -83167 1998 155770 87586 -107107 -104858 35319 30273 -53073 12369 106533
772 106533 13553 -106718 -35880 57931 -17819 -74820 51392 132017 -4025 -120502 -41072
783 -41072 36428 -14928 -8281 101552 73423 -107494 -140250 23553 95413 6447 -12139 54834
795 54834 3439 -108046 -49413 90292 56844 -61803 -23373 73508 7995 -98816 -34000
806 -34000 72544 25957 -36661 34233 67068 -59967 -122953 16502 120214 29450 -54734
817 -54734 -3974 9642 -69220 -43292 95665 97226 -52787 -88041 24776 47419 -37698 -23657
829 -23657 67262 33169 -68817 -34654 59225 13326 -74088 -6701 99202 40276 -71029
840 -71029 -42756 27994 -4739 -27591 57796 85238 -42079 -120211 -17981 77669 31232 -13350
852 -13350 28892 21538 -66469 -61148 50419 70470 -24367 -41511 36649 32829 -53719 -50982 31631
865 31631 36461 -13316 13507 56289 -13966 -99134 -38696 72886 63273 -10582 -15427 -2620
877 -2620 -46481 -53899 36953 86177 8396 -56936 -13285 26464 -13817 -31440 20055 33713
889 33713 -16479 -21487 25584 11052 -54591 -40273 43520 59125 -1468 -26731 -9805 -22041
901 -22041 -32331 20910 63633 11494 -58097 -38459 18456 18169 -3490 10345 14277 -21172 -27090
914 -27090 19400 31427 -18224 -38780 5641 30811 1712 -17193 -3462 -5662 -18074 9430
926 9430 44212 14891 -42328 -37109 13996 29446 7915 133 -3871 -27101 -26492 20132 45327
939 45327 5719 -32976 -14393 15813 10022 -1031 6075 -687 -20477 -8081 27167 20709 -23145
952 -23145 -30704 7671 28829 14372 2691 -1481 -19761 -24433 12195 42689 15149 -30172 -28388
965 -28388 4219 15725 10208 11742 4259 -17657 -15870 18206 30014 -3541 -28276 -9478 15119
978 15119 13351 3942 466 -10462 -19741 1491 33296 24923 -14953 -29491 -6431 14479 14582
991 14582 7735 -2270 -18998 -19697 8158 30029 12933 -18418 -20342 1833 15524 12333 3772
1004 3772 -10015 -21369 -10314 16301 23088 -1747 -24129 -15758 7069 18705 13571 -760 -16642
1017 -16642 -19597 -801 20809 15868 -10843 -25246 -12893 8857 17673 10797 -5936 -18363 -12563
1030 -12563 8971 21514 8310 -15849 -23228 -6903 12016 16228 3462 -14107 -18267 -3866
1042 -3866 16530 20086 2122 -17541 -18104 -766 16085 14531 -3026 -19102 -17029 2338 19309
1055 19309 15732 -3891 -17962 -11809 7760 20422 11978 -8916 -20514 -11487 9107 19192 8778
1068 8778 -10531 -18025 -5338 14514 21478 7633 -11970 -17823 -3999 14399 17570 1861 -16344
1081 -16344 -17419 116 18476 18564 1324 -15491 -13530 4850 19951 15582 -4437 -19063 -13788
1094 -13788 5420 18330 13059 -5466 -17483 -9205 11143 21460 10529 -8978 -16869 -6836
1106 -6836 9749 16833 6229 -12498 -19988 -5122 15858 19582 2328 -13921 -13503 -15 13997
1119 13997 16039 2204 -17058 -20373 -321 18553 13225 -6355 -16118 -9033 3969 14205 13598
1132 13598 -2306 -19720 -14988 9174 19493 2468 -16384 -16034 -4385 6302 14864 12205 -8648
1145 -8648 -24975 -9477 19621 20990 -3835 -18256 -12072 -4204 2033 12537 10005 -13115 -23886
1158 -23886 705 24931 11367 -14853 -14643 -679 2326 4081 11775 1226 -25996 -24079 14336
1171 14336 32473 4349 -20138 -11330 947 -625 7605 20523 1521 -30749 -19654 20474
1183 20474 23377 -9922 -17277 3957 6439 -4066 7591 17541 -8626 -30071 1176 35735 12943
1196 12943 -26515 -19985 6703 4795 1268 19950 17626 -23771 -34705 12344 40726 6704 -22695
1209 -22695 -5836 6552 -10001 -5573 23438 14626 -24685 -18361 27337 27234 -17356 -24661 9925
1222 9925 16131 -4035 3010 16707 -12872 -39778 -2091 46633 25088 -23219 -21054 4865 -1328
1235 -1328 -6079 22703 27800 -18798 -40735 2743 31419 21 -21569 5449 17851 -8352
1247 -8352 -11868 15654 7798 -27815 -12604 36184 28212 -27289 -36088 846 9890 -1042 17959
1260 17959 30508 -14465 -52195 -12552 40153 23849 -13982 -5679 5496 -19846 -26358 15410
1272 15410 29871 -9607 -22550 17490 24672 -22735 -36170 7390 24966 1821 2253 18406
1284 18406 -13809 -55939 -21179 47655 44523 -8792 -20497 -3870 -18819 -25921 20545 50141
1296 50141 3367 -40366 -11251 19084 -9590 -27388 13079 35739 207 -17700 10051 4856
1308 4856 -38179 -24224 43588 50866 -12882 -39155 -9301 -2990 -16071 17410 55388 12862
1320 12862 -51614 -32221 26621 20991 -12807 4724 27032 -9341 -38109 1993 31813 -6217
1332 -6217 -26919 21046 42765 -11076 -43235 -1889 24162 -708 75 33844 10250 -54459
1344 -54459 -42989 34131 51953 1720 -13962 6103 -12986 -38406 4058 55864 22931 -34806
1356 -34806 -19038 18488 -5231 -32060 6719 42050 9609 -20046 4945 9835 -34868 -35961
1368 -35961 33273 60889 4690 -36766 -18895 -11755 -25423 9226 61746 34582 -40012 -45711
1380 -45711 4351 12530 -10356 10531 36737 939 -40472 -14289 18560 -8115 -26011 21237
1392 21237 49811 -235 -43021 -17118 6691 -10017 1328 45599 27155 -46839 -56943 8241
1404 8241 35023 3891 1672 22798 -7961 -49344 -14206 43901 21979 -28758 -9916 25698
1416 25698 -5385 -40571 -2097 36042 4485 -20229 16561 25181 -34785 -51448 20526 58347
1428 58347 6854 -27159 -2857 -5761 -42203 -11184 63227 51152 -33304 -47512 6891 11083
1440 11083 -22137 5110 51829 14831 -47012 -22901 26181 -2603 -38424 13714 65995 16167
1452 16167 -47293 -23910 11174 -14142 -15345 49603 60940 -26926 -74943 -13988 34441 5490
1464 5490 -1321 40432 24989 -47163 -47087 25537 35491 -20217 -14679 41250 23361 -43873 -36208
1477 -36208 21844 16698 -18070 13421 51953 -1892 -66658 -26856 42782 27222 -15486 3531
1489 3531 20465 -26091 -46377 16976 54615 -647 -39700 2840 29448 -12381 -28265 17182
1501 17182 26249 -21478 -24926 25355 22432 -32618 -29427 29475 34349 -16237 -22604 10412 1514
1514 1514 -24738 4696 42923 6984 -47967 -28201 23462 18991 -7059 6796 17608 -17762
1526 -17762 -36234 6071 34374 1132 -24365 3372 19271 -11847 -26737 2987 15793 -4625
1538 -4625 -1100 24948 9746 -35138 -32722 14266 29784 6192 -2370 1990 -17368 -31737 653
1551 653 36170 18450 -15888 -10814 7411 -3308 -13723 4944 16102 -2738 -9864 10276 11221
1564 11221 -18523 -23829 8682 26125 9351 -3016 125 -10118 -21825 541 30537 18075
1576 18075 -16366 -19012 2019 4429 -1403 8604 14025 -5766 -15549 5668 18513 -2917 -17804
1589 -17804 -259 14563 3341 -5147 2796 -151 -13385 -2983 23687 18510 -12645 -20459 320
1602 320 10311 2636 4132 7714 -7981 -20166 -673 22456 11002 -12196 -8838 6808 3968
1615 3968 -3434 3851 5326 -9430 -12382 8796 17061 -4312 -18366 -3569 10918 6003 1747
1628 1747 4387 -3536 -16882 -7139 16624 15201 -8991 -16729 -3068 4845 1342 4099 6871 -4618
1642 -4618 -13784 105 15179 5659 -12968 -11362 2600 5325 313 1539 -581 -10433 -8843 9184
1656 9184 16617 633 -14502 -9007 2921 5210 3357 2472 -5068 -12429 -5125 10806 12077 -2712
1670 -2712 -11126 -3665 4721 5558 3698 -275 -7793 -9475 1269 11281 6120 -7625 -9947 -1022
1684 -1022 7003 7978 4269 -2759 -8846 -5684 5900 11161 2342 -8940 -8923 -35 7195 8056 2895
1699 2895 -4665 -7039 -74 9239 9390 -1229 -9502 -6825 1732 7814 6450 -1509 -7231 -5300 4078
1714 4078 10890 7236 -3371 -8529 -4225 4658 8412 3675 -5066 -8499 -3139 6179 10020 3923 -5206
1729 -5206 -7696 -558 7461 8349 615 -7654 -8466 -1017 7088 7400 -318 -8059 -6410 1997 8887 7088
1745 7088 -1543 -8419 -6470 1932 7631 4348 -4547 -9655 -5708 3671 8633 4364 -4210 -8338 -3464
1760 -3464 5005 7952 2134 -7026 -9583 -3250 4799 6980 735 -7157 -8248 -605 7305 7441 -576
1775 -576 -7880 -7780 -323 5823 4994 -2323 -9361 -7534 2202 8655 5265 -3399 -7388 -4332 2711 7232
1791 7232 4850 -4478 -10439 -5766 4724 7914 1220 -5364 -6065 -1494 4483 8187 3686 -6036 -9378
1806 -9378 -750 8190 6284 -2725 -7628 -4824 436 5973 8574 2108 -7835 -7792 4333 11241 4431
1821 4431 -4406 -6036 -3809 -69 5797 7877 -516 -9625 -4336 8872 9917 392 -4420 -2570 -339
1836 -339 1474 6826 5238 -6659 -12185 562 13093 8108 -3648 -5462 -2048 -1206 3590 10855
1850 10855 5422 -10058 -12442 2600 10367 1746 -3966 -239 830 -2354 3095 8760 -778 -12024
1864 -12024 -3825 12600 9254 -6308 -9308 -2552 -1947 102 11127 11748 -7346 -17766 -2457 13032
1878 13032 5895 -4850 -968 411 -8009 -5621 8892 7308 -10352 -10086 10220 12601 -5427 -11019
1892 -11019 450 1587 -4353 3952 13266 -2888 -22580 -9092 15430 12179 -6033 -4422 3339
1905 3339 -5636 -9500 8575 15904 -6335 -20095 -300 14851 -685 -11655 2608 8317 -7029
1918 -7029 -6805 12612 9586 -15757 -13918 14543 16488 -9709 -14578 3739 3054 -8546 4922 22691
1932 22691 1688 -27498 -12273 19690 13896 -7708 -903 9768 -8655 -21063 5175 23217
1944 23217 -716 -16703 6435 19702 -7345 -22409 2641 17212 -997 -4174 15905 7200
1956 7200 -27818 -24572 18401 29967 958 -9329 4931 -3348 -22643 -2971 30110 16251
1968 16251 -18452 -11786 12827 1066 -20961 -2954 23578 9456 -11842 2408 12483 -13937
1980 -13937 -26594 8403 33847 7488 -19512 -7757 1884 -12447 -7293 24894 24564 -14781 -25849
1993 -25849 3772 14485 -6814 -7054 14822 8035 -17721 -11148 13590 5108 -17076 -2684 22723
2006 22723 8579 -19530 -12293 8475 2216 -6288 10650 15503 -14346 -29692 -665 22987 8692
2019 8692 -6540 1499 -137 -17615 -10924 18097 18380 -8961 -13878 4212 2456 -14724 -6366 14438
2033 14438 9672 -6389 118 7369 -10850 -22528 2207 26269 12347 -9711 -8604 -6747 -15760
2046 -15760 -5585 23616 25149 -7124 -21293 -3972 2927 -6211 1667 18877 8017 -15472 -9796
2059 -9796 7880 -1370 -14532 4497 25618 8861 -15502 -9076 2040 -7224 -5224 21292 24253
2072 24253 -11512 -29717 -4401 14113 2430 1159 16697 6156 -22991 -16377 16791 16883 -10133
2085 -10133 -7245 15210 5112 -20431 -9099 16905 7111 -10754 6110 21288 -7340 -31102
2097 -31102 -3750 27360 11646 -10060 904 4690 -20381 -20716 20588 34518 -2921 -23560
2109 -23560 -224 8909 -12495 -9258 21846 18624 -16543 -17341 11248 5964 -21083 -7802 28250
2122 28250 20186 -16087 -15834 4885 -4245 -16655 10672 34878 4131 -33503 -18223 11705 5226
2135 5226 -5849 13664 19948 -12758 -28748 1029 19449 -2803 -13503 11091 17103 -12717
2147 -12717 -22248 2608 10983 -6784 -1322 21964 9871 -25794 -23187 10827 17714 -1739 -1165
2160 -1165 9161 -7394 -25028 -2822 24795 10912 -13645 -5150 9673 -2744 -14086 2644
2172 2644 14837 -2422 -11931 5795 10923 -11236 -16595 7755 19102 1722 -8009 1447 -1388
2185 -1388 -13356 -1575 20959 12672 -13605 -15391 2592 5368 -1712 5454 12272 -2266 -14943
2198 -14943 -1120 12818 1822 -9086 1954 10534 -1267 -9300 653 3990 -4843 -1166 14651
2211 14651 11183 -10856 -15145 1540 9205 2483 3263 6461 -5279 -16300 -2591 15654 9267
2224 9267 -6015 -3365 4606 -1473 -6637 3261 8052 -3592 -7760 5549 9104 -6698 -12307 2296
2238 2296 10599 2436 -903 3942 -2724 -13680 -3926 15108 11280 -7630 -10851 -238 754 -3368
2252 -3368 4601 10140 -1839 -12134 -1279 9887 705 -9572 -1425 7308 362 -5642 800 1827
2266 1827 -7917 -6145 10382 13340 -4214 -13076 -2956 3671 -412 1285 7104 -491 -12931 -7078
2280 -7078 8964 8170 -4502 -5116 3297 2119 -3908 -231 4179 -3420 -8424 1927 10301 1131 -9636
2295 -9636 -5030 3877 3230 1265 4500 1687 -7892 -7673 5211 9815 -853 -7725 -2550 1827 -198
2310 -198 1162 4833 342 -7040 -1997 8031 5937 -4193 -6121 287 2229 1034 2236 1987 -3743
2325 -3743 -5722 2540 9441 3677 -4853 -4546 623 2079 2571 3049 -466 -6239 -4506 4316 7576 1435
2341 1435 -3778 -2408 1287 2633 3032 2135 -2561 -5715 -1475 5313 4938 -1861 -4901 -1828 2148 3882
2357 3882 3730 759 -4528 -4761 1222 5806 2446 -3185 -5200 -2027 1803 3518 2811 -1105 -4558 -2718
2373 -2718 3268 4861 645 -4536 -4720 -1077 2341 3164 469 -3836 -4825 -546 4374 4257 -535 -4695
2389 -4695 -4014 -31 3096 2693 -1155 -5242 -4272 772 4737 2966 -1818 -4506 -2088 1936 4243 1791
2405 1791 -2948 -5509 -2730 2171 4164 1165 -3424 -4449 -934 3625 4439 889 -2962 -4580 -729
2420 -729 3203 3565 -510 -4441 -3881 365 4392 3936 -86 -3698 -2992 1454 4763 3103 -1627 -4530
2436 -4530 -2822 1368 4055 2365 -1789 -3991 -1631 3588 5508 2188 -2464 -3717 -408 3033 3918
2451 3918 1134 -3107 -4235 -366 4744 4440 355 -3155 -2629 1327 4175 3821 155 -4482 -4226 992
2467 992 4979 2876 -1814 -3658 -1580 1895 4191 3513 -1018 -4492 -2304 3028 4508 648 -3623
2482 -3623 -3821 -588 2613 4422 1996 -2707 -4708 -414 4794 4049 -732 -3532 -3163 -1173 2030 3804
2498 3804 221 -4336 -4152 1804 4578 1706 -1838 -3187 -2073 -61 3076 2349 -2821 -6361 -2345
2513 -2345 3890 4221 295 -2663 -2984 -2250 1073 5234 2656 -4361 -7036 -934 3053 1691 -872 -606
2529 -606 -1571 -2368 1803 4667 162 -6423 -3118 4528 4633 -1555 -3591 -2581 -3420 -914 6245 7458
2545 7458 -2528 -9042 -2176 5427 3303 -467 862 -247 -5459 -3098 5326 4560 -4689 -5378 4964
2560 4964 6765 -1675 -4018 1024 609 -3304 2525 9326 405 -11696 -5809 7402 7144 -1265 -297
2575 -297 2895 -3938 -6725 4394 11209 -971 -10016 -1074 7846 23 -5987 1947 5649 -3109 -4225
2590 -4225 7619 7396 -8176 -9657 6556 11048 -2814 -7328 1596 959 -6852 540 13826 5304
2604 5304 -13106 -8968 7993 7268 -4461 -1038 6760 -2757 -11861 5 11719 292 -10670
2617 -10670 1115 12042 -219 -11342 -1228 7211 -1720 -4339 8443 7340 -12260 -16505 4511
2630 4511 14276 876 -5001 2983 -119 -11870 -4660 13946 9576 -9689 -8639 5631 2363 -9900
2644 -9900 -3242 10193 4024 -7285 -250 7583 -4942 -14515 1438 15948 4980 -9828 -4705
2657 -4705 81 -7028 -4430 13136 14496 -6576 -15435 -861 6762 -2019 -1187 9222 4291 -10953
2671 -10953 -8099 6257 3031 -7696 -69 13340 5469 -10772 -7547 3147 -149 -2080 9662
2684 9662 12659 -7218 -18422 -4200 10227 5266 719 7116 2850 -12321 -10001 8560 10793
2697 10793 -3253 -3993 7198 2972 -10893 -6287 7609 4918 -3469 4145 10950 -4116 -16879
2710 -16879 -2897 13883 7458 -3459 1092 1771 -10865 -10557 10720 16719 -2445 -11461 1534
2723 1534 5715 -5710 -4257 10621 6938 -9877 -7047 8971 3752 -11378 -3637 14332 7346
2736 7346 -9800 -5867 5420 -1889 -8758 7102 16785 -2544 -20285 -6037 10952 3854 -3484
2749 -3484 7211 7343 -12476 -15882 6516 14898 -2384 -8481 6171 5382 -12643 -11549 8133 9754
2763 9754 -5059 -1421 12056 707 -20001 -10917 14023 13022 -3334 -1847 3682 -10029 -17794
2776 -17794 3539 21537 7084 -11547 -4009 4530 -6440 -10240 7811 14747 -2647 -10879 3154
2789 3154 5004 -11464 -10581 11360 16341 -1994 -8385 763 -1871 -11319 -202 18449 9731 -13059
2803 -13059 -12248 3352 2900 -4094 4356 12432 -1108 -13472 -2158 10158 629 -7899 2996 10659
2817 10659 -1896 -10221 280 5912 -3081 -2529 10585 8643 -10047 -13107 3456 9712 1070 -369
2831 -369 4862 -2835 -12998 -3116 13380 8747 -5547 -4214 3716 -1083 -6936 2247 9638 -52
2845 -52 -6849 1700 5399 -5642 -9509 3845 11400 2439 -3422 463 -1842 -9863 -2593 13022 10733
2860 10733 -5826 -9671 -897 367 -3380 3380 10376 1289 -9478 -3187 5707 251 -6720 727
2874 727 8034 240 -6362 -1037 1511 -5238 -4037 8715 9848 -3918 -10535 -2082 3393 -584 740
2889 740 6190 374 -10546 -5912 7023 6358 -4132 -3181 3879 1144 -4928 -571 5248 -1493 -6662
2904 -6662 995 7441 -856 -8324 -1380 5819 1875 -1781 2453 1116 -6726 -5515 6184 8735 -2182
2919 -2182 -7594 -1156 1279 -1575 1463 6712 1550 -7035 -3426 4894 3376 -3763 -2040 3774 1763
2934 1763 -2787 -375 1854 -2681 -4009 4366 8734 553 -6520 -3365 1337 1073 1729 4899 1866
2949 1866 -6222 -5804 2984 5745 346 -2162 1206 1114 -1626 -165 2425 -383 -4046 424 5341 1897
2965 1897 -4236 -3386 820 2272 1836 3501 1484 -4339 -5050 1684 5777 1293 -2794 -2089 -326 -670
2981 -670 1094 3405 543 -3658 -1943 3683 3118 -1490 -3226 -826 98 -122 1792 1431 -2573 -4590
2997 -4590 104 4643 2499 -2143 -2857 -1020 -497 766 2848 362 -4188 -3916 1311 3938 585 -2377
3013 -2377 -1504 -691 -328 1443 1988 -1055 -4320 -1977 2592 3080 -886 -2973 -1170 -222 1297 2339
3029 2339 1475 -2582 -4008 -20 3544 1860 -1563 -2664 -1739 -146 1683 2615 667 -2847 -2599 1417
3045 1417 3526 1336 -1974 -2456 -961 763 2125 1891 -985 -3107 -1112 3050 3476 758 -1950 -2012
3061 -2012 -482 1769 2372 714 -1995 -2864 -2 3173 3002 -191 -2155 -1357 588 2749 2312 -217
3077 -217 -2430 -2453 824 3061 1570 -1057 -2424 -882 1461 2927 1852 -913 -2304 -1160 1547 2900
3093 2900 640 -2345 -2774 -426 2168 2723 900 -1526 -2424 7 2481 2686 -345 -2752 -2314 -8
3109 -8 2219 2149 -155 -2233 -2156 443 3390 1980 -1194 -2631 -1302 759 2038 1169 -1449 -3384 -2147
3126 -2147 1438 2975 513 -2259 -2626 -528 1278 2170 620 -2163 -3237 -892 1972 2034 -488 -2694
3142 -2694 -1655 -107 1963 2376 73 -2934 -2276 726 2709 885 -1600 -2703 -1575 436 2372
3157 2372 1961 -1147 -3155 -1326 2054 2950 333 -1901 -2309 -1195 755 2447 1275 -1854 -3136 354
3173 354 2855 1870 -288 -1387 -1480 -427 1858 2587 -528 -3624 -2369 2155 3718 929 -631 -1668
3189 -1668 -1841 -126 3414 3574 -1026 -3918 -1326 2032 1307 24 -54 -184 -1050 301 3609 1783 -3067
3206 -3067 -2738 2198 3557 593 -1655 -990 -1609 -1753 2518 5539 708 -4971 -2490 2804 2773 -271
3222 -271 291 477 -2789 -3113 2478 4115 -1925 -4351 639 3853 104 -2445 342 528 -2467 -503
3238 -503 4871 1863 -6293 -5596 2929 5090 236 -1131 1049 -2126 -4865 997 6992 1575 -6195
3253 -6195 -3148 2850 569 -3454 206 3724 -1133 -3664 2396 4078 -3964 -6885 2231 7179 377
3268 377 -4384 -992 -1001 -4624 -820 8062 5799 -6234 -7131 1735 3336 -1931 -113 4808 45 -6360
3284 -6360 -1702 5450 631 -6067 -103 7255 2067 -5385 -1818 2217 -1974 -2447 5920 7043 -4915
3299 -4915 -9606 488 6202 1126 -790 3361 638 -6638 -3110 7611 5244 -5219 -4338 4069
3313 4069 2060 -4623 -930 5504 1102 -4629 1425 6487 -1828 -8309 1054 8806 1936 -4600 -617
3328 -617 1035 -5486 -2791 9628 9829 -4572 -9395 460 3704 -1799 906 8081 2757 -8988 -5917
3343 -5917 5240 2485 -5427 934 10366 2813 -8554 -4580 2647 -1214 -2836 7806 11357 -4541
3357 -4541 -15080 -4173 6480 2602 678 7916 4269 -10718 -11041 4489 8964 -2086 -2833 6873
3371 6873 2934 -10127 -7877 5160 4472 -3983 2099 10325 -951 -14918 -6600 8911 5900 -2716
3385 -2716 1896 4464 -7573 -12719 3217 13122 969 -8206 840 5452 -5139 -7192 5578 7669
3399 7669 -5484 -6052 6299 5073 -8792 -7043 8247 7770 -4947 -4663 4672 113 -8769 451
3413 451 12667 2488 -12563 -6442 6871 3226 -3596 3596 7355 -5364 -11789 2283 11558 711
3427 711 -6412 2668 5828 -6124 -8297 4316 7724 -2554 -2266 7819 3525 -11481 -8688 7496
3441 7496 9609 -577 -567 3448 -5137 -12595 -209 14320 7305 -5533 -2765 2778 -4149 -7203
3455 -7203 4546 10624 -201 -6551 1763 3429 -7481 -7934 7140 11111 -106 -3918 1497 -1820
3469 -1820 -9520 -738 13156 8319 -7534 -7715 1444 102 -4242 3922 10457 -280 -10344 -1931
3483 -1931 6311 -866 -6568 3113 8102 -2427 -8051 609 3969 -4562 -3285 9103 8003 -7664
3497 -7664 -10670 2368 5261 -1775 -26 6662 -849 -11932 -4707 9847 6194 -5088 -2532 4818
3511 4818 -1308 -8304 910 8293 13 -7066 1452 6434 -4189 -10030 1597 9228 1030 -4270
3525 -4270 2297 1605 -8634 -6214 8921 10381 -3679 -8060 649 1467 -4931 -52 9162 3597 -8028
3540 -8028 -4510 5818 2162 -6468 -1217 7523 2285 -6117 -1373 3811 -2535 -5823 4448 10285
3554 10285 -530 -8946 -2281 4344 291 -1439 4819 3428 -6784 -7149 4230 7266 -1183 -3831
3568 -3831 2839 3041 -3517 -2100 4567 2295 -4275 -1139 6144 2155 -5704 -3081 4207 3603 -869
3583 -869 848 2437 -3312 -5485 2209 7374 1937 -4693 -2022 1100 -688 -210 3469 3120 -3271 -3484
3599 -3484 2511 3194 -1781 -2652 1763 2197 -978 -985 1114 -1374 -3368 880 5440 2568 -3411 -3698 -232
3616 -232 327 990 2439 1338 -3610 -4374 855 3012 712 -1244 -378 41 -781 173 1575 -783 -2808
3633 -2808 -809 3180 1575 -2146 -2419 -497 471 1200 2386 1192 -3123 -4002 660 3384 1374 -1730
3649 -1730 -1541 -1231 -1313 514 2674 748 -2679 -2022 1979 2241 -706 -1700 -390 -369 -289 1899 1813 -1654
3667 -1654 -3475 -32 3621 2541 -932 -1471 -744 -998 306 2885 1517 -2759 -3128 756 3025 839
3683 839 -965 -416 -432 -217 1446 2060 -44 -2914 -1734 2130 2679 66 -1154 -815 -446 457 2075
3700 2075 2443 -950 -3131 -786 2613 1797 -628 -1354 -660 -287 759 2465 1317 -1661 -2181 713
3716 713 2629 1193 -1115 -1353 -1218 248 1447 1718 -61 -2388 -1483 1158 2582 652 -1568 -1513 -980
3733 -980 650 1464 1112 -1350 -2691 -1129 1431 2266 131 -1542 -1324 -432 1126 1468 303 -2064 -2624
3750 -2624 -448 1802 1367 -793 -2051 -1403 427 1879 1563 -241 -2468 -1768 619 1951 533 -1583
3766 -1583 -2351 -872 822 1872 966 -1048 -2014 -835 1243 1720 256 -1825 -2143 -793 929 1567
3782 1567 467 -1641 -1650 113 2206 1734 -339 -1575 -1433 -37 1291 1238 -319 -2314 -1729 1096 2439
3799 2439 1329 -919 -1345 -649 738 2011 1198 -785 -2348 -638 1643 1894 357 -984 -1287 -273
3815 -273 1288 2102 853 -1699 -2191 289 1869 1393 -8 -1352 -1188 100 1610 2459 317 -2255
3831 -2255 -1266 1545 2315 868 -480 -992 -956 44 1841 1874 -1068 -2399 -458 1797 1454 -111 -533
3848 -533 -1071 -985 643 2064 591 -2800 -2556 1132 2610 724 -463 -622 -1324 -1242 1512 3010 351
3865 351 -3282 -1929 1485 1415 -574 -257 200 -892 -605 1765 1785 -1894 -3452 252 2757 655 -1361
3882 -1361 -1031 -740 -1894 175 3582 1878 -3056 -3124 898 2272 -2 -670 182 -781 -2372 562 3098
3899 3098 88 -3441 -1003 2725 1608 -1357 -381 680 -1352 -940 2454 2615 -2492 -4335 417 3639
3915 3639 1065 -644 398 -665 -2907 -135 4099 2288 -2879 -2795 1257 1091 -1301 -152 2087 165
3931 165 -1663 1258 2996 -974 -4270 126 4154 1725 -1559 -647 -611 -3077 -1082 4881 4469 -1976
3947 -1976 -4267 120 1752 -607 418 3246 632 -3737 -1341 3620 492 -3927 -397 4728 1749
3962 1749 -2673 -805 1340 -1958 -2345 3814 5279 -2318 -6160 -521 3627 405 -669 3035 1152
3977 1152 -5086 -3266 4307 3891 -3471 -2635 2495 1436 -3799 -1273 3987 463 -4066 970 5355
3992 5355 -859 -6837 -918 5739 1434 -3391 185 1587 -4589 -4861 4961 7565 -2074 -6564 -130
4007 -130 2815 -2748 -1446 5145 3263 -5913 -4795 3540 2634 -5002 -2119 6454 3581 -4908 -3483
4022 -3483 2376 -557 -4419 2668 8568 32 -9309 -4187 4291 1625 -1553 3980 4697 -4817 -8425
4037 -8425 1587 6553 -339 -3487 3048 4036 -4504 -5756 2609 3956 -2488 -344 6434 2577 -8102
4052 -8102 -5891 4622 5125 -1091 85 3337 -3136 -8060 158 8770 3496 -4292 -920 3100 -2183
4067 -2183 -4209 3158 6164 -1187 -4082 2384 3118 -4006 -4553 4363 6125 -1062 -2296 1329 -433
4082 -433 -5247 -64 7922 3775 -5166 -4667 1538 490 -1842 2890 5491 -1559 -6451 -144 4639
4097 4639 -286 -3421 2530 4068 -2435 -4234 1826 2144 -3196 -1069 6109 3501 -5531 -5195 2285
4112 2285 2564 -1333 1234 4025 -2504 -7911 -832 6839 2422 -3466 -13 2611 -2595 -4718 3035
4127 3035 5563 -2008 -4741 2589 3512 -4512 -5280 3705 4801 -2391 -2658 2935 -344 -7321 -1490 8421
4143 8421 4526 -5557 -4497 2215 -195 -3847 2999 8166 -1044 -8526 -1351 5759 -201 -4566 3081
4158 3081 6440 -2320 -6780 988 4037 -3347 -3174 6836 7140 -5026 -7889 1429 4122 -1772 -161
4173 -161 6909 1871 -9164 -5977 5889 5592 -2868 -1037 5114 228 -7506 -1336 6341 1552 -4914
4188 -4914 1305 6688 -1600 -8228 -959 6672 1218 -2777 3195 3764 -5529 -7369 3483 7703 -467
4203 -467 -4814 1314 2659 -4368 -3110 5084 4502 -4379 -3618 4586 2874 -4370 -3495 4350 2711 -3612
4219 -3612 -1288 3652 -507 -5275 469 6335 1688 -5501 -1969 3093 175 -2556 2217 3491 -3090
4234 -3090 -5429 1310 5074 -181 -3125 1026 2040 -2440 -2174 2766 2180 -2568 -2282 2856 1747 -3391
4250 -3391 -2994 2010 2517 -923 127 1977 -1704 -4579 89 4595 1711 -2568 -2022 297 -1169 -1267
4266 -1267 1998 2961 -1125 -2877 760 2077 -1155 -2390 376 1806 -307 -871 971 -190 -2481
4281 -2481 -859 3241 2255 -1154 -1897 -288 -429 -556 1536 2119 -1060 -2917 -83 2182 340 -909
4297 -909 43 952 -480 -558 1077 622 -1756 -1317 1576 1627 -697 -1342 87 92 169 1312 1708 -597 -2532
4316 -2532 -803 2240 1402 -594 -765 -235 -569 -306 1496 1493 -1028 -1671 557 1467 173 -901 -315 -226
4334 -226 -433 126 1440 173 -1837 -958 1644 1714 162 -1006 -497 -681 -221 936 1369 -470 -2145
4351 -2145 -576 1031 875 -184 -421 -130 -254 298 1137 576 -1381 -1733 56 1393 230 -834 -621
4368 -621 -649 -204 691 1179 -378 -1667 -1165 420 1163 -77 -1052 -674 -835 188 936 569 -389 -1418
4386 -1418 -362 760 871 -197 -840 -735 -539 403 1167 249 -1162 -1122 174 1120 727 51 -661 -733 -146
4405 -146 487 810 -80 -988 -891 311 1015 750 -156 -480 -288 354 1108 596 -479 -1176 -526 949 916 -149
4425 -149 -518 -751 71 735 1093 463 -580 -966 -75 1079 902 58 -849 -689 372 869 1303 -58 -777
4444 -777 -677 756 1217 709 -368 -924 -602 420 865 640 -172 -841 -349 1000 946 299 -267 -760 -370
4463 -370 340 1110 274 -782 -1054 155 941 835 125 -286 -590 -266 735 975 -17 -1032 -776 386
4481 386 705 173 -368 -527 -301 11 899 754 -381 -1313 -566 759 554 -252 -382 -686 -853 174 1332
4500 1332 410 -1108 -1284 254 942 154 -343 -673 -1004 -723 517 1027 167 -1519 -1070 735 986 37
4518 37 -172 14 -920 -519 954 708 -790 -1682 -411 1182 742 -377 -18 -674 -674 47 1467 775 -1200
4537 -1200 -1421 157 623 165 -112 252 -131 -645 595 1275 156 -1532 -524 1069 697 -363 -167
4554 -167 -271 -985 -579 1620 1643 -395 -1437 -164 990 715 131 501 -300 -1271 -517 1487 794 -900
4572 -900 -763 1118 848 -632 -176 659 -241 -630 1080 1550 -590 -2353 -425 1301 503 249 752 65
4590 65 -1586 -798 1518 1809 -900 -1246 560 205 -1007 -374 950 112 -1068 556 2131 38 -2435
4607 -2435 -553 1182 615 -733 375 279 -1689 -2182 1337 2623 -634 -1944 113 992 -958 -840
4623 -840 1602 763 -2047 -1532 2198 1234 -2255 -1369 1965 1123 -1260 -455 1509 -784 -2529 487 3151
4640 3151 -37 -3153 -916 2088 147 -1402 1233 1878 -1933 -2702 1549 2942 -997 -2477 1179
4655 1179 1671 -1968 -1913 1602 1568 -1945 -866 2919 1495 -3058 -2078 2377 2369 -1325 -635 1662 -1106
4672 -1106 -3468 -13 4362 1721 -2508 -1186 1840 -601 -2162 1304 3088 -826 -2791 763 2255
4687 2255 -1654 -2679 1779 3043 -321 -2147 679 1032 -2710 -1423 3499 2950 -2143 -2756 981 1185
4703 1185 -1353 166 2931 637 -3215 -591 2171 583 -2297 -532 2331 -6 -2429 -186 1764
4718 1764 -573 -1687 1348 2563 -1097 -2999 354 2128 -232 -587 1059 115 -2861 -1417 2713
4733 2713 2453 -1177 -1717 288 -109 -1663 208 2170 366 -1756 -654 1020 -1038 -2340 811 2465
4749 2465 434 -1113 -45 -302 -2482 -882 2601 2677 -1048 -2292 -461 -163 -1226 1235 3161 593
4765 593 -2339 -1375 993 -219 -1626 896 2273 105 -1908 -343 712 -1783 -1318 2626 3040 -1036
4781 -1036 -2481 50 459 -1251 375 2953 1142 -2705 -1736 1739 1040 -1394 63 2193 160 -2169
4797 -2169 48 2224 -486 -2558 633 2956 -53 -2761 231 1853 -634 -1491 2085 2019 -2314 -2245
4813 -2245 2063 2818 -1599 -2084 996 717 -1769 -380 3242 1013 -3205 -1673 2471 1417 -2145 -133
4829 -133 2626 73 -2482 -346 2365 -343 -1886 1230 3357 -408 -3829 -615 1509 -581 -1025
4844 -1025 2549 1906 -2538 -3779 915 2038 -747 -531 2009 1107 -2642 -1844 1657 1322 -1865 -676
4860 -676 2705 660 -2899 -1324 1492 1060 -819 831 2005 -1135 -3691 -467 2648 665 -1608
4875 -1608 376 1171 -1340 -2199 1332 1987 -876 -1521 1270 1642 -1830 -1915 1116 1013 -1106 -468 1856
4892 1856 279 -2406 -819 2691 1247 -1248 -450 1004 68 -1283 268 1836 -704 -2312 68
4907 68 2192 93 -1364 627 1342 -565 -1361 1225 1182 -1451 -1402 1221 1617 -948 -1238 821 534 -637
4925 -637 0 1831 202 -1983 -965 1776 955 -918 -504 700 -293 -1168 548 1972 -200 -1270
4941 -1270 306 1253 -70 -1136 326 1031 45 -487 1142 991 -1119 -958 1180 1468 -133 -1110 157
4958 157 231 -548 -23 1442 276 -1279 -573 1201 495 -670 -545 1007 -4 -511 279 1104 -417 -1488
4976 -1488 146 1099 -74 -758 -152 277 -235 -259 736 399 -925 -1234 297 699 -146 -814 -67 -78 -655
4995 -655 -79 640 68 -628 -653 424 422 -513 -394 -16 -136 -50 247 572 -379 -1112 -330 766 212 -193 -8
5016 -8 -248 -250 119 456 277 -509 -459 208 700 91 -102 -7 20 -121 290 280 -84 -415 -447 206 625 -117 87
5039 87 -270 -176 388 473 325 -165 -664 164 271 363 161 -3 -76 55 93 668 375 -417 -131 152 473 275
5061 275 -27 -260 -433 249 441 363 -156 -323 -246 587 426 356 -48 -495 -114 52 341 184 -348 -573 20
5082 20 223 426 130 50 -192 -291 337 135 -225 -371 -561 -139 20 348 -182 -293 -334 14 176 186 -247 -577
5104 -577 -632 223 298 27 -102 -332 -240 93 -9 191 -24 -390 -228 141 420 -18 -313 -430 -91 54 201
5125 201 -54 -396 -283 293 559 193 30 -306 -346 38 70 311 -187 -188 -103 -109 295 174 -255 -126 -275 34
5147 34 115 352 77 -473 -602 -123 516 30 -245 42 -156 100 419 207 -113 -165 202 408 -2 -125 -215
5168 -215 -162 -207 259 715 27 -59 -4 157 15 339 -23 76 -18 -241 431 539 111 -154 429 445 414 73 172
5191 172 -64 -142 65 330 263 -383 -302 101 242 269 44 -20 -87 -284 -124 214 -120 -572 -310 235 334 29
5213 29 -26 11 -342 -44 43 285 -124 -543 45 263 -58 -210 -36 -312 -338 -13 561 -46 -109 -325 39 193
5235 193 -253 -44 -246 -417 -494 280 47 -172 -269 -124 109 -168 -5 143 -16 -371 -374 537 -62 -614 -404
5256 -404 114 504 -123 190 621 -332 -646 104 374 466 -324 67 224 -458 -617 191 188 -241 -171 692 548
5277 548 -360 -659 -201 90 -122 63 507 58 -970 -368 663 381 -136 -227 741 277 -590 -172 651 20
5297 20 -833 141 778 101 -663 28 440 252 -218 522 385 -617 -775 510 741 -256 -459 235 307 -764
5317 -764 -417 693 536 -581 -425 509 443 -420 -232 570 183 -297 -98 581 15 -779 98 949 340 -949
5337 -949 -217 499 79 -780 174 697 -391 -978 109 1002 -450 -348 471 488 -631 -740 -71 388 -535
5356 -535 -581 592 373 -856 -936 542 209 -345 95 525 -163 -1247 -267 917 210 -562 -69 299 -143
5375 -143 -1026 347 768 -1 -473 -13 478 -416 -990 383 838 -136 -314 448 100 -589 -568 938 773
5394 773 -306 -579 -20 355 -463 112 849 438 -671 -68 556 151 -113 182 702 -43 -752 18 275
5413 275 -481 -261 392 588 -383 -906 104 815 96 367 940 114 -832 -716 503 769 7 -5 839 -102
5433 -102 -548 -282 829 674 -130 67 404 -38 -764 -246 815 520 -217 -228 591 -678 -711 538 1216
5452 1216 183 -752 -76 178 -668 -688 896 777 -231 -628 119 -49 -198 -108 740 240 -380 -419 477 -105
5472 -105 -983 146 873 361 -751 -172 54 -16 -609 473 793 -518 -640 -321 445 -70 -83 422 34
5491 34 -582 -771 550 390 -142 -292 476 235 -722 -509 400 100 -42 170 383 -199 -1108 -179 782 171
5511 171 -186 -109 -114 -550 -608 74 800 314 -374 -12 -82 -429 -21 464 415 -137 -240 -41 -48 -846 -78 408 471
5534 471 -235 4 6 -96 -42 425 1133 339 -779 -222 426 127 80 361 474 -99 -259 257 277 -136 -51 674
5556 674 415 -336 -307 -29 91 181 -35 833 211 -664 -322 477 582 237 406 421 -348 -885 -79 1014 110
5577 110 -210 347 81 -245 -721 188 695 179 -221 328 350 -549 -464 365 607 -45 -452 257 227 -707 63
5598 63 601 407 -339 -240 -159 -181 -367 -191 379 -12 -219 -73 392 83 -675 49 493 19 -600 -131 298
5619 298 -276 -461 354 615 -34 -915 -335 411 13 -252 157 402 -583 -461 448 298 -361 -364 237 164 -144
5640 -144 -217 330 -66 -601 43 295 -214 -638 -273 489 27 21 263 28 -302 -376 255 837 362 -454 -136
5661 -136 62 171 -234 246 481 -205 -177 152 426 -368 -125 292 303 28 -132 251 93 -136 93 258 462
5682 462 -276 -341 143 227 402 157 -133 -392 -471 -195 466 67 -100 -21 186 91 158 265 145 -321 -292 201
5704 201 349 32 -396 262 78 -37 202 59 62 -151 -49 289 114 -399 -426 -92 -134 292 196 89 -397 -396
5726 -396 295 132 0 -352 -53 83 -115 125 -459 -99 -251 243 302 288 -264 -337 -97 59 -11 -119 -44 -356
5748 -356 -229 -233 60 152 -231 -398 -37 461 310 3 -83 -290 -180 52 -15 -129 -170 -88 233 303 -125 29 -34
5771 -34 -99 -205 303 166 86 -364 -175 22 -23 192 -349 -154 -295 -5 258 410 -203 -197 106 278 128 18
5793 18 63 -275 -125 203 295 165 -204 -18 147 2 435 108 -297 -113 -42 341 262 288 -78 -246 39 105
5815 105 200 -7 -240 -332 -111 86 201 -165 -370 22 -171 144 -65 -60 -173 8 241 381 119 -184 -205 -178
5837 -178 120 71 68 154 -381 -119 -22 397 18 -188 -213 -336 -184 59 354 -183 -579 -183 419 133 149 -274
5859 -274 21 312 -150 112 108 -467 -380 -78 435 -98 -180 -172 -111 -61 291 343 50 -584 -259 37 -116 -189 -327
5882 -327 -122 -73 -183 -107 278 -51 -376 271 224 8 -84 -391 61 -95 -9 105 234 -716 -317 348 659 -211
5904 -211 -98 185 33 -473 290 530 139 -472 -268 359 245 -65 -82 419 287 -64 255 602 -517 -548
5924 -548 169 698 -4 -341 93 83 -86 -58 1108 409 -427 -627 134 234 -492 -75 392 169 -335 -144
5944 -144 301 -32 -379 34 778 142 -827 -426 243 -246 -365 855 1087 -443 -1004 -94 445 82 -430
5963 -430 522 333 -823 -821 753 431 -495 -352 338 247 -592 -578 554 425 -364 179 761 -471 -1412 -329
5983 -329 1038 482 -204 -111 250 -586 -787 567 989 -258 -707 309 342 -573 -785 406 507 -554 -443
6002 -443 571 -158 -866 -399 1129 800 -677 -642 104 -222 -895 119 1546 -281 -1282 -210 958
6019 958 -27 -709 439 732 -730 -1174 443 853 -599 -598 1066 981 -632 -955 696 746 -723 84 1306
6038 1306 365 -1895 -870 1340 940 -635 282 1095 -466 -1563 180 2171 432 -1201 22 737
6054 737 -465 -1391 766 1582 -573 -1051 658 564 -1487 -1396 1396 1712 -357 -946 198 93 -1530 -407
6072 -407 2307 1170 -1905 -1457 777 135 -1058 665 1997 265 -1932 -834 1176 -677 -1320 1148
6088 1148 1999 -227 -2220 -170 905 -418 -468 1865 1647 -1508 -2343 298 1368 -374 -299 1520 484
6105 484 -2078 -1475 1335 1274 -962 -755 1360 47 -2207 -904 1388 445 -1120 368 1230 -693 -1936
6122 -1936 93 2108 598 -1103 210 372 -1157 -1383 1168 2107 -569 -1595 128 548 -1092 -268
6138 -268 1723 1153 -835 -1103 622 498 -1342 -23 1867 833 -1435 -766 508 -41 -650 995 1920
6155 1920 -448 -1838 -572 960 -50 58 1126 582 -1145 -1337 787 1167 -427 -7 881 256 -1401
6172 -1401 -1026 647 451 82 496 1290 -241 -1828 -515 1104 582 -120 442 199 -1237 -1392 642
6189 642 1504 132 -625 409 372 -809 -645 1100 724 -856 -566 732 -96 -1190 -180 1475 502
6206 502 -665 -380 463 -735 -784 937 1736 -55 -1589 -146 810 -366 -247 1167 967 -1172 -1303
6223 -1303 644 965 -405 -262 1064 646 -1502 -1091 856 125 -1046 385 1704 82 -1920 -1039
6239 -1039 1375 325 -409 615 885 -916 -2079 174 1754 76 -988 166 452 -1049 -1668 421
6255 421 1299 -235 -865 804 527 -1447 -1286 803 1343 -292 -249 732 -55 -1732 -308 1951 1156 -1120
6273 -1120 -702 479 -132 -823 188 1501 2 -1236 82 1109 -30 -954 493 834 -189 -952
6289 -952 534 540 -818 -548 1140 1286 -577 -853 109 389 -251 47 750 -56 -1252 -419 1199 726 -657
6308 -657 38 814 -269 -794 79 861 -171 -741 223 910 -430 -842 -108 871 -125 -475 205 60 -708
6327 -708 -630 800 975 -304 -733 53 25 -546 -121 907 -113 -728 -296 624 78 -385 22 324 -99
6346 -99 -381 19 274 -529 -590 343 855 -92 -586 -28 117 -236 -185 405 -76 -972 -588 354 360 47 -296 21
6368 21 -65 -85 -53 517 56 -752 112 648 103 -431 -312 161 -142 122 204 350 -427 -404 208 729 161 -289
6390 -289 -145 217 -189 31 607 253 -685 -394 228 580 -210 -549 137 117 -337 -11 42 -89 -592 -3 880
6411 880 430 -298 -465 202 -2 60 263 445 -539 -221 -109 709 34 -421 43 112 -92 309 235 -97 -456
6432 -456 -375 454 193 -126 -504 -148 -86 38 228 195 18 -458 -257 531 391 -154 -561 -267 169 305 294
6453 294 -45 -319 -482 448 457 334 -205 -375 -332 57 84 53 -88 -394 -212 175 350 -97 -313 -279 142 13
6475 13 -26 159 -558 -487 -111 332 75 -319 -380 -177 167 282 389 64 -497 -403 204 523 41 -99 -295 123
6497 123 -133 83 289 -121 -285 -234 323 336 -80 -232 -121 117 226 260 402 -123 -541 3 405 421 60
6518 60 -42 -270 -55 68 504 35 -365 -369 244 352 77 -137 -163 32 -29 34 416 -31 -578 -1 443 23
6540 23 -232 -289 -140 -205 -124 588 532 -365 -571 154 626 185 -46 157 -2 -215 -248 387 247 -508 -289 678
6562 678 712 -137 -310 178 180 -146 61 659 141 -1001 106 838 357 -282 455 457 -195 -636 258 472 -417
6583 -417 -629 220 454 -312 -293 229 85 -458 -141 631 257 -874 -619 852 876 -437 -323 115 -79 -647
6603 -647 422 887 55 -913 -27 253 -152 -565 45 512 -284 -615 258 607 -376 -603 518 1161 -495
6622 -495 -598 346 120 -627 322 1299 -69 -1007 -664 775 502 -7 218 386 -553 -960 215 769 -294
6641 -294 -822 526 396 -457 -830 198 365 -352 338 1134 150 -1228 -817 799 786 -9 339 589 -789
6660 -789 -1122 442 1605 410 -480 218 605 -643 -996 880 1257 -262 -293 1171 582 -1479 -930 1197
6678 1197 1382 -381 -307 618 -415 -1674 -231 2158 908 -1980 -630 986 -245 -1557 777 1769
6694 1769 -193 -1899 489 1603 -523 -1410 636 1743 -720 -1475 637 816 -1425 -1134 1856 1475
6710 1475 -1573 -1865 1286 1186 -1186 -699 1784 290 -2502 -334 2535 1110 -1852 -834 1725 -378
6726 -378 -2295 330 2497 -147 -2380 250 1782 -1253 -2239 870 2817 -144 -1906 388 725 -1948
6742 -1948 -1814 2514 2656 -1557 -2292 728 784 -1455 -122 2835 1690 -2778 -1753 1452 203 -2091
6758 -2091 265 2656 829 -2573 -868 1581 -549 -1781 1130 2964 -407 -3124 -551 1446 -573
6773 -573 -1136 1650 1842 -1710 -2660 777 2165 -647 -1037 1947 1217 -2128 -1963 1453 1026 -1297 -318
6790 -318 2138 457 -2625 -796 1940 1049 -1023 73 1483 -1245 -2472 414 2449 -45 -1554
6805 -1554 354 1087 -1022 -1211 1111 1729 -883 -1362 682 962 -1608 -1049 1919 1291 -1196 -1145 1034
6822 1034 -179 -1691 201 2293 315 -2039 -997 770 5 -784 1035 1608 -1212 -2256 113 1479
6838 1479 -327 -885 1164 1177 -1631 -1734 616 815 -1010 -490 1825 856 -1935 -1339 1339 710 -885
6855 -885 364 1350 -735 -2318 -186 1813 412 -1116 658 700 -888 -1695 940 1444 -661 -1465 837
6872 837 1079 -1759 -1309 1033 1193 -707 -686 726 198 -1434 -401 2117 1120 -1423 -914 757 127
6889 127 -1188 688 1859 -124 -1995 -160 1473 -192 -922 596 1457 -650 -1616 425 1133 -529
6905 -529 -743 1547 1652 -1146 -1619 605 1260 -516 -82 1358 134 -2090 -780 1368 717 -832 -57
6922 -57 1200 -238 -1557 204 1565 10 -1004 287 1392 -663 -1402 303 1308 -109 -524 831
6938 831 174 -1308 -746 1160 1447 -623 -740 284 45 -816 -9 1312 368 -1062 -221 813 19 -740
6956 -740 -17 1024 71 -1008 -126 596 -408 -828 1022 995 -421 -1036 30 322 -392 -279 799 633
6974 633 -1342 -787 541 679 -566 -475 762 -130 -810 -15 890 -293 -657 122 1163 76 -974 -235
6992 -235 402 -196 -456 694 671 -781 -699 780 1031 -89 -537 162 204 -362 -248 571 356 -852 -529
7011 -529 737 294 -573 -532 388 58 -495 299 769 -369 -911 316 1162 165 -713 76 499 -46 -306
7030 -306 489 600 -903 -707 275 764 161 -515 57 33 -234 -320 373 188 -656 -436 709 370 -427 -469
7050 -469 37 149 -161 111 338 -321 -686 -167 535 392 -484 -320 398 -215 -17 451 358 -8 -737 66
7070 66 881 -89 -305 19 43 -33 -57 234 -21 -309 12 189 459 -38 -194 215 -28 -47 245 409 -280 -93
7092 -93 -243 72 232 -277 -270 147 -113 184 575 419 -441 -412 228 215 47 -265 -48 -143 -38 89 119 121 -226
7115 -226 -144 287 218 165 -235 72 -316 94 342 666 -219 -542 193 669 197 99 -81 -288 -267 108 328 22
7137 22 -190 -163 17 314 46 -208 -349 -146 116 167 466 53 -287 -169 212 269 -60 60 -174 8 -90 264
7159 264 518 -36 -395 29 56 42 -185 66 -199 43 -68 479 270 -523 -149 794 421 -243 -512 -13 -115
7180 -115 -362 271 488 90 -418 57 466 265 -103 154 -7 1 -107 304 452 -405 -437 231 357 107 -259
7201 -259 33 -101 -167 37 595 7 -590 -714 102 354 -395 -268 83 -382 -323 253 913 20 -698 -70 544
7222 544 255 -596 -98 203 -318 -590 300 562 -130 -509 -100 818 -105 -647 39 88 -74 -171 759 241 -827
7243 -827 -428 510 729 -442 -171 529 -152 -410 103 453 8 -499 116 621 -96 -496 92 489 -325 -107
7263 -107 274 408 -330 -963 371 674 274 20 76 -130 -250 -92 723 341 -543 -67 482 190 -803 97
7283 97 452 5 -499 381 641 -161 -610 173 887 -64 -559 124 397 -617 24 866 477 -623 -628 424
7303 424 564 -163 -30 595 -587 -1011 -65 983 89 -249 223 552 -295 -864 136 177 -441 -187 761
7322 761 237 -1003 -1061 387 652 -78 -127 611 -204 -1138 -500 809 414 -799 -157 277 -609 -1002 190
7341 190 746 -97 -883 403 856 -675 -1024 662 1511 -235 -435 460 94 -1261 -994 1197 1024 -1069
7359 -1069 -852 779 49 -1189 77 1295 262 -1303 -565 975 -27 -1397 -185 1384 -187 -1150
7375 -1150 -41 1073 -501 -994 1017 1744 -780 -1487 226 1369 -403 -611 1302 792 -1609 -951
7391 -951 1158 1172 -1055 -746 958 314 -1521 -437 1227 660 -877 207 1723 -137 -2013 -148
7407 -148 1760 173 -982 484 1012 -1500 -1244 958 1849 -585 -1355 526 893 -1192 -752 1549 1325
7424 1325 -1376 -1253 1104 850 -1382 -418 1543 765 -1433 -487 990 134 -1606 808 2092 169
7440 169 -2071 -639 1297 -480 -830 576 1349 -1442 -1921 558 1586 -732 -766 1518 609 -1636 -1121
7457 -1121 1120 945 -1021 5 1943 442 -2348 -685 1606 686 -1229 195 1454 -806 -2473
7472 -2473 192 2137 313 -1351 631 1046 -924 -1413 1160 2076 -580 -1159 1075 686 -1908 -1407
7488 -1407 1552 2304 -1048 -883 1119 350 -2232 -807 2305 1118 -1529 -937 1049 152 -1696 358
7504 358 2094 70 -1906 -249 1519 -534 -1744 655 1803 -423 -1877 422 1257 -1056 -1178 1305
7520 1305 1383 -1241 -1375 1241 1387 -740 -542 1490 359 -1664 -486 1817 922 -1574 -483 982
7536 982 -119 -1642 328 1891 -5 -1383 335 1377 -514 -1866 368 1764 -418 -1085 490
7551 490 809 -780 -1028 1427 1598 -555 -1143 289 430 -971 34 1665 469 -1563 -774 1028 432
7568 432 -1259 -46 1418 32 -1105 -396 507 -386 -952 827 1291 -501 -1593 -295 414 -527 -246
7585 -246 1075 826 -1314 -1352 549 328 -637 -62 705 193 -937 -316 707 -119 -705 244 1134 29
7603 29 -1550 158 875 164 -505 250 749 -903 -881 605 1117 -273 -731 533 -148 -763 -123 1155
7621 1155 170 -1085 -862 810 553 -805 -243 910 165 -1105 250 801 -136 -846 202 986 179
7638 179 -769 -77 853 -167 -204 937 1046 -545 -873 627 785 -439 -388 826 565 -756 -310 710
7656 710 202 -653 -155 895 125 -788 -297 730 267 -535 513 934 -171 -1072 44 909 146 -505
7674 -505 175 504 -392 -506 641 727 -265 -486 309 426 -586 -627 349 398 -705 -238 576 313 -835 -638
7694 -638 744 259 -176 -155 360 35 -420 -37 482 -224 -646 23 432 443 -697 -233 172 -283 -295 206
7714 206 489 -253 -770 123 380 -343 -331 23 223 -11 -15 141 252 -661 -31 343 170 111 -191 -91 -85 -41
7736 -41 371 324 -236 -507 -172 550 136 -362 80 26 7 -128 273 -203 -356 -35 277 548 155 -37 -272
7757 -272 -55 -228 -184 299 12 -384 -143 71 224 105 -250 102 262 238 102 155 -53 -65 195 180 224 -291
7779 -291 -61 -43 -383 -11 268 -132 -144 75 353 104 57 120 -147 -159 -132 41 68 69 -471 14 434 129 69
7802 69 -226 49 -346 -23 432 218 -100 -241 -51 54 -49 -184 -102 -191 -280 -174 200 -26 -53 -407 181 -124
7824 -124 -493 -171 -50 97 20 191 118 128 -175 -240 298 315 -300 22 63 -107 -297 20 47 -175 -308 65
7846 65 42 95 -378 106 144 -222 -16 564 122 -320 -306 486 132 -148 -236 -47 -12 -369 194 377 34 -443
7868 -443 -188 84 223 -208 184 -224 -150 -85 198 625 -88 -636 396 399 -45 -125 -26 284 -214 35 524 65
7890 65 -517 -222 508 186 -104 -72 460 -103 -190 -44 658 -145 -613 8 305 75 -285 -40 330 -19 -374
7911 -374 86 648 -309 -387 195 265 -138 23 415 8 -664 -58 523 18 -389 -172 579 291 -328 213 556
7932 556 -151 -367 321 280 -222 -294 89 557 36 -183 -36 307 -358 -170 640 556 -603 -415 437 188 -400
7953 -400 -208 302 -88 -714 -94 656 -275 -754 242 798 294 -490 220 149 -298 -375 857 722 -291 -291 24
7974 24 536 -763 -363 506 382 -911 -558 561 332 -927 -16 950 48 -754 83 652 -362 -500 278
7993 278 929 -287 -1082 -106 924 -92 -483 669 473 -598 -610 480 982 -364 -514 711 202 -502
8011 -502 -364 732 539 -836 -25 872 247 -1176 -342 954 376 -478 -152 697 -508 -703 351 968
8029 968 -177 -861 -123 629 -253 -426 874 710 -669 -696 435 514 -517 -404 957 556 -940 -445
8047 -445 507 189 -405 116 1041 3 -1071 -363 465 -426 -315 487 867 -660 -1110 200 787 -365
8065 -365 -438 728 630 -749 -452 536 69 -617 -2 1207 221 -1070 -652 719 253 -406 73 802 -630
8084 -630 -1133 -45 1022 -68 -708 438 640 -716 -528 561 683 -581 -700 982 598 -1132 -457
8101 -457 921 431 -835 -466 903 173 -850 -106 1598 161 -1217 136 1174 -33 -916 258
8117 258 1386 -729 -1622 549 1203 -436 -883 632 937 -1256 -1358 790 1032 -671 -384 1390 750
8134 750 -1546 -1107 1433 692 -694 102 1277 -145 -1735 -101 1767 776 -940 -149 998 -744
8150 -744 -1759 751 1827 -175 -1229 222 861 -1196 -1721 583 1931 -488 -1050 885 207 -1634
8166 -1634 -1014 1613 1700 -704 -900 860 140 -1397 50 1733 662 -1235 -527 1083 -1 -1496
8182 -1496 221 1486 58 -1190 196 1017 -547 -1079 690
8191F90
$$ Imaginary data points
##PAGE= N=2
##DATA TABLE= (X++(I..I)), XYDATA
0 0 0 0 0 -8 8 -8 9 -16 24 -32 38 -48 64 -73 89 -109 133 -160 185 -218 259 -299 342 -397 457 -527 594
27 594 -674 772 -871 977 -1099 1232 -1378 1537 -1710 1907 -2120 2347 -2600 2883 -3193 3533
43 3533 -3909 4333 -4810 5343 -5951 6652 -7467 8429 -9582 11001 -12796 15140 -18353
56 -18353 23053 -30607 44733 -80233 352456 437644 -450672 -281611 78675 -89406 -296766
67 -296766 280124 589193 -312 -513173 -84285 248897 -128792 -297830 287618 511121
77 511121 -64425 -393483 -8669 103468 -254875 -131406 486784 421315 -309610 -481049
87 -481049 40279 187410 -87160 48170 383819 67326 -467135 -243812 315571 200778
97 200778 -215326 -58322 266392 4343 -327925 -39923 284277 8127 -235313 100599
107 100599 306936 -117809 -390070 3986 312122 45941 -145982 65617 62319 -272824
117 -272824 -204394 298568 366197 -108066 -289039 -17087 54194 -113438 18701 280559
127 280559 90672 -277937 -176501 140566 66810 -145232 18722 243536 59682 -190689
137 -190689 -87786 40606 -92335 -91707 216444 289681 -85920 -323448 -120351 77331 43190
148 43190 95003 226044 50483 -285477 -237228 103421 173170 -10922 -8844 107454 -11828
159 -11828 -185778 -67097 113380 28040 -66720 97126 189727 -54709 -252295 -91506 108767
170 108767 77486 46493 118284 12730 -236069 -194780 129784 237593 36956 -68752 -1046
181 -1046 -42705 -131772 3367 179827 63740 -133506 -47776 114500 10109 -140393 -21660
192 -21660 136934 52441 -48581 38051 47224 -142506 -163191 112818 241719 19766 -156823
203 -156823 -66220 5771 -48816 26016 190848 99289 -166524 -168780 65451 111888 -37636
214 -37636 -39235 76782 23411 -100396 -26784 89811 -8208 -116828 25445 177162 45845
225 45845 -143860 -96886 24620 9414 7395 110123 80032 -131772 -185596 26556 158604
236 158604 45914 -48941 1837 -1381 -84397 -36161 97488 55856 -98625 -72867 82582
247 82582 73469 -68388 -77305 25706 33448 -10365 39306 67622 -59162 -150935 -23724 130266
259 130266 78806 -51966 -60721 -18243 -29528 -3595 87343 75524 -64404 -109951 8914
270 8914 83126 13807 -43934 -14393 -2503 -23140 15927 65012 1643 -89260 -39507 79764
282 79764 78855 -18533 -55915 -28405 -19606 1831 66093 65285 -44925 -107054 -18039 84001 62955
295 62955 -7052 -24323 -21285 -27716 7732 63045 33682 -58365 -67897 21768 70089 22709 -26272
308 -26272 -25804 -13796 4690 47573 58012 -12128 -80345 -44806 43446 65445 16925 -27027
320 -27027 -39827 -28145 16025 65356 48207 -31102 -66696 -12743 48115 41944 -1702 -31007
332 -31007 -37427 -17860 31584 59737 15333 -53114 -51719 16307 59389 35119 -13813 -42985
344 -42985 -40004 -3074 44865 47240 -12005 -62774 -39187 28283 58696 27250 -23080 -45912
356 -45912 -26802 18201 47398 23328 -34296 -59437 -22562 34342 49694 12824 -35267 -46981
368 -46981 -9881 39387 47864 3222 -47127 -49923 -5588 38246 37639 -4933 -45742 -41649 6215
381 6215 48759 40347 -11285 -49631 -35292 13998 44548 25458 -23291 -51499 -29839 20456
393 20456 48378 24993 -24553 -47313 -17644 32331 48865 13934 -35795 -48290 -12955 32441
405 32441 41611 6600 -36760 -42381 -2204 43413 46493 2552 -41663 -39023 6285 44624 34963
418 34963 -12613 -47526 -32814 14705 46627 32703 -11566 -40604 -24450 23399 51656 26947
430 26947 -26545 -49006 -17490 28771 41185 13385 -24554 -38949 -12876 34996 53222 14868
442 14868 -38560 -42846 2528 40742 33340 -2651 -34820 -38602 -3927 41640 45482 -3104 -44157
455 -44157 -27707 18561 38745 21943 -8937 -34155 -31952 8050 46223 25525 -32892 -48699
467 -48699 -5042 36359 35020 11141 -16867 -41137 -30515 26328 59596 12633 -53716 -48757
479 -48757 4984 28824 18201 9341 -8026 -36713 -22783 37461 50547 -17521 -62336 -19238
491 -19238 33010 22796 -3426 -7051 -23839 -43154 157 69126 46630 -46402 -69143 -1765
503 -1765 36212 13443 4179 5835 -34134 -58393 9206 74558 22689 -61209 -37988 32727 26358
516 26358 -12872 2224 12193 -36469 -42526 40157 67279 -28022 -84389 -5923 63578 23484
528 23484 -15345 8348 -5129 -61678 -24143 84370 73099 -54058 -88017 4235 43616 -3259
540 -3259 2069 46154 1901 -68412 -15642 73972 26926 -69594 -30441 65233 39065 -41591
552 -41591 -26089 14648 -23836 -33487 65760 104882 -20401 -117781 -38107 60382 35336 1063
564 1063 34954 14503 -79248 -69313 56778 85055 -20236 -50366 33525 44952 -37804 -43669
576 -43669 27870 19410 -35265 11566 81031 5914 -109230 -62510 65302 73611 4840 1694
588 1694 6264 -60659 -75258 41187 110851 15685 -76701 -33698 20627 -9430 -16155 43851
600 43851 40939 -37758 -39518 35935 28164 -54284 -42774 49656 57139 -15742 -33404 -11285 -36357
613 -36357 -39762 53568 110770 14535 -96077 -69318 7502 19825 27156 63903 26380 -81123
625 -81123 -90430 16120 59545 2172 -7528 44089 20391 -57553 -46611 16063 2863 -23850
637 -23850 45833 94081 -11642 -125834 -72537 38345 50337 37719 69773 25044 -112011
648 -112011 -127195 29854 114973 30565 -26094 17717 -2645 -89067 -49751 76424 65958
659 65958 -37751 -11942 77070 7180 -121065 -61263 83909 68752 -19013 13166 42210
670 42210 -75379 -133061 33839 168127 51225 -87879 -34056 26207 -47565 -49943 93784
681 93784 111547 -63717 -117968 32374 80371 -47218 -58560 84027 83275 -67700 -71172 55775
693 55775 29084 -88700 -12440 144369 61631 -134327 -102588 60317 53420 -24997 50315
704 50315 106440 -56933 -182341 -22744 151587 61463 -65224 4601 54005 -76425 -119144
715 -119144 54579 134438 -12805 -75096 55779 66851 -108964 -128703 67488 130553 -5515
726 -5515 -38741 45551 -22301 -161594 -56217 171941 143488 -61675 -89474 9701 -30349
737 -30349 -95051 38287 165469 33270 -130952 -52222 63409 -20946 -90714 46553 139656
748 139656 5583 -100384 -13426 28466 -76520 -62023 121386 145378 -56260 -145721 -24551
759 -24551 34024 -23880 24913 133069 42599 -144732 -112496 63199 71000 -33734 234
770 234 81324 -6242 -117208 -32843 80838 15609 -54858 44425 105566 -35231 -139389 -27928
782 -27928 80371 24882 -9390 62335 32690 -118935 -115831 69340 132248 5931 -48189
793 -48189 18260 -3076 -88442 -25447 106763 61630 -71580 -41397 62855 10473 -88779
804 -88779 -18320 93776 39596 -48204 3138 44243 -55478 -96998 44922 132831 13234
815 13234 -90548 -26400 24471 -31489 -16936 93854 75494 -77738 -100130 33891 68461
826 68461 -25956 -30042 54345 26611 -71718 -36914 63167 26272 -61794 -3867 90621 22448
838 22448 -91596 -48683 46843 23739 -19316 35836 52326 -60259 -111524 11643 107720
849 107720 35517 -40993 -5600 7370 -55516 -42792 62931 71427 -35041 -58301 25003 30994
861 30994 -49334 -42584 46056 50254 -17158 -12155 27596 -24385 -84736 -10977 93856 58426
873 58426 -42446 -48229 -7016 -21543 -22733 50867 77445 -13471 -77714 -18798 36837 -1204
885 -1204 -26786 19363 33856 -18552 -30340 16748 12003 -41447 -22359 55677 54729 -23028 -49374
898 -49374 -12415 -1237 -8059 28152 52157 -6779 -66609 -28902 39361 32866 -5454 -1950 7905
911 7905 -17619 -21570 20992 29712 -18955 -35466 13422 37106 -162 -24322 -3376 6878 -3350
924 -3350 12701 34353 1434 -46965 -27742 30637 37783 -104 -15121 -8817 -15081 -8578 29287
937 29287 41410 -5299 -40387 -11280 25350 14758 -6216 -1854 -247 -13089 -2098 25797
949 25797 15255 -25393 -24790 19051 34225 6490 -13972 -11645 -14254 -10876 19678 36851 1248
962 1248 -39391 -24465 17917 25862 7097 -889 -4482 -16901 -10685 18737 22853 -12519 -32050
975 -32050 -4420 22207 12751 -5333 -8258 -9426 -10312 8346 29128 10804 -27873 -32047 1959
988 1959 22872 11739 -4184 -11753 -16713 -9636 15216 26890 2241 -26604 -19344 9366 18514
1001 18514 5246 -8480 -15273 -15448 -249 20330 17486 -10837 -26012 -8108 17275 19071 3401
1014 3401 -12098 -18938 -11859 8118 21652 8152 -18371 -23408 -1109 19779 18406 1868 -13564
1027 -13564 -16272 -3846 15272 18391 -1419 -21484 -17737 5048 20083 14553 -3938 -16153 -11389
1040 -11389 7142 20898 13955 -8040 -21314 -11695 9775 19532 8970 -10185 -18246 -6461 13765
1053 13765 22238 9018 -11670 -17985 -3801 15168 18552 2539 -16555 -18514 -855 17711 18456
1066 18456 1369 -15530 -13948 4445 19922 16026 -3404 -19296 -14547 4553 18285 12234 -6898
1079 -6898 -18722 -10270 10142 20984 11429 -9376 -18949 -8197 10668 18045 5081 -14674 -20287
1092 -20287 -5765 13371 18196 4432 -13660 -17173 -1882 16185 16681 -1246 -18468 -17399 -243
1105 -243 14169 12206 -3338 -17668 -15419 3679 19508 13477 -8068 -19758 -10227 6580 14155
1118 14155 7418 -9031 -20890 -13850 8644 20607 6872 -14192 -16865 -2528 10753 13237 4699
1131 4699 -10874 -20182 -8167 14454 17446 -4629 -20578 -11150 6285 13657 11774 2396 -14254
1144 -14254 -20691 -384 23522 16023 -13044 -22749 -6700 7072 9187 10671 4207 -13495 -17338
1157 -17338 8415 26539 6221 -21076 -14819 7005 10088 3703 4771 -2600 -20196 -11401 23832
1170 23832 32103 -3605 -27171 -9431 10874 8101 5979 11500 -4737 -27765 -10437 27997 24610
1183 24610 -13094 -19578 7402 13663 -1543 2058 10689 -8687 -23720 6166 34886 6760 -32757
1196 -32757 -17853 17773 15913 1444 9682 7056 -24254 -26508 19975 40597 -2007 -33510 -9069
1209 -9069 13392 -1272 -3450 18514 10166 -24340 -16133 26654 22978 -23537 -27038 13081 20776
1222 20776 -5935 -7304 7227 -11114 -28808 8538 47371 14712 -37060 -27430 11382 10234
1234 10234 -3020 13377 15101 -25056 -37732 9713 37221 317 -25794 2285 18754 -8173
1246 -8173 -15802 10534 8144 -22325 -9614 32685 18741 -35785 -36199 13127 25979 3560 6173
1259 6173 13737 -21177 -45132 718 49290 21746 -27227 -18848 4912 -9847 -15729 20660 31689
1272 31689 -10695 -26349 12224 21585 -22167 -31132 16486 33763 -75 -12209 4140 -13347
1284 -13347 -38977 284 59538 39008 -27943 -37300 -3349 -1195 -7412 25767 42406 -8788
1296 -8788 -49042 -11161 28305 2500 -19474 16467 35749 -5265 -28329 1663 8779 -23236
1308 -23236 -10100 46330 40551 -30015 -50583 -2133 19694 3315 17599 39501 -4067 -58277
1320 -58277 -25898 39705 30438 -15761 -6905 18709 -9870 -34721 6003 37242 -969 -26849
1332 -26849 15372 34087 -18836 -46080 3456 35793 4348 -10129 15276 -64 -48241 -26412
1344 -26412 49175 53569 -13783 -35906 -4095 -4126 -22423 12569 51073 9631 -49258 -26788 22464
1357 22464 5615 -23132 10014 40302 2422 -34066 -8043 9721 -22220 -20618 39380 51615
1369 51615 -17240 -56696 -19587 9274 681 18100 49240 11694 -57787 -48223 18226 30755
1381 30755 -2597 2649 23195 -8905 -44410 -11676 28770 5810 -17567 18650 38780 -13944
1393 -13944 -52488 -13192 24210 8051 2711 29316 9043 -52415 -46411 28948 52415 4529
1405 4529 -14275 6337 -9817 -39209 -2493 50266 21081 -35640 -18065 24995 928 -32565
1417 -32565 4075 42171 7112 -26850 4466 19545 -28176 -37307 32518 59710 -4827 -46188
1429 -46188 -10700 7334 -17170 4918 60626 34035 -51809 -55315 15987 30973 -9175 2519
1441 2519 39485 3382 -53758 -22981 35259 13331 -26242 14573 55563 -352 -62278 -25908
1453 -25908 27290 9352 -5604 36904 37340 -44863 -75595 3900 58703 17893 -11400 18156
1465 18156 8597 -50388 -40230 36406 44694 -18825 -23139 29499 15291 -47029 -32468 33840
1477 33840 30725 -15122 831 32478 -14060 -65510 -14378 57661 31409 -27343 -14091 12902
1489 12902 -19214 -33883 24635 53740 -7777 -48393 -908 32621 -8926 -29498 14162 26561
1501 26561 -19777 -26154 22061 22474 -29585 -25453 32892 32894 -23762 -31164 10587 11039 -16151 3623
1515 3623 33913 -1385 -49123 -19179 37800 27758 -12075 -6169 9461 -15355 -28356 13375
1527 13375 37912 -718 -29121 84 20195 -8672 -22923 9158 24133 45 -6444 13798
1539 13798 2480 -33374 -21965 27867 36168 -1024 -17144 -5919 -10811 -16299 13498 39652
1551 39652 12269 -25883 -16861 9203 3271 -9029 6050 17033 -2291 -12469 5892 9520
1563 9520 -14807 -16084 16846 28934 2323 -15535 -7747 -6170 -11235 8258 29390 10071 -24902
1576 -24902 -20715 8282 13267 1565 4428 8418 -7939 -15547 5070 16605 -4715 -18616 1417
1589 1417 17087 2323 -10180 -1185 1648 -7648 235 20156 10571 -20273 -22690 5205 15916
1602 15916 2220 -3346 872 -8203 -15147 4503 22928 6374 -18264 -11575 8304 5711 -5353
1615 -5353 -1028 2920 -8086 -9439 9146 14184 -7419 -19006 198 15403 5785 -5043 -2762
1628 -2762 -5076 -12473 -2005 17441 11491 -14144 -18291 1810 11690 3467 312 1959 -5816 -11112
1642 -11112 2299 14649 2186 -15455 -9666 7710 9100 -284 -1853 -1165 -6093 -2537 11245
1655 11245 13611 -4977 -17059 -5851 9310 8222 1158 -1574 -5011 -7339 1360 13645 10241
1668 10241 -6685 -12018 -387 8953 5717 -207 -3666 -6530 -4439 6045 12403 3466 -9308 -7981
1682 -7981 4328 10465 6024 -1247 -6210 -7644 -1111 8755 9471 -1762 -10692 -6171 5522 9977
1696 9977 5645 -1751 -7074 -5357 2589 9218 4873 -6232 -10403 -3123 6491 8521 2732 -4899 -7565
1711 -7565 -2050 6918 9096 1602 -8226 -9703 -1387 6848 6806 -1097 -7900 -7288 889 8817 7494 -1549
1727 -1549 -9271 -6919 2011 8022 4237 -4925 -10127 -5974 3054 8465 4472 -4512 -8685 -3399 5218
1742 5218 8168 2234 -6783 -9843 -3312 5054 7066 702 -7356 -8492 -656 7813 7792 13 -7497
1757 -7497 -7760 -168 7141 5764 -2310 -9175 -7185 1660 8407 5911 -2088 -7826 -4898 4031 9070
1772 9070 4570 -4734 -8612 -4171 3736 7452 3055 -4835 -7939 -2217 7508 9740 2339 -5856 -6722
1787 -6722 -348 6014 6906 1231 -6862 -8438 -240 9028 8300 -698 -6857 -3446 3212 7372 5872
1802 5872 -465 -7505 -6681 3224 9778 4199 -5446 -7211 -579 5462 7324 5446 -1758 -8955 -4732
1817 -4732 7078 10704 732 -8329 -6352 481 3987 6032 5001 -3274 -8659 -1582 10218 7856
1831 7856 -4293 -7911 -2074 2099 2306 3779 1038 -7549 -9035 4508 14054 4587 -8712 -7942 102
1846 102 1948 3266 5954 -26 -12469 -10365 5924 12007 -43 -7570 -1770 1911 -1065 673
1860 673 5012 -2977 -11706 -2140 12145 6374 -10794 -11133 1033 4362 2810 7246 5378 -10975
1874 -10975 -16933 2105 16258 4685 -9309 -5151 798 -4474 -3059 9169 6515 -9805 -8435
1887 -8435 10824 11295 -8329 -13127 2093 6570 -1735 1563 8363 -5025 -18855 -2794 20677
1900 20677 12184 -10020 -8947 3504 -1146 -5747 8018 13138 -8295 -19357 2721 18162 1060
1913 1060 -12164 2056 10235 -3847 -6728 10448 8324 -14789 -11799 15802 16057 -12357 -16219
1926 -16219 6338 10457 -3629 3130 16114 -2872 -26263 -6682 25213 15429 -12505 -8334 6946
1939 6946 -5418 -15145 8754 24143 -1618 -18996 3460 17517 -7479 -21403 5507 21428
1951 21428 493 -10207 6875 2758 -24212 -15488 26844 31155 -6930 -21130 -1280 612 -14078
1964 -14078 2237 28576 10664 -25782 -16780 13455 5604 -16643 -297 24160 7305 -18115
1976 -18115 -5950 9052 -10008 -19368 13479 31952 -1080 -29208 -11174 8610 -1786 -1859 20991
1989 20991 16068 -22108 -28387 7688 19772 -4395 -9926 10289 6136 -18277 -11114 15186 8574
2002 8574 -14425 -3177 20079 4947 -23046 -12068 13778 7804 -6095 4376 9195 -14947
2014 -14947 -23784 7768 29270 6944 -14784 -5798 594 -10738 -3961 20044 15668 -14051 -18194
2027 -18194 4758 7378 -8788 -2551 16763 10043 -9922 -6053 4660 -6754 -14194 9265 27691
2040 27691 6023 -19491 -13157 -278 -2493 4360 24130 17769 -16481 -25926 -721 12392 972
2053 972 2313 14299 2773 -18794 -10468 10887 5278 -8429 6119 22232 2342 -22651 -11276
2066 -11276 7942 2823 -737 16663 14764 -18861 -29629 2680 24239 7311 -3985 6788
2078 6788 551 -22000 -12056 21057 18386 -12608 -12240 11277 4575 -18760 -6807 20084 9921
2091 9921 -12586 -710 14231 -9444 -27855 2023 31479 9121 -19380 -7956 4189 -11949
2103 -11949 -11196 23575 29557 -12170 -31713 -1453 14538 -5815 -6991 18480 13296 -21030 -20338
2116 -20338 11662 11107 -14870 -4467 26463 14162 -24364 -21666 7711 5704 -8666 10124 26444
2129 26444 -5514 -38090 -14005 22980 14714 -5161 5687 11667 -16022 -27002 5961 25393
2141 25393 -123 -15389 7220 14021 -14037 -21068 8013 18259 -2367 -3914 14448 3709
2153 3709 -26577 -17951 19519 23191 -4312 -9080 3607 -5385 -17312 4451 27635 8796 -18702
2166 -18702 -9229 10742 1235 -11768 4006 15770 -2141 -13088 3848 11045 -8575 -13164 11303
2179 11303 19828 -2365 -13782 -1593 2349 -6590 1936 18488 7485 -18495 -15715 8230 12033
2192 12033 6 1647 7065 -4873 -14557 198 14338 2260 -10253 411 9698 -1877 -10467
2205 -10467 464 7028 -1605 -822 10248 5196 -14445 -14617 5998 13304 1284 -2960 532 -6462
2219 -6462 -12355 1748 17344 7336 -11123 -7552 3702 176 -5873 1934 7138 -3766 -8409
2232 -8409 3768 7689 -7053 -11173 4777 12406 469 -6043 -1117 -3082 -9690 -425 15054 7818
2246 7818 -12494 -13028 2278 5585 -395 2825 6998 -4125 -12350 -750 10939 846 -9819
2259 -9819 -967 8665 488 -7014 -632 3285 -4081 -3093 10240 10130 -8240 -14629 -410 8663 2521
2274 2521 -461 3874 -1872 -10736 -3199 12022 8715 -6017 -6419 3820 3648 -3462 -1022 3834 -1509
2289 -1509 -5930 3237 9891 -397 -10386 -3017 7911 5833 -461 342 -306 -6857 -4696 7611 9894
2304 9894 -2606 -8652 -943 5442 2234 654 2626 -268 -5529 -816 8033 4546 -6229 -6766 1873
2319 1873 4929 1569 286 582 -2961 -3445 3983 8563 1165 -7695 -4755 2489 3781 1343 200
2334 200 -2062 -4935 -1929 5738 6588 -1412 -6457 -2403 2618 2540 720 -751 -3533 -4845 272 5636
2350 5636 3242 -4271 -5431 -180 3652 3016 457 -2393 -5185 -3369 2536 5409 480 -5554 -5002
2365 -5002 456 3785 3573 981 -2981 -4538 -1206 4045 3856 -1967 -5670 -3625 1451 4054 2410
2380 2410 -1080 -4110 -3164 2024 5637 2635 -3111 -5464 -2333 2377 3889 1209 -2860 -4576 -1191
2395 -1191 3606 5179 1429 -3387 -4141 -120 3582 3767 -148 -3996 -3894 150 4608 4402 -511 -3785
2411 -3785 -2469 2012 5087 3365 -1094 -4158 -2851 1743 4654 2706 -1684 -4010 -1264 3465 5285
2426 5285 2583 -1700 -3732 -1089 3064 4673 1053 -3432 -4267 -233 3948 4423 1163 -3035 -3183 507
2442 507 4471 4456 -657 -4181 -3207 818 3604 2644 -1033 -4048 -3045 1734 5286 2924 -2225 -4432
2458 -4432 -1833 2299 3462 1344 -2379 -5105 -2319 2797 4666 1071 -3429 -3589 113 3182 3208 479
2474 479 -3705 -4775 -1029 3832 3296 -1833 -4915 -2843 1134 3592 2622 -716 -4335 -4209 1082 4845
2490 4845 1926 -3663 -4977 -2152 1121 3098 2355 -1340 -4583 -2503 3474 4549 9 -3776 -3228
2505 -3228 -854 1523 2126 897 -3674 -5328 131 6054 3716 -2218 -4132 -2446 107 2766 4183
2520 4183 941 -5680 -5844 1542 5683 1999 -1817 -1126 -299 73 2359 3753 -996 -5831 -1400 5708
2536 5708 4162 -2879 -4395 -662 569 1959 6138 4745 -4691 -8559 244 7885 3808 -2504 -1251
2551 -1251 -131 -3329 -1331 6041 4614 -4421 -4671 5220 6679 -3340 -5631 1356 2701 -1533 2022
2566 2022 6220 -1607 -10938 -3617 10446 7825 -3818 -3896 1490 -2181 -4655 4853 9469 -3409 -11810
2581 -11810 -746 9034 758 -6606 1102 5929 -2182 -4883 5354 4964 -8418 -8641 7607 10407
2595 10407 -5224 -10268 1355 3946 -3354 647 10813 1848 -14791 -8102 10340 8925 -5924
2608 -5924 -4760 4257 -1754 -10233 1238 12088 297 -11624 353 10889 -1297 -12596 -620
2621 -620 9130 -83 -5473 4534 4860 -11888 -12587 9084 16537 -624 -10025 -93 1152 -7611 -1617
2636 -1617 13978 7556 -12208 -10424 6752 5113 -7316 -1900 11425 4156 -9015 -2592 7029
2649 7029 -3174 -10671 4421 16762 1892 -13678 -5942 4383 -209 -376 12266 10358 -10656
2662 -10656 -16169 2108 11655 1381 -2910 5790 2324 -10484 -6499 9087 6838 -5368 -81
2675 -81 11278 2284 -12944 -7260 6808 5011 -946 6031 7013 -9601 -17042 1489 16565 6998
2689 6998 -3330 833 -496 -10941 -6481 11349 11948 -5259 -7424 4585 2391 -9613 -4183 10280
2703 10280 7252 -4507 -284 6345 -5924 -15272 698 16700 6334 -8920 -4446 1079 -6812
2716 -6812 -5686 12232 14579 -6338 -15387 410 7638 -3784 -4428 8314 5041 -11201 -8081 9014
2730 9014 5450 -9941 -3395 12948 5779 -12817 -8055 6919 1981 -6398 5008 12419 -6254
2743 -6254 -20558 -2345 16324 6545 -5796 1305 3902 -11654 -12175 10235 16611 -3704 -12299
2756 -12299 3026 5665 -10287 -8580 11266 12101 -5360 -5620 7291 -1007 -17390 -5308 18566
2769 18566 12960 -8462 -8750 1387 -5600 -10272 8956 22323 3029 -17227 -7271 6462 -1455
2782 -1455 -6344 8515 13798 -5087 -13484 1647 6827 -6866 -6546 13350 15057 -6148 -13795 -329
2796 -329 2747 -5337 2782 16390 5287 -16938 -12208 7513 9221 -1588 2251 8661 -3390 -13904
2810 -13904 -985 12336 2093 -8708 1303 9508 -2923 -10742 1070 8210 -653 -2969 6916
2823 6916 4838 -11471 -11367 7130 12583 -279 -5097 865 -2622 -9569 857 14702 6793 -9873
2837 -9873 -7707 3197 666 -5245 1977 8504 -1222 -8736 -171 5410 -4045 -7261 5710 11242
2851 11242 -415 -8309 -2612 -447 -5515 364 12277 6735 -10837 -12011 1159 5028 13 2895
2865 2895 6980 -1860 -11195 -3055 7175 1533 -6182 800 7445 -499 -8093 -2038 3455 -1568 -1708
2880 -1708 7804 7331 -7495 -12085 617 7187 1359 -883 3280 -1044 -8972 -2754 9418 6952
2894 6952 -5178 -4748 3393 2040 -4484 -638 5063 -410 -5465 1492 6993 -1216 -7586 20 7916
2909 7916 2603 -3245 -106 666 -4962 -2787 7428 7877 -4418 -8820 117 4921 1101 1306 4638
2924 4638 -133 -6996 -2802 6052 4067 -4109 -2364 4316 1871 -3244 -1053 2395 -845 -2182 4395
2939 4395 7048 -2027 -8287 -2914 4055 2801 908 1758 -520 -6163 -4155 5368 6803 -1175 -4309
2954 -4309 157 1279 -1612 -1002 1553 -874 -3503 705 4669 489 -5483 -3481 2794 3187 963
2969 963 748 -577 -4666 -4060 2679 5655 -94 -4830 -2194 1249 926 727 1940 -672 -3780 -1602
2985 -1602 3759 2398 -3150 -3865 -258 1466 777 1237 359 -2717 -3205 1425 4914 939 -4150 -3242
3001 -3242 -29 1071 1299 1463 -532 -3795 -2347 3143 4722 -174 -3099 -1581 653 1010 1396 1117
3017 1117 -1894 -3685 -590 3971 2606 -1512 -2840 -224 1771 1938 1762 321 -3103 -2960 1541 3787
3033 3787 1428 -2378 -2476 -93 1872 2266 2011 -97 -2745 -1364 2479 3311 -63 -2839 -1878 369
3049 369 2155 2179 699 -1426 -2708 294 3677 3006 -743 -3232 -1837 989 2588 1665 -490 -2639
3065 -2639 -1754 1603 3688 1828 -1409 -2598 -824 1638 1971 594 -1712 -2797 -1190 1716 2987
3080 2987 874 -2477 -2262 140 2490 1986 -83 -2429 -3094 -645 2272 2319 -776 -3133 -2050 886
3096 886 2688 1840 -853 -2426 -2227 363 2360 1123 -2146 -3463 -1316 1258 2194 829 -1689 -2941
3112 -2941 -1205 1970 2756 319 -2775 -2985 -830 1638 1771 -307 -2168 -2535 96 2599 2495 -477
3128 -477 -2736 -2042 747 2096 1316 -614 -2538 -2450 833 2844 1821 -1465 -2135 -522 1348 2178 1173
3145 1173 -972 -2853 -1139 1885 3059 -77 -2292 -2003 313 2364 2809 884 -1443 -2553 214
3160 214 3060 2500 -625 -2633 -1366 325 1995 2626 635 -2054 -1634 1482 3221 948 -1751 -1640
3176 -1640 -494 620 2006 1708 -1291 -2821 -395 3574 3561 -94 -2376 -1301 -372 944 2807 1768
3192 1768 -2514 -4078 -250 3189 1649 -899 -680 -270 -343 502 2644 502 -3719 -2591 2554 3542
3208 3542 -968 -2932 -1219 -302 -31 2871 3814 -1405 -5824 -2297 4061 3083 -1665 -1537 -343 -2058
3224 -2058 -2158 2799 3646 -2138 -4644 1010 4196 -790 -3647 -634 1181 -1316 -459 3352 607 -6251
3240 -6251 -3720 4835 5999 -1515 -2890 -270 -1174 -2991 1928 6144 -47 -7150 -2911 4127 1820
3255 1820 -2994 98 3803 -792 -3540 1309 3528 -3532 -5526 3451 7146 -860 -6080 -1488 1438
3270 1438 -1313 881 7117 3458 -7357 -6912 3638 5661 -1145 -1365 3234 -413 -5647 -1172 5815
3285 5815 1546 -4942 655 6856 1118 -6701 -2117 3723 561 -1370 4787 4203 -5711 -8402 2852
3300 2852 8678 1276 -3208 1140 421 -5293 -1741 7513 4652 -6059 -5194 4118 3304 -3929 -925
3315 -925 5534 1179 -5237 346 5490 -2245 -7125 1909 8880 327 -7038 -2174 2751 -2122 -1301
3330 -1301 8549 6522 -7810 -10805 1548 6791 -405 -761 4921 -59 -9889 -5115 7080 4562
3344 4562 -4563 -186 8147 139 -10661 -4687 5513 2477 -1826 5070 6567 -7968 -14849 -580
3358 -580 11302 4858 -1934 2609 342 -10799 -8550 7944 10761 -2634 -5687 3865 1847 -9912
3372 -9912 -5948 7882 7327 -3384 -821 6511 -3024 -13893 -3344 12788 7468 -5136 -2751 2055
3386 2055 -6256 -8626 6338 14063 -515 -10957 -810 5646 -3217 -6199 5979 7759 -5505
3399 -5505 -7412 5706 5432 -7373 -5460 9345 8126 -6430 -6294 4594 2486 -6122 922 10970
3413 10970 652 -13202 -4828 10195 5809 -4243 776 5076 -5053 -9714 4511 12680 -51
3426 -51 -8413 705 5233 -4788 -6669 5896 8998 -2680 -4904 4844 1594 -10398 -5572 10463
3440 10463 10729 -2966 -5711 267 -3733 -8138 3837 15283 4379 -10531 -6310 3027 -1136 -4631
3454 -4631 5503 9543 -2357 -9341 -65 4302 -4793 -5053 8503 10218 -3461 -8670 -696 -2
3468 -2 -5407 1671 12291 4886 -11521 -9647 3179 3877 -1865 3131 7603 -2781 -11366 -1437 8121
3483 8121 325 -6114 2041 7462 -3044 -8910 680 5887 -2199 -2797 7196 5282 -9206 -10139 4595
3498 4595 8583 -950 -2785 3489 -1568 -10040 -1858 11811 6490 -6871 -4646 3958 -183 -6438
3512 -6438 1188 8800 -75 -7675 463 6762 -3253 -8227 3460 10738 608 -6605 -133 1992
3526 1992 -5812 -3270 10081 9112 -6230 -9813 1595 5189 -1835 8 7824 2149 -9117 -4653
3540 -4653 7162 3627 -5831 -1114 7816 2091 -6930 -2180 4826 5 -4042 3993 8182 -2722
3554 -2722 -10500 -1321 6953 1914 -2464 2606 2199 -6098 -5664 5805 7866 -2287 -5550 1855 3144
3569 3144 -3253 -2626 4209 2329 -4543 -1663 5399 1568 -6128 -2569 5242 3849 -2647 -1572 947
3584 947 -2579 -3975 2734 6861 -389 -6727 -2771 2842 1350 -519 2337 1490 -4098 -3914 2379 3132
3600 3132 -2303 -3198 1438 2497 -1280 -1953 416 -603 -2029 1374 4766 494 -5351 -3634 1289
3615 1289 2209 892 1409 60 -3657 -3398 2247 4316 359 -2606 -473 596 -606 -23 843 -608
3631 -608 -2237 62 3424 1186 -2957 -1943 932 1810 1236 980 76 -3417 -2714 1944 4247 690
3647 690 -2711 -1544 289 666 1243 2380 369 -2867 -1540 2597 2105 -1212 -2049 429 776 627 1107
3664 1107 1354 -1530 -2663 1206 4005 1312 -1970 -1878 -242 530 1172 2333 884 -2928 -2344 1977
3680 1977 3335 369 -1952 -910 299 -36 835 1478 -555 -3078 -737 2847 2283 -906 -2272 -518
3696 -518 850 1233 1765 782 -2022 -3047 21 2783 1423 -1599 -2127 -343 496 1012 1594 43 -2411
3713 -2411 -2062 1003 2415 155 -2001 -1743 -369 739 1019 770 -1277 -2247 -759 1977 2117 -477
3729 -477 -2492 -1593 17 1107 1087 46 -2034 -2466 97 2356 1600 -755 -1924 -1054 607 1030 1109
3746 1109 -690 -2002 -1421 684 2262 823 -1400 -2068 -365 1600 1613 850 -1365 -2225 -731 1546
3762 1546 2111 39 -1749 -1609 291 1963 1808 326 -1427 -1767 262 2057 1834 -623 -1824 -1118
3778 -1118 946 1781 1390 -240 -1539 -931 1301 2247 905 -1076 -1695 -432 1099 1776 398 -877
3794 -877 -1769 -227 1791 2236 118 -1656 -1446 467 1455 1687 421 -1829 -1781 118 2183 1705 -188
3811 -188 -1519 -611 700 1286 1343 -391 -2013 -1529 1024 2171 660 -1486 -1444 -516 753 1688 1383 -1070
3829 -1070 -2574 -720 1678 2072 -339 -1731 -1379 -194 851 1920 961 -1658 -2557 142 2242 745
3845 745 -1305 -1451 -962 -86 732 1398 -263 -2953 -1867 2017 2593 -203 -1697 -1048 -580 38 1668
3862 1668 1848 -522 -3772 -1391 2152 1633 -1031 -654 425 -236 -188 1454 1276 -2093 -3280 1144 3163
3879 3163 458 -2168 -1126 144 -119 1059 2815 1001 -3786 -2662 1946 3118 -487 -1498 175
3894 175 -412 -1477 921 2891 -133 -3122 -448 3298 1541 -1971 -786 982 -119 -504 2390 1751
3910 1751 -2935 -3440 1934 4256 937 -1510 -437 -130 -1498 729 4214 1357 -3925 -2667 1989
3925 1989 2078 -1079 -401 2325 292 -1767 600 2460 -1136 -3436 1045 4452 785 -2954 -1539 273
3941 273 -1339 406 4686 2766 -3632 -4736 1017 3080 -89 -637 1850 -149 -3739 -1138 3409
3956 3409 1005 -3620 -491 4076 1184 -3916 -1809 1472 -543 -1443 2833 3769 -3757 -6482 491
3971 491 4966 687 -1920 1096 286 -4641 -2537 5099 3742 -4040 -3999 2818 1962 -3364 -1508 3870
3987 3870 870 -3701 89 4380 -1399 -6355 -277 6328 1455 -4760 -1011 2173 -2486 -2710 5398
4002 5398 6338 -3395 -7605 549 4387 -723 -1922 4059 2157 -5781 -4408 4790 3692 -3941 -1645
4017 -1645 6129 2665 -6014 -4168 3502 1809 -2791 2428 6910 -1620 -9832 -2412 7439 3864 -1941
4032 -1941 1386 3014 -4934 -7132 3462 7928 -505 -4688 1839 3300 -4443 -4802 4212 5716 -1799
4047 -1799 -2067 4335 808 -7849 -4092 6686 6036 -2314 -2656 1203 -2561 -5627 2279 9346 2054
4062 2054 -6411 -2784 2785 -1093 -3270 2706 5742 -2150 -5143 1334 3197 -3387 -3578 4525 5919
4077 5919 -2571 -4797 276 505 -3505 807 7448 1958 -7480 -5102 2968 2695 -919 2057 3287
4092 3287 -2754 -6626 294 5453 199 -3722 1181 3525 -2938 -4904 1581 3411 -2087 -1088 4626
4107 4626 1762 -6562 -4935 3850 4409 -1301 -1032 2050 -2693 -6594 793 8026 2134 -5233 -1704
4122 -1704 2705 -1604 -3899 3250 5257 -2646 -5032 2323 3966 -3704 -4109 4593 5532 -2912 -4013
4137 -4013 2259 595 -5067 -276 8839 3729 -7480 -4950 3768 2485 -2334 2501 6241 -2357 -8924
4152 -8924 -615 7363 1034 -4672 1704 5822 -2794 -6856 1718 5599 -1377 -2773 5753 5185 -6476
4167 -6476 -8288 3174 6736 -867 -1599 4481 559 -8662 -3599 8214 6297 -3972 -3018 3809 46
4182 46 -6431 -938 6897 2237 -5283 -152 5396 -2000 -8066 269 7954 1629 -4444 336 2274
4197 2274 -4701 -5694 4940 8071 -1933 -6341 525 3447 -2593 -2418 4752 3809 -4898 -4153 4043
4212 4043 2928 -4817 -2923 4493 3056 -3939 -2442 3011 215 -4558 522 6280 418 -6296 -2150
4227 -2150 4039 1179 -2656 702 2666 -2893 -4833 2293 5576 -733 -4245 -10 2012 -1613 -2336
4242 -2336 2517 2136 -2815 -2191 2933 2122 -3390 -2459 3078 3037 -1284 -1052 737 -1116 -3510 1054 5177
4259 5177 1324 -3909 -2487 1222 590 -385 2111 2546 -1693 -2933 754 2356 -925 -2147 1076 2198
4275 2198 -594 -1094 707 -155 -1711 126 3635 2029 -2445 -2526 460 1012 212 1125 1178 -1559 -2226
4292 -2226 769 2620 735 -1618 -203 646 -428 -222 791 340 -1621 -835 1945 1674 -1115 -1529
4308 -1529 287 1047 281 662 1044 -999 -2512 270 2571 992 -1300 -1352 -58 114 239 1487 860
4325 860 -1381 -1764 579 1549 -355 -1511 -400 524 -70 370 972 -253 -1770 -590 1400 1310 -1197
4342 -1197 -2021 -1031 -60 -35 845 891 -1235 -1789 138 1766 1023 -816 -922 -424 -104 65 602 -445 -1611
4361 -1611 -1121 850 1662 413 -1002 -777 50 35 677 767 -590 -1700 -770 975 1114 112 -719 -105
4379 -105 72 721 1106 691 -811 -964 102 1320 724 -971 -1020 -483 557 819 742 102 -1066 -829 713
4398 713 1606 237 -877 -781 -494 452 930 217 -443 -940 -192 1205 1365 327 -846 -745 128 644 1151
4417 1151 206 -784 -1011 325 1152 913 1 -894 -228 198 1006 759 -386 -1106 -879 479 1219 566 -657
4436 -657 -910 -492 504 1289 723 -580 -1030 -457 804 1052 146 -1394 -1057 -124 523 1186 229 -976 -991
4455 -991 -109 908 817 -39 -770 -782 -257 387 798 -162 -1044 -644 618 1284 498 -736 -1093 -272 106 581
4475 581 508 -511 -1244 -275 665 788 132 -839 -611 -246 541 911 506 -761 -1305 178 787 475 -469
4494 -469 -451 -113 211 794 1297 303 -1380 -854 747 1062 -84 -576 -758 -147 -5 643 922 65 -1373
4513 -1373 -44 1141 972 -190 -521 -65 -297 221 921 969 -986 -1095 425 1580 769 -453 -315 -165
4531 -165 -239 468 1290 544 -1550 -1001 834 1406 5 -333 299 -126 -475 292 1039 -172 -1746 -158
4549 -158 1408 575 -380 -530 230 -116 -18 1252 1050 -1084 -1420 283 1625 466 -661 -249 -123 -804
4567 -804 -156 1571 509 -1339 -909 1110 887 -737 -599 115 -377 -429 874 1086 -875 -2154 63
4584 63 1809 936 -629 -366 -325 -1526 -607 1777 1417 -1284 -1894 379 432 -626 -300 860 -122 -1061
4602 -1061 228 1382 -800 -2437 -706 1947 725 -1073 -220 188 -1239 -1311 1762 2452 -1112 -3025
4618 -3025 192 1697 -661 -1035 1247 710 -1382 -832 2285 1182 -1918 -1053 2389 1334 -1397 -814
4634 -814 1476 -45 -1779 794 2899 -305 -3434 -429 3073 706 -1415 607 1810 -1868 -2225
4649 -2225 2153 3243 -1024 -2993 1004 2069 -1157 -1597 2083 2151 -1448 -1258 2418 1577 -2949 -2129
4665 -2129 3136 2366 -1832 -1563 1357 -131 -2612 725 4502 655 -3288 -1377 1946 446 -1943
4680 -1943 1385 2714 -875 -3217 688 2487 -1296 -2347 1995 2950 -825 -2833 449 1119 -1667
4695 -1667 -643 3192 2017 -3228 -3262 1588 1941 -903 -465 2150 149 -3336 -1095 2725 749 -2438
4711 -2438 -321 2289 248 -2578 -172 2009 -219 -1540 872 1907 -1651 -2973 925 2486 -201
4726 -201 -1467 211 430 -1836 -547 2927 1870 -2229 -2145 497 597 -1127 336 2244 -176 -2535
4742 -2535 -681 1376 -289 -1269 1159 2501 -158 -1914 -378 398 -1320 -21 2875 2131 -1974 -2739
4758 -2739 -64 1188 169 1183 2569 -155 -3177 -1210 1611 468 -1097 868 2295 -398 -2465
4773 -2465 -64 856 -906 -208 2692 2446 -1944 -3236 229 1391 -569 463 2264 573 -3025 -1516
4789 -1516 2521 1325 -1239 -237 1903 317 -2205 -136 2365 -312 -2155 933 2647 -396 -2770
4804 -2770 204 2378 -202 -1529 1334 1580 -1840 -2123 2034 2146 -2100 -2610 1216 1367 -1198 -222
4820 -222 2273 623 -3351 -1665 2422 1379 -2165 -912 2105 2 -2906 -706 2383 -93 -2054
4835 -2054 1121 2336 -1262 -3479 -370 2439 221 -905 1629 1316 -2833 -3230 1709 2980 -161
4850 -161 -1783 889 566 -2701 -1837 2100 1803 -1852 -817 2239 364 -3253 -1308 2500 1254 -871
4866 -871 -81 1350 -1475 -3146 638 3204 641 -1808 -135 1208 -692 -1464 1393 2120 -1072 -1741
4882 -1741 1150 1595 -1384 -1434 1416 1574 -878 -622 1393 497 -2080 -180 2306 1542 -1556 -1107 1088
4899 1088 249 -1128 656 1770 -429 -1907 381 2611 96 -1193 421 1424 -666 -1163 915
4914 915 1280 -1127 -1440 1463 1345 -990 -1507 858 1441 -833 145 1339 113 -1976 -502 2013 1001
4931 1001 -1112 -880 630 85 -888 657 1057 -248 -1665 15 1170 -462 -1314 15 1022 -511
4947 -511 -848 535 857 -1109 -1167 1638 1120 -1000 -1183 -99 303 -721 125 1213 -17 -1193 -471
4964 -471 1171 608 -545 -260 386 62 -773 -26 666 -415 -913 430 1358 407 -1018 111 424 126
4982 126 -540 889 197 -652 -899 536 876 -261 -914 12 268 -9 178 637 10 -802 -407 703 411
5001 411 -587 -486 140 576 18 502 772 -245 -606 199 1092 344 -502 -325 -4 -187 -67 578 330 -278
5021 -278 -475 365 516 156 -234 -78 154 -10 184 114 -170 -660 -51 653 628 63 -259 139 71 216 309
5042 309 119 -148 -542 160 650 255 -47 -77 -206 67 517 434 331 -108 -394 214 400 168 -450 -517 -125
5063 -125 331 237 52 -248 -589 39 289 254 -16 -287 -315 -81 10 102 65 -274 -545 39 269 58 -215 -206 -375
5086 -375 39 -142 272 -250 -590 -575 123 58 87 105 -137 -261 -50 294 120 -125 -755 -126 146 -40 -171
5107 -171 -317 -79 174 -202 131 319 -361 100 39 254 142 101 -42 -210 -41 64 528 146 -208 -422 273
5128 273 179 103 -287 -198 -186 11 425 326 -32 -96 -230 643 281 102 -205 -326 140 95 -37 198 -229 -309 -15
5151 -15 483 424 50 -250 229 65 144 603 159 -86 -400 377 265 -227 -107 -77 -51 154 587 502 -84 -574
5173 -574 -45 17 293 -234 -605 -403 -123 209 152 238 97 -243 93 270 82 -331 -353 -90 -216 -180 58 251
5195 251 -425 -178 267 447 238 -337 136 -172 -101 -34 -85 -222 -576 -100 273 -183 19 -369 72 -136 -61
5216 -61 33 -119 -564 -541 -32 292 35 -189 -149 -91 -176 238 117 108 -364 -342 -31 -188 -70 97 -186 -566 -156
5239 -156 -74 461 -74 -400 23 333 123 16 228 34 -379 192 723 635 -484 -226 335 576 226 208 236
5260 236 -454 -290 74 608 -50 -602 18 545 -58 -187 523 474 -173 -203 586 574 -493 -876 458 361 182
5281 182 208 542 281 -778 -203 845 670 -193 -34 556 149 -611 -225 484 203 -728 96 650 159 -915
5301 -915 -147 686 75 -450 -33 407 -713 -721 440 1063 -478 -803 210 484 -319 -578 499 243 -941
5320 -941 -502 728 165 -886 -618 338 366 -610 -194 756 -23 -665 239 884 -246 -1082 -402 686 -60
5339 -60 -602 207 539 -484 -1268 141 922 54 -954 -88 65 -650 -750 311 678 -643 -429 464 346
5358 346 -492 -585 886 579 -330 -201 -5 -316 -517 -143 872 442 -411 -469 430 -44 -619 389 1052 -358
5378 -358 -946 -215 524 -320 -831 456 691 -309 -611 245 180 -193 -124 953 681 -723 -895 222 559
5397 559 -497 244 635 67 -538 -336 806 475 -15 26 723 -176 -712 -6 584 -131 -501 357 515 -450
5417 -450 -711 360 649 38 -231 567 -16 -888 -574 595 552 -172 -201 353 -222 -730 32 929 291 -638
5437 -638 -371 48 -567 -1035 18 553 280 -599 -256 208 -644 -491 299 1044 -156 -908 -680 -9 -424
5456 -424 -69 1055 627 -407 -616 35 420 -368 124 728 153 -1047 -562 163 -25 -437 294 830 -118
5475 -118 -865 -503 552 189 -82 54 5 -548 -974 174 912 71 -201 341 273 -662 -209 341 614 -356
5495 -356 -347 165 147 -764 -148 569 665 32 -173 349 -382 -414 113 717 354 -381 -416 325 -179 -44 298 850
5517 850 -139 -254 109 645 -252 59 504 205 -243 -300 347 -117 -389 51 865 189 -380 -535 23 63 -159
5538 -159 515 637 -232 -963 -596 426 130 -96 278 343 -598 -587 421 235 -232 -143 327 453 -866 -652
5558 -652 150 174 -138 27 365 -84 -1002 -486 663 380 -402 -300 9 -365 -391 122 705 64 -329 -327 283
5579 283 -659 -221 308 445 -230 -533 2 133 -458 -452 501 481 80 -591 29 -351 -166 -212 535 414 -875
5600 -875 -703 83 73 -459 129 347 188 -304 -120 620 191 -633 -80 577 -36 -585 121 318 25 -297
5620 -297 386 477 -298 -624 41 444 -33 -250 382 -28 -618 -454 507 317 -146 -416 335 338 -39 -94 673
5641 673 235 -243 125 274 183 -198 54 791 538 -276 -18 -103 198 -154 173 434 -270 -532 -278 544 153
5662 153 -8 181 102 235 -329 106 205 -56 -103 251 273 -257 -103 -127 -149 -67 -158 535 304 -397 -272 215 288
5685 288 80 -17 45 -232 -424 151 381 2 -362 -181 -284 -48 -300 -116 53 39 -303 -6 223 -111 -157
5706 -157 -220 33 -72 -25 -315 -119 -277 83 122 -13 -264 -585 75 12 138 255 -156 -152 -359 186 383 183
5728 183 -391 38 301 -252 103 0 184 -378 -118 145 197 -196 -339 202 296 22 169 -214 -528 -352 106
5749 106 -41 -75 -40 24 307 399 -102 -6 123 -94 -137 179 473 218 139 -214 380 162 49 -109 -152 -12 67
5772 67 219 258 -65 -171 -109 -26 -50 -46 169 -58 63 201 433 127 -103 88 -24 -21 64 -335 56 87 34 -33
5796 -33 386 133 -172 98 141 311 46 -15 61 -304 -116 -13 -129 -199 -287 85 -155 366 105 -14 -239 -329
5818 -329 -147 58 231 -328 -167 39 98 -58 27 44 -219 -158 134 -119 13 -453 -128 -201 196 228 -140 -309
5840 -309 -172 119 295 393 50 -73 -50 -227 60 75 155 45 -202 216 75 -2 155 -322 67 79 -51 -74
5862 -74 54 -328 -42 241 283 -356 -464 -229 133 306 -45 -4 121 -333 -84 352 206 -43 -138 175 -39
5883 -39 -118 -117 272 -80 -284 49 351 24 -449 -83 49 -125 99 404 74 -236 -192 265 479 153 -476 232
5905 232 31 -537 246 277 -77 -479 -162 252 164 -303 -170 362 140 -388 55 170 -49 -238 -40 934 -176
5926 -176 -642 -125 56 250 51 489 319 -415 -620 344 315 -228 -30 223 22 -509 -281 596 34 -433
5946 -433 166 580 116 -846 -573 7 28 -81 769 514 -1050 -1121 345 735 287 -445 245 31 -410 -314
5966 -314 482 710 -658 -279 580 196 -779 -348 529 470 -415 86 569 -222 -1129 -9 1627 407 -585
5985 -585 -341 280 -616 -274 650 1056 -555 -1237 149 395 -583 -320 763 574 -555 -687 421 391 -448
6004 -448 -286 1305 617 -852 -697 542 6 -707 710 1275 -147 -1455 24 1054 470 -737 344
6021 344 810 -1063 -1240 857 1100 -650 -686 542 884 -770 -1076 517 648 -465 -254 1083 203 -1755
6039 -1755 -532 1542 964 -882 -327 686 -461 -1227 580 1689 52 -1562 -347 906 -707 -855
6055 -855 851 1607 -571 -1244 327 570 -1029 -1129 1573 1752 -1116 -1670 441 338 -909 340 2145
6072 2145 668 -2151 -1794 978 1040 -839 -10 1500 -390 -2290 -678 1577 -34 -1075 764 1661
6088 1661 -659 -2487 -64 1145 -111 -732 1289 772 -1913 -2442 1135 1903 -367 -1024 968 318
6104 318 -1901 -1077 2014 1277 -1292 -880 1023 418 -1999 -437 1581 617 -996 -34 1079 -750 -1533
6121 -1533 131 2043 276 -1466 -287 315 -612 -1116 1342 1756 -800 -1906 428 1168 -340 -492
6137 -492 1278 742 -1359 -1151 778 745 -874 -98 1388 441 -1663 -581 1246 557 -221 812 1273
6154 1273 -573 -2014 -342 1670 585 -254 522 249 -1122 -1193 986 1482 -127 -440 439 2 -1507
6171 -1507 -930 1053 824 -35 67 633 -498 -1834 -161 1360 801 -597 -206 28 -1220 -1106 928
6188 928 1727 -634 -1146 -59 581 -371 -318 1271 656 -1008 -617 583 130 -699 -211 1177 440 -1065
6206 -1065 -507 648 -516 -592 969 1542 -688 -1645 -480 821 -27 -487 623 645 -1347 -1243 886
6223 886 1197 -619 -712 1008 492 -1205 -595 1372 866 -1016 -442 1310 -496 -2023 -682 1854 1035
6240 1035 -670 82 452 -786 -1253 803 2011 426 -1052 90 779 -904 -963 855 1488 -660 -1028
6257 -1028 499 336 -981 -830 1733 1556 -747 -524 307 137 -1224 -52 1713 630 -1288 -615 638
6274 638 -66 -418 669 1256 -453 -1375 -97 1029 -177 -1038 343 976 -501 -765 247 692 -519
6291 -519 -742 1027 868 -1206 -1276 491 674 -38 -451 701 80 -1210 -459 1075 320 -1182 -540 630
6309 630 -54 -624 133 518 -161 -711 210 925 -529 -783 247 1083 -281 -687 267 -8 -474 -283 922
6328 922 755 -835 -921 49 397 -329 79 461 -3 -855 28 661 240 -398 -285 594 75 -323 -247 201
6348 201 -590 -419 648 830 -558 -732 -26 358 -145 24 275 -143 -645 -365 669 454 -112 -338 323
6367 323 286 -60 199 235 -34 -608 263 454 -70 -629 -263 415 468 105 35 473 -312 -264 553 996 -71
6388 -71 -451 -111 317 248 143 286 51 -469 -150 472 149 -73 -313 111 1 331 116 -41 -60 -451 92
6409 92 670 191 -481 -493 166 -51 102 270 -448 -487 -217 296 572 43 -664 -274 78 183 69 -55 -144
6430 -144 -496 -275 596 21 -117 -491 -37 293 153 -51 -138 -236 -201 -35 347 187 -460 -596 145 272 270 -17
6452 -17 -90 -328 -581 80 375 -161 -530 -322 -108 204 153 -10 -189 -569 -201 3 222 -271 -211 -283 222 42
6474 42 148 61 -267 -424 86 412 276 28 -572 130 223 444 -133 -224 -307 -305 108 547 26 -105 -269 48
6496 48 221 48 532 91 -22 -312 584 240 -409 36 93 246 194 328 591 -202 -388 535 486 178 -246
6517 -246 -101 -28 225 -110 284 -56 -538 -271 450 604 -77 -281 255 236 -50 568 379 -205 -566 -63 491
6538 491 634 -245 -204 68 -37 43 521 388 -416 -776 155 525 -46 -460 -141 285 -115 20 257 134 -378
6559 -378 -474 372 230 -448 -658 -90 326 -334 395 380 -285 -725 25 599 492 -685 -186 130 -373 -486
6579 -486 422 549 -326 -587 190 542 -285 -730 -119 456 -292 -51 780 58 -812 -661 600 958 -181
6598 -181 -757 168 86 -202 322 1101 -47 -997 -179 635 254 -516 -167 640 -310 -560 612 292 -786
6617 -786 -249 378 852 -566 -617 61 202 -252 215 869 -317 -1062 -174 961 647 -222 43 315 -340
6636 -340 -649 569 922 -92 -756 188 680 -615 -729 569 885 -194 -95 319 -106 -1273 -413 1164
6654 1164 1007 -157 -95 308 -758 -660 702 1680 -43 -1144 -197 417 -949 -644 721 1067 -207 -935
6672 -935 273 371 -1265 -702 1237 1383 -844 -1075 418 -280 -928 161 2036 683 -1914 -1087 959
6689 959 132 -1022 444 1719 -514 -1991 476 1412 -621 -1431 881 1982 -759 -1749 557 1309
6705 1309 -973 -1077 1633 1268 -1893 -1635 1368 1847 -996 -753 1274 22 -2011 -595 2399 551
6721 551 -2265 -1063 1481 342 -1929 329 2193 94 -2128 -88 1838 -903 -2336 1152 2689
6736 2689 -675 -2667 309 1032 -1263 -1287 2777 2249 -1798 -2447 998 1736 -950 -413 2470 968 -2778
6753 -2778 -1804 1988 1000 -1634 -103 2642 248 -2913 -1318 1832 429 -1371 1007 2084 -1282
6768 -1282 -3277 -303 2564 494 -1051 920 1148 -2305 -2292 1481 2232 -750 -1303 1126 761 -1921
6784 -1921 -1617 1724 1648 -1519 -697 1741 -20 -2823 -958 2350 1397 -1350 -358 945 -651 -1928
6800 -1928 802 2539 -188 -2190 37 1517 -461 -1079 1059 1721 -1028 -1730 788 1151 -1340 -907
6816 -907 1845 1097 -1819 -1648 514 414 -945 219 1901 60 -2808 -541 1739 600 -957 610
6832 610 1186 -1298 -2158 616 2212 -407 -1340 615 1261 -1349 -1539 1093 1135 -630 -434 1664 584
6849 584 -2064 -1059 1996 1342 -948 -143 979 -850 -1719 269 2454 240 -1775 -351 1074 -375
6865 -375 -1434 928 1492 -791 -1666 699 1532 -1185 -1049 1474 1484 -1015 -883 683 224 -1283 72
6882 72 2245 685 -1994 -1294 1240 622 -707 582 1648 -455 -1817 -84 1732 39 -1223 466
6898 466 1270 -715 -1557 593 1349 -671 -741 1507 864 -1623 -1630 1131 1299 -517 -260 644 129 -1901
6916 -1901 -681 1550 891 -1057 -572 854 -99 -1108 234 1589 13 -1283 -89 889 -686 -1498
6932 -1498 465 1493 161 -778 171 388 -1182 -950 1483 1223 -1155 -1264 183 365 -665 182 1022
6949 1022 -12 -1327 -806 839 245 -815 -60 954 50 -999 196 720 -376 -519 764 1220 -422
6966 -422 -1380 178 933 122 -136 605 96 -1194 -668 865 881 -469 -407 715 87 -661 -79 571 -25
6985 -25 -610 158 889 -249 -1376 -206 892 123 -520 298 699 -624 -265 323 1054 -561 -881 -36
7003 -36 306 -282 127 830 233 -1005 -568 750 393 -460 -526 302 281 -346 -121 794 -64 -798 97 964
7023 964 219 -753 -344 427 -100 -201 303 408 -948 -539 350 712 65 -549 154 213 -14 -153 639 -93
7043 -93 -604 -428 548 348 -539 -253 38 243 -109 -34 141 -229 -490 -59 726 106 -482 -420 219 210 1 37
7065 37 511 -323 -437 413 217 -34 -324 -227 27 -144 278 245 149 -727 97 306 561 -462 -944 141 6
7086 6 12 344 -313 -397 -457 141 705 244 -333 -281 -19 -122 120 368 1 -393 -268 362 568 -178 -186 18 157
7109 157 294 -110 289 -216 -673 -205 384 151 -286 -518 -207 -221 108 405 46 -187 -85 239 -5 348
7129 348 -318 -282 94 -71 95 327 189 -361 -223 335 488 -11 -165 -104 253 228 -18 124 -65 -245 -291
7150 -291 398 381 -121 -115 -236 -106 159 474 -75 -262 -453 183 492 162 -392 -55 248 89 83 262 28 -406
7172 -406 -340 -64 480 -216 -102 -27 7 -149 120 157 -314 -845 16 592 124 -491 -211 178 3 63 153 264
7194 264 -379 -819 244 580 56 -395 127 139 -318 -108 573 -53 -545 -289 815 308 -366 -232 117 -37
7214 -37 -139 349 604 -191 -634 -369 700 148 -561 -169 321 -173 -648 448 610 -375 -642 145 618 -282
7234 -282 -325 615 307 121 -4 437 403 -614 -309 782 428 -171 -266 120 -119 -413 142 691 207 -607
7254 -607 -38 667 177 -344 -137 707 49 -379 281 465 -377 -691 89 883 55 -530 124 25 -158 -56
7274 -56 562 309 -826 -286 555 33 -339 -162 267 -225 -686 56 644 -63 -571 77 905 -180 -871 -43
7294 -43 368 -257 -156 595 362 -716 -453 579 929 -258 -276 396 -89 -725 119 648 -80 -407 -140 390
7314 390 -54 -679 121 649 -434 -290 313 226 -819 -606 616 1018 -122 -464 191 -128 -909 -116 1434
7333 1434 586 -846 -320 710 -249 -647 96 1402 155 -868 182 823 -788 -816 829 1410 -477
7350 -477 -820 61 401 -846 -445 1268 854 -1170 -1012 860 493 -462 46 1487 409 -1283 -317 1366
7368 1366 394 -1087 36 1708 363 -1238 229 1067 -274 -991 961 1468 -824 -1639 258 1302
7384 1302 -220 -701 1260 608 -1255 -1019 1420 1187 -1083 -477 950 281 -1334 -224 1685 586
7400 586 -1397 15 1676 -175 -1644 363 1781 271 -1218 81 731 -761 -1422 1179 1770 -669
7416 -669 -1816 341 942 -716 -842 1503 1082 -1584 -1127 1362 654 -1254 -518 1496 505 -1740 -753
7433 -753 998 219 -1450 302 1784 -255 -2049 -251 1670 368 -1233 842 1098 -1461 -1778 1203
7449 1203 1620 -690 -1329 850 753 -1206 -1087 1340 1357 -906 -555 1692 369 -2023 -300 2000 1101
7466 1101 -1374 -418 845 -749 -2128 643 2090 258 -1764 -226 1062 -641 -1499 1374 2291 -570
7482 -570 -1766 810 941 -1178 -753 1713 1647 -1219 -1168 928 411 -1877 -366 2162 730 -1920 -1064
7499 -1064 997 338 -1226 587 1987 -219 -2161 -202 1616 -494 -1748 782 1638 -432 -1914
7514 -1914 610 1467 -834 -1024 1488 1649 -1458 -1457 1441 1211 -919 -731 1020 557 -1663 -364 1970
7531 1970 887 -1845 -792 1065 138 -1454 102 1744 -58 -1567 -53 1278 -436 -1347 678
7546 678 1561 -614 -1604 47 743 -676 -571 1512 1175 -1381 -1718 294 955 -509 -76 1270 293
7563 293 -1652 -928 1047 694 -817 86 1142 -24 -1484 -314 1172 48 -617 783 1222 -792
7579 -792 -1610 3 953 -170 -470 352 779 -1391 -998 1186 815 -726 -473 697 232 -1045 -170 1177
7597 1177 111 -928 81 986 -10 -1375 -96 961 131 -722 410 419 -505 -696 967 1227 -367
7614 -367 -582 520 603 -460 -100 836 397 -769 -632 854 295 -781 -237 761 531 -796 -20 696
7632 696 -152 -952 384 944 -379 -1214 156 846 -31 -391 610 624 -796 -898 261 899 -596 -741
7650 -741 224 324 -808 -331 741 432 -737 -356 781 275 -870 -465 705 0 -611 -103 773 -263
7668 -263 -800 257 929 287 -904 -43 445 -374 -300 547 814 -505 -873 344 386 -486 -688 120 211 -240
7688 -240 -187 467 98 -775 -332 547 140 -452 -617 436 187 -448 -193 197 -160 -496 -51 823 519 -52
7708 -52 -76 182 -177 -405 355 275 -221 -444 300 335 -14 -490 -14 275 43 64 383 300 -279 72 642 561
7730 561 -146 -320 -15 266 -8 506 240 -36 -316 -32 289 268 -150 128 175 204 -65 87 207 -146 135
7751 135 233 207 -106 -458 53 68 384 362 360 102 -264 -231 80 361 -271 -86 161 -75 197 261 200 -407 -261
7774 -261 141 260 57 -224 131 214 -197 -77 181 214 -213 -366 294 129 224 3 349 -201 -196 -56 167 149
7796 149 -83 -8 209 83 -26 -82 28 232 47 314 278 -139 -416 317 92 145 -186 -1 7 -140 171 250
7818 250 149 -197 -217 403 607 -96 -83 -73 -4 32 477 228 -110 -362 156 339 4 -308 70 -66 -118 -152
7840 -152 256 420 -152 -362 258 256 -94 -199 -123 221 -1 108 304 62 -323 -42 461 493 -421 -95 254
7861 254 195 -183 253 671 5 -656 201 334 331 84 68 219 -71 -135 521 220 -236 -378 120 451 -77 -414
7883 -414 -229 -69 -246 17 502 -147 -758 -74 359 26 -305 -91 250 86 -369 -157 509 95 -392 70
7903 70 446 -256 -437 -148 555 -198 -7 294 361 -229 -191 388 518 -225 -235 143 192 -187 -65 372 -179 -237
7925 -237 -130 395 90 -215 100 255 -479 -432 225 640 -97 -591 157 337 -299 -380 350 239 -579 -149 660
7946 660 350 -497 -181 616 402 -406 -155 555 -188 -488 81 736 43 -767 232 839 133 -620 -153 151
7966 151 -274 -482 644 515 -551 -638 306 835 -19 -291 321 258 -694 -140 674 431 -702 -362 689
7985 689 167 -726 -257 648 202 -710 437 877 -87 -903 -53 1111 229 -380 125 595 -523 -606 666
8004 666 973 -438 -563 265 298 -634 -426 659 602 -463 -108 813 327 -714 -327 1032 230 -732 -273
8023 -273 496 -80 -790 459 915 -202 -1011 88 666 -141 -352 478 480 -791 -842 533 608 -773 -342
8042 -342 449 409 -969 -492 796 270 -432 288 871 -317 -1423 -471 1018 418 -341 301 425 -995
8060 -995 -1122 777 1058 -297 -321 562 493 -1030 -626 508 506 -455 14 1007 -17 -1202 -484 1045 694
8079 694 -513 -261 686 -350 -1183 377 1235 -28 -916 90 483 -276 -682 759 652 -697 -839 712
8097 712 310 -803 -701 855 473 -909 -342 868 474 -1243 143 1318 -425 -1304 48 1224 408
8114 408 -967 493 872 -464 -1354 714 1304 -289 -1113 388 753 -1049 -914 980 1395 -808 -1146
$$ [...]
##END NTUPLES=NMR FID
##END=
