##TITLE=1H_LR-699-C1
 CDCl3, 8 sc, 
 13.11.2019
##JCAMPDX= 6.0         $$ Bruker NMR JCAMP-DX V2.0
##DATA TYPE= NMR FID
##DATA CLASS= NTUPLES
##ORIGIN= UXNMR, Bruker Analytische Messtechnik GmbH
##OWNER= root
$$ XWIN-NMR		Version 3.5
$$ Wed Nov 13 15:38:03 2019 Russian Standard Time (UT+4h)  she@DPX200
##.OBSERVE FREQUENCY= 200.1315
##.OBSERVE NUCLEUS= ^1H
##.DELAY= (6, 6)
##.ACQUISITION MODE= SIMULTANEOUS
##.ACQUISITION SCHEME= undefined
##.AVERAGES= 8
##.DIGITISER RES= 18
##SPECTROMETER/DATA SYSTEM= spect
##.PULSE SEQUENCE= zg30
##.SOLVENT NAME= CDCl3
##.SHIFT REFERENCE= (INTERNAL, CDCl3, 0, 15.7039)
##AUDIT TRAIL= $$ (NUMBER, WHEN, WHO, WHERE, WHAT)
$$ ##TITLE= Audit trail, XWIN-NMR		Version 3.5
$$ ##JCAMPDX= 5.01
$$ ##ORIGIN= Bruker BioSpin GmbH
$$ ##OWNER= she
$$ F:/spectra/data/she/nmr/H-F/1/audita.txt
$$ ##AUDIT TRAIL=  $$ (NUMBER, WHEN, WHO, WHERE, WHAT)
(   1,<2019-11-13 15:37:07.65 +0400>,<she>,<DPX200>,
      <created by zg, POWCHK disabled, PULCHK disabled
       configuration hash MD5:
       00 E9 B6 7A A2 85 ED C7 34 08 36 98 17 FE 4E 26
       data hash MD5: 16K
       5C 56 66 CD 44 8C 1C 76 A1 8F ED 1C 2C 91 93 C3>)
$$ ##END=
$$ 
$$ hash MD5
$$ C6 53 F3 B4 40 37 E4 65 44 C4 9F 2F 20 A3 72 6A
##$RELAX= 
##$RELAX= 
##$RELAX= 
##$RELAX= 
##$RELAX= 
##$RELAX= 
$$ Bruker specific parameters
$$ --------------------------
##$DU= <F:/spectra>
##$EXPNO= 1
##$NAME= <H-F>
##$PROCNO= 1
##$TYPE= <nmr>
##$USER= <she>
##$AMP= (0..31)
100 100 100 100 100 100 100 100 100 100 100 100 100 100 100 100 100 100 
100 100 100 100 100 100 100 100 100 100 100 100 100 100 
##$AQSEQ= 0
##$AQ_mod= 1
##$AUNM= <au_zg>
##$AUTOPOS= <>
##$BF1= 200.13
##$BF2= 200.13
##$BF3= 200.13
##$BF4= 200.13
##$BF5= 200.13
##$BF6= 200.13
##$BF7= 200.13
##$BF8= 200.13
##$BYTORDA= 1
##$CFDGTYP= 0
##$CFRGTYP= 5
##$CHEMSTR= <none>
##$CNST= (0..31)
1 1 145 1 1 1 1 1 1 1 1 1 1 1 1 1 1 1 1 1 1 1 1 1 1 1 1 1 1 1 1 1 
##$CPDPRG= <>
##$CPDPRG1= <>
##$CPDPRG2= <>
##$CPDPRG3= <>
##$CPDPRG4= <mlev>
##$CPDPRG5= <mlev>
##$CPDPRG6= <mlev>
##$CPDPRG7= <mlev>
##$CPDPRG8= <mlev>
##$CPDPRGB= <>
##$CPDPRGT= <>
##$D= (0..31)
0 1.2 0 0 0 0 0 0 0 0.06 0 0.03 0 0 0 0 0.0002 0 0 0 0 0 0 0 0 0 0 0 0 
0 0 0 
##$DATE= 1573645027
##$DBL= (0..7)
120 120 120 120 120 120 120 120 
##$DBP= (0..7)
150 150 150 150 150 150 150 150 
##$DBP07= 0
##$DBPNAM0= <>
##$DBPNAM1= <>
##$DBPNAM2= <>
##$DBPNAM3= <>
##$DBPNAM4= <>
##$DBPNAM5= <>
##$DBPNAM6= <>
##$DBPNAM7= <>
##$DBPOAL= (0..7)
0.5 0.5 0.5 0.5 0.5 0.5 0.5 0.5 
##$DBPOFFS= (0..7)
0 0 0 0 0 0 0 0 
##$DE= 6
##$DECBNUC= <off>
##$DECIM= 24
##$DECNUC= <off>
##$DECSTAT= 4
##$DIGMOD= 1
##$DIGTYP= 9
##$DL= (0..7)
0 120 120 120 120 120 120 120 
##$DP= (0..7)
150 150 150 150 150 150 150 150 
##$DP07= 0
##$DPNAME0= <>
##$DPNAME1= <>
##$DPNAME2= <>
##$DPNAME3= <>
##$DPNAME4= <>
##$DPNAME5= <>
##$DPNAME6= <>
##$DPNAME7= <>
##$DPOAL= (0..7)
0.5 0.5 0.5 0.5 0.5 0.5 0.5 0.5 
##$DPOFFS= (0..7)
0 0 0 0 0 0 0 0 
##$DQDMODE= 0
##$DR= 18
##$DS= 0
##$DSLIST= <SSSSSSSSSSSSSSS>
$$ [...]
##$SUBNAM2= <"">
##$SUBNAM3= <"">
##$SUBNAM4= <"">
##$SUBNAM5= <"">
##$SUBNAM6= <"">
##$SUBNAM7= <"">
##$SUBNAM8= <"">
##$SUBNAM9= <"">
##$SW= 24.0689530833862
##$SWIBOX= (0..15)
0 0 2 0 0 0 0 0 0 0 0 0 0 0 0 0 
##$SW_h= 4816.95568400771
##$TD= 16384
##$TD0= 1
##$TE= 0
##$TE2= 300
##$TE3= 300
##$TEG= 300
##$TL= (0..7)
0 120 120 120 120 120 120 120 
##$TP= (0..7)
150 150 150 150 150 150 150 150 
##$TP07= 0
##$TPNAME0= <>
##$TPNAME1= <>
##$TPNAME2= <>
##$TPNAME3= <>
##$TPNAME4= <>
##$TPNAME5= <>
##$TPNAME6= <>
##$TPNAME7= <>
##$TPOAL= (0..7)
0.5 0.5 0.5 0.5 0.5 0.5 0.5 0.5 
##$TPOFFS= (0..7)
0 0 0 0 0 0 0 0 
##$TUNHIN= 0
##$TUNHOUT= 0
##$TUNXOUT= 0
##$USERA1= <user>
##$USERA2= <user>
##$USERA3= <user>
##$USERA4= <user>
##$USERA5= <user>
##$V9= 5
##$VALIST= <valist>
##$VCLIST= <CCCCCCCCCCCCCCC>
##$VD= 0
##$VDLIST= <DDDDDDDDDDDDDDD>
##$VPLIST= <PPPPPPPPPPPPPPP>
##$VTLIST= <TTTTTTTTTTTTTTT>
##$WBST= 1024
##$WBSW= 4
##$XGAIN= (0..3)
0 0 0 0 
##$XL= 0
##$YL= 0
##$YMAX_a= 531755
##$YMIN_a= -465739
##$ZGOPTNS= <>
##$ZL1= 120
##$ZL2= 120
##$ZL3= 120
##$ZL4= 120
##$ABSF1= 10
##$ABSF2= 0
##$ABSG= 5
##$ABSL= 3
##$ALPHA= 0
##$AQORDER= 0
##$ASSFAC= 0
##$ASSFACI= 0
##$ASSFACX= 0
##$ASSWID= 0
##$AUNMP= <proc_1d>
##$AZFE= 0.1
##$AZFW= 0.1
##$BCFW= 1
##$BC_mod= 2
##$BYTORDP= 1
##$COROFFS= 0
##$CY= 11.3945322036743
##$DATMOD= 1
##$DC= 2
##$DFILT= <>
##$DTYPP= 0
##$F1P= 16.9975609425685
##$F2P= -3.02152046262296
##$FCOR= 0.5
##$FTSIZE= 0
##$FT_mod= 4
##$GAMMA= 1
##$GB= 0.15
##$INTBC= 1
##$INTSCL= 1
##$ISEN= 128
##$LB= 0.24
##$LEV0= 0
##$LPBIN= 0
##$MAXI= 10000
##$MC2= 0
##$MEAN= 0
##$ME_mod= 0
##$MI= 1.114404
##$NCOEF= 0
##$NC_proc= 0
##$NLEV= 6
##$NOISF1= 3.799351
##$NOISF2= 2.8
##$NSP= 1
##$NTH_PI= 0
##$NZP= 0
##$OFFSET= 15.70392
##$PC= 1
##$PHC0= -9444.164
##$PHC1= 4.800882
##$PH_mod= 1
##$PKNL= yes
##$PPARMOD= 0
##$PSCAL= 0
##$PSIGN= 0
##$REVERSE= no
##$SF= 200.130013532006
##$SI= 16384
##$SIGF1= 3
##$SIGF2= 2
##$SINO= 400
##$SIOLD= 16384
##$SREGLST= <1H.CDCl3>
##$SSB= 0
##$STSI= 0
##$STSR= 0
##$SW_p= 3612.71676300578
##$SYMM= 0
##$S_DEV= 0
##$TDeff= 0
##$TDoff= 0
##$TI= <>
##$TILT= no
##$TM1= 0
##$TM2= 0
##$TOPLEV= 0
##$USERP1= <user>
##$USERP2= <user>
##$USERP3= <user>
##$USERP4= <user>
##$USERP5= <user>
##$WDW= 1
##$XDIM= 8192
##$YMAX_p= 0
##$YMIN_p= 0
$$ End of Bruker specific parameters
$$ ---------------------------------
##NTUPLES= NMR FID
##VAR_NAME=  TIME,          FID/REAL,        FID/IMAG
##SYMBOL=    X,             R,               I
##VAR_TYPE=  INDEPENDENT,   DEPENDENT,       DEPENDENT
##VAR_FORM=  AFFN,          ASDF,            ASDF
##VAR_DIM=   8192,          8192,            8192
##UNITS=     SECONDS,       ARBITRARY UNITS, ARBITRARY UNITS
##FACTOR=    0.0002076,     1,               1
##FIRST=     0,             0,               0
##LAST=      1.7004516,     0,               0
##MIN=       0,             -465739,         0
##MAX=       1.7004516,     531755,          0
$$ Real data points
##PAGE= N=1
##DATA TABLE= (X++(R..R)), XYDATA
0@%%%%%%%%%NrMqJ6j6J6j8K6l5L7m2N5o5P2q2R8j17J32j48J72j98K21k47K80l17
$$ 0 0 0 0 0 0 0 0 0 0 5 -4 0 -8 8 -8 8 -10 16 -19 18 -24 31 -34 38 -44 54 -63 69 -79 93 -105 116 -131 149 -168
35a68L53l92M40m90N44o02O67p43Q20r02R99j109J226j356J505j676J867k081
$$ -168 185 -207 233 -257 287 -315 352 -391 429 -473 526 -583 643 -713 792 -884 983 -1098
53a098K333k624K953l306L609l513R41L5514M19474j35559m38523J52555K03245
$$ -1098 1235 -1389 1564 -1742 1867 -1646 -705 34809 454283 318724 -119799 32756 236001
66B36001l77479l24261M40463M62986k69327l84000J86063J50093l76636j72177
$$ 236001 -141478 -465739 -25276 437710 168383 -215617 -29554 120539 -256097 -428274
76d28274N23113L86021l14430k94908K15271N3525m09760r1030N05166K33926
$$ -428274 94839 480860 166430 -128478 86793 140318 -269442 -360472 144694 378620
86C78620l76286k07945K48006M149l54335O0649N27711J27068l94749j28296K27848
$$ 378620 2334 -205611 42395 46544 -307791 -247142 280569 407637 12888 -115408 112440
97A12440j00223l51838J34776M76465k178l91262k4878K43149j31281k68395K50861
$$ 112440 12217 -339621 -204845 271620 269442 -121820 -146698 96451 -34830 -303225 -52364
108e2364M41276j09117l86621K5866J85177k14082k32946L02690L68598j89643
$$ -52364 388912 279795 -106826 -80960 104217 -109865 -342811 -40121 328477 138834
118A38834l26037J20539J79517k18898j39717L58187K81652k75896k98146J38763
$$ 138834 -187203 -66664 112853 -106045 -245762 112425 394077 118181 -179965 -41202
128d1202J02393k59058p5585L80795K04011k97093k01635K02260P7131k41647
$$ -41202 61191 -197867 -273452 107343 311354 14261 -187374 14886 92017 -149630
138a49630L403L68986Q9956l44775j58353J90178M414k33063P7417L61222K5758
$$ -149630 -146227 222759 312715 -32060 -190413 -235 4179 -228884 -151467 209755 235513
149B35513l13172n7708K10386l3680k03557J25445K99313q1913l21722j4783J80387
$$ 235513 -77659 -135367 75019 41339 -162218 -36773 262540 180627 -141095 -155878 24509
160B4509p9358j56088J92000K72849j19460k60801O0695J62477j16213j26291
$$ 24509 -54849 -210937 -18937 253912 134452 -126349 -65654 96823 -19390 -145681
170a45681K01574J86523j96125k37310R4748J31298j26616n8968K45601J52504
$$ -145681 55893 242416 46291 -191019 -96271 35027 -91589 -150557 95044 247548
180B47548k07318j73129J31570Q9602j55183l9673K20976O6088k41712j27728
$$ 247548 40230 -132899 -1329 88273 -66910 -106583 114393 180481 -61231 -188959
190a88959J55763O7568j33256K8901K35415K8109k31414p3573J51657J0894j49436
$$ -188959 -33196 34372 -98884 -69983 165432 193541 -37873 -111446 40211 51105 -98331
201i8331M0303J90783l7591k20017j5188J63261Q01j05564R2616J74193p2969
$$ -98331 -58028 132755 95164 -124853 -140041 23220 24021 -81543 11073 185266 112297
212A12297j96551J5377J25066n2323j04962R6222J25286j04774j51090O9107J23790
$$ 112297 -84254 -68877 56189 3866 -101096 -4874 120412 15638 -135452 -66345 57445
223E7445n0498n5704J21934Q7712j32543j28045P1143P2434q5413m3120J18874
$$ 57445 6947 -48757 73177 160889 28346 -99699 -28556 43878 -41535 -84655 34219
234C4219N2638j27965o8784J09635O6623p3447p601J14407P522j44896n5329R0887
$$ 34219 86857 -41108 -109892 -257 66366 -7081 -14682 99725 107247 -37649 -92978 -2091
246b091K1195q4828J2378J11255n644j14442p97J09597J2677p2847K4484Q2339
$$ -2091 19104 -65724 -53346 57909 52265 -62177 -62974 46623 59300 -13547 10937 93276
258I3276m7048j20714K468Q2188j4817o1235M7033Q1243l9667p7979L9595P8394
$$ 93276 46228 -74486 -72018 10170 -4647 -65882 -18849 62394 22727 -55252 -15657 62737
270F2737k6345n4556L8633M0947o9756p5318L7923N5817l0505k7082N9914M3385
$$ 62737 36392 -18164 20469 61416 -8340 -83658 -45735 10082 -20423 -47505 12409 55794
282E5794n1243l6813N1494L6515m4967k8019L7591M328o6097k7230M9956K5726
$$ 55794 4551 -32262 19232 55747 10780 -17239 20352 24680 -41417 -68647 -18691 7035
294G035l0396M788N5101Q163m7444n452M2842l54m5831o425K8422j7040m6818
$$ 7035 -23361 -18573 36528 44691 -2753 -8205 34637 34283 -11548 -17973 10449 -6591 -53409
307e3409P066M6335N874k0179K1212L8237j2897l5381P736K4359j9530l4937O328
$$ -53409 -46343 -8 5866 -14313 6899 45136 32239 -3142 4594 28953 9423 -25514 -19186
320a9186J8049j9881k2663K3379L4466k441r563K1142J8577j9331k3658P160O933
$$ -19186 -1137 -21018 -43681 -20302 14164 11723 2160 23302 41879 22548 -1110 6050 12983
333A2983k2294j9597R463J0210j0653k649K3287J9299k955j848J1479J353j8410
$$ 12983 -9311 -28908 -19445 -9235 -19888 -22537 750 20049 17094 15246 26725 28078 9668
346I668j3752P45l974j4586m941R592O560Q24R067J5890P421j745K57K93r193
$$ 9668 -4084 -3339 -7313 -21899 -26840 -17248 -10688 -9864 -797 15093 22514 20769 21026 21319 12126
361A2126j3806p396m084o756l864N793Q991N811P242J1487P747n82l700k975p239
$$ 12126 -1680 -9076 -13160 -19916 -23780 -17987 -8996 -3185 4057 15544 23291 22709 19009 16034 8795
376H795j2419j0110m417k557j958L430R877J0096O953O644O337J488m685p364
$$ 8795 -3624 -13734 -18151 -20708 -22666 -19236 -9359 737 7690 14334 20671 22159 17474 10110
390A0110p322q248r187o769j041L297M596O522R474J0186O434J695p90k716o943
$$ 10110 2788 -5460 -14647 -21416 -22457 -19160 -14564 -8042 1432 11618 18052 19747 18957 16241 9298
405I298r916r182n706m052k144K199O996Q867Q251P123N869K519j808n464q107
$$ 9298 -618 -9800 -15506 -19558 -21702 -19503 -12507 -3640 4611 11734 17603 20122 18314 12850 4743
420D743q887p593o038m322L47N797P341N505Q528J0517N557k652l896j643p072
$$ 4743 -4144 -11737 -17775 -22097 -21750 -15953 -8612 -3107 5421 15938 21495 18843 14947 13304 6232
435F232j4407q787J281n4n459L727J5288R564j223M615J3934K013j4362q281K100
$$ 6232 -8175 -16962 -15681 -15735 -21194 -17467 -2179 7385 6162 10777 24711 26724 12362 4081 6181
450F181q273j9534m658J3453M244q009P213K1937N299j0252M722J6360n951k3929
$$ 6181 -2092 -21626 -26284 -12831 -8587 -16596 -9383 12554 17853 7601 12323 28683 22732 -1197
464a197n970P742j2046k0564P587K4254R21j0611J4149K2518p367j6600J1738
$$ -1197 -7167 575 -11471 -32035 -24448 -194 727 -9884 4265 26783 19416 2816 14554
477A4554J5705j9508k7218M980R346k0883j4222K7440K6948j2313j0421K5222
$$ 14554 30259 10751 -16467 -11487 -2141 -23024 -37246 -9806 17142 4829 -5592 19630
489A9630J4275k7026j5148K6362R155l7366k1867K2435N202l1501J465M9616J8524
$$ 19630 33905 6879 -8269 18093 27248 -10118 -31985 -9550 -4348 -35849 -34384 15232 33756
502C3756l1570m982L5285k997m4870m54M2440o071n2776m782L8376p654l7418
$$ 33756 2186 -2796 32489 29492 -15378 -15832 26608 20537 -32239 -37021 1355 -6299 -43717
515d3717K6005O3212m423m8645P994L7442k6891m9622K5060M9416k9481n6353
$$ -43717 -17712 45500 41077 -7568 426 37868 10977 -38645 -13585 35831 6350 -50003
527e0003J9483M2764k6144l0150N4245N7845l7024n2345K6490K7695n0577l5495
$$ -50003 -30520 12244 -13900 -44050 10195 68040 31016 -21329 5161 32856 -17721 -53216
539e3216N5748M0160n5989m3515M6082L1482m5249p450P8819L1691p1151l9874
$$ -53216 2532 42692 -13297 -56812 -10730 20752 -24497 -31947 46872 78563 7412 -32462
551c2462M5031N689o6112k026Q1290J2176p9206j6504O6994N640n7002K6849R1049
$$ -32462 12569 18258 -47854 -49880 31410 43586 -35620 -52124 14870 20510 -36492 -9643 81406
564H1406j2337r6862j2175N8336k3440o6459M3641R1820l0211r0592K1099P3614
$$ 81406 69069 -27793 -39968 18368 -5072 -71531 -27890 63930 33719 -56873 -35774 37840
576C7840k8173n3213O6694Q0528o5482j01753K7800N7802n2265m5082Q8944P5171
$$ 37840 9667 -43546 23148 103676 38194 -63559 -35759 22043 -30222 -75304 13640 88811
588H8811p7851q0016N9669N9079n9995k8675R7906M3926j11640p8362O6028L8910
$$ 88811 10960 -69056 -9387 49692 -10303 -38978 58928 102854 -8786 -87148 -21120 17790
600A7790p0182l355J16640L0414j14425m6002Q7313K5041p6602J3055J09086j2723
$$ 17790 -52392 -55747 60893 91307 -23118 -69120 18193 43234 -33368 -20313 88773 76050
612G6050j36924l0645R1091O797o9201M8247J18152l2647j29845L431R5769j7237
$$ 76050 -60874 -91519 -428 6369 -62832 -14585 103567 70920 -58925 -55494 40275 23038
624B3038p1482O0599R3747p6620j33720K9548R6803k9350m9162R4810Q8024r8256
$$ 23038 -48444 12155 105902 29282 -104438 -74890 21913 -7437 -56599 38211 126235 27979
636B7979j17859N6613Q4207n6920m5647R9773N3398j29603j00135Q6651Q0475
$$ 27979 -89880 -33267 50940 -5980 -51627 48146 101544 -28059 -128194 -41543 38932
647C8932n9898j3700J21990L1499j46240p6671J00080N1999q1949k465J17850
$$ 38932 -20966 -34666 87324 118823 -27417 -104088 -4008 47991 -33958 -36423 81427
658H1427m944j57285m0625J24340M2042p4808L0818J19808l8590j63168j5162
$$ 81427 76483 -80802 -121427 2913 44955 -29853 965 120773 82183 -80985 -96147
669i6147J20395O681q2778M7279J05452o9865j49659K9551J31570o169o6210P2564
$$ -96147 24248 30929 -51849 -4570 100882 31017 -118642 -89091 42479 36310 -29900 42664
681D2664Q5842j05811j43738N1538J12959l6674n8283Q7990O4595j23462j10005
$$ 42664 128506 22695 -121043 -69505 43454 6780 -51503 36487 101082 -22380 -132385
692a32385R2406J09897m8663l9077R7042K8509j52300r1951J06538Q3084o8054
$$ -132385 -39979 69918 21255 -17822 79220 107729 -44571 -136522 -29984 53100 -14954
703a4954j8572J07733N823j52531m7870J33934O5316p7600j973R8983l5955j65487
$$ -14954 -33526 74207 80030 -72501 -120371 13563 78879 1279 -694 98289 62334 -103153
715a03153k1243J37965L6876q0592K5813J00840n5932j48539K3153J44071Q001
$$ -103153 -124396 13569 50445 -30147 -4334 96506 40574 -107965 -84812 59259 67260
726F7260q4438L7754P7008r4527j41403N3120J36900j5143o9769O4922O7130j08160
$$ 67260 -17178 20576 97584 3057 -138346 -85226 51674 36531 -33238 31684 98814 -9346
738i346j11970Q6462J20099m5184o6186O7681L2499j31977q5234J12305J04160
$$ -9346 -121316 -34854 85245 40061 -26125 41556 74055 -57922 -143156 -30851 73309
749G3309n6676l9169Q5121J3090j35509n0755J26031P1846q0514l0220P7428k0113
$$ 73309 16633 -22536 62585 75675 -59834 -110589 15442 87288 6774 -23446 53982 33869
761C3869j37380j2963J41456N2688p8157k110Q0135m2211j30499J6057J34182
$$ 33869 -103511 -116474 24982 77670 -487 -2597 77538 35327 -95172 -79115 55067
772E5067J4305r0385R344O6731o4415j12438N4187J36379l677p8804L1500N5882
$$ 55067 69372 -21013 -11669 55062 -9353 -121791 -67604 68775 65098 -13706 17794 73676
784G3676q4559r7778P1674J12413l7319p6537M2890M0550r1852o5645J01677J01640
$$ 73676 -10883 -108661 -36987 75426 38107 -38430 4460 45010 -46842 -112487 -10810 90830
796I0830n1072n9100N4292J8391j06176m7046J06698P0021p2211m3951O2149M183
$$ 90830 39758 -19342 34950 53341 -52835 -99881 6817 76838 4627 -39324 22825 27008
808B7008r8323r309J22073M9309p8771k7141N8581k3276j01691R597J14280J8294
$$ 27008 -71315 -80624 41449 90758 11987 -15154 43427 20151 -81540 -71943 42337 60631
820F0631q2087n436O1685l2057q1759M1829J12126m752q2472N410M5710n4250
$$ 60631 -21456 -26892 34793 2736 -79023 -37194 74932 70180 -12292 -6882 38828 -15422
832a5422p4583N5699R6361k5294p0474K6490M4306n5257m9934P4007P9144m6482
$$ -15422 -90005 -34306 62055 36761 -33713 -7223 37083 -18174 -68108 5899 85043 38561
844C8561o6016K9377K3555o8345l5239Q1730O1323n3394m4475M4964J8346o3764
$$ 38561 -27455 1922 25477 -42868 -78107 3623 64946 11552 -32923 12041 30387 -33377
856c3377j3216Q3972L5534o8116l7644M1023j629o4665N396Q5856K0950o2895
$$ -33377 -46593 37379 72913 4797 -32847 8176 6547 -58118 -52722 33134 54084 -8811
868h811j3546M8481r716n7491J9906P4515o087o9694o219L9521k2448m6827L8387
$$ -8811 -22357 26124 16408 -41083 -21177 53338 47251 -22443 -28662 10859 -11589 -58416 -20029
881b0029P1298j4859n5955J3187L6849l1058l9249M1931N0108l6046n3485J9085
$$ -20029 51269 36410 -19545 -6358 30491 -567 -39816 2115 52223 16177 -37308 -18223
893a8223K8108l3935k1609N4947M3996l7153l7047K7574J8125m0373j6398M8094
$$ -18223 9885 -24050 -45659 9288 53284 16131 -20916 6658 24783 -15590 -31988 16106
905A6106K2144m7415k8730L1708J3000l3374J779N3574J5442m3563j6437L0019
$$ 16106 38250 -9165 -37895 -6187 6813 -26561 -24782 28792 44234 671 -15766 14253
917A4253m56l7608K880M1968p68m3111n381L2657j121k4944J7208M1055p354l8315
$$ 14253 13797 -23811 -20931 21037 20269 -22842 -28223 4434 3313 -21631 -4423 36632 29278 -9037
931i037L46K2667j3638k6853J6035K9343j5399k9542J2213K5085j0422j3580K4120
$$ -9037 -8691 13976 338 -26515 -10480 18863 3464 -26078 -13865 11220 798 -12782 11338
944A1338K3255k1440k6668J0469J2211j9688j3236K2460J5251k0144j3532K0323
$$ 11338 34593 13153 -13515 -3046 9165 -10523 -23759 -1299 13952 -6192 -19724 599
956E99J4158j4283l754K2303N868k5013j3676J3501K270j8077j103K1690M342
$$ 599 14757 474 -3280 19023 24891 -122 -13798 -297 1973 -16104 -17207 4483 8825
969H825j7432n37J9328L682j3714K493J5291n774k1363l183J1364l056j1656O462
$$ 8825 -8607 -9144 10184 13866 152 2645 17936 12162 -9201 -12384 -1020 -4076 -15732 -9270
983i270J6308j625j0454O094J3085l580j0010L782O447r994j3391K511P374m042
$$ -9270 7038 5413 -5041 1053 14138 10558 548 4330 10777 783 -12608 -10097 -2723 -6765
997f765m163R467R711l353m221O397N244o460o532K381J35q896n407M459M089
$$ -6765 -10928 -1461 8250 4897 676 7073 12317 5857 -675 1706 1841 -7055 -12462 -8003 -3914
1012c914k212J504Q451M536l068q48L669p45o729l830O99k391n084j32N010K806
$$ -3914 -6126 -4622 3829 8365 5297 4449 8118 7373 644 -3186 -2487 -4878 -9962 -10094 -5084 -2278
1028b278O22L328N622R50k264o52k39l330n277k507o9j283j106K218M573K868
$$ -2278 -1656 1672 7294 8244 5980 5328 5089 1759 -3518 -6025 -6094 -7377 -8483 -6265 -1692 1176
1044A176J441L111K227q14k456k294j957l584l455j462P40J196J702K989L648
$$ 1176 2617 5728 7955 7141 4685 2391 434 -3150 -6605 -8067 -7327 -6131 -4429 -1440 2208
1059B208K843J669M86l26j870l203l255k754j491j405k10J958K968K755K873K710
$$ 2208 5051 6720 7206 6880 5010 1807 -1448 -4202 -5693 -7098 -7308 -5350 -2382 373 3246 5956
1075E956J811l90j608j919k725l144k966j819l29Q20J982K883K792L336K084O14
$$ 5956 7767 7377 5769 3850 1125 -2019 -4985 -6804 -7133 -6313 -4331 -1448 1344 4680 6764 7378
1091G378o48j092k303l405l350j431q99r62N87L024L796J837J874K932J215k558
$$ 7378 6730 5638 3335 -70 -3420 -4851 -5750 -6712 -6125 -3101 695 2532 4406 7338 8553 5995
1107E995k861r60j604m738l118J437J328j443J635N640L956p16P15L149j162n947
$$ 5995 3134 2174 570 -4168 -7286 -5849 -4521 -5964 -4329 1311 5267 4551 5266 8415 7253 1306
1123A306l122J020k122n149j17M862P16k222L841P941Q82l823J298L206n251q479
$$ 1306 -1816 -796 -2918 -8067 -8184 -3322 -2606 -4828 -987 6954 7836 4013 5311 8517 3266 -5213
1139e213n0L744l504m996M682O870k387l086P266Q107m233o059M035J373j0532
$$ -5213 -5263 -1519 -5023 -10019 -5337 1533 -854 -3940 3326 11433 7200 1141 5176 6549 -3983
1154c983p735O286N153o538l005J0364N685q068j950J2140N023j0535n181P510
$$ -3983 -11718 -5432 -279 -6817 -9822 542 6227 -1841 -3791 8349 13372 2837 -2344 5166
1168E166k081j5236k715J3536L643r908J865J4124j37j3305K912J5994j736j5591
$$ 5166 3085 -12151 -14866 -1330 2313 -7595 -5730 8394 8257 -5048 -2136 13858 12122 -3469
1182c469k19R426q253j6772O589J8607j740j1661Q353J3899r502j4978J1019J5967
$$ -3469 -3688 5738 -2515 -19287 -12698 5909 4169 -7492 861 14760 5258 -9720 1299 17266
1196A7266j0380j6881O784Q671j5957j2523J8662J8620j0292j0211J4485Q506
$$ 17266 6886 -9995 -3211 5460 -10497 -23020 -4358 14262 3970 -6241 8244 16750
1208A6750j9625j0261K0259J1250j9769j2237J4175L155k1899k270K8782J2023
$$ 16750 -2875 -13136 7123 18373 -1396 -13633 542 3697 -18202 -20472 8310 20333
1220B0333j8949n095J8544k731k5754L59K7523J356k6497l010J9376o611k3111
$$ 20333 1384 -3711 14833 12102 -13652 -13293 14230 15586 -10911 -13921 5455 -1156 -24267
1233b4267J2329L4209j162k5428L650J8287j5743k5862J6102K9435j2675k7175
$$ -24267 -11938 22271 21109 -4319 -669 17618 1875 -23987 -7885 21550 8875 -18300
1245a8300R807J8202j8095j7466K8843L0320j8081k5480J3976J1467k7980j6387
$$ -18300 -8493 9709 -8386 -25852 2991 33311 15230 -10250 3726 15193 -12787 -29174
1257b9174L2369K2632k6776k1080K1795J0169k7186l958M1642J7007l4113j7846
$$ -29174 3195 25827 -949 -22029 -234 9935 -17251 -21209 20433 37440 3327 -14519
1269a4519K1720n53l3769J883M3218P334l6987q124K8277l025k9378J4516M5144
$$ -14519 7201 6648 -27121 -25238 17980 25314 -11673 -19797 8480 5455 -23923 -9407 35737
1282C5737l726m2880m127K3867j4144l0044K2790M3972j1938l9496P841K6696
$$ 35737 32011 -10869 -14996 8871 -5273 -35317 -12527 31445 19507 -19989 -12148 14548
1294A4548j7531k3386L2878L8042k5981m1679J1066K0202k5843j7654M1841L3668
$$ 14548 -2983 -26369 6509 44551 18570 -23109 -12043 8159 -17684 -35338 6503 40171
1306D0171l1970l2907K2297J8237k8876r579M5848K1136m4729l0515K5208J0085
$$ 40171 8201 -24706 -2409 15828 -13048 -22627 23221 44357 -372 -30887 -5679 4406
1318D406l2379K554N2943J3610m6757j8663L2201L203l3849J0586N0218l344n4637
$$ 4406 -27973 -25419 27524 41134 -5623 -24286 7915 11118 -22731 -12145 38073 34729 -19908
1331a9908j1361L3406m271l0019K5008N2329j2846n2671J009L3602j3416k8619
$$ -19908 -31269 2137 -2134 -32153 -7145 45184 32338 -20333 -19324 14278 862 -27757
1343b7757L1401M2371k9335n2233J1010L2820j8187j8322M3442L7977l8269m5750
$$ -27757 3644 46015 16680 -35553 -24543 8277 -9910 -28232 15210 53187 14918 -30832
1355c0832K0200K6339k6783j4203M5804K4213m9026l7897L0011K3109k7015j063
$$ -30832 -10632 15707 -11076 -25279 20525 44738 -4288 -42185 -12174 10935 -16080 -17143
1367a7143N2425J3859n5155k8712L3636J2598l2846N186N0575l78n8302j5227
$$ -17143 35282 49141 -6014 -34726 -1090 11508 -21338 -16152 34423 34045 -24257 -39484
1379c9484M0884Q337k8679J7666M9644j3957o0534n992L9227l932k9263K5083
$$ -39484 1400 9737 -18942 -1276 48368 34411 -26123 -32115 7112 3180 -26083 -1000
1391a000M3624k5797n5752J0276M2009q326k2609L4103L5116l9893n2889J8071
$$ -1000 42624 16827 -38925 -28649 13360 5034 -17575 16528 51644 11751 -41138 -23067
1403b3067L5719j8862j7537M0298K6337m7130m0137L1969L3054k2772r214M2608
$$ -23067 12652 -6210 -23747 16551 42888 -4242 -44379 -12410 20644 -2128 -11342 31266
1415C1266J1685n6629l2619L6834K3057k7477m29M5561K033n5832j6769M3910
$$ 31266 42951 -13678 -46297 -9463 13594 -13883 -14312 31249 33282 -22550 -39319 4591
1427D591J6152k9022O449M0407j3249n8887p113M4316O755k7241J6561L9141k0960
$$ 4591 20743 -8279 -1830 38577 25328 -33559 -40672 3644 10399 -16842 -281 38860 17900
1440A7900n2103P373M4394k663k6517K0269K8953l3647m8544J7191M1392q599
$$ 17900 -34203 -26830 17564 14901 -11616 8653 37606 3959 -44585 -27394 13998 5399
1452E399j9688K8222K4334l8307l8317K6706L5252j7419j7492K8443J1901m5539
$$ 5399 -14289 13933 38267 -40 -38357 -11651 23601 6182 -11310 17133 29034 -16505
1464a6505k8870L5173L0163j9866q033L3405M191m6531j8172L8982J9037k6311
$$ -16505 -45375 -10202 19961 95 -7938 25467 29658 -16873 -35045 3937 22974 -3337
1476c337m180K9899o998m6635n083M3363J3254k4645N198K9427j4997m4166L792
$$ -3337 -7517 22382 15384 -31251 -36334 7029 20283 -4362 836 30263 15266 -28900 -25108
1489b5108L9891J407k6862R369K4058k2064l7660J6062L9864l530k1899J5672
$$ -25108 14783 16190 -10672 -1303 22755 691 -36969 -20907 18957 15427 -6472 9200
1501I200J8874k8694l2494K0526L1831j2876j9554J8230J3466l0072k1969K9367
$$ 9200 28074 -620 -33114 -12588 19243 6367 -13187 5043 18509 -11563 -33532 -4165
1513d165K8201j5637j3580J9797N131l4413j5683K9656J8756k0238q938K1686
$$ -4165 24036 8399 -5181 14616 19747 -14666 -30349 -693 18063 -2175 -11113 10573
1525A0573O11l0657m309L3617J2834k1295m472J9030q067l1112Q35L1080M550
$$ 10573 11184 -19473 -23782 9835 22669 1374 -3098 15932 7865 -23247 -22412 8668 13218
1538A3218k0918K162J8926j0133k4587R991K9747j843k0819M506J3391j6884k2379
$$ 13218 -7700 -5538 13388 3255 -21332 -11341 18406 16563 -4256 250 13641 -3243 -25622
1551b5622J4078K5023o646j6334J0475J2518j7011j4930J8865J9692j2561j4911
$$ -25622 -11544 13479 6833 -9501 974 13492 -3519 -18449 416 20108 7547 -7364
1563g364J0177N747k0116j0238K0807J5012j3076q250J4253L599j8425m227K0541
$$ -7364 2813 8560 -11556 -21794 -987 14025 949 -7301 6952 10551 -7874 -12101 8440
1576H440P600j6472p110J1669j573j7486P02K0923M952j3938p51J2651l550j5459
$$ 8440 16040 -432 -7542 4127 2554 -14932 -14230 6693 11645 -2293 -3044 9607 6057 -9402
1590i402L946J6630j988j5251K24R615o219j1544Q175J6293k862j1094M450Q262
$$ -9402 -5456 11174 9186 -6065 -5841 3774 -2445 -13989 -5814 10479 7617 -3477 973 9235
1604I235q187r859Q362J0323p852j0461N180O110p937m952J1347R589o997o744
$$ 9235 1048 -8811 -449 9874 2022 -8439 -3259 2851 -5086 -10038 1309 10898 3901 -2843
1618b843O456L134r477m502R325M015r298m622P271K206o778M40J0753K853q155
$$ -2843 3613 6747 -2730 -7232 2093 6108 -3190 -7812 -541 1665 -5113 -4673 6080 8933 778
1633G78k071N660j381q233J39P553n16p403L20O612l70m492L360P271j772o474
$$ 778 -1293 4367 2986 -5247 -5108 2445 1929 -5474 -5154 1458 1088 -3404 -44 7227 5455 -1019
1649a019N96L565l589n443K749M948k694m216L356M414j639k330L978L254l490
$$ -1019 -423 3142 -447 -5890 -3141 1807 -887 -5103 -1747 2667 1028 -1302 2676 5930 2440
1664B440m244J482R49l542k177K996K720k381q00L221K479j878n56K638L41l636
$$ 2440 -1804 -322 627 -2915 -5092 -2096 624 -1757 -2557 664 3143 1265 709 3347 3688 52
1680E2k031J237l22k591J04K917J182j327P86K521M91j673J49P72r84k787r24
$$ 52 -1979 -742 -1064 -3655 -3551 -634 548 -779 7 2528 3019 1346 1495 2267 1283 -1504 -2428
1697b428P68n32n95J041J903O52O3Q62J397p40j166k75k69j597j530KO03J12K08
$$ -2428 -1660 -2192 -2787 -1746 157 809 872 1734 3131 2391 1225 950 681 -916 -2446 -2444 -1841 -1729 -1521
1716a521J387J490M97q0P17L0r57j147p35p23p00m94Q6Q49O69O38J234O14L89
$$ -1521 -134 1356 1853 1773 2490 2520 1563 416 -319 -1042 -1742 -2236 -2150 -1301 -632 6 1240 1854 2243
1735B243k19q4o06j079j019p92k37k88K23K33J030J218Q12L82L21k6o29p06p07
$$ 2243 2024 1940 1334 255 -764 -1556 -1793 -2081 -1858 -1625 -595 623 1435 1817 2138 2112 1483 777 70
1754G0j160p35l71Q9L09O31J085Q75O48L50M00m44p81m70o58j257p15oK27J94
$$ 70 -1090 -1825 -2196 -2107 -1798 -1167 -82 793 1441 1791 2191 1747 966 496 -162 -1419 -2134 -2140 -1913 -1719
1774a719P83J420Q44L5K36N21l12j112j016k58n67j362j16J255M76k17J120J898
$$ -1719 -936 484 1328 1363 1599 2120 1808 696 -320 -578 -1145 -2507 -2623 -1368 -892 -1109 11 1909
1792A909L15r24j11Q00r62k006k58P28j033j566J047K144N3m51J538K011j291
$$ 1909 2224 1300 1189 1989 1027 -979 -1237 -509 -1542 -3108 -2061 83 136 -315 1223 3234 1943
1809A943j877O52R92k568j699J149J258j727j487K726K429j150n55K904J147l559
$$ 1943 66 718 1710 -858 -2557 -1408 -150 -1877 -3364 -638 1791 641 86 2990 4137 578
1825E78k268K167N27l118j052L015R57l511j43M709J404k849M09L458j163n302
$$ 578 -1690 477 1004 -2114 -3166 -151 806 -2705 -2848 1861 3265 416 825 4283 3120 -2182
1841b182p67L785o46l878J220M585j052m787K037N892q68l928K052L715m225o352
$$ -2182 -2949 836 190 -3688 -2468 2117 1065 -3722 -1685 4207 3339 -589 1463 5178 953 -5399
1857e399K432M847k601l634M068M394m301m489N116N453l885l658M179K439p772
$$ -5399 -2967 1880 -721 -4355 -287 4107 -194 -4683 433 5886 2001 -1657 2522 4961 -2811
1872b811m858O066M569m773j973O929K137p973k230P920L363o863j751O330j233
$$ -2811 -7669 -1603 2966 -1807 -3780 3149 5286 -2687 -4917 3003 6366 -497 -2248 4082 2849
1887B849j0205q50R522K297o588J147Q117k198r847J478J0112o78q142J413O906
$$ 2849 -7356 -8206 1316 3613 -2975 -1828 6289 4091 -5756 -4278 5834 5156 -2986 -1573 5333
1902E333n909j0146M669J1154j778o831N034O920p756r326O772R776n187p761
$$ 5333 -576 -10722 -6053 5101 3323 -3508 1526 8446 690 -8636 -1864 7912 2725 -5036
1916e036N771M547j0104p344J0624R937o318n367Q148K823j2385n478J2294O838
$$ -5036 735 5282 -4822 -12166 -1542 8395 2077 -3290 4858 7681 -4704 -10182 2112 8950
1930H950r764m628Q962J13j3031j539J5439N513j0088j782R506l144j4497J240
$$ 8950 -814 -5442 3520 3633 -9398 -10937 4502 10015 -73 -1855 7651 4507 -9990 -8750
1944h750J5222J351j2131N29R870n900j3021O491J6762j308j1666L131Q020r875
$$ -8750 6472 7823 -4308 -3779 6091 191 -12830 -6339 10423 9115 -2551 580 8600 -1275
1958a275j2753Q958J5180n255j1140N838P210j1308r128J3811J4222q450j0193
$$ -1275 -14028 -5070 10110 4855 -6285 -447 6763 -4545 -13673 138 14360 5910 -4283
1971d283P038M130j4632o987J5907J1147j1197p947J0046K354j4834k341J8838
$$ -4283 2755 6885 -7747 -14734 1173 12320 1123 -6824 3222 5576 -9258 -11599 7239
1984G239P742j3741o486R860j892j6038J272J9951M210j4994k392J1270m176j4685
$$ 7239 14981 1240 -5246 4614 2722 -13316 -12044 7907 12117 -2877 -5269 6001 1825 -12860
1998a2860O290K0167j058j6493k76R917q431j3717J0821J9414m450j5581M117
$$ -12860 -6570 13597 12539 -3954 -4230 5687 -2744 -16461 -5640 13774 9324 -6257 -2140
2011b140R447j0488j0981J4640J6496r725j5221N749O871j3081p520J8624J4321
$$ -2140 7307 -3181 -14162 478 16974 7249 -7972 -2223 4648 -8433 -15953 2671 16992
2024A6992j2677j2129R041M916j4528l597J9725R288j6789j0051J0141J715j4499
$$ 16992 4315 -7814 1227 6143 -8385 -11982 7743 17031 242 -9809 332 2047 -12452
2037a2452J496K2018N258j7744o054J1589j741j4610N396K0628n18j9524k829
$$ -12452 -10956 11062 16320 -1424 -7478 4111 2370 -12240 -6844 13784 13266 -6258 -9087
2050i087J1658l826j2566J0356K0484m632j8697P55J0870p627j0923J3192J6779
$$ -9087 2571 -1255 -13821 -3465 17019 12387 -6310 -5555 5315 -2312 -13235 -43 16736
2063A6736r689j7576M378J0237r034p264J7169J4259j3353j5645P146P296j1777
$$ 16736 7047 -10529 -6151 4086 -4948 -12212 4957 19216 5863 -9782 -2636 4660 -7117
2076g117m220J8230R789j6824j2006J0329N490j1687O98J9608N156j9213r000
$$ -7117 -11337 6893 16682 -142 -12148 -1819 3671 -8016 -7318 12290 17446 -1767 -10767
2089a0767J1385J463j2569L909J9375M48j9782m158J3049o34j0840P815J8077
$$ -10767 618 2081 -10488 -6579 12796 13244 -6538 -10696 2353 1719 -9121 -1306 16771
2102A6771n115k0186r06J2075l829r752J0973J5752q784j7868L544J1810n439
$$ 16771 11656 -8530 -9436 2639 -1190 -10942 31 15783 6999 -10869 -7325 4485 -954
2115i54p024J2986J2295j3289j6508O263R700p724m612J5139Q957j5071j2390
$$ -954 -7978 5008 17303 4014 -12494 -6231 3469 -4255 -8867 6272 15229 158 -12232
2128a2232R540Q086q886j875J5297M123j7668r630J0844N343r458J939J5752O79
$$ -12232 -2692 5394 -3492 -5367 9930 14053 -3615 -13245 -2401 2942 -6516 -4577 11175 11854
2142A1854j7494m889J2109K540r468M024J3555m144j7488j632J2695j71q098P284
$$ 11854 -5640 -10529 1580 4120 -5348 -1324 12231 8087 -9401 -11033 1662 1491 -6607 677
2156F77J2826p108j6134K735J1598l201p154Q412R584j0897j3697N888J0468m377
$$ 677 13503 6395 -9739 -7004 4594 1393 -5761 2651 12235 1338 -12359 -6471 3997 -380
2170c80m865J0735P162j2482j1039Q024Q133o451l645J0796L327j3608p503J0193
$$ -380 -5245 5490 12652 170 -10869 -2845 5288 -1163 -4808 5988 9315 -4293 -11796 -1603
2184a603O602o667p56J0914Q44j4239m583J0455L396p711Q18R922k093j2859j019
$$ -1603 4999 -1668 -2424 8490 9334 -4905 -9488 967 4363 -3348 -2530 7392 5299 -7560 -8579
2199h579J0823K175o633K758Q586m515j2374J061R841r31o375M299P206o145j0051
$$ -8579 2244 4419 -2214 544 9130 4615 -7759 -6698 3143 2212 -4163 136 7342 1197 -8854
2214h854M396R167k128n132N500N072q148q624N334P469m018l990O673L516q543
$$ -8854 -4458 4709 2581 -2551 2949 8021 -127 -8751 -3417 4052 34 -3956 2717 6233 -2310
2229b310n459P500N886m918k554O262Q85r173l801P722L639n510o94O655k67q214
$$ -2310 -7769 -269 5617 699 -1855 4407 5292 -3881 -7682 40 3679 -1831 -2525 4130 3863 -4351
2245d351o64P641K080n550M7N162k497p882Q07P165L95m873K030M951k992o240
$$ -4351 -5015 2626 4706 -844 -797 4365 1868 -6014 -5207 1958 2353 -2520 -490 4461 1469 -4771
2261d771K269O439j457m516K190L041l968n135L316N617k099k953L361K621m328
$$ -4771 -2502 3937 2480 -2036 154 3195 -773 -5908 -2592 3025 926 -2027 1334 3955 -373
2276c73l402L968L510l197k751L122R97m308k096M362L013k763j275L419P05m696
$$ -373 -3775 193 3703 506 -2245 877 1874 -2434 -4530 -168 2845 82 -1193 2226 2931 -1765
2292a765p80L844J129l677o87K803k46l736M45M397N84k956M80K702j251l288
$$ -1765 -2545 1299 2428 -1249 -1936 867 621 -3115 -2670 1727 2311 -645 -165 2537 1286 -2002
2308b002P04L010o66k746O56J916j161k144J681L110n91k146P62J591j869k208
$$ -2002 -1298 1712 1046 -1700 -1044 872 -289 -2433 -752 2358 1767 -379 383 1974 105 -2103
2324b103J602J675j470j676J630J149j376p33K031J680j749q09P71N54k013p56
$$ -2103 -501 1174 -296 -1972 -342 807 -569 -1302 729 2409 660 -149 622 1176 -837 -1593
2340a593J570M05j153o00J660N09q78l27J685K23j254l60Q74o65j215j37J120
$$ -1593 -23 382 -771 -1371 289 798 -80 -407 1278 1501 247 -113 761 96 -1119 -1256 -136
2357a36L1q31N75R61l0p57N47P83n38q68r3K93l84p36N43O05O5l36M20Q05j02
$$ -136 -105 -936 -361 600 570 -187 360 1143 605 -263 -356 -63 -447 -1183 -640 -35 30 -306 114 919 817
2378H17o02K82K9l76n77n3j5k12j54M48M12J44J51L65J44j29n53R4j62j91n80
$$ 817 215 497 526 150 -427 -480 -495 -707 -861 -413 -1 143 294 659 803 674 121 215 53 -138 -718
2399g18k0J69J51k7K27P43KN5m2J21l33k55k71k29p5l27J35L02J75K07K11L54
$$ -718 -738 -569 -418 -445 -218 525 527 582 540 661 328 73 -198 -427 -502 -829 -694 -392 -217 -10 201 555
2421E55L4M1n6k14n52j47j53j24j60L28J71K97J19L42K59M1m15nN6m95m01j26
$$ 555 589 630 574 360 -192 -339 -492 -616 -776 -448 -277 20 139 481 740 781 366 361 417 -78 -479 -605
2443f05J81j56K4N21K74J6K14L09J78n84j15K8j38o59l43M34p5k5M71L28K81j14
$$ -605 -424 -580 -556 -35 239 255 469 778 956 372 257 285 147 -512 -855 -421 -496 -521 -50 278 559 445
2465D45J9N67n18o03j06Q6l55o33N33M94j23l53Q92O86m03n78K68M86p84p81N85
$$ 445 464 1031 513 -90 -196 -110 -465 -1098 -565 -71 -194 -547 345 1031 628 50 318 804 20 -761 -176
2486a76M27j162k94J146K87l65R1J041L32j358l47R14k75j306j5J196q0j296P5
$$ -176 251 -911 -1205 -59 228 -137 -46 995 1327 -31 -378 536 261 -1045 -1060 136 56 -1240 -1165
2505a165J569K93j306Q42J466m56j901j65J425p40j579R50J651q04j674J174J754
$$ -1165 404 697 -609 233 1699 1243 -658 -823 602 -138 -1717 -767 884 80 -1594 -420 1334
2522A334q86r16J222J279j660j979R18J281j294j161K030J265j897j250J950J479
$$ 1334 448 -468 754 2033 373 -1606 -688 593 -701 -1862 168 1433 -464 -1714 236 1715
2538A715j560o87K119K71k815j295K007O56j916K34K817J55k902k87K788K01k134
$$ 1715 155 -532 1587 1858 -957 -2252 -245 411 -1505 -1271 1546 1701 -1201 -1488 1300 1501 -633
2555f33N48K398j085l792K07K881j96k081J748K726j358l312J022L205j362k252
$$ -633 -85 2313 1228 -2564 -2357 524 328 -1753 -5 2721 1363 -1949 -927 2278 916 -1336
2571a336J851K155l032l294J780L262j448j563L097J745l219k767K624K626k644
$$ -1336 515 2670 -362 -3656 -1876 1386 -62 -1625 1472 3217 -2 -2769 -145 2481 -163
2586a63j431L034J103m617k072L831K203k422k98L720L96n150j259M045J095l241
$$ -163 -1594 1440 2543 -2074 -4146 -315 1888 -534 -832 2888 3284 -1866 -3125 920 2015 -1226
2602a226j39L913j202n162O0N137Q30l370J675L614k397n470J149M693q91l455
$$ -1226 -1365 2548 1346 -3816 -3756 1381 2211 -1159 516 4130 1733 -3737 -2588 2105 1214 -2241
2618b241K106L299l522m742K943N210j469k748L142K305m993m429L826M095k821
$$ -2241 -135 3164 -358 -5100 -2157 3053 1584 -1164 1978 4283 -710 -5139 -1313 2782 -39
2633c9k272L675J651n331k897N403L952l403j662M050l3o559j945N860K539m056
$$ -39 -2311 1364 3015 -2316 -5213 190 4142 739 -923 3127 3094 -3465 -5410 450 2989 -1067
2649a067n24M604q93o312J53O468J247l937J86L634k797o379J141O873K10m126
$$ -1067 -1591 3013 2120 -4192 -4039 2429 3676 -261 -75 3559 762 -5617 -4476 2397 2607 -1519
2665a519J500L871l757n323L221O483j375m447K244K342n084m980M852O127k591
$$ -1519 -19 3852 95 -5228 -2007 4476 3101 -1346 898 3240 -1844 -6824 -1972 4155 1564
2680A564l232L218K069n811l362O318M662m349k852L504K85o663j603P196L834
$$ 1564 -1668 1550 3619 -2192 -5554 764 5426 1077 -1775 1729 2014 -4649 -6252 944 4778
2695D778m465j529M121o17o447j15P378J767n518j192L848k030o300K294P933
$$ 4778 313 -1216 2905 2288 -4159 -4274 3104 4871 -647 -1839 2009 -21 -6321 -4027 3906
2710C906M72n212O60L647l480n744L455P123j625n375J220L099m284m220N245
$$ 3906 4378 -834 -174 3473 -7 -5751 -2296 4827 3202 -2173 -953 2146 -2138 -6358 -1113
2725a113O710k302m843K435K018n354l356O055N147m221m244L264J295n492j125
$$ -1113 5597 3295 -1548 887 2905 -2449 -5805 250 5397 1176 -3068 196 1491 -4001 -5126
2740e126P246M292n250k830L453l82o027N2P474J872n841j749M181j109n043K046
$$ -5126 2120 6412 1162 -1668 1785 1403 -4624 -4572 2902 4774 -1067 -2816 1365 256 -4787 -2741
2756b741P859N22o364q09L345k409n121L230P137j232n790M36L772k959l585N047
$$ -2741 5118 5640 -724 -1533 1812 -597 -5718 -2488 4649 3417 -2373 -1937 1835 -1124 -4709 338
2772C38O008l131n443J268K378m303k376N753M808m051m330K984J899m104j033
$$ 338 6346 3215 -2228 -960 1418 -2885 -5261 492 5300 1249 -3081 -97 1802 -2302 -3335
2787c335O448K834n166l767K950M94m344J31O736J867n431k048L669J56m129J336
$$ -3335 3113 5947 781 -2986 -36 458 -3886 -3755 2981 4848 -583 -2631 1038 1194 -2935 -1599
2803a599O192O1o184j371L300j093l753L073N845j072n288J13L731j766l252L330
$$ -1599 4593 4654 -1530 -2901 399 -694 -4447 -1374 4471 3399 -1889 -1776 1955 189 -3063 267
2819B67M800k910n486J091L019k412j879M530M154l494m315K108K391l113j171
$$ 267 5067 2157 -3329 -2238 781 -1631 -3510 1020 5174 1680 -2635 -527 1864 -1249 -2420
2834b420M529K083m799l221K694J754k774K71M924J272m542k118L008N33l296
$$ -2420 2109 4192 -607 -3828 -1134 620 -2154 -1883 3041 4313 -229 -2347 661 1194 -2102
2849b102O12M346l37n083p61L363N75k671J879M176j002m551k57K975j074k464
$$ -2102 -1490 2856 2519 -2564 -3325 38 613 -2058 -179 3997 2995 -1556 -1813 1162 88 -2376
2865b376K186L240k215l821Q71L160r66j791L168K642l002l412J370J944j985
$$ -2376 -190 3050 835 -2986 -2115 1045 79 -1712 1456 4098 1096 -2316 -946 998 -987
2880i87j046K835J630l369k001K455J913j617l85L011P18l547k019K308P25k126
$$ -987 -2033 802 2432 -937 -2938 -483 1430 -187 -572 2439 3157 -390 -2409 -101 624 -1502
2896a502P1K976J21l151m04K682O16j910N67K548r58l466l15K394k04j510R36
$$ -1502 -1431 1545 1666 -1485 -1889 793 1409 -501 66 2614 1656 -1810 -2125 269 65 -1445 -509
2913e09K387j280k405J022K500p42j281J034J239k013k220R76J716j008q19K046
$$ -509 1878 598 -1807 -785 1715 973 -308 726 1965 -48 -2268 -1292 424 -584 -1403 643
2929F43J128j778j165J597J313j228j054J498K08k350r74J894O01r25K09J525
$$ 643 1771 -7 -1172 425 1738 510 -544 954 1162 -1188 -2162 -268 333 -592 -383 1142
2945A142K04j640j39J498L52j664j69J243o71j888J77J529M35p12N67J416p75
$$ 1142 1346 -294 -433 1065 1417 -247 -416 827 156 -1732 -1555 -26 409 -303 264 1680 905
2962I05j369M93J018l88j317N17L43p06j220R81J306l21j13M85O81r03q73M64
$$ 905 -464 29 1047 659 -658 -141 202 -504 -1724 -743 563 242 129 614 1295 392 -481 -17
2980a7N06p68o83P31K15j047k55J203R10l78j13O76p2r56l17K31R1q45j39P41
$$ -17 489 -279 -962 -231 -16 -1063 -1318 -115 795 417 304 980 908 -48 -365 -134 -43 -888 -1027 -286
3000b86J41o26K33J216M6l87K25L40m85p26p0K95k95n45J28M41K25l58P63N69
$$ -286 -145 -771 -538 678 724 337 562 902 417 -309 -379 -84 -379 -924 -796 -355 -130 -488 275 844
3020H44J08l96k43K88q75n62L68k2j66Q5K67K51J2L08M83J51k08l49r8j62p77
$$ 844 952 556 313 601 -274 -836 -468 -490 -656 -571 -304 -53 -41 267 750 901 693 344 246 84 -693
3041f93r2K44J2O3J53M62K28M0R6J71o2k90k29mn12j97J04nK48K01J97L15J54
$$ -693 -785 -541 -529 -466 -313 149 377 417 513 684 622 332 103 99 -413 -610 -506 -511 -263 -62 135 450 604
3064F04l6l1j6k39k44l96l9l05J33J12K76J76J46M22n9K43j70j31l18l98j81j65
$$ 604 568 537 521 282 38 -358 -397 -702 -569 -457 -181 -5 141 563 504 747 577 446 128 -270 -451 -616
3086f16Lr1L43K08L01K59J30K03n4k72k18p1m56k70k3j0J41NL82L62P1Q2K07k7
$$ -616 -613 -704 -361 -153 148 407 537 740 686 414 196 125 -331 -601 -624 -634 -493 -488 -106 256 327 409 616 589
3110E89o7l77j54l57k51J6j90M03N0J39N73J27K29p5j88j12l20m84o3m6j40j95
$$ 589 522 145 -9 -366 -617 -601 -791 -388 -338 -199 374 501 730 655 467 355 35 -449 -512 -558 -698 -893
3132h93N02R1K40K54J98K15Q5k47k10j71m68j11k7k21M1L6O92J40J77Q5L48n6
$$ -893 -391 -300 -60 194 392 607 692 445 235 64 -404 -515 -542 -763 -722 -686 6 146 323 408 756 700
3154G00n34O0M1n43n16J88J36m5q2O14N15J60j21K8J74o41l32J96k75n43j9L41
$$ 700 166 226 267 -276 -792 -604 -468 -513 -595 19 534 694 573 601 775 134 -198 -2 -277 -820 -839 -498
3176d98L18j45K96M86N94l51k08Q6r5p29l18K26K25p57J37N78M38l75M90P34k
$$ -498 -180 -325 -29 457 1051 700 492 578 483 -246 -564 -338 -113 -870 -733 -155 283 -92 398 1132 1130
3197A130r76n7M22o65o39mQ28l55p19N14R71j89k06P13O13p65r13L02L04p73o33
$$ 1130 154 97 519 -146 -785 -789 39 -316 -1035 -521 450 261 55 768 1381 616 -297 5 309 -464 -1097
3218a097P70N16q94j70R85O83o22J3J078k06j145q25P46Pp89j00J399J51j296
$$ -1097 -327 189 -705 -875 110 793 171 184 1262 1056 -89 -914 -168 -161 -950 -1050 349 500 -796
3237g96L17R85J84o89L18R49o24j601k07Q73j29r23Q16J358l48j429O83J454n16
$$ -796 -479 506 690 1 319 1268 644 -957 -1164 -291 -420 -1343 -527 831 483 -946 -263 1191 675
3256F75q01O82Q41j659j416N33J130l47p87J526J043j287j011J284P48j060o47
$$ 675 -126 556 1397 -262 -1678 -1145 -15 -362 -1149 377 1420 133 -878 406 1154 94 -553
3273e53J309l9j952q02J528O71q50L38J767J65k044m33J760L47j676J73J234r85
$$ -553 756 717 -1235 -2037 -509 162 -688 -350 1417 1582 -462 -895 865 1212 -464 -291 943 -42
3291d2k212N98K049J99j243J049J972j472k072Q35J675p80j519R57J094k055j717
$$ -42 -2254 -1656 393 592 -651 398 2370 898 -1174 -339 1336 556 -963 -6 1088 -967 -2684
3308b684J597K294p54p34J714R56k487j572J505J456j600p10J588K81k480q90
$$ -2684 -1087 1207 453 -281 1433 2389 -98 -1670 -165 1291 -309 -1019 569 850 -1630 -2520
3324b520K877J360j391p3J901n40l278m16K754L23k155K88K018r73k597Q32L144
$$ -2520 357 1717 326 253 2154 1614 -1664 -2080 674 997 -1158 -870 1148 175 -2422 -1590 1554
3341A554M82j899L49J844k003k857R27K493m55j659J126J374j885j931K125K945
$$ 1554 2036 137 486 2330 327 -2530 -1603 890 435 -1224 -98 1276 -609 -2540 -415 2530
3357B530r75j876J390P11l138j931K684K161j790r51J899N08k795q89L424J703
$$ 2530 1555 -321 1069 1780 -1358 -3289 -605 1556 -234 -1185 714 1222 -1573 -2462 962 2665
3373B665k182j131K096o45l640k10L400J227k265K0K358r40l059R65L558J91k723
$$ 2665 483 -648 1448 803 -2837 -3047 353 1580 -685 -665 1693 753 -2306 -1341 2217 2408 -315
3390c15o7J781k203k853J856L533m55k198J059J669k049k392K541L108j399k704
$$ -315 -382 1399 -804 -3657 -1801 1732 1277 -921 138 1807 -242 -2634 -93 3015 1616 -1088
3406a088R89Q81k940j324L366K733j716j711J883N61k828j111L804J414k626j797
$$ -1088 -99 782 -2158 -3482 -116 2617 901 -810 1073 1634 -1194 -2305 1499 2913 287 -1510
3422a510J738P1l049N3M454J242k629q00K106r17l032O87L890L6l513o5J700j209
$$ -1510 228 299 -2750 -2697 1757 2999 370 -430 1676 759 -2273 -1586 2304 2340 -1173 -1238 462 -747
3440g47k435K088M188m68l153N18J729k051k440K320L234j737l004Q47J786k002
$$ -747 -3182 -1094 3094 2626 -527 -9 1720 -331 -2771 -451 2783 1046 -1958 -1111 675 -1327
3456a327j368L545K817k191k548J626N72k697j085L409J780l041j619K175N91
$$ -1327 -2695 850 3667 1476 -1072 554 1126 -1571 -2656 753 2533 -508 -2127 48 639
3471F39k442M21L898R46l360j219J800l73k922P94L600R7l316l44K514o20k136
$$ 639 -1803 -1382 2516 3462 102 -1117 683 310 -2612 -1818 1782 1879 -1437 -1781 733 113 -2023
3488b023K011L308p20l622k14J940j596k153K525K896j365k914J183J921j388
$$ -2023 -12 3296 2576 -1046 -1260 680 -916 -3069 -544 2352 987 -1927 -744 1177 -211
3503b11j209K503K440k693k733Q47J491k146q11L362J856k664k090K210J115j972
$$ -211 -1420 1083 3523 830 -1903 -1056 435 -1711 -2522 840 2696 32 -2058 152 1267 -705
3519g05j13K963N52l238j537J590M92k115P23L367J6k927j44K284l51k004J182
$$ -705 -818 2145 2697 -541 -2078 -488 4 -2111 -1388 1979 1995 -932 -1076 1208 857 -1147 35
3536C5K557j199l435K8K233o62j507K107K490j414k515Q19J849j084j495J666
$$ 35 2592 1393 -2042 -2014 219 -443 -1950 157 2647 1233 -1282 -463 1386 302 -1193 473
3552D73J610k112k284J028J690r56q19K371J672k224j720J568J208j883p21K134
$$ 473 2083 -29 -2313 -1285 405 -551 -1370 1001 2673 449 -1271 297 1505 -378 -1099 1035
3568A035L11k729r33J854Q81j201K74K607N6k528o96J770P2j796L28J907p54k435
$$ 1035 1346 -1383 -2316 -462 419 -782 -508 2099 2155 -373 -1069 701 773 -1023 -695 1212 458 -1977
3586a977M25K189O2j293J144J683j148k041K44J626r83j422J203J220j390j555
$$ -1977 -1552 637 699 -594 550 2233 1085 -956 -712 914 -69 -1491 -288 932 -458 -2013
3602b013J551J420o97l68J355M66j755j279R78P17j195m56J421O20j574m69J531
$$ -2013 -462 958 261 -107 1248 1714 -41 -1320 -342 375 -820 -1276 145 765 -809 -1278 253
3619B53Q46r78L0J147l43j597p12J376Q4j002J00J210p8j181K64J507K2r05M80
$$ 253 1099 121 151 1298 955 -642 -1354 22 106 -896 -796 414 336 -845 -581 926 948 43 523
3638E23M30p71j381Q9J046k6r93Q78J077n83q65O99J088l15r56L77K91j104o97
$$ 523 953 182 -1199 -1110 -64 -90 -1083 -205 872 289 -576 123 1211 896 -60 317 608 -496 -1193
3657a193M48Q74n24n7O59O74o28n16J007K31o83n86L65o0q73k47R63M01m21K26
$$ -1193 -745 129 -395 -452 207 881 253 -263 744 975 292 -294 71 11 -862 -1109 -146 255 -166 60
3677F0O38O9o26J19N67l58q14k2J74k13n17K05R71j63j64N26M16k16m80J43P1
$$ 60 698 767 141 260 827 469 -345 -367 -193 -406 -923 -718 253 90 -74 452 868 652 172 315 386
3698C86l43o26J87j4k17q0L29R22k31q6O31J6m60n07K18k60k28l85J61K30j21
$$ 386 43 -583 -396 -410 -627 -707 -378 544 313 227 858 874 414 -93 125 -135 -363 -748 -587 -357 -478
3719d78K04N20M10j85l3J19k54m62m3l3k12k53J51J4L41L6J38O66J1l02R9j16
$$ -478 -274 246 656 471 438 557 303 -159 -202 -235 -447 -700 -549 -535 -194 -158 -20 646 657 355 454 338
3741C38j89n59K0l5k27K6l1M18L61m1K51J54p4l19K43m48j69j16k36J7J34J28
$$ 338 149 -410 -390 -425 -652 -626 -657 -239 122 81 332 486 412 93 336 -112 -281 -397 -633 -616 -482 -354
3763c54L99J88O6R1L6J95k11o12L81m60k11j95O7L19O2K18L31q8K18M8P6k40l18
$$ -354 45 233 299 390 426 621 410 -202 179 -281 -492 -687 -620 -301 -239 -21 310 222 440 488 564 324 6
3786Fk33N5o3l73K5M08J0J83K88K37K74l33O4m1k93n97K9j03j4l8J93L35K33P4
$$ 6 -227 -172 -235 -608 -583 -175 -165 18 306 543 817 484 548 507 214 -383 -354 -457 -471 -509 -316 19 252 326
3810C26M13J00m58k17K07k71m26l71L02J01j16Q3L96K17j83J04N78j20o06j20
$$ 326 739 839 381 164 371 100 -326 -697 -395 -294 -410 -327 69 286 103 207 785 665 59 -61
3830f1j25k0o73O9P70o8l14L90O61l3o12N03L62l52r25J12K75m18n08O39M81n0
$$ -61 -186 -206 -879 -810 -40 -108 -422 -32 629 596 -16 487 849 497 -428 -316 -41 -459 -967 -328 153 103
3852A03l56M22O37k82n83N75J81o67r43L78N34p66K5Q21P33n79m95R18L73j166
$$ 103 -253 169 806 524 -59 516 697 30 -913 -535 -1 -767 -742 79 812 233 -262 656 1029 -137
3872a37r3P67P4j360l61P65K04p87M15J348K28j264K47R87m80j194K51J280q39
$$ -137 -230 537 611 -749 -1110 -345 -141 -928 -513 835 1063 -201 46 1033 553 -641 -390 890 51
3891E1j419K44J174j56q98J133J579r00j211N97R07j237r93J209R22j560j243
$$ 51 -1368 -1124 50 -106 -1004 129 1708 808 -403 194 1101 -136 -1129 80 1002 -558 -1801
3908a801J407J118j208l23J957R02j722j236J097M49j558k88J922K44k064m62
$$ -1801 -394 724 -484 -807 1150 2052 330 -906 191 640 -918 -1206 716 960 -1104 -1566
3924a566J701O98j420O83J967j64k386o28J607l30j523N63K166q54k188L77K266
$$ -1566 135 833 -587 96 2063 1899 -487 -1115 492 162 -1361 -798 1368 514 -1674 -1297 969
3941I69p0j604J308K060j686k603N78J651r68j318J906J732j935k233J967J871
$$ 969 899 -705 603 2663 977 -1626 -1048 603 -365 -1683 223 1955 20 -2213 -246 1625
3957A625j352j103K417J004k830k103J606J479j969k91K685R46l109j100K601
$$ 1625 273 -830 1587 2591 -239 -2342 -736 743 -1226 -1517 1168 2114 -995 -2095 506
3972E06J147k099K28K610m67l871p96K846L68k021R58L057q38l544K34L265l86
$$ 506 1653 -446 -218 2392 1925 -1946 -2742 104 472 -1549 -591 2466 1628 -1916 -1682 1583 1197
3989A197k275J492K304k354l608J090L031p86j661K224K635k742l160J786K904
$$ 1197 -1078 414 2718 364 -3244 -2154 877 91 -1570 654 3289 547 -2613 -827 2077
4004B077j611j769K475J248l534k855K659K801j676p61K851J207m158k036L276
$$ 2077 466 -1303 1172 2420 -1114 -3969 -1310 1491 -185 -946 1905 3112 -1046 -3082 194
4019A94J944k489o99L000k17m558j051M237J626k511M71L066q16m649o7L906J16
$$ 194 2138 -351 -1050 1950 1733 -2825 -3876 361 1987 -524 -53 3013 2197 -2452 -2519 1387 1503
4036A503k733Q15K837k101m176J255M540k33k631J880K646l296l957J890L761
$$ 1503 -1230 -415 2422 321 -3855 -2600 1940 1707 -924 956 3602 306 -3651 -1761 2000
4051B000j222k416K281K020l650l309L598L637j688j753K541R05m669k585L871
$$ 2000 778 -1638 643 2663 -987 -4296 -698 2939 1251 -502 2039 2944 -1725 -4310 -439
4066d39K849k573j386L145M65m635j252M831K350k945n66K679q66n138n41M983
$$ -439 2410 -163 -1549 1596 2061 -2574 -3826 1005 3355 410 -156 2523 1657 -3481 -4022 961
4082I61J202l039N1L220j560m398R73N313J59l443P52K423k934m337K185M765
$$ 961 2163 -876 -825 2395 835 -3563 -2590 2723 2882 -561 191 2614 -320 -4657 -2472 2293
4098B293p78l197K060K189l096l515L493M389j980l099J925J306m355k426M073
$$ 2293 1515 -1682 378 2567 -529 -4044 -551 3838 1858 -1241 684 1990 -2365 -4791 -718
4113g18L869k584k063L160M89m322j255M712K285l173j708K472j99m842J34N287
$$ -718 3151 567 -1496 1664 2153 -2169 -3424 1288 3573 400 -1308 1164 965 -3877 -3743 1544
4129A544J553l421m26L070j073m424R30M904J93l956L2K629k258l805K427M997
$$ 1544 3097 -324 -750 2320 1247 -3177 -2247 2657 2850 -1106 -1074 1555 -703 -4508 -2081 2916
4145B916p8l878J032K478k729l535L161M248j926l734J539J799l183k444M509
$$ 2916 2838 -1040 -8 2470 -259 -3794 -633 3615 1689 -2045 -506 1293 -1890 -4334 175
4160A75L789k346k817J953J253l612j906M372K563l421k311K682O85l661k33M898
$$ 175 3964 1618 -1199 754 2007 -1605 -3511 861 3424 3 -2308 374 1059 -2602 -2835 2063
4176B063J866l579j556K498l00l860N07M584M00l704r32L060p92l152J924M518
$$ 2063 3929 350 -1206 1292 992 -2868 -2361 2223 2623 -1081 -2013 1047 255 -2897 -973 3545
4192C545n78l846J10K319k060k869K462L694j468l218P46K465j715k018K937L374
$$ 3545 2967 -879 -769 1550 -510 -3379 -917 2777 1309 -1909 -1163 1302 -413 -2431 506 3880
4208C880k143l358J421J237k564j397L187K535k725k077J984J284k306p66L538
$$ 3880 1737 -1621 -200 1037 -1527 -2924 263 2798 73 -2004 -20 1264 -1042 -1808 1730
4223A730J628l202k133K087M10k822L8L695R44l325q30K709J00k401N36L326K0
$$ 1730 3358 156 -1977 110 520 -2302 -2264 1431 2375 -950 -1780 929 1029 -1372 -836 2490 2510
4240B510l665m98K081n17k458J527L259o04l082N54K347j191j913J830K298j762
$$ 2510 -1155 -1653 428 -89 -2547 -1020 2239 1635 -1447 -893 1454 263 -1650 180 2478 716
4256G16k792P97J742j260j317K221K409j908k004J624J322j699j111K134J051
$$ 716 -2076 -1279 463 -797 -2114 107 2516 608 -1396 228 1550 -149 -1260 874 1925
4271A925k416j558J570R87j490j45K567P60k421r12J687M68j897k9K062mk390
$$ 1925 -491 -2049 -479 508 -982 -1127 1440 2200 -221 -1133 554 1022 -875 -904 1158 1154 -1236
4288a236l22J721j64j096P30K256k27k261K8J512m85j576Q20J484r09j947O95
$$ -1236 -1558 163 -1 -1097 -367 1889 1662 -599 -571 941 456 -1120 -300 1184 275 -1672 -977
4305i77J641k36j094J178J489j386j445P24R31r99j234J262O88r86r57J108J027
$$ -977 664 428 -666 512 2001 615 -830 -106 825 -174 -1408 -146 542 -444 -1401 -293 734
4322G34n73n19J436L17j380q08Q45L55r85m69J197L00j076k43J355L26p43j8J094
$$ 734 161 -358 1078 1395 15 -793 52 407 -578 -1047 150 450 -626 -869 486 812 69 51 1145
4341A145l44j322k59R25j21p31P6R33k21n67K73R95m35m05L78M20m37j098J78
$$ 1145 801 -521 -780 145 24 -707 -631 302 81 -486 -213 782 347 -58 320 740 303 -795 -617
4360f17M51l04l80P72P33m38p25P04N70j72p35L62J53p24n86L44O07n02j56P71
$$ -617 -166 -470 -850 -78 655 217 -508 196 766 594 -141 221 374 -350 -936 -592 15 -487 -643 128
4380A28L64l55j24L85K65m19m62L29k03n79p1N85J48j97K24M54Q8l64J23O4on19
$$ 128 492 137 13 398 663 244 -218 111 -92 -671 -742 -157 -9 -206 18 472 560 196 319 383 377 -142
4402a42j45R9j34j66j19O18N6k40L61L44j24j81L3j4j83m72J00P4j13j67L99K62
$$ -142 -287 -188 -322 -488 -607 11 67 -173 188 532 408 227 260 246 63 -409 -309 -235 -348 -515 -116 146
4424A46l4L5K00K97k53l84o5K43m10k63K08K28j29N2J84L51q9j08J89J51k95k23
$$ 146 112 147 347 644 391 7 -58 185 -225 -488 -280 -52 -181 -129 55 406 317 209 398 549 254 31
4446C1j63l0q1j42K81k6J7L20K29p4P8j58K28k76k88l55J92p4l49J95M38N9o0
$$ 31 -132 -162 -243 -385 -104 -130 -113 207 436 362 440 282 510 234 -54 -409 -217 -291 -640 -445 -7 52 -8
4469hR4M45p1l83L7K94m63n68K89R8k06k2L33L53K1j22J02L95l80k90Q3Q7m26
$$ -8 86 531 460 77 114 408 -55 -623 -334 -236 -442 -464 -131 222 243 121 223 618 238 -52 31 118 -308
4492c08j54J58J7k4j35P67K23l09n2K40j20n28L6J71j71m54J10L76jk05L37O72
$$ -308 -462 -304 -287 -311 -446 321 544 235 183 423 303 -225 -189 -18 -189 -643 -533 -157 -158 -363 -26 646
4514F46q0m90j6M39n25m70K68K26l24k69L89M82n67j93J087M11n93n60M86K1r16
$$ 646 566 76 60 499 -26 -496 -228 -2 -326 -595 -206 276 -291 -484 603 1014 421 -139 347 368 -548
4535e48r5O37K80p27j80Q47K13p41J41R45m6o52n01R00n45q23R2J131P0q59K20
$$ -548 -643 -6 274 -453 -633 214 427 -314 -173 772 726 74 -427 473 -72 -895 -803 328 398 -461 -241
4556b41J101m81q85P23R54m61j137J25Q03q43q59O09J301m94r06Q99O46q49p18
$$ -241 860 379 -506 217 1171 710 -427 -302 501 -342 -1201 -592 709 215 -691 208 854 5 -713
4575g13J088J179j361j180Q80K39j170k68J654P45j155n29J196L17j467j70J769
$$ -713 375 1554 193 -987 -107 132 -1038 -1306 348 1093 -62 -591 605 922 -545 -715 1054
4592A054J72j819m38J271k7j717M24K288J28j894K44J329n11j556O15J887n89
$$ 1054 1226 -593 -1031 240 213 -1504 -1080 1208 1336 -558 -314 1015 504 -1052 -437 1450 861
4609H61k035L7J640p82j546J573K228q35k052P63J139j361j142J532J858j757
$$ 861 -1174 -1137 503 -279 -1825 -252 1976 1141 -911 -148 991 -370 -1512 20 1878 121
4625A21j802R59J248j373p86K519J630k113j845J658O62k113l71K593O84k502
$$ 121 -1681 -722 526 -847 -1633 886 2516 403 -1442 216 878 -1235 -1606 987 1671 -831
4641h31j081K230L38j986K51L247L45l060p05J715Nk445Q11L118m50l052J63K081
$$ -831 -1912 318 656 -1330 -1079 2168 2513 -547 -1252 463 468 -1977 -1166 1952 1502 -1550 -1387 694
4659F94m97j878J696K921j289l179M60J930j327j898K361K682j916k855J288K092
$$ 694 197 -1681 15 2936 1647 -1532 -1072 858 -469 -2367 -6 2676 760 -2095 -807 1285
4675A285j565j143K851J716k705k691J488J709k213q03L417J406l040k039K488
$$ 1285 -280 -1423 1428 3144 439 -2252 -764 945 -1268 -2071 1346 2752 -288 -2327 161
4690A61J166k029o30L648O60m075j338K197Q17k322M96L714o8l807o81K884J04
$$ 161 1327 -702 -1332 2316 2976 -1099 -2437 -240 577 -1745 -1249 2465 2397 -1410 -2091 793 897
4707H97k285R87L437j388m008K41K819m80k137K160L101j999l714J053K740j206
$$ 897 -1388 -401 3036 1648 -2360 -2119 700 220 -1917 243 3344 1345 -2369 -1316 1424 218
4723B18j845K345K430k913l446J764K409j633r94L125J906l481k781K487J873
$$ 218 -1627 718 3148 235 -3211 -1447 962 -671 -1665 1460 3366 -115 -2896 -409 1464
4738A464j926q56L215P85l989j856K766J596k158J48L866k25m503q64L082P25
$$ 1464 -462 -1318 1897 2682 -1307 -3163 -397 1199 -959 -811 3055 2830 -1673 -2537 545 1270
4754A270k607M91L488r84m495J40L528P4k055J441L029j891m235N91L423o48k270
$$ 1270 -1337 -846 2642 1658 -2837 -2697 831 905 -1150 291 3320 1429 -2806 -2215 1208 560 -1710
4771a710K039K543k733l550J877L296j218j509K396J712l249l236K389K391j463
$$ -1710 329 2872 139 -3411 -1534 1762 544 -965 1431 3143 -106 -3342 -953 1438 -25
4786b5j300K600J118l449k149L043K233k054n96K719M51m171j537L282J335k315
$$ -25 -1325 1275 2393 -1056 -3205 -162 2071 17 -579 2140 2591 -1580 -3117 165 1500 -815
4802h15j87L230p63l728k88L619P34k275M21K606j490l869M53L513J51k399J098
$$ -815 -1002 2228 1465 -2263 -2551 1068 1802 -473 -52 2554 1064 -2805 -2352 1161 1312 -1087 11
4819A1K627k130l359J443L433p04k182J484J598k533l054K268K623r58j479J711
$$ 11 2638 508 -2851 -1408 2025 1321 -861 623 2221 -312 -3366 -1098 1525 567 -912 799
4835G99J724l318k180K784K341j584j439K020M51l383j437L316J814k092m99K439
$$ 799 2523 -795 -2975 -191 2150 566 -873 1147 1598 -1785 -3222 94 1908 -184 -683 1756
4851A756k11l587l36L314R35k297l42K311r26l278L13L460N81k176M23J728j160
$$ 1756 1545 -2042 -2378 936 1871 -426 -768 1543 617 -2661 -2348 1112 1693 -483 -60 1668 508
4868E08k924Q27L110p1k442O38J829k065k076J662K851p53j781J414R96k327j607
$$ 508 -2416 -1589 1521 1450 -992 -354 1475 -590 -2666 -1004 1847 1094 -687 727 1723 -604 -2211
4885b211K035K045j515j603J482P62k080j235K558J820j548j028J371M47k520
$$ -2211 -176 1869 354 -1249 233 995 -1085 -2320 238 2058 510 -518 853 1300 -1220
4900a220q21K646J106k183n79J797k66k230M46K547M90j978j83J631p71k047M71
$$ -1220 -2041 605 1711 -472 -1051 746 480 -1750 -1304 1243 1733 -245 -428 1203 432 -1615 -1144
4917a144K345k07j814L51J412q10j737J182K180o89j755N80R78j028j688J355
$$ -1144 1201 994 -820 -469 943 133 -1604 -422 1758 1069 -686 -106 872 -156 -1844 -489
4933d89J955j129j325R24R07j196j002J888J081j020j265P63L60j394n52J748
$$ -489 1466 337 -988 -64 843 -353 -1355 533 1614 594 -671 92 452 -942 -1494 254
4949B54R26j482l39J149L66j501j21J753L89j561o77J186k39j264K69J646o5j174
$$ 254 1180 -302 -641 508 874 -627 -748 1005 1394 -167 -844 342 103 -1161 -892 754 689 -485
4967d85M3J210n43r79N49J324n47j214J07R70o56r37R59J148n11j045O33O38q27
$$ -485 -442 768 225 -754 -205 1119 572 -642 -535 435 -221 -1158 -199 949 438 -607 26 664 -163
4986a63l89N48Q29j002o29M88N24m66m74J085O50r07l69O56J20q25pP67j4p93
$$ -163 -552 -4 825 -177 -806 -318 206 -260 -734 351 1001 94 -275 381 501 -324 -331 436 422 -371
5006c71l54Q08o6l71n0Q76K16o69k57O27j27o96OP74j85o78l9O26q2l22L27O58
$$ -371 -725 83 17 -354 -404 472 688 19 -238 389 262 -434 -428 346 161 -517 -556 70 -12 -334 -7 651
5028F51j88o85J50L26k69k80J07O27o32j23J10M00j09k84N09L07n98l63M71r6
$$ 651 463 -222 -72 254 -15 -295 -188 439 -193 -316 -206 194 85 -199 310 617 19 -344 127 31
5048C1L6m01L37K13m34j70M22N14l59j87L97j3k98l67L20J13l89p0K90J49r8j10
$$ 31 67 -334 3 216 -218 -388 34 548 189 2 399 386 88 -279 41 154 -235 -305 -15 134 36 -74
5070g4K59K29k26o4L28l60k04p8R9P0k58P5J24mj68L05L39n0l02k49L71k08k45
$$ -74 185 414 188 124 452 92 -112 -190 -91 -21 -279 -204 -80 -84 -252 53 392 342 40 -209 162 -46 -291
5093b91k5J46NR1Q2J92j82q1J31L7J40j50p7P3j88j02qK53j10k20L74J5J7J15
$$ -291 -316 -170 -165 -74 8 200 18 -63 68 105 245 95 18 91 -97 -199 -207 46 -64 -284 90 105 122 237
5117B37p5J28j29k86R2J0l33K02J06q1K0K2J02L08l29j47M99l84j9j59L66k35
$$ 237 162 290 161 -125 -33 -23 -356 -154 -48 -129 -109 -87 15 323 -6 -153 346 -38 -57 -216 150 -85
5139h5j45M5J91J68j64J24J36Ok63M6j3l3m15K67Q9r0j04K07J79k17J0L30k29
$$ -85 -230 -185 6 174 10 134 270 276 13 59 46 13 -402 -135 -46 -136 -240 -33 146 -71 -61 269 40
5162D0N1j11R1p6q3l27L05R8k89J22K66M9n4o1J61J57m57o2K01j03k35L0M77o0
$$ 40 91 -20 71 -5 -88 -415 -110 -12 -301 -179 87 136 82 21 182 339 -118 -180 21 -82 -317 -287 190 130
5186A30k95J83L14o4k73J84K36l27k05R6K84m47l16L95L70m26M6L89K96p31p7
$$ 130 -165 18 332 268 -5 179 415 88 -117 -21 263 -184 -500 -105 265 -161 -115 274 570 -161 -238
5207b38L58Q5m22j66N17Q7n93j98O63K12l60O6M08k10n18k8P12k02m09k93P48
$$ -238 120 205 -217 -383 134 221 -372 -570 93 305 -55 11 419 209 -309 -337 375 173 -236 -529 219
5228B19k02o96K80Q43m8l75m1N73m29p66M38O61m29n23K99O51n59n17P23O99l23
$$ 219 17 -679 -399 444 396 21 -20 553 124 -642 -204 457 28 -495 -196 455 -104 -621 102 801 478
5249D78o48O06Q3r11m16Q25L90m72m54P26M48j067l87J100M49p62k46P83j55r51
$$ 478 -170 436 519 -392 -808 17 407 -65 -519 207 655 -412 -799 301 750 -12 -258 525 370 -581
5269e81k21J198N2r25K41O33j45j052K94J357k14j036K46N69m75j235Q71J310
$$ -581 -802 396 448 -477 -236 397 252 -800 -506 851 637 -399 -153 416 -59 -1294 -423 887
5287H87l11j033P15N18q60q13O59J163n46r78O95M80j081p14J037J396j063p19
$$ 887 576 -457 258 776 -84 -897 -238 925 379 -599 96 576 -505 -1219 -182 1214 151 -568
5305e68Q68M22j187n22J475O90j294o01R94J61j476j68J693O07j290o8R03k92
$$ -568 300 722 -465 -987 488 1178 -116 -717 277 438 -1038 -1206 487 1094 -196 -264 639 347
5323C47j254J53J645J50j709L26P99m04j463R05J787m67j287M49P17r43r59R85
$$ 347 -907 -754 891 1041 -668 -342 457 53 -1410 -505 1282 815 -472 -23 694 -249 -1208 -223
5341b23J622p27j442N82P98j121q44J504J676j187j312P95N14j256o45J788R52
$$ -223 1399 672 -770 -188 610 -511 -1355 149 1825 638 -674 121 635 -621 -1266 522 1474
5358A474j406r50J226K01j669M2K147N68j723p01J281q4j671J81K191R0j596l54
$$ 1474 68 -882 344 545 -1124 -1082 1065 1633 -90 -791 490 406 -1265 -1084 1107 1197 -399 -753
5376g53J295o10j012O45J947j63j935j53J385j008j046J041K015q52j718O03J022
$$ -753 542 -68 -1080 -435 1512 1349 -586 -739 646 -362 -1408 -367 1648 796 -922 -319 703
5393G03j079r83J561J551q76j975Q50P98j145q03J911J250j572j328J266M19j215
$$ 703 -376 -1359 202 1753 877 -1098 -248 550 -595 -1398 513 1763 191 -1137 129 548 -667
5410f67m15J993P94j908r80J011O14j633R9K409J93j989p08J464J29j605Q72J888
$$ -667 -1082 911 1705 -203 -1183 -172 442 -1191 -1092 1317 1510 -479 -1187 277 406 -1199 -327 1561
5428A561l00k219j71J366o6j332Q85K007p14k066M27J255o51j210J572J565j293
$$ 1561 1261 -958 -1129 237 171 -1161 -276 1731 1017 -1049 -622 633 -18 -1228 344 1909 616
5445F16k050Q81J135j126o22J683J354j487j718R61R19r63n20J889P52k116j007
$$ 616 -1434 -553 582 -544 -1166 517 1871 384 -1334 -373 546 -417 -937 952 1704 -412 -1419
5462a419J102O88r62j35J995K66j818r08J345M69j245JJ998j49k305k79J661K85
$$ -1419 -317 371 -591 -726 1269 1535 -283 -1191 154 623 -622 -621 1377 1228 -1077 -1356 305 590
5480E90j409P30J698p27k047J86J438j85j140Q09J808j209j930N41J434o37o14
$$ 590 -819 -89 1609 882 -1165 -979 459 274 -866 -57 1751 542 -1388 -847 587 -50 -664
5497f64J320J206j526j843Q91J236p02p37J409O95j600j119J064J075p17l76J349
$$ -664 656 1862 336 -1507 -616 620 -82 -819 590 1285 -315 -1434 -370 705 -12 -388 961
5514I61L70j946o76J107Q63j330J60J486q4j835l38J524L95r52J46J258l10j800
$$ 961 1331 -615 -1291 -184 679 -651 -491 995 911 -924 -1262 262 657 -295 -149 1109 799 -1001
5532a001k53J492N6r32N67J324p88j709K34J556l05q35Q18J016r80j704O21J285
$$ -1001 -1254 238 294 -638 -71 1253 465 -1244 -1010 546 241 -594 224 1240 260 -1444 -823 462
5550D62l03q69J124O27j110j090R06R61m00p56J065L14j313p91J174O35o69l31
$$ 462 159 -710 414 1041 -69 -1159 -253 708 308 -448 617 931 -382 -1173 1 636 -33 -364
5568c64J042J17j159n55R83P57q92k62J074l95j085q6Q11M74p18J70Q74l50j254
$$ -364 678 795 -364 -919 64 821 -71 -333 741 346 -739 -825 -14 460 -258 -88 786 436 -818
5587h18J2J220P0r33K86P20o13p94L49J133J49j140L77P08o44p00M18Q29n26n95
$$ -818 -806 414 484 -449 -163 557 -56 -850 -501 632 781 -359 18 726 82 -618 -200 629 103 -492
5607d92N00M83o77o70P87O82n36l42N99J83o60o20Q59L50m58l60O61J81q73r8
$$ -492 8 491 -186 -856 -69 613 77 -265 334 517 -143 -763 96 446 -12 -372 289 470 -403 -501
5627e01N98M12o57j67O96k29m51k43P27K26r10L44N12j21q20J58R14n4p08M8N15
$$ -501 97 509 -148 -315 381 152 -299 -542 185 411 -499 -155 357 236 -584 -426 488 434 -274 -226 289
5648B89j83n45K10N19j62m55L02M14m98l38L97M18r2l70J90%j25n25M31L50k42
$$ 289 106 -439 -229 290 128 -327 -25 389 -109 -447 -50 368 276 -94 96 96 -29 -554 -123 227 -15
5669a5k68L41J73k40m25N08K03k73k46J90k1k57j31O31J8l32J41K92j52k58k0
$$ -15 -283 58 231 -9 -434 74 277 4 -242 -52 -73 -330 -461 170 188 -144 -3 289 137 -121 -141
5690a41K97N3l82Q2K25j65k34J59K49Q0k00oJ27j39p8k9K17o9k80K40M6ml26J52
$$ -141 156 209 -173 -91 134 -31 -265 -106 143 223 23 17 144 5 -73 -102 115 46 -234 6 52 48 -278 -126
5714a26K62K2l30K24J42l48r8O1K80k02N7Q8K25l18j35K02M8j98L18k05L9m7k48
$$ -126 136 158 -172 52 194 -154 -252 -191 89 -113 -56 32 257 -61 -196 6 54 -144 174 -31 8 -39 -287
5737b87L37j3j84K46j95J17P8k87L52j26j09k14L37J52k50JJ6J05j03N7l2R5l47
$$ -287 50 37 -147 99 -96 21 99 -188 164 38 -71 -285 52 204 -46 -45 -29 76 -27 30 -2 93 -254
5760b54K44N0k6k19J98Q1o1M8m6J13l05L3j7L35N5j79l6J09p2n1k7K16k90j18
$$ -254 -10 40 14 -205 -7 74 13 61 15 128 -177 -144 -161 174 229 50 14 123 51 0 -27 189 -101 -219
5784b19k8L92j17m9L8R5j71o0J74K55r2l58O4J17j27n2J06l9o4j71K84J41j06
$$ -219 -247 145 28 -21 17 112 -59 -119 55 310 218 -140 -76 41 -86 -138 -32 -71 -135 -306 -22 119 13
5807A3l1R4L3l8k84L42n6j4j80J9P2J53K3k58K12l40M4K24n5j8R8j6R3k34L8J20
$$ 13 -18 76 109 71 -213 129 73 59 -121 -102 -30 123 146 -112 100 -240 -196 28 -27 -45 53 37 130 -104 -66 54
5833E4j64J89M3l1k20M8N3L27m51O6J69L3k39j38K89qR7j80L19l10L3j0J85q1
$$ 54 -110 79 122 91 -129 -81 -28 299 -152 -86 83 116 -123 -261 28 20 117 -63 256 -54 -21 -31 154 73
5857G3j28J57L2l83K71O0n8L0m01L35J54M0k04O6L8k5o8n7j1q4k4L37o1j81J34
$$ 73 -55 102 134 -249 22 82 24 54 -347 -12 142 182 -22 44 82 57 -11 -68 -79 -163 -187 150 89 -92 42
5882D2J2J72l01j86J30K22k92l1M64l2j25J4J24J8l04j08L00P2l41r0M69j11l15
$$ 42 54 226 -75 -261 -131 91 -201 -232 232 200 75 89 213 231 -73 -181 119 191 -150 -240 229 118 -197
5905a97k5M44j26k44J16J74N7j84j29L80j35m71J29M43q0l11R0N44m42k01L27
$$ -197 -222 222 96 -148 -32 142 199 15 -114 266 131 -340 -211 232 152 -159 -69 475 33 -168 159
5926A59k6r6k73J94K40l52j30K41K86m20lL36J73m51k33M58N6k33j08M25Kl94
$$ 159 133 37 -236 -42 198 -154 -284 -43 243 -177 -180 156 329 -122 -355 103 159 -74 -182 243 245 -149
5948a49j00K87K91n71K28L71o7n64r4N78m2l74J79L28j72o11L92M39k73k74K49
$$ -149 -249 38 329 -242 -14 357 290 -274 -368 210 168 -206 -27 301 129 -482 -90 349 76 -198 51
5969E1M45n78l39K40N17k72l33L86K55m98l65M95L81j74l69L96N6m66q2L65M14
$$ 51 496 -82 -421 -181 336 64 -269 117 372 -126 -491 4 385 211 -158 238 294 -172 -254 111 525
5990E25o73j12N88Ln90k21N21K39m01r4O39j60o40NN38K53o26oN31j43p08L52
$$ 525 -148 -260 328 331 -259 -480 41 280 -121 -215 424 264 -376 -371 167 420 -206 -212 319 176 -532 -180
6012a80K52J14m12Q1O00m95m85J76P85l29j47M4L12l07p12N10O74j81n05L30J37
$$ -180 72 186 -226 -145 455 -40 -525 -349 436 107 -40 4 316 9 -703 -193 481 300 -205 125 262
6033B62o30l37P75N12l45n48O80j0p76k04Q27L44n10j13L63J26r42j22Q48K43
$$ 262 -368 -705 70 582 237 -311 369 359 -417 -621 206 550 40 -73 290 416 -526 -648 200 443
6053D43p40m2O83k22m95m45J096J75n78PL77j84q19M16N97J8o67K25N77m09o23
$$ 443 -297 -339 344 122 -373 -818 278 453 -125 -118 259 75 -744 -328 269 287 -380 -155 422 13 -610
6074f10L02P96k8o60K37M71o99n31O83N48k99m59L23J64m16l72N74M58m24l52
$$ -610 -308 488 460 -200 37 508 -191 -722 -39 509 210 -249 74 238 -178 -550 24 482 58 -294
6094b94M75J71p47j27P56K92n02m13N87oo26k12J024J71n03k39M63r2o63L51P71
$$ -294 181 352 -395 -522 234 526 24 -389 198 192 -434 -646 378 549 46 -193 270 178 -485 -134 637
6115F37j23o56l0O73m73m48R3P52%o22K01L25n42m59M46P50j91o03L21J29m11
$$ 637 514 -142 -172 501 28 -420 -327 425 425 -197 4 329 -213 -672 -226 524 333 -270 51 180 -231
6136b31m81R11M36l74o25L95J95n14P1L06O79q00l66O06R8o39k6O49M24r08o4
$$ -231 -712 199 635 261 -364 31 226 -288 -217 89 768 -32 -398 208 306 -333 -359 290 714 -194 -258
6157b58M00Q3p09K5R55P6o68k89P85m40m85J71R61k20o79%O50n65m75N90O34n26
$$ -258 142 225 -484 -459 496 572 -96 -385 400 -40 -525 -354 607 387 -292 -292 358 -207 -682 -92 542 16
6179A6l83K31M12n86j76M31N65j90o34L43L20n38k81O80J78l78l18L29J18m24
$$ 16 -367 -136 276 -310 -486 -55 510 320 -314 29 349 -189 -470 210 388 10 -308 21 139 -285
6199b85j18O61L96q26k02M35J93n07K9N99J95o29k79N13q5m63K50O78m29l89M1
$$ -285 -403 258 654 -172 -374 61 254 -253 -224 375 570 -59 -338 175 90 -373 -123 555 126 -263 -222
6220b22M48j74m76J57P57k19o37J02M32o9l78K96M29j89n67K01L60l35j32L34
$$ -222 226 52 -424 -267 490 271 -366 -264 168 99 -279 17 446 257 -310 -109 251 -84 -216 118
6240A18K57k49m87K31K79k59k43O11J88n62k04K33L26l86l8L10K54o08j82L01
$$ 118 375 126 -361 -130 149 -110 -353 258 446 -116 -320 -87 239 -147 -185 125 379 -229 -411 -110
6260a10K92m34K79L09Q8q92J84K57K60k17J58J1j05k04k93M17O6k50P0M56k05
$$ -110 182 -252 27 336 424 -468 -284 -27 233 16 174 185 80 -124 -417 0 66 -184 -114 342 137
6281A37m75J89K88jl24P4L20j71l22k0L65j56J60PM6k76q0K72J30r3j74K13K53
$$ 137 -338 -149 139 138 -186 -112 208 37 -285 -305 60 -96 64 71 117 -159 -239 33 163 70 -104 109 362
6304C62l35l53K70M0J29j68K16o9o0j49k3L28j84j45J91K41n38J25NK24r6k4J34
$$ 362 27 -326 -56 -16 113 -55 161 92 32 -117 -140 188 4 -141 50 291 -247 -122 -117 107 11 -13 121
6327A21j25m0o0K8Q9L0r8K80j44k92K15J06n5j33J36O0k67L8rL1Q7l9j5J52j15
$$ 121 -4 -44 -104 -76 13 43 -55 225 81 -211 4 110 55 -78 58 118 -149 -111 -120 -89 -2 -41 -56 96 -19
6352a9K2P4R8p4j61J84n2k21n9L6K87j96J14j4R2k14M8q4l3K8J39J82j47j6j67
$$ -19 3 77 175 101 -60 124 72 -149 -208 -172 115 -81 33 19 111 -103 -55 -139 -172 -144 -5 177 30 14 -153
6377a53J94L7O4K5QM3m26L34N9k00j45K33r4j44J53K8O7j7k41J15R7K5k87J53
$$ -153 41 78 142 167 175 218 -208 126 185 -15 -160 73 -21 -165 -12 16 83 66 -175 -60 37 62 -225 -72
6401g2J71j42L0j74J69n9o7R7m8M2J02j27O4j55n8K21M8M2k42K00j02Q1j8m2n5
$$ -72 99 -43 -13 -187 -18 -77 -144 -47 -95 -53 49 -78 -14 -169 -227 -6 42 84 -158 42 -60 21 3 -39 -94
6426i4J03JJ26k84K3J23p3K26j72j64L92q0j91r3K59Jj52j7P9L2l4n5J34j99J93
$$ -94 9 10 136 -148 -125 -2 -75 151 -21 -185 207 127 -64 -157 102 103 -49 -66 13 45 11 -44 90 -109 84
6451H4q9M5NK7r9O7p9m4J47Q8j05n6Q1n9kp5J91l13J43jl1J35mL0o1K1Qk39J35
$$ 84 -5 40 45 72 -27 40 -39 -83 64 152 47 -9 72 13 11 -64 127 -186 -43 -44 -75 60 56 86 25 46 54 -185 -50
6480e0R6k14K30j6L4l2j9j49J28LP9j17J0k9n0K97j80j50J6L19k24L8J39k66R8
$$ -50 46 -168 62 46 80 48 29 -120 8 11 90 -27 -17 -46 -96 201 21 -129 -113 206 -18 20 159 -107 -9
6505iJ47m9l7j09K15k10Jm4l7K08n5j35O5Q9K4L9k74N3J44j1n2J68l5q4j04P9
$$ -9 138 89 52 -57 158 -52 -51 -95 -132 76 21 -114 -49 40 64 103 -171 -118 26 15 -37 131 96 12 -92 -13
6531a3R5j27J66p6j01K3R1ko9j32K73j35Mk6J5n0J20Q7k66J54K15l00J25m5o6
$$ -13 82 -45 121 45 -56 -33 58 56 -13 -145 128 -7 -3 -29 -14 -64 56 143 -123 31 246 -54 71 26 -40
6556d0j17R6J19K30m31L09j97N4Jm1K45k83OJ2K3N0k6Q5j2j94o6N5K92j13k97
$$ -40 -157 -61 58 288 -143 166 -31 23 24 -17 228 -55 -49 -37 -14 36 10 95 83 -111 -177 -122 170 57 -240
6581b40K29J26j44L2J5K1j24m1L13j76j02q3L52l1p3m6J22j45l90L07K78q5j39
$$ -240 -11 115 -29 3 18 39 -85 -126 187 11 -91 -174 178 147 74 28 150 5 -385 -78 200 115 -24
6604b4J97k43M9K4l1N8N0j5j76K54o0j1JJ79k69j31J98J09k31M8J50J18k23k65
$$ -24 173 -70 -21 3 -28 30 80 65 -111 143 83 72 73 252 -17 -148 50 159 -72 -24 126 244 21 -244
6628b44K59R9m5r0K66j70p9k41M76k14k15J17L00k38j32j59L27P7k00P8J71j79
$$ -244 15 114 69 -21 245 75 -4 -245 231 17 -198 -81 219 -19 -151 -310 17 94 -106 -28 143 -36
6650c6Kj01K32l1j94R5O9J94l57O9P8j9J2N9J21j61j29K14Q1k44j72J65L08j47
$$ -36 -34 -135 97 66 -128 -33 36 230 -127 -58 20 1 13 72 193 32 -97 117 198 -46 -218 -53 255 108
6674A08k09L5j3j45J35K22R1k15q7L6K26j77r8J42K84l01j40K62m8O3k10K79k28
$$ 108 -101 -66 -79 -224 -89 133 224 9 -78 -42 184 7 -91 51 335 34 -106 156 108 171 -39 240 12
6697A2k69j8M87j42l36L76J26k53l43J21K97rj57j4K40j09k39j26O09l28J41P
$$ 12 -257 -275 212 70 -266 110 236 -17 -360 -239 58 49 -108 -122 118 9 -230 -356 253 -75 66 73
6719G3J87k04k55J82q3M4r1K57J22r6l46K94M0j06M0K80n9l57k46L66J47k40j53
$$ 73 260 56 -199 -17 -100 -56 -147 110 232 136 -210 84 124 18 58 338 279 -78 -324 42 189 -51 -204
6742b04M80Kn15m7M05J29k53J88K2N9m02j41M04j3l75K73O4O8n35K71L66l15j35
$$ -204 276 278 -237 -284 121 250 -3 185 207 266 -136 -277 127 114 -261 12 76 144 -391 -120 246 -69 -204
6765b04L58K53l86k30J78P8o4j21R2L39l63o1j75M29j71M5K06K0k65m74L76K41
$$ -204 154 407 21 -209 -31 47 -17 -138 -46 293 -70 -131 -306 123 -48 -3 203 223 -42 -516 -140 101
6787A01k99Q5K21K7l40q3N48M6m34p7L29R2n85j8M72J6r0K3L76l01n38M05L21
$$ 101 -198 -113 108 135 -205 -288 260 306 -128 -205 124 216 -369 -387 85 101 11 34 410 109 -429 -24 297
6810B97M9m93K17J84k79l45K09K53M4k99L17J45k40k77J60K77m09n3L48J98l92
$$ 297 346 -147 70 254 -25 -370 -161 92 136 -163 154 299 59 -218 -58 219 -190 -243 105 303 -89
6831h9k57J61M69k68j47K82J4m68kL37J57k77N9J94p3l78Q4L66k3j50o3K83o6
$$ -89 -346 -185 284 16 -131 151 165 -303 -305 32 189 -88 -29 165 92 -286 -202 164 141 -9 -72 211 145
6854A45k92q1M49j37k8k89L89j01m64J98M99j00m24K48J80o9m05J39L16J3k63
$$ 145 -147 -228 221 84 56 -233 156 55 -409 -211 288 188 -236 12 192 123 -282 -143 173 186 -77
6875g7J29J66k44m06K90L90j40j53Q1K15k81k84L15K50k42j43M57j43l27p2L33
$$ -77 52 218 -26 -432 -142 248 108 -45 36 251 -30 -314 1 251 9 -134 323 180 -147 -219 114
6896A14J26j33j99J37N6m87K00K75J05l91J58J74j29j59j25N49q5l17k7L19j11
$$ 114 240 107 -92 45 101 -386 -186 89 194 -197 -39 135 6 -153 -278 271 186 -131 -158 161 50
6917E0j99N8K59j43j33J26K34l02k31K58K99q7l5m2p0q3k43L01K65k06k64J85
$$ 50 -149 -91 168 25 -108 18 252 -50 -281 -23 276 189 154 112 42 -41 -284 17 282 76 -188 -3
6939cQ2p4j72K58q0N8k38J39RR6k81L32O6k94j23K06k5j90K01J24O6j06k67K72
$$ -3 79 5 -167 91 11 69 -169 -30 -21 75 -206 126 192 -102 -225 -19 -44 -234 -33 91 157 51 -216 56
6963E6k32o3K47o0J78j57J2J34k1j97m8J97J65m09M5K41L9l07J41K34j60o1l0
$$ 56 -176 -239 8 -52 126 -31 -19 115 94 -103 -151 46 211 -198 -153 88 127 -180 -39 195 35 -26 -56
6986e6L28j32k72M2J15j68j00K44K2K2j67L55P9l28p8J76k78J37n9J98N3k09j19
$$ -56 272 140 -132 -90 25 -143 -243 1 23 45 -122 233 312 -16 -94 82 -196 -59 -118 80 133 -76 -195
7009a95K26r8K2P9J56j32nJ04r6j27m0J14J59r9j48j4K66l2j08J18J95l82q9J4
$$ -195 31 -67 -45 34 190 58 53 157 61 -66 -106 8 167 68 -80 -94 172 140 32 150 345 -37 -126 -112
7033a12L31k83k49J24L11q3j32Q7j0P3j29j3J48L0K3k73J57P1k49J53N5o7M4k4
$$ -112 219 -64 -313 -189 122 39 -93 -6 -16 57 -72 -85 63 93 116 -157 0 71 -178 -25 30 -37 7 -17
7057a7N3j61J5QL09k52%N4m7j04P6K82r8j94K34k80n1J00Q1L8j3k08J29q0K12
$$ -17 36 -125 -110 -102 207 -45 -45 9 -38 -142 -66 216 118 -76 158 -122 -173 -73 8 46 33 -175 -46 -126 86
7082H6j88R1k3K9J51j75J73j34Q3Qk65M6jK05p5q7R6k3L3K7k20L13r1lk46J40
$$ 86 -102 -11 -34 -5 146 -29 144 10 93 101 -164 -118 -119 86 11 -76 20 -3 30 57 -163 150 59 56 -190 -50
7108e0k38L86k97Q3k6K56M9j75J05R2j93R7K5k05J91j19O2j56J74j8j36K1J46
$$ -50 -288 98 -199 -116 -142 114 163 -12 93 185 -8 89 114 -91 100 -19 43 -113 61 43 -93 -72 74
7131G4mj25M0m1Q7M1J7m5J09p6j35J04m5l2M6j99K70q6j5O3K5k25K21j60J91j32
$$ 74 70 -55 -15 -56 31 72 89 44 153 77 -58 46 1 -31 15 -184 86 0 -15 48 73 -152 69 -91 100 -32
7157c2j4KJ31n6p0K1PJ55k86J17j05J78j55R6J6m3K62j36p6rj19Q7L3J39j67k4
$$ -32 -46 -44 87 31 -39 -18 -11 144 -142 -25 -130 48 -107 -11 5 -38 224 88 12 3 -116 -29 4 143 -24 -48
7183d8K3J09j80L5r4M2J73J46j54j73J49k07J41rJ5J13K5j69R5P8j79o1K58j95
$$ -48 -25 84 -96 -61 -155 -113 60 206 52 -121 28 -179 -38 -47 -32 81 106 -63 32 110 -69 -130 128 -67
7207f7p6j47K00K11j56N4k55R6J08r1K21K26l65j06J44Q9P6k78j22J93p2J76m1
$$ -67 -143 -290 -90 121 -35 19 -236 -140 -32 -123 98 324 -41 -147 -3 86 162 -116 -238 -45 -117 59 18
7230A8m9o2M1O1K8O4p5J02P5j55n0n8J24j44R7k9J41j75K42j50O0j27QK08j80
$$ 18 -31 -93 -52 9 37 101 26 128 203 48 -2 -60 64 -80 17 -12 129 -46 196 46 106 -21 -13 195 15
7255A5M5J02m7j22J3RJ90k95J17M8%J06j92K51K7j64k19J69P7j22l3J01M0j07
$$ 15 60 162 115 -7 6 15 205 -90 27 75 75 181 -11 240 267 103 -116 53 130 8 -25 76 116 9
7279Ij18K97l74L1q4L06K69n65J02J81J99k55r5J68J3k08R0M4J74j9j14q1J20
$$ 9 -109 188 -186 -155 -239 67 336 -229 -127 54 253 -2 -97 71 84 -124 -34 10 184 165 51 -30 90
7302I0m35K66N54l05k18L6J51p4k09J9L63k02j32K80p1q4p9O6J20k44K1J0L26
$$ 90 -345 -79 475 170 -48 -12 139 65 -144 -125 238 36 -96 184 113 29 -50 16 136 -108 -87 -77 249
7325B49k94j93K37J40k93p6L14J89m97J0J76J75k06j72L19n2k47N7L70O6l65J0
$$ 249 -45 -238 -1 139 -154 -230 84 273 -224 -214 -38 137 -69 -241 78 26 -221 -164 206 272 -93 -83
7347h3R1L8q0J9J53J05m97L74J62m09j27K9L29k1j86K08J9j55J06q8N20l73l22
$$ -83 8 46 -34 -15 138 243 -254 120 282 -127 -254 -225 104 83 -103 105 124 -31 75 -13 507 134 -188
7370a88L08K2k95J26j12K41j17j92O4K39k40j50N11O0m13p3K67K3k27j57L16L30
$$ -188 120 142 -153 -27 -139 102 -15 -207 -143 96 -144 -294 217 277 -136 -209 58 81 -146 -303 13 343
7392C43l58p9L52j40m51J79M13j02l47L8K94Q6m69J57L45l0j34j48J66j76j14
$$ 343 -15 -94 258 118 -333 -154 259 157 -190 -152 142 228 -241 -84 261 231 97 -51 115 -61 -175
7413a75Q4K57o4l06K54Q6k20j73K14K51o0k61k3N02m88k07L34K63l56k00L26L9
$$ -175 -91 166 102 -204 50 136 -84 -257 -43 208 148 -113 -136 366 -122 -329 5 268 -88 -288 38 77
7435G7k11j59N79J56m22m00M49J15m16M9M07J05n11M6K04R6m72J55N22o5m01R1
$$ 77 -134 -293 286 442 20 -380 69 184 -232 -183 224 329 -182 -136 68 164 -308 -153 369 304 -97 -6
7457fJ89k04j69K1M31r6l15J84Q7j42k36K87K90j55k29Q9J00m17Q5N2N53k36l49
$$ -6 183 -21 -190 -169 262 166 -149 35 122 -20 -256 31 321 166 -63 26 126 -291 -206 -154 399 163 -186
7480a86J57L05l89p5L30J90k65k71K51%m02K09K83L49n84k68N44P4m48J0M49m2
$$ -186 -29 276 -113 -188 142 332 67 -204 47 47 -355 -146 137 486 -98 -366 178 252 -196 -186 263 221
7502B21l24j39K40oL0r8L46k34l30J52L03m5k00Q1L38r2l76j66K67p4j45K77K86
$$ 221 -103 -242 -2 -8 22 -76 270 36 -294 -142 161 116 -84 -3 335 243 -133 -299 -32 -106 -251 26 312
7525C12k67k09J15J01p5j01N54p6l06n09L67L7J41l53M74J31l72l18K89K64m42
$$ 312 45 -164 -49 52 -23 -124 430 354 48 -461 -94 -57 84 -269 205 336 -36 -354 -65 199 -243
7546b43J4M21J70o85o2M88nj08j27L66M8n67P5L32j39j47jL74Ll97L9L15j00l11
$$ -243 -229 192 362 -323 -385 103 98 -10 -137 229 277 -290 -215 117 -22 -169 -170 204 207 -190 -151 164 64 -247
7570b47K24J71O1m39O6K59j49j32J2N50m95j59J98K08j41j37K61J73l11j45J34
$$ -247 -23 148 209 -230 -164 95 -54 -186 -174 376 -119 -278 -80 128 -13 -150 111 284 -27 -172 -38
7591c8L15m82M4K78j27k04l8J90L08k15j81L78k5m55Q2K26J61k02j66L74j15j76
$$ -38 277 -205 -161 117 -10 -214 -252 -62 246 31 -150 228 203 -252 -170 56 217 15 -151 223 108 -68
7613f8O8J68J38l81Q9J47m8j20j33J09N1j35J86O1p1m20k6N77l1k21O7R6n9l30
$$ -68 0 168 306 -75 14 161 113 -7 -140 -31 20 -115 71 132 61 -359 -385 192 161 -60 7 103 44 -286
7637b86K30J59j03n5K73O1m59k2Q6L87m79K04J80k9l04R9J24K2n6j4j18J16k74
$$ -286 -56 103 0 -55 218 279 -180 -202 -116 271 -208 -4 176 147 -157 -58 66 88 32 18 -100 16 -258
7660b58L19m8J75o7k70L15j70n9l7J82j27J17J0J6k70Q3J1J66k6j19n5J64k84
$$ -258 61 13 188 121 -149 166 -4 -63 -100 82 -45 72 82 98 -172 -89 -78 88 62 -57 -112 52 -232
7683b32K1J38K77k56Q2j29K53j44N5j26J83j18j21K06n4j66J46n1L6J90l67J45
$$ -232 -211 -73 204 -52 30 -99 154 10 65 -61 122 4 -117 89 35 -131 15 -36 0 190 -177 -32
7705c2N9j78Q7Pn2J18M6L5j57J11p2P4r9Q4LR1j26j40J79J09k37l6%K46j85J6
$$ -32 27 -151 -64 -57 -109 9 55 90 -67 44 -28 46 -53 31 34 125 -1 -141 38 147 -90 -126 -126 120 -65 -49
7731d9NK05q7k9L5n3o7L3J33j02j83J21Q9l8kq0J24km6L1J31n0o7k39L03j89Q8
$$ -49 -44 161 74 45 80 27 -40 -7 126 24 -159 -38 51 13 11 -69 55 53 7 38 169 119 52 -187 116 -73 15
7758A5J6j10K44k34K52k75Q7J02J36k69N5jM7l0rpj64J42j15J77j42J71L9k3k45
$$ 15 31 -79 165 -69 183 -92 -5 97 233 -36 19 18 65 35 26 19 -145 -3 -118 59 -83 88 127 104 -141
7783a41K42n7q9j3p2K50j56n4K32K0r9l1j49J69%r7m0P6l1q2K99J5l20jJ02K03
$$ -141 101 44 -45 -58 -130 120 -36 -90 142 162 63 32 -117 52 52 -45 -85 -9 -40 -122 177 192 -128 -129 -27 176
7809A76j25Q1j82J24p3n9Q8M3L1q9P0M5k07P8m1j02Q6J70j23J39l6j46J77k47
$$ 176 51 132 -50 74 1 -58 30 73 104 15 85 130 -77 1 -40 -142 -56 114 -9 130 94 -52 125 -122
7833a22J52%P4j68L6O1m0m6l5K53q1k56L50o2j86Pj42J38K32j50r0J04k7j56K71
$$ -122 30 30 104 -64 -28 33 -7 -53 -88 165 84 -172 178 116 -70 -63 -205 -67 165 15 -75 29 2 -154 117
7858A17j85Q9j49O8J42J6j14J30k30M9j3M1P6j52O8kL6L3q2J26l5l6j40Q7K68
$$ 117 -68 21 -128 -60 82 98 -16 114 -116 -67 -80 -39 37 -115 -47 -49 -13 20 -62 64 29 -7 -147 -60 208
7883B08k44m8R0K09j93j67Q3J45j64K38j41R9l10K28K0L1n3J46J71k18k08J08
$$ 208 -36 -84 6 215 22 -145 -62 83 -81 157 16 115 -195 33 53 84 31 177 348 130 -78 30
7905C0m9J00j26J53p6J61l94L29oj17K8q0J05l30P0J10N0r2J06K37j96JnJ5p7
$$ 30 -19 81 -45 108 32 193 -201 128 122 5 33 -47 58 -272 -202 -92 -42 -134 -28 209 13 14 9 24 -53
7930e3j51J04Q4M2j97O7L01j60l5m1K38k70j08j07K39Q0l26L32L0r4j80K29Q3
$$ -53 -204 -100 -16 26 -171 -104 197 37 2 -39 199 -71 -179 -286 -47 33 -293 39 69 -25 -205 24 107
7953A07r5j13J66P8k84Q0KJ52j16k58K05K28j25j80K94k5j2j35r6J70j60k18L36
$$ 107 12 -101 65 143 -141 -61 -59 93 -23 -281 -76 152 27 -153 141 116 104 -31 -127 43 -117 -335 1
7976Al9j62J04J93J16l70qK06L5p1N3J38l2l66k1J98N0k00K11J28j56k44P3M35
$$ 1 -38 -200 -96 97 213 -157 -165 41 76 5 58 196 164 -202 -223 -25 25 -175 36 164 8 -236 -163 272
8000B72j97j13L7L4rl80K14L25j67k10K01K33j68m35K18K16q8j6N7k3k06q5L68
$$ 272 75 -38 -1 33 24 -356 -142 183 16 -194 7 240 72 -363 -145 71 -17 -33 24 1 -205 -290 78
8023G8m1j42Q7J41J68m20Q7J21M7l24PN38j08n38K22K44j62kr3M34j20m30P7M06
$$ 78 37 -105 -18 123 291 -129 -42 79 126 -198 -191 347 239 -299 -77 167 5 3 -90 344 224 -206 -129 277
8047B77k38k46K98R4j58m25K47M48k20m18M74K03m25j11L50P6k44L3J12p5l1k38
$$ 277 39 -207 91 185 27 -398 -151 297 77 -341 133 336 -89 -200 150 226 -18 15 127 52 21 -217
8069b17J75J11q7j51L87O6n94J1M20P4k18k55M40M3m12L4L30l3k94QL78j37l73
$$ -217 -42 69 -18 -169 218 284 -310 -299 121 195 -23 -278 162 205 -207 -173 157 124 -170 -162 216 79 -294
8092b94J01M29j85j75K22L4J10o03K34M66m3m92L31J58k91l23K33L06k10j20K83
$$ -294 -193 236 51 -124 98 132 242 -361 -127 339 296 -196 135 293 2 -321 -88 218 8 -112 171
8113A71N8m09k21M09K30j31k71L71q5n24j46O52J49l08j11J46J54l43K5L22j8
$$ 171 229 -180 -401 8 238 107 -164 207 122 -402 -548 104 253 -55 -166 -20 134 -209 -184 138 120
8134A20j11l1L89k15m04k36O12kk14k1L20j27l80J65M15j22l94J59J07J76p18
$$ 120 9 -22 367 152 -252 -488 124 122 -92 -113 207 80 -300 -135 280 158 -236 -77 30 206 -512
8155e12N36L80j40n33K48M05n48j68M49J51k67k69K47K13l73j85K29N38l87j89
$$ -512 24 404 264 -269 -21 384 -164 -332 117 268 1 -268 -21 192 -181 -366 -137 401 14 -175
8175a75K18J19k71q8L63Qk92KK87L3l69k9M02k3k25m3
$$ -175 43 162 -109 -197 166 174 -118 -116 171 204 -165 -194 208 185 -40 -83
8191h3
$$ Imaginary data points
##PAGE= N=2
##DATA TABLE= (X++(I..I)), XYDATA
0@%%%qJ6j6J6k4L3m1M9o5Q9j06J24j50J88k27K62l09L70m29M95n75O63p62Q67
$$ 0 0 0 0 -8 8 -8 8 -16 17 -24 25 -40 49 -57 67 -83 105 -122 140 -169 201 -228 267 -308 355 -407 460
27D60r81J116j267J427j603J800k017K252k509K797l111L448l821M236m696N198
$$ 460 -521 595 -672 755 -848 952 -1065 1187 -1322 1475 -1636 1812 -2009 2227 -2469 2729
43B729n751O372p066P844q725R738j0911J2282j3913J5902j8385K1577k5868L1977
$$ 2729 -3022 3350 -3716 4128 -4597 5141 -5770 6512 -7401 8501 -9884 11693 -14175 17802
57A7802m1436N8173r6507L34920Q2177o45393J52824K40883k30710k59686M69101
$$ 17802 -23634 34539 -61968 272952 355129 -290264 -137440 103443 -127267 -386953 82148
68H2148L93832l50545m71059K09304K50780k43267j21796M99482K82876m39869
$$ 82148 475980 125435 -345624 -136320 114460 -128807 -250603 248879 531755 91886
78I1886l96297K24091J50089k93284m0467M93256J67510m55869k52750K95813
$$ 91886 -304411 -80320 69769 -223515 -263982 229274 396784 -59085 -311835 -16022
88a6022J12674k65910O6915M65695K1990m98947j75965K80771J2539k61750J53737
$$ -16022 96652 -169258 -102343 363352 385342 -113605 -289570 -8799 3740 -258010 -104273
99a04273M38864p0148m55118l5771L09903l7442k23749K18227L58990k05110m56369
$$ -104273 334591 264443 -190675 -226446 83457 46015 -177734 40493 399483 194373 -261996
110b61996K9913K72756j03454j73950K91477L14347k56565l71373J36972K53713
$$ -261996 -232083 40673 -62781 -236731 54746 369093 112528 -258845 -121873 131840
120A31840j49442j32980L02708K00490l49085l27438J84252K04491j71210n2861
$$ 131840 -17602 -150582 152126 352616 3531 -323907 -139655 64836 -106374 -159235
130a59235L45753J42636l55975k25383K37708J45428k03080j9250L06845K4268
$$ -159235 186518 329154 -26821 -252204 -14496 130932 -72148 -91398 215447 239715
140B39715l87899j50053K61135R9006j79557O7196L10518l3951l58461o1624K55426
$$ 239715 -148184 -298237 -37102 61904 -117653 -50457 260061 226110 -132351 -193975 61451
151F1451K1052j91387Q9182K45383j24862l34639K0614K58103p348j37811J56726
$$ 61451 82503 -108884 -19702 225681 100819 -233820 -213206 44897 37549 -100262 56464
162E6464K16503j70981k88793P4961K10126p8587j32526J61987J45851k17558
$$ 56464 272967 101986 -186807 -111846 98280 19693 -112833 49154 195005 -22553
172b2553k26577J44984K00911q4308p1400J95747R7096k47481j83563J58703J34062
$$ -22553 -249130 -104146 96765 12457 -58943 136804 233900 -13581 -197144 -38441 95621
183I5621j33114n5803J87163M2624k43883j02610K06699J16946j22389n671J82783
$$ 95621 -37493 -93296 93867 136491 -107392 -210002 -3303 113643 -8746 -14417 168366
194A68366j5884k54633o6850J87224M7947j40197K0834J67820m6657k11539J3503
$$ 168366 152482 -102151 -169001 18223 66170 -74027 -53193 114627 67970 -143569 -130066
205a30066K03654K5325j20460M9256J29752j01355k03560L4528J61481k5407j05287
$$ -130066 73588 98913 -21547 27709 157461 56106 -147454 -112926 48555 23148 -82139
216h2139P8883J13329j04820j39366R2363J48287m8477q5060Q0768N7522j44192
$$ -82139 -3256 110073 5253 -134113 -41750 106537 58060 -27000 53768 111290 -32902
227c2902j20223R9100J06007o8179m9128J05747M7011j25107n8978J24285P5413
$$ -32902 -153125 -54025 51982 -16197 -65325 40422 87433 -37674 -96652 27633 103046
238A03046q6905l9319Q3804p167j42302l7020J21313M7094p7147L249J00866r554
$$ 103046 16141 -23178 60626 53459 -88843 -125863 -4550 42544 -34603 -31354 69512 59958
250E9958j13583L647J14736Q982r2681j172O6847m6744j07654K5736J08846J890
$$ 59958 -53625 -49978 64758 73740 -18941 -20113 46734 -10 -107664 -81928 26918 28808
262B8808o2211L6331P2351m4734q1293L8867P8100l4902p1069K5637L9703n9733
$$ 28808 -33403 2928 75279 30545 -50748 -11881 66219 31317 -39752 -14115 25588 -34145
274c4145n7944N9348P4719k4463l4330M8337L4189n8272m3218M8301L3328n2040
$$ -34145 -92089 -32741 41978 17515 -16815 31522 65711 7439 -35779 12522 45850 -6190
286f190l7331L5999J2912n1721j1258O5877L5413l3249o663M1842j765n5921j1762
$$ -6190 -43521 -7522 5390 -46331 -57589 8288 43701 10452 3789 45631 43866 -12055 -23817
299b3817M0658j281m7732n951L5821m213l3400J8833N4093N912k9650P577K6316
$$ -23817 16841 15560 -32172 -38123 -2302 -6515 -39915 -21082 33011 38923 9273 16850 43166
312D3166k2251m2750N095K5483j6917l0856J3612K8804q566j4360K8161L3526
$$ 43166 20915 -21835 -16740 8743 -8174 -39030 -25418 3386 -5180 -19540 8621 42147
324D2147r940k2465Q272Q905k7124k6740R133J2689j4901j1941J9443J9864m591
$$ 42147 32207 9742 18014 26919 -205 -26945 -17812 -5123 -20024 -31965 -12522 7342 2751
337B751j376K0844J2874j4010j4108J886m114k0660j1469P764N228n023L751J7500
$$ 2751 1375 22219 35093 21083 6975 8861 4747 -15913 -27382 -19618 -14390 -19413 -15662 1838
351A838J0923M47M277Q206k557j2676q912n043j0040j0351n58O228L404N117J1692
$$ 1838 12761 13208 17485 25691 23134 10458 1546 -3497 -13537 -23888 -24446 -18218 -14814 -9697 1995
366A995J1601M042R78K480k435j0791j1314o485o296p410j658N593P760O388Q583
$$ 1995 13596 17638 18616 21096 18661 7870 -3444 -9929 -16225 -23635 -25293 -19700 -11940 -5552 3031
381C031J0867O560J23k832l413p238j0965r394n065k420p62L386Q361J0407Q164
$$ 3031 13898 20458 20581 17749 14336 7098 -3867 -13261 -18326 -20746 -21508 -18122 -9761 646 8810
396H810N958N183K342l460q015q577p584p680p155k120L036N854O346Q195R681
$$ 8810 14768 19951 22293 18833 10818 2241 -5343 -13023 -20178 -22298 -19262 -13408 -7062 1133 10814
411A0814O875K661j000l390o835q470q825p471l990l78L218N476P977J0284P929
$$ 10814 17689 20350 19350 15960 9125 655 -8170 -15641 -19631 -20009 -16791 -11315 -3338 6946 14875
426A4875L337J991J374m202j1213r730m287n504q444l72J0321Q294J669O792J4174
$$ 14875 18212 20203 21577 17375 6162 -3568 -7855 -13359 -21803 -22175 -11854 -3560 -1891 4901 19075
441A9075N506p906m136M435o302j8999j0013N074j198j0079M976K1038R345o173
$$ 19075 24581 16675 12539 16974 10672 -8327 -18340 -13266 -14464 -24543 -19567 1471 10816 4643
455D643M825J6497j019j8069l770Q982r953k4625k777J4721j419j0427J4670K7649
$$ 4643 9468 25965 24946 6877 3107 12089 2136 -22489 -25266 -10545 -11964 -22391 -7721 19928
469A9928P75j5061P316J5277j3515k2982N517J1791j9283k4462J1426K0229q700
$$ 19928 20703 5642 12958 28235 14720 -8262 -2745 9046 -10237 -34699 -23273 -3044 -11744
482a1744o497K9304K5026j8524j9387J6521Q943k9731j8203K3723R327l3989j6092
$$ -11744 -18241 11063 36089 17565 -1822 14699 23642 -6089 -24292 -569 8758 -25231 -41323
495d1323L1619J7536k1015M014M5108J0335m2466j5285K8412k782m2851o29M1950
$$ -41323 -9704 7832 -13183 -9169 35939 46274 3808 -11477 16935 14153 -28698 -29327 12623
508A2623l976m7964J735M8984L994l1706K1610N2344j7195o1035K46L7791k0026
$$ 12623 8647 -39317 -37582 11402 15396 -16310 5300 57644 40449 -20586 -20340 17451 -2575
521b575m4258K6441N0028k6849n2226K6591N3705j6978l1002M2925M2367n1057
$$ -2575 -46833 -20392 29636 2787 -49439 -22848 30857 13879 -17123 25802 68169 17112
533A7112o2234K5474L6865l8468k9019N5890L9184n5057m1199N3195M2034m0135
$$ 17112 -45122 -19648 17217 -21251 -50270 5620 44804 -10253 -51452 1743 43777 3642
545C642j6003O1508J4716q3277m3822N3508K2706n1648J467P7389Q402q1000j4128
$$ 3642 -12361 49147 63863 -19414 -63236 -9728 12978 -38670 -37203 40186 48588 -32412 -46540
558d6540P5242J5335n7875J1907P0506k7697j03269o394P6700r91n4737L9821
$$ -46540 28702 44037 -13838 -1931 68575 40878 -62391 -68785 7915 6924 -47813 -7992
570g992Q1862l7637r3233K4673Q4437k0603o0333M6107O0361p5717r9446M3384
$$ -7992 73870 36233 -57000 -32327 52110 31507 -28826 17281 77642 1925 -97521 -54137
582e4137Q3474l1363m1996P6082O0004q7242q1765O7441P1916n5513m2612P5310
$$ -54137 29337 -2026 -44022 32060 92064 4822 -76943 -9502 62414 6901 -35711 39599
594C9599K8062j14010o6764R0161O7103n6832j2705R5949J2822j22309m2970J00373
$$ 39599 67661 -46349 -113113 -22952 44151 -12681 -25386 70563 83385 -38924 -81894 18479
606A8479L9033p8036n809Q7361k1821j30446j0477J20592L0530o8635K6284R0772
$$ 18479 57512 -20524 -26333 61028 39207 -91239 -101716 18876 49406 -19229 7055 97827
618I7827m8669j32428J3451J14552m940q0325L7665P5447p7245j18173N6087J26110
$$ 97827 49158 -83270 -69819 44733 39793 -40532 -2867 72580 -4665 -122838 -66751 59359
630E9359j6109o4258O2437O0685j08020j11779P5807J06055m9828o1670P5067
$$ 59359 43250 -21008 41429 102114 -5906 -117685 -41878 64177 14349 -47321 27746
641B7746M1549j21563p7650J15861J03268o1722m2645Q5060J0817j46746o0107
$$ 27746 69295 -52268 -129918 -14057 89211 27489 -15156 69904 80721 -66025 -126132
652a26132J25713P2479q3395k5479R4805r133j42596j5120J51014N4144r1376
$$ -126132 -419 72060 -11335 -36814 57991 48858 -93738 -108858 42156 96300 4924
663D924p057Q6486m9197j51966J0031J48741K1595r4555J9708Q7428o6237j29844
$$ 4924 -2133 84353 35156 -116810 -106779 41962 63557 -30998 -11290 76138 9901 -119943
675a19943N5807J51962p256r5499L2020O1894j02947j20872Q2310J39619l2765
$$ -119943 -64136 87826 80570 -14929 17091 78985 -23962 -144834 -62524 77095 44330
686D4330q0744N9066N3259j12539q6675J16283J20978o3640p6883O1049J8381
$$ 44330 -36414 22652 75911 -36628 -123303 -7020 113958 50318 -26565 34484 52865
697E2865j35167o0575J38757J01159p7236m9687Q0991L076j35024k3823J52636
$$ 52865 -82302 -142877 -4120 97039 19803 -29884 51107 54183 -80841 -104664 47972
708D7972O6113j03315m1007P4432l0458j37102J3319J64748M2654j02766q534
$$ 47972 114085 10770 -30237 44195 13737 -123365 -110046 54702 97356 -5410 -13944
719a3944Q1282m9922j27307M5064J55645j227j16164M623O7432p4880j08344Q4434
$$ -13944 67338 17416 -109891 -64827 90818 89591 -26573 -21950 45482 -29398 -137742 -53308
731e3308J53596k3483j01467L2677N7556r4325q9112J04200J23855o2889r8374
$$ -53308 100288 76805 -24662 8015 65571 -28754 -117866 -13666 110189 47300 -51074
742e1074M5426L8543j02923n2530J35545J07894p8318p5338O0628J5243j15107
$$ -51074 -5648 32895 -70028 -122558 12987 120881 42563 -32775 27853 43096 -72011
753g2011k9096J39060O7815j03413n8448O8531j204j05197J4068J53105M2268
$$ -72011 -101107 37953 105768 2355 -56093 12438 11234 -93963 -79895 73210 115478
764A15478j09252l6158O7143k8986j06545L4892J40561L345j14772j0622P0724
$$ 115478 6226 -29932 37211 8225 -98320 -63428 77133 80478 -34294 -44916 25808
775B5808l9068q3184P1162J35280k4504j12253O283N5818o3622p4371Q5868J12570
$$ 25808 -13260 -96444 -25282 109998 85494 -26759 -20476 35342 -28280 -102651 -16783 95787
787I5787n2451r8685L3063N3845o5435m4995J07414R0522p7387q8690M0830L0173
$$ 95787 43336 -55349 -22286 31559 -33876 -78871 28543 119065 41678 -47012 -6182 23991
799B3991q1795k7394J14915O4210q9255o1912O1728K2066p6176J703J18232L1043
$$ 23991 -57804 -85198 29717 93927 4672 -57240 4488 26554 -49622 -47919 70313 101356
811A01356j05924m8505N8408k738p7627K4373J16215Q148j00307j6996O8044j2927
$$ 101356 -4568 -53073 5335 2597 -75030 -50657 65558 73706 -26601 -43597 24447 11520
823A1520o6364M3945J01025k5668j05005n038N7268l0130n4272O3800R2071l9280
$$ 11520 -54844 -10899 90126 64458 -40547 -45585 11683 -18447 -72719 -8919 83152 43872
835D3872q6533K0986N4547l9128m2070O9179O5029o5134q0522L0284M1639m5366
$$ 43872 -42661 -21675 32872 -6256 -48326 20853 85882 20748 -59774 -29490 12149 -33217
847c3217k1706Q2968N2502o8580n7155M4820K9709n2286j1903P5858K2687q1763
$$ -33217 -54923 28045 80547 11967 -45188 -368 29341 -22945 -34848 41010 63697 -18066
859a8066m3390N0686J9035m7135J1414Q1024R424p7090k2037N2217Q84n0847J7267
$$ -18066 -61456 -10770 8265 -38870 -27456 53568 62992 -14098 -36135 16082 16966 -33881 -16614
872a6614O6054j5963p6996m265N4304m479l6567L7057O2385k7885o7753R209M3347
$$ -16614 49440 33477 -43519 -47784 6520 2041 -34526 2531 64916 37031 -30722 -21513 21834
885B1834k2260l6165L8000M3719m1826n5019K6327M2636k1383j8637M8566L3096
$$ 21834 -426 -36591 1409 45128 3302 -51717 -25390 17246 -4137 -22774 25792 58888
897E8888m9178m5701K8477K5752l3248j5837M5309J8376m9498k6380M0416K4041
$$ 58888 9710 -35991 -7514 18238 -15010 -30847 14462 32838 -16660 -43040 -2624 21417
909B1417k7760j671M4970N051n2941k0228L3467P141l2594L157M0690j908m2936
$$ 21417 -6343 -8014 36956 42007 -10934 -31162 2305 9446 -23148 -19991 20699 18791 -24145
922b4145j959L9665N346k5584J0552L2294j5678m3695j23K9056o638k3179J6567
$$ -24145 -26104 13561 18907 -6677 3875 36169 20491 -23204 -23327 5729 -909 -24088 -7521
935g521K9403j5050k8852J4805K9452r354j8395J6688J6301k6605k8382J3863
$$ -7521 21882 6832 -22020 -7215 22237 12883 -5512 11176 27477 872 -27510 -13647
947a3647J9258j3891j0466K2988J5902k0576j3331K0887J5049j7197r469J6394
$$ -13647 5611 -8280 -18746 4242 20144 -432 -13763 7124 22173 4976 -4493 11901
959A1901J693k6697j1776J9033Q779j3747P76K1927L881j8810k041J8644J709
$$ 11901 13594 -13103 -24879 -5846 2933 -10814 -10038 11889 15770 -3040 -5081 13563 15272
972A5272j7582k215J2022o457j9689N86J7440J989r218P447J5339l605j2978L303
$$ 15272 -2310 -4525 7497 1040 -18649 -18063 -623 1366 -7852 -405 14934 11329 -1649 1654
986A654J0762o072j3277J739O390q184j0321P381J2157j021l404Q313P665o293
$$ 1654 12416 6344 -6933 -5194 1196 -6988 -17309 -9928 2229 1208 -2196 6117 13782 7489
1000G489p955L509L135q515p175L001K375n434j531Q686O833j137M17N685J417
$$ 7489 -466 3043 6178 -2337 -9512 -6511 -4136 -9570 -11101 -2415 4418 3281 3698 9383 10800
1015A0800o947m226J532j585o744k384L306J292j462K843P119L109q71J024J767
$$ 10800 3853 -373 1159 -426 -7170 -9554 -6248 -4956 -6418 -3575 3544 6653 5782 6806 8573
1030H573k330n792k589p38k727l097O21L358J693J518M003M407Q95q96q40j211
$$ 8573 6243 451 -2138 -2876 -5603 -8700 -8079 -4721 -3028 -1510 2493 6900 7795 6899 6059 4848
1046D848l215m237k479q34j087j10K121L493L486K128K464J545j43k155k660k508
$$ 4848 1633 -2604 -5083 -5917 -7004 -7114 -4993 -1500 1986 4114 6578 8123 7980 5825 3165 657
1062F57l188k729j984L02J590J989K618L492K823J530K62p49j515l211l245k682
$$ 657 -2531 -5260 -7244 -6942 -5352 -3363 -745 2747 5570 7100 7362 6613 5098 1887 -1358 -4040
1078d040j831j022k3J683K705L217L046K307J115J21j111k430l304k701k075k181
$$ -4040 -5871 -6893 -6916 -5233 -2528 689 3735 6042 7157 7278 6167 3737 433 -2268 -4343 -6524
1094f524p68J463K138K195K313L389K846k95r81n54j847m434l571o44l70j747
$$ -6524 -7292 -5829 -3691 -1496 817 4206 7052 6757 5776 5222 3375 -1059 -4630 -5274 -5644 -7391
1110g391J14M339L528K37J828M347J515l696k560L93k874o108k140L283R02k394
$$ -7391 -7277 -2938 590 827 2655 7002 8517 4821 2261 2654 -220 -6328 -8468 -5185 -4283 -6677
1126f677K464O749J855k298K466N102k060p158j684J659m704o725K444P010o41
$$ -6677 -4213 2536 4391 2093 4559 9661 7601 443 -1241 418 -4286 -11011 -8567 -1557 -2198
1141b198l123N807P076k356m476M822M718o951q495K135K102p827m447R397Q046
$$ -2198 -5321 486 7562 5206 730 5552 10270 3319 -5176 -3041 -939 -8766 -13213 -3816 4230
1156D230m810k646R243N158r007l794R289K389j3069o556P343N54j0679P06J6242
$$ 4230 -580 -3226 6017 11175 2168 -1626 7663 10052 -3017 -9573 -2230 -1676 -12355 -11649 4593
1171D593N281j0156n91J2117j190j4189R95J3344l355j7294q34J1868m057j1448
$$ 4593 9874 -282 -873 11244 10054 -4135 -3140 10204 6849 -10445 -11279 589 -3468 -14916
1185a4916R512J9973k608j4845M776J1797r771j5146R394J4819j1844j7758P940
$$ -14916 -5404 14569 11961 -2884 1892 13689 3918 -11228 -1834 12985 1141 -16617 -8677
1198h677J2804j0223q373J9729J7762j4081j5318J0927P955j8212r995J9656J0507
$$ -8677 4127 -6096 -14469 5260 23022 8941 -6377 4550 12505 -5707 -15702 3954 14461
1211A4461k0954j2591J6913Q139j6014J3K7614Q053k4814j0724J6420j47k2862
$$ 14461 -6493 -19084 -2171 5968 -10046 -10033 17581 25634 820 -9904 6516 6369 -16493
1224a6493J830K7362N7k7475k909K2884J04j8965J2196K9936p114l2248m43J9354
$$ -16493 -14663 12699 12756 -14719 -17628 5256 5360 -13605 -1409 28527 21413 -10835 -11278 8076
1238H076j0450k1423J7073K8439j4289k8888J0762K3321j1964j5436K5563K4062
$$ 8076 -2374 -23797 -6724 21715 7426 -21462 -10700 12621 657 -14779 10784 34846
1250C4846k5521l1490J3038J6829k0597j1991L2102K0493k9978k2531K3843J6606
$$ 34846 9325 -22165 -9127 7702 -12895 -24886 7216 27709 -2269 -24800 -957 15649
1262A5649k2282m703L5269R185m1125k1162K5209Q703k5612M242M0632L290m1043
$$ 15649 -6633 -11336 23933 33118 -8007 -29169 -3960 4743 -20869 -16627 24005 27295 -13748
1275a3748r285L2561L681k6552J0602L7047j1555m8171l809L2447l336k3333K2087
$$ -13748 -23033 9528 13209 -13343 -2741 34306 22751 -25420 -29229 3218 -118 -23451 -1364
1288a364L8834j8374m3914Q197L3303j0870k2946K6000K9273l2647m4170J6582
$$ -1364 37470 19096 -24818 -16621 16682 5812 -17134 8866 38139 5492 -38678 -22096
1300b2096L1629j5079j4414L6961K5984l9004l6109K5403K6237k3699j1736L7865
$$ -22096 9533 -5546 -19960 17001 42985 3981 -32128 -6725 19512 -4187 -15923 21942
1312B1942J2696m9430k8861L4451K2670k3720K77M4270M423n3367j9355L8114
$$ 21942 34638 -14792 -43653 -9202 13468 -10252 -9975 34295 38718 -14649 -34004 4110
1324D110J2480l0568N311M1234j0129n6226o089M5413Q109k6862J7680M1042k2007
$$ 4110 16590 -13978 -8667 32567 22438 -33788 -39877 5536 13645 -13217 4463 45505 23498
1337B3498n6800M013M3011m866k8269K3268L3977l3831n0415J9891M5597r362
$$ 23498 -33302 -29289 13722 8856 -19413 3855 37832 4001 -46414 -26523 19074 9712
1349I712k1388L2114K5784m5511m6172K7370L7601k0174j7867L6601J6845n0890
$$ 9712 -11676 20438 46222 711 -45461 -18091 19510 -664 -18531 18070 34915 -15975
1361a5975l2772M0680L4678k3672r461L9014L407n8905k5148M4496K3545k9745
$$ -15975 -48747 -8067 26611 2939 -6522 32492 35899 -23006 -48154 -3658 19887 -9858
1373i858j150M0636n499n7178q052N2178J5874l0848N880L6179k0956n9825K180
$$ -9858 -11008 29628 24129 -33049 -41101 11077 26951 -3897 1983 38162 17206 -42619 -40439
1386d0439N1629M699l0441J5799L4966k8550n1817J8495N2289n246l0118K0250
$$ -40439 11190 15889 -14552 1247 36213 7663 -44154 -25659 26630 21384 -8734 11516
1398A1516K4171m2335m7120K9313M7639j3742k3444K9384J9061m6383l4650M1162
$$ 11516 35687 -6648 -53768 -24455 23184 9442 -14002 15382 34443 -11940 -46590 -5428
$$ [...]
8191F0
##END NTUPLES=NMR FID
##END=
