##TITLE=1H_LR-698_R2-C1-K1
 CDCl3, 8 sc, 
 28.1.2020
##JCAMPDX= 6.0         $$ Bruker NMR JCAMP-DX V2.0
##DATA TYPE= NMR FID
##DATA CLASS= NTUPLES
##ORIGIN= UXNMR, Bruker Analytische Messtechnik GmbH
##OWNER= root
$$ XWIN-NMR		Version 3.5
$$ Tue Jan 28 14:49:47 2020 Russian Standard Time (UT+4h)  she@DPX200
##.OBSERVE FREQUENCY= 200.1315
##.OBSERVE NUCLEUS= ^1H
##.DELAY= (6, 6)
##.ACQUISITION MODE= SIMULTANEOUS
##.ACQUISITION SCHEME= undefined
##.AVERAGES= 8
##.DIGITISER RES= 18
##SPECTROMETER/DATA SYSTEM= spect
##.PULSE SEQUENCE= zg30
##.SOLVENT NAME= CDCl3
##.SHIFT REFERENCE= (INTERNAL, CDCl3, 0, 15.7039)
##AUDIT TRAIL= $$ (NUMBER, WHEN, WHO, WHERE, WHAT)
$$ ##TITLE= Audit trail, XWIN-NMR		Version 3.5
$$ ##JCAMPDX= 5.01
$$ ##ORIGIN= Bruker BioSpin GmbH
$$ ##OWNER= she
$$ F:/spectra/data/she/nmr/H-F/1/audita.txt
$$ ##AUDIT TRAIL=  $$ (NUMBER, WHEN, WHO, WHERE, WHAT)
(   1,<2020-01-28 14:48:31.82 +0400>,<she>,<DPX200>,
      <created by zg, POWCHK disabled, PULCHK disabled
       configuration hash MD5:
       00 E9 B6 7A A2 85 ED C7 34 08 36 98 17 FE 4E 26
       data hash MD5: 16K
       C8 60 E5 40 79 1B 55 B1 5F F4 42 2A 6D 03 16 C8>)
$$ ##END=
$$ 
$$ hash MD5
$$ C3 5F A4 16 B3 6A 96 AE 05 05 22 DC 1F D5 C7 0A
##$RELAX= 
##$RELAX= 
##$RELAX= 
##$RELAX= 
##$RELAX= 
##$RELAX= 
$$ Bruker specific parameters
$$ --------------------------
##$DU= <F:/spectra>
##$EXPNO= 1
##$NAME= <H-F>
##$PROCNO= 1
##$TYPE= <nmr>
##$USER= <she>
##$AMP= (0..31)
100 100 100 100 100 100 100 100 100 100 100 100 100 100 100 100 100 100 
100 100 100 100 100 100 100 100 100 100 100 100 100 100 
##$AQSEQ= 0
##$AQ_mod= 1
##$AUNM= <au_zg>
##$AUTOPOS= <>
##$BF1= 200.13
##$BF2= 200.13
##$BF3= 200.13
##$BF4= 200.13
##$BF5= 200.13
##$BF6= 200.13
##$BF7= 200.13
##$BF8= 200.13
##$BYTORDA= 1
##$CFDGTYP= 0
##$CFRGTYP= 5
##$CHEMSTR= <none>
##$CNST= (0..31)
1 1 145 1 1 1 1 1 1 1 1 1 1 1 1 1 1 1 1 1 1 1 1 1 1 1 1 1 1 1 1 1 
##$CPDPRG= <>
##$CPDPRG1= <>
##$CPDPRG2= <>
##$CPDPRG3= <>
##$CPDPRG4= <mlev>
##$CPDPRG5= <mlev>
##$CPDPRG6= <mlev>
##$CPDPRG7= <mlev>
##$CPDPRG8= <mlev>
##$CPDPRGB= <>
##$CPDPRGT= <>
##$D= (0..31)
0 1.2 0 0 0 0 0 0 0 0.06 0 0.03 0 0 0 0 0.0002 0 0 0 0 0 0 0 0 0 0 0 0 
0 0 0 
##$DATE= 1580208511
##$DBL= (0..7)
120 120 120 120 120 120 120 120 
##$DBP= (0..7)
150 150 150 150 150 150 150 150 
##$DBP07= 0
##$DBPNAM0= <>
##$DBPNAM1= <>
##$DBPNAM2= <>
##$DBPNAM3= <>
##$DBPNAM4= <>
##$DBPNAM5= <>
##$DBPNAM6= <>
##$DBPNAM7= <>
##$DBPOAL= (0..7)
0.5 0.5 0.5 0.5 0.5 0.5 0.5 0.5 
##$DBPOFFS= (0..7)
0 0 0 0 0 0 0 0 
##$DE= 6
##$DECBNUC= <off>
##$DECIM= 24
##$DECNUC= <off>
##$DECSTAT= 4
##$DIGMOD= 1
##$DIGTYP= 9
##$DL= (0..7)
0 120 120 120 120 120 120 120 
##$DP= (0..7)
150 150 150 150 150 150 150 150 
##$DP07= 0
##$DPNAME0= <>
##$DPNAME1= <>
##$DPNAME2= <>
##$DPNAME3= <>
##$DPNAME4= <>
##$DPNAME5= <>
##$DPNAME6= <>
##$DPNAME7= <>
##$DPOAL= (0..7)
0.5 0.5 0.5 0.5 0.5 0.5 0.5 0.5 
##$DPOFFS= (0..7)
0 0 0 0 0 0 0 0 
##$DQDMODE= 0
##$DR= 18
##$DS= 0
##$DSLIST= <SSSSSSSSSSSSSSS>
$$ [...]
##$SUBNAM2= <"">
##$SUBNAM3= <"">
##$SUBNAM4= <"">
##$SUBNAM5= <"">
##$SUBNAM6= <"">
##$SUBNAM7= <"">
##$SUBNAM8= <"">
##$SUBNAM9= <"">
##$SW= 24.9337058887773
##$SWIBOX= (0..15)
0 0 2 0 0 0 0 0 0 0 0 0 0 0 0 0 
##$SW_h= 4990.01996007984
##$TD= 16384
##$TD0= 1
##$TE= 0
##$TE2= 300
##$TE3= 300
##$TEG= 300
##$TL= (0..7)
0 120 120 120 120 120 120 120 
##$TP= (0..7)
150 150 150 150 150 150 150 150 
##$TP07= 0
##$TPNAME0= <>
##$TPNAME1= <>
##$TPNAME2= <>
##$TPNAME3= <>
##$TPNAME4= <>
##$TPNAME5= <>
##$TPNAME6= <>
##$TPNAME7= <>
##$TPOAL= (0..7)
0.5 0.5 0.5 0.5 0.5 0.5 0.5 0.5 
##$TPOFFS= (0..7)
0 0 0 0 0 0 0 0 
##$TUNHIN= 0
##$TUNHOUT= 0
##$TUNXOUT= 0
##$USERA1= <user>
##$USERA2= <user>
##$USERA3= <user>
##$USERA4= <user>
##$USERA5= <user>
##$V9= 5
##$VALIST= <valist>
##$VCLIST= <CCCCCCCCCCCCCCC>
##$VD= 0
##$VDLIST= <DDDDDDDDDDDDDDD>
##$VPLIST= <PPPPPPPPPPPPPPP>
##$VTLIST= <TTTTTTTTTTTTTTT>
##$WBST= 1024
##$WBSW= 4
##$XGAIN= (0..3)
0 0 0 0 
##$XL= 0
##$YL= 0
##$YMAX_a= 296605
##$YMIN_a= -99635
##$ZGOPTNS= <>
##$ZL1= 120
##$ZL2= 120
##$ZL3= 120
##$ZL4= 120
##$ABSF1= 10
##$ABSF2= 0
##$ABSG= 5
##$ABSL= 3
##$ALPHA= 0
##$AQORDER= 0
##$ASSFAC= 0
##$ASSFACI= 0
##$ASSFACX= 0
##$ASSWID= 0
##$AUNMP= <proc_1d>
##$AZFE= 0.1
##$AZFW= 0.1
##$BCFW= 1
##$BC_mod= 2
##$BYTORDP= 1
##$COROFFS= 0
##$CY= 11.3945322036743
##$DATMOD= 1
##$DC= 2
##$DFILT= <>
##$DTYPP= 0
##$F1P= 16.9975609425685
##$F2P= -3.02152046262296
##$FCOR= 0.5
##$FTSIZE= 0
##$FT_mod= 4
##$GAMMA= 1
##$GB= 0.15
##$INTBC= 1
##$INTSCL= 1
##$ISEN= 128
##$LB= 0.24
##$LEV0= 0
##$LPBIN= 0
##$MAXI= 10000
##$MC2= 0
##$MEAN= 0
##$ME_mod= 0
##$MI= 1.114404
##$NCOEF= 0
##$NC_proc= 0
##$NLEV= 6
##$NOISF1= 3.799351
##$NOISF2= 2.8
##$NSP= 1
##$NTH_PI= 0
##$NZP= 0
##$OFFSET= 15.70392
##$PC= 1
##$PHC0= -9789.008
##$PHC1= 22.20081
##$PH_mod= 1
##$PKNL= yes
##$PPARMOD= 0
##$PSCAL= 0
##$PSIGN= 0
##$REVERSE= no
##$SF= 200.130013532006
##$SI= 16384
##$SIGF1= 3
##$SIGF2= 2
##$SINO= 400
##$SIOLD= 16384
##$SREGLST= <1H.CDCl3>
##$SSB= 0
##$STSI= 0
##$STSR= 0
##$SW_p= 3612.71676300578
##$SYMM= 0
##$S_DEV= 0
##$TDeff= 0
##$TDoff= 0
##$TI= <>
##$TILT= no
##$TM1= 0
##$TM2= 0
##$TOPLEV= 0
##$USERP1= <user>
##$USERP2= <user>
##$USERP3= <user>
##$USERP4= <user>
##$USERP5= <user>
##$WDW= 1
##$XDIM= 8192
##$YMAX_p= 0
##$YMIN_p= 0
$$ End of Bruker specific parameters
$$ ---------------------------------
##NTUPLES= NMR FID
##VAR_NAME=  TIME,          FID/REAL,        FID/IMAG
##SYMBOL=    X,             R,               I
##VAR_TYPE=  INDEPENDENT,   DEPENDENT,       DEPENDENT
##VAR_FORM=  AFFN,          ASDF,            ASDF
##VAR_DIM=   8192,          8192,            8192
##UNITS=     SECONDS,       ARBITRARY UNITS, ARBITRARY UNITS
##FACTOR=    0.0002004,     1,               1
##FIRST=     0,             0,               0
##LAST=      1.6414764,     0,               0
##MIN=       0,             -99635,          0
##MAX=       1.6414764,     296605,          0
$$ Real data points
##PAGE= N=1
##DATA TABLE= (X++(R..R)), XYDATA
0 0 0 0 0 0 0 0 0 1 -8 8 -8 8 -16 16 -22 24 -32 35 -41 49 -57 69 -81 91 -105 121 -138 158 -179 201 -227
31 -227 256 -285 322 -357 398 -444 494 -548 608 -673 743 -824 913 -1012 1123 -1246 1388
48 1388 -1551 1739 -1957 2224 -2546 2950 -3475 4187 -5212 6832 -9785 16982 -75143 -40566
62 -40566 50140 -60864 -80826 -37937 -28126 -63873 -10156 39589 -8891 -92999 -79307 -32797
74 -32797 -16810 2040 42513 15728 -49490 -42932 34095 58601 27517 14592 15973 -9620 1758
87 1758 82174 136456 92952 37916 46490 74480 80199 93696 100714 55352 -1639 12348 68878
100 68878 90824 87597 97602 89706 50576 50705 114104 153266 115071 64109 54963 63992 76254
113 76254 109421 132224 101168 51277 47743 78560 94072 92339 84877 56359 18608 22688 71067
126 71067 102546 89603 67026 55850 47871 53287 83214 100787 67416 15670 -83 19278
138 19278 40990 51400 49232 25543 -4005 -5725 24161 48940 43321 17814 -9314 -21511 -8728
151 -8728 20542 38186 25688 -2683 -22265 -20134 127 20192 15254 -17485 -48554 -53457 -34607
164 -34607 -12121 -499 -8292 -32833 -49236 -36078 -7374 6420 -3838 -26552 -46539 -52795
176 -52795 -37046 -11645 -4077 -23884 -47870 -53448 -40044 -19929 -7869 -15310 -40680 -60368 -54091
189 -54091 -29129 -8764 -6198 -20250 -38945 -44067 -26457 -1366 6471 -8985 -32497 -46154 -41341
202 -41341 -21248 -2017 -1498 -20463 -37991 -35940 -16267 5083 11985 -771 -22025 -31872 -21177
215 -21177 -36 13693 10184 -6062 -22442 -20580 -195 19426 18134 349 -16884 -22205 -12551
228 -12551 6592 20215 14061 -5915 -16840 -6711 12937 26265 25403 10915 -7994 -13299 638
241 638 19823 24533 12480 -3669 -11758 -4887 12493 26458 22424 4095 -10906 -10212 4196 19675
255 19675 23776 11716 -5157 -10533 1002 17370 25020 17858 1467 -13081 -11745 3430 17082
268 17082 14753 978 -11831 -13780 -3236 12337 20404 11761 -6129 -15856 -9158 5516 15162
281 15162 11977 -1276 -15531 -16291 -2649 12557 14409 2376 -12656 -19327 -12293 2427 11419
294 11419 6463 -8541 -18405 -14548 -811 11472 12640 1288 -13192 -17966 -8611 5377 10709
307 10709 2916 -10763 -18972 -13822 214 11173 9557 -2814 -14585 -15306 -4293 8321 11800
320 11800 3037 -9595 -14676 -8126 5621 14015 10149 -2905 -13028 -11049 281 10814 11545 1853
334 1853 -9623 -12914 -3823 9540 16003 9926 -2508 -9861 -6358 5165 14534 13459 2394 -8691
348 -8691 -9425 118 11617 15832 8700 -3425 -9963 -3749 8460 15292 11871 958 -7877 -7451 3474
363 3474 14710 16086 6578 -4854 -8141 -1500 9479 14978 9913 -2339 -10134 -6650 4735 13253
377 13253 12439 3063 -7156 -9213 -929 10655 14145 6242 -5101 -10302 -5633 5165 12100 10116
391 10116 -637 -9968 -9378 -593 8630 9938 2094 -8204 -12554 -6436 4983 10199 5864 -4461
405 -4461 -11358 -9692 -122 8451 7883 -1693 -11077 -12303 -5395 4211 8234 2719 -8174 -13754 -9418
420 -9418 346 7026 4728 -4064 -12635 -12673 -4121 5519 7162 -27 -9891 -13429 -8367 1526 6935 3216
436 3216 -6447 -14089 -11674 -2560 5398 5647 -1669 -11250 -12872 -6453 3220 7091 1861 -7827 -13181
451 -13181 -10101 -42 7237 5526 -3184 -11546 -11494 -3952 4871 7319 1243 -8357 -12563 -7479 2467
466 2467 7733 4994 -3651 -10459 -9122 -851 7469 8089 453 -7825 -9862 -3762 4608 9348 5234
481 5234 -3738 -9387 -6248 2616 9214 8388 876 -6763 -7720 -646 8206 10752 5167 -3500 -7351 -3150
497 -3150 5599 11392 8973 373 -6225 -4938 2705 10400 11513 5072 -3027 -5690 17 8530 12670
512 12670 8918 637 -4858 -2768 5433 12282 11456 4148 -2850 -4082 2149 10546 13152 7813 -557
527 -557 -4685 -862 6858 12584 10923 2865 -3539 -3622 3989 11155 11552 5694 -1892 -5150 -828 7767
543 7767 11995 8512 -272 -5415 -3186 3521 9664 9754 3397 -4462 -5978 -362 7160 9238 4595 -2570
559 -2570 -7294 -4378 2459 8400 6267 -1379 -7334 -7345 -1630 4611 6684 1216 -6560 -9673 -5824 1463
575 1463 5320 2400 -4655 -10250 -9671 -2915 3255 3214 -2842 -9725 -11293 -7063 -213 3137 -640 -8335
591 -8335 -12763 -9866 -3425 1848 660 -5446 -11920 -12614 -7241 19 2164 -3056 -9934 -13134 -9517
606 -9517 -2807 1606 -202 -7070 -12359 -11471 -5333 663 1080 -3341 -9924 -11907 -7882 -786 2492 104
622 104 -6564 -11067 -8995 -2495 2769 2729 -2475 -8333 -9418 -4266 2372 4745 954 -4830 -7989 -5241
638 -5241 1002 5726 4746 -932 -5978 -5348 10 5310 6960 3209 -2390 -5210 -1199 5253 8688 6700
654 6700 1146 -2756 -1672 3302 9095 9454 4588 -924 -2032 2816 8110 10634 8123 2220 -1235
669 -1235 882 6944 11112 10038 5053 428 162 4379 10356 11446 7673 2176 -396 2329 7791
684 7791 11199 9842 4496 -8 771 5593 10504 10499 6232 1496 -954 2622 7782 10322 7600 2096
700 2096 -1062 534 4760 8714 8343 3662 -1464 -1941 1736 6312 7401 4594 -380 -3184 -1509 3577
716 3577 6688 5166 437 -3584 -3445 122 4165 5189 1330 -3751 -5417 -2367 1810 4073 2116
731 2116 -2789 -5865 -5036 -1093 2768 2499 -1768 -5497 -6915 -3324 707 1856 -458 -5240 -7616 -6238
747 -6238 -1578 1302 179 -4021 -7567 -7404 -4077 -10 1014 -2100 -6533 -8367 -6026 -1476 1141
762 1141 -896 -4750 -7640 -7138 -3270 468 746 -2778 -6819 -7428 -4067 -592 1345 -850 -4868 -7230
778 -7230 -5503 -1104 1273 586 -2826 -5965 -6254 -2744 903 1924 -902 -4309 -6061 -3525 27 2687
794 2687 1358 -2298 -4949 -4232 -617 2453 2492 -154 -3604 -4263 -1948 2026 4089 1804 -1639 -3828
810 -3828 -2332 862 3786 3505 314 -2874 -2868 354 3245 4158 2229 -1125 -2815 -1036 2875 4723
826 4723 3391 53 -2370 -1843 1354 4376 4751 1862 -1177 -2217 214 3387 4873 3350 -5 -1607
842 -1607 -987 2394 4694 4353 1197 -1244 -1581 788 3837 4591 2703 -592 -2073 -374 2688 4392
858 4392 3530 706 -1962 -1411 1103 3843 4251 1698 -1044 -2215 -555 2626 3716 2266 -275 -2102
874 -2102 -1391 1167 3281 3179 353 -2023 -2352 -262 2048 3419 1723 -1347 -2923 -1469 1235 2897
890 2897 2255 -720 -2684 -2424 -218 1812 2427 371 -2401 -3254 -1527 1183 2579 1466 -1493 -3268
906 -3268 -2460 149 1889 1727 -440 -3016 -3274 -1106 1594 1985 394 -2226 -3384 -2427 -139 2199
922 2199 1345 -1427 -3434 -3173 -605 1612 1631 -49 -2458 -3207 -1555 716 2186 512 -1506 -3010
938 -3010 -2736 -207 1874 1782 -457 -2285 -2605 -1300 1448 2164 712 -1696 -2805 -1642 575 2114
954 2114 1875 -712 -2245 -2201 -436 1596 2309 682 -1594 -2173 -964 1416 2508 1577 -451 -2060 -1537
971 -1537 751 2422 2408 847 -1228 -1641 -272 2115 2885 1459 -630 -1679 -702 1375 2738 2613 245
988 245 -1429 -1459 533 2737 3099 1176 -746 -1421 -577 1885 3412 2194 -216 -1478 -1073 864 2632
1005 2632 2701 662 -1352 -1806 -360 1835 2551 1351 -545 -1764 -1059 971 2675 2153 -7 -1864
1021 -1864 -1706 122 1656 2008 835 -1170 -1966 -1126 721 2378 1143 -782 -2157 -1988 66 1500
1037 1500 1476 -70 -1886 -2532 -1150 871 1621 477 -1579 -2694 -2166 -266 1228 1006 -937 -2362
1053 -2362 -2757 -814 420 1348 13 -2111 -2794 -1961 195 1221 693 -975 -2480 -2415 -637 1047 1231
1070 1231 -335 -2125 -2721 -1130 584 1564 489 -1557 -2227 -1876 -24 1511 784 -551 -2205 -2245 -602
1087 -602 1344 1715 319 -1284 -1705 -1076 554 2194 1277 -194 -1932 -1403 169 1713 1883 533 -1168
1104 -1168 -1634 -174 1260 2473 1492 -306 -1170 -875 929 2165 2329 517 -1147 -1023 290 1708
1120 1708 2367 1431 -370 -1285 -502 1290 2439 1885 108 -1256 -975 868 2189 2239 1059 -783 -1147
1137 -1147 191 1545 2496 1649 -79 -961 -774 583 2123 1734 581 -867 -1269 3 1301 1970 890
1154 890 -607 -1625 -975 715 1559 1247 -392 -1763 -1601 -328 1141 1329 85 -1112 -1937 -1105 461
1171 461 1330 627 -916 -2270 -1806 -404 951 603 -436 -1866 -2240 -1215 154 1102 -1 -1534 -2527
1188 -2527 -1925 -555 641 273 -923 -2141 -2421 -1057 598 662 -495 -1872 -2094 -1513 -318 600 -104
1205 -104 -1284 -2143 -2020 -575 433 859 -451 -1594 -1840 -806 -25 860 174 -881 -2094 -1362 120
1222 120 752 982 -272 -1393 -1274 -184 735 1214 466 -497 -1381 -748 491 1351 1077 -103 -1005 -636
1240 -636 359 1505 1847 965 -417 -622 329 1063 1945 1459 49 -473 -233 1010 1921 1724 954 -155
1258 -155 -118 541 1621 2202 1574 289 -285 68 1279 1907 1968 783 -267 27 639 1774 2024 1046 151
1277 151 -418 265 1555 2072 1309 380 -354 -159 622 1817 1524 576 -160 -588 43 1208 1369 1032 -22
1296 -22 -934 -351 888 1416 959 298 -701 -758 -62 756 1159 205 -692 -1422 -336 774 806 422 -656 -1246
1316 -1246 -1138 -318 524 731 -188 -1375 -1669 -796 229 516 139 -772 -1611 -1408 -185 271 313 -478 -1364
1335 -1364 -1506 -800 187 437 -479 -1152 -1552 -1373 -484 276 160 -908 -1545 -1676 -744 210 288 -554 -1476 -1651
1355 -1651 -1143 20 546 -68 -1084 -1720 -1004 -580 369 391 -477 -986 -1282 -850 76 462 181 -870 -1368
1374 -1368 -803 35 664 411 -203 -809 -953 -157 775 787 165 -742 -1024 -238 566 973 584 -86 -713 -471
1394 -471 197 894 882 520 -173 -607 397 1020 1281 641 42 -281 128 1009 978 787 375 -347 -27 325
1414 325 1140 1289 788 -248 -267 175 900 1154 994 318 -21 -156 684 1180 1133 536 -16 -223 353 1219
1434 1219 975 812 72 -577 -152 734 1105 1179 43 -419 -270 286 898 866 569 -232 -789 -67 546 888
1454 888 738 -308 -780 -516 246 804 659 16 -649 -656 -426 432 768 339 -567 -750 -878 174 559 246
1474 246 32 -663 -575 -195 331 340 353 -724 -329 -393 29 363 -8 -552 -917 -1022 -244 707 251 -264 -947
1495 -947 -752 -521 360 269 59 -486 -818 -1097 51 358 -10 -381 -566 -1060 -153 596 84 43 -801 -783 -186
1516 -186 109 521 -97 -396 -658 -732 -101 272 358 82 -728 -797 -12 289 604 431 -535 -688 -614 154 291
1537 291 426 -328 -712 -759 220 663 450 187 -414 -867 -438 183 589 415 -407 -749 -447 408 567 535 417
1558 417 -240 -537 -400 494 624 98 -308 -553 -199 364 801 154 78 -639 -482 67 486 686 298 -181
1578 -181 -474 -420 277 709 389 -245 -299 -580 420 696 367 -51 -657 -371 -419 448 568 252 -268 -451 -283
1599 -283 526 578 422 72 -644 -599 13 227 393 -141 -325 -523 -419 212 604 536 -482 -442 -220 178 506
1620 506 502 294 -220 -665 14 452 598 449 -323 -450 -337 323 590 271 79 -337 -146 158 588 622 85
1641 85 -269 -192 -240 470 900 539 91 -373 -333 71 343 180 121 -576 -359 -162 774 683 410 -360 -347 188
1663 188 106 422 521 390 -356 -278 171 631 630 213 -92 -230 -140 554 519 381 -33 -167 -153 225 446 554 333
1686 333 -204 -288 186 216 609 543 -243 -498 -137 388 466 691 -235 -112 -169 -73 55 540 481 -349 -37 -180
1708 -180 52 282 454 5 -636 -574 -109 404 180 13 -245 -626 -184 84 357 293 -278 -534 -319 -255 107
1729 107 442 -56 -407 -709 -213 159 637 66 -367 -675 -434 -111 392 359 -219 -310 -499 -329 347 529 97
1750 97 -409 -658 -285 55 321 150 71 -267 -466 50 337 195 207 -136 -445 215 291 409 269 -427 -321
1771 -321 -159 -134 517 428 -181 -464 -498 242 320 296 359 -362 -586 -222 104 241 81 4 -442 -300 166 416
1793 416 463 82 -323 -570 -207 260 609 512 -161 -480 -424 103 133 250 -179 -555 -265 105 434 445 129 -422
1815 -422 -437 -210 -11 363 192 80 -443 -338 -37 265 276 38 -101 -352 -199 201 338 249 12 -95 -154
1836 -154 -104 300 24 186 -181 -213 -80 503 222 -57 -186 -124 -183 362 506 207 -118 -317 -47 49 329 388
1858 388 107 82 13 -233 152 234 269 -90 -315 -121 143 451 576 -66 -80 -183 189 288 319 359 -73 -181 -111
1881 -111 204 155 105 150 -334 -187 110 -18 247 191 -200 -183 -122 314 517 178 -138 -404 -168 157 405 142
1903 142 165 35 -190 -145 -63 302 -41 -354 -639 -286 76 204 277 91 -297 -380 22 129 101 -245 -297 -608
1925 -608 -342 134 55 225 -235 -436 -200 -77 272 362 108 -479 -172 -61 232 478 10 -96 -227 -270 7
1946 7 166 108 -144 -347 -316 -3 175 111 167 -256 -303 -77 185 122 31 52 -363 -305 143 112 483 -100 -97 -347 -113
1971 -113 0 208 136 135 -74 76 520 214 -52 -72 -510 -377 238 185 329 0 -268 -560 -97 245 264 421
1993 421 -100 10 -152 -173 271 475 12 -57 -383 -212 409 479 375 100 50 -33 117 327 376 -4 -135 -258
2015 -258 181 545 432 241 -131 -535 -48 289 347 97 -35 -73 -31 93 -91 193 63 -145 -26 210 -132
2036 -132 109 168 -150 -78 -198 305 150 136 5 -459 140 -236 164 184 152 -25 -79 -138 -152 -114 -75 -251 -308 -494
2060 -494 -141 79 46 74 -384 -110 -16 86 192 133 -128 -215 -121 164 321 111 -10 -320 -220 -114 211 231
2082 231 83 11 -80 70 -12 232 -50 -331 -334 -220 158 217 268 -22 -113 -233 -200 196 254 283 49 -61 32 300
2106 300 221 194 -165 -124 -288 125 245 -21 23 357 92 184 -169 349 89 215 21 -12 143 450 358 -75
2128 -75 166 -157 203 89 211 -94 -99 147 -32 160 364 361 255 -99 107 299 88 392 109 -31 -68 242
2150 242 258 164 206 98 -181 -370 121 189 102 -55 237 -527 -254 83 -4 -182 136 -301 70 -216 37 22
2172 22 -26 -276 -101 -128 144 391 -134 -196 -222 -378 -319 129 -19 -105 97 -128 46 -244 -15 157 -256 -21
2194 -21 53 198 165 -279 -16 -195 -281 -32 62 87 -60 -4 -254 -364 -97 253 69 -273 -244 -112 205 200 -52
2217 -52 25 6 -346 -575 131 -168 -9 115 -443 -162 11 140 -292 246 -74 -278 -9 191 13 -310 -221
2238 -221 -278 -430 -20 67 250 18 -449 -131 50 355 100 -51 -18 -63 -268 189 52 2 23 -180 -19 -45
2260 -45 11 48 191 -237 -283 25 -51 39 -4 111 -151 -154 -24 369 249 -28 18 128 551 -108 3 -44 75 -176
2284 -176 95 337 76 203 308 -44 301 40 139 252 134 75 -221 82 76 -72 222 -16 -227 82 -99
2305 -99 290 73 -290 -330 17 -172 57 48 -263 219 -190 -61 33 193 40 157 75 -298 -160 -118 -74 -225 -125
2328 -125 -228 -272 305 -6 162 -267 -197 -94 168 51 -160 -8 -421 -29 -195 120 111 -161 -10 -34 75 73
2350 73 -23 -11 -291 -153 -283 81 127 -112 48 -441 -114 -208 50 -32 -103 66 64 -302 77 189 114 30 0 -118
2374 -118 -68 384 152 -126 -298 -52 -197 -86 252 -30 -231 -75 -88 135 45 173 447 100 -148 97 -19
2395 -19 241 342 -66 -66 184 291 240 239 142 -14 -267 105 318 302 242 -23 -4 176 -88 174 378 27 10 -12
2419 -12 284 8 148 413 -169 15 92 3 123 243 270 -19 -184 -17 257 238 -209 132 -107 -126 61 227
2441 227 20 82 80 -84 170 200 171 -78 -74 -319 98 29 56 -31 -195 9 22 62 -50 78 -148 73 -123 195
2465 195 -162 -111 -79 -1 -80 -224 -126 -6 -249 -68 -183 -153 -106 100 8 -109 -137 -318 -202 -249 -30 -313 -156
2488 -156 -166 -64 -279 -100 -168 13 -632 -211 -34 165 -234 93 -366 67 -3 279 -103 153 -115 -290 215
2509 215 -51 116 58 104 -160 0 101 -231 16 -141 17 -37 -127 107 204 105 29 -71 -50 478 285 92 -33
2532 -33 18 278 -214 79 273 213 173 91 37 -18 151 214 -104 -202 -199 78 178 283 341 42 -33 -321 116 128 19
2557 19 118 -139 368 13 77 15 -26 64 -18 218 238 396 -20 -202 -69 -16 -271 79 -128 -159 -114 131 11 34
2581 34 -275 174 -257 -94 12 24 262 -206 -75 -134 -162 7 -126 -50 -183 -414 114 191 -106 -33 -99 33 -181
2604 -181 -1 -150 -52 22 -94 -76 -106 65 -291 -197 81 -333 -146 -2 -14 -35 95 -149 -177 -247 82 -57 -81
2627 -81 18 86 98 130 -131 117 198 -160 58 288 -129 -70 70 117 -329 -12 -326 317 -319 71 27 88 -127
2650 -127 -197 103 -156 -5 -217 38 -190 88 126 79 -130 284 -53 -51 22 91 -179 -196 127 -257 25 2 -198
2673 -198 -88 -114 83 -46 -239 59 -289 -36 158 19 -6 -305 -244 -13 -307 -113 81 24 -121 287 100
2694 100 -57 142 32 152 32 14 -105 -119 -15 -196 14 -112 -48 -7 16 -74 -200 -100 52 -92 360 -76
2716 -76 -213 55 -42 -126 -118 96 -223 44 -271 -244 33 -136 78 -17 -387 -170 36 251 180 2 -68 45 105
2739 105 -45 309 -62 101 123 -19 51 328 48 -89 42 -14 -31 46 -13 -183 -35 61 132 -188 -47 -188 -161
2762 -161 362 -244 147 27 -181 -103 -105 77 -22 15 111 255 -202 -40 -52 -39 -91 262 -140 133 -41 -135 179
2785 179 269 194 -265 -109 -30 91 244 -5 -119 19 -64 93 146 165 -4 155 64 -58 118 317 161 236 70
2808 70 129 -100 -16 -132 152 185 241 132 203 -131 -123 48 -166 111 -210 201 47 219 281 -477 -194 -80 42
2831 42 -71 36 -194 -158 -76 16 138 -72 -67 -114 -106 -66 221 -116 -297 114 -214 -230 74 56 89 -153 -88 46 65
2856 65 -29 -196 -172 -109 147 375 -169 -100 -185 -72 -313 -132 64 -137 -244 40 -362 211 123 226 -254 -44
2878 -44 -33 43 -94 -156 -93 -39 -251 -74 0 28 -72 159 232 -125 -107 127 -26 -118 -28 122 101 185 251 271 137
2903 137 37 -224 -7 39 79 -228 -54 -29 -70 -130 280 248 117 -75 -167 171 86 -149 15 51 55 -142 -237 133
2927 133 97 143 6 166 -13 81 102 -308 -77 -108 -64 -80 345 20 44 48 -70 311 -49 217 -128 72 103 214
2951 214 181 -41 -103 -13 154 -154 -163 -81 83 -46 -197 -75 84 -170 208 -29 111 72 -329 -209 -84 -236
2973 -236 -480 -30 155 17 -4 136 46 -138 52 16 88 -27 -126 -100 -4 -5 154 -65 -80 5 -33 63 -258 -148
2997 -148 20 100 114 -50 73 347 55 73 25 -53 80 77 -192 -170 108 -99 -177 -101 12 50 -25 -42 13 -137 68
3022 68 18 -318 240 1 -116 173 -168 -53 -2 119 196 -127 -244 -13 -243 64 -179 118 -14 225 -211
3043 -211 -68 -59 -65 217 174 233 -220 -78 -232 85 215 102 -29 18 89 207 -266 -82 -39 -150 208 -88 54
3066 54 6 -141 259 152 -147 -128 -35 -77 291 -132 -178 36 -76 -74 -10 55 -107 94 -61 -353 -130 -328 67
3089 67 158 75 64 -241 175 29 103 -152 -88 -218 55 42 -7 16 -27 -70 -14 -6 -85 -150 41 210 -287 220 -153
3114 -153 1 -77 20 -124 32 -56 13 38 -206 102 -184 -21 -46 239 59 195 235 450 172 299 47 -151
3136 -151 48 153 72 349 -70 -84 75 -150 -112 176 140 50 -70 -89 40 -248 186 -18 -171 -189 311 -118
3158 -118 -94 163 182 -41 189 41 -141 -154 9 5 243 -193 -124 167 19 118 93 205 62 -247 272 15 -122
3181 -122 19 164 -11 183 162 57 -41 -165 -139 -17 -203 76 335 288 25 50 -22 62 101 75 -96 265 -191
3204 -191 -75 43 295 -419 26 100 -457 -11 100 40 265 77 153 79 -367 32 154 7 148 57 -13 -35
3226 -35 123 23 -42 -50 15 -122 104 -232 141 -183 27 106 -55 102 -319 -21 103 23 64 -20 -270 145 132
3249 132 -84 17 -96 -100 -224 51 105 -128 -93 90 170 -152 182 -22 251 78 -116 -76 260 213 -57 -40 -223
3272 -223 83 209 -138 -89 -67 -96 25 32 -292 107 297 -41 107 -72 -58 -99 145 119 -75 265 142 82 -94
3295 -94 265 190 182 -85 -18 -142 -133 54 -219 -111 -261 -251 165 221 -64 -207 -201 -189 36 269 -4 147 -15 61
3319 61 88 -169 -222 -102 92 397 -44 80 130 -161 110 113 -210 2 -161 54 79 -46 -142 -3 -356 -140 70
3342 70 142 2 -89 -11 20 72 -24 -50 -1 129 -55 72 10 -139 -128 78 -297 -273 -305 302 137 300 -83 -153 175
3367 175 -133 -44 -87 -292 4 247 52 303 149 -6 -272 137 178 93 -155 113 -193 -223 41 207 20 -137
3389 -137 -7 -29 -109 293 -67 -145 -64 146 3 -54 138 242 -4 132 -397 72 -168 172 -40 62 257 364
3411 364 2 -4 214 49 48 16 75 146 63 80 164 159 68 -212 -250 -34 406 169 -350 63 30 54 -7 -121 37 113
3437 113 276 63 69 -110 41 -278 -150 21 52 171 116 -47 11 -29 -8 193 228 -28 176 524 -241 -81 50
3460 50 189 -44 -190 -15 42 3 -25 -123 146 192 -90 -6 -75 83 16 135 151 128 111 57 -146 95 32 118 143
3485 143 -11 -25 87 45 34 36 180 226 17 58 -339 14 148 -115 -81 -228 58 235 -148 -83 -139 -257 -15
3508 -15 341 217 143 -385 76 -32 8 -86 -325 -199 -199 114 -284 -146 -32 -91 -191 -285 238 -44 -37 283 229 -143
3532 -143 -178 -173 -123 42 -42 86 -83 1 -143 -166 -87 -338 176 -59 139 -120 -58 159 -32 204 0 342 -330
3555 -330 -154 -71 -21 -30 -87 97 8 -167 194 101 12 11 -192 77 -21 -7 4 1 -99 -8 -137 -266 92 -21 -162
3580 -162 88 -133 39 289 -5 -4 -57 52 -93 -205 130 -26 108 62 -70 11 -260 262 -223 179 219 -135
3602 -135 150 243 -74 -65 -93 -7 161 303 -174 -226 21 -171 238 214 -111 84 51 -101 107 2 -121 -37 -24
3625 -24 158 7 -201 84 295 217 131 10 245 47 288 -103 -392 -222 -13 -57 -184 -311 67 -6 50 92
3647 92 -222 53 179 114 -84 -23 9 -14 -209 88 -117 104 187 42 -112 206 84 -46 17 -53 -187 -152 -20
3670 -20 -67 181 103 -190 -83 25 2 82 -126 9 94 71 26 100 -187 125 -199 36 -29 79 -218 -139 123 -19
3694 -19 10 -14 130 350 -69 -36 -32 -126 81 2 90 94 96 202 -27 87 -92 -42 92 -291 209 -119 -18 -44 -111
3719 -111 -261 108 -3 136 27 -321 -133 -46 46 184 -93 -78 59 -333 -204 -139 59 0 -27 60 135 -63 -35
3742 -35 252 225 62 165 135 -61 86 49 -121 -209 15 377 159 -118 -276 -68 -21 -64 229 64 68 207 284
3765 284 -5 158 -425 -281 118 -186 3 -100 -199 48 -110 -341 243 -29 -248 162 -229 87 -119 35
3785 35 -74 118 -27 -98 7 299 -145 -66 147 -152 -2 -120 176 68 95 62 50 -10 -99 -41 219 35 214
3808 214 -20 174 -4 111 -15 -283 -103 -97 -283 -406 3 84 -80 -21 -138 -209 -49 338 -60 21 -51 50
3830 50 58 -42 32 49 -82 40 297 -28 123 -22 -70 -179 -168 60 90 17 0 -82 -312 -31 -102 47 -169 46
3854 46 44 -41 74 -307 -19 142 93 -137 205 370 -125 -139 138 -86 231 3 143 128 106 -256 -295 -78 -13
3877 -13 45 -116 -83 -261 -81 71 -19 286 -139 -279 36 134 66 -246 -111 -138 191 66 -325 87 39 65 -125
3900 -125 -41 -203 142 75 43 17 171 166 -128 -18 -112 76 98 -23 -123 35 177 5 -115 -49 41 -223 293
3923 293 14 -223 19 70 33 -173 23 -145 104 -2 3 -102 9 11 -38 -89 168 19 -123 65 -141 76 29
3946 29 -254 -160 22 67 -162 -186 178 153 -36 122 25 -197 -256 -330 -32 60 -26 81 228 135 30 73 -138 -134 -106
3971 -106 -6 -132 2 71 -229 207 68 -58 56 -29 197 362 -308 -17 -75 -127 37 -44 328 -257 130 47
3993 47 -448 -168 -189 327 -216 134 -142 -84 78 -19 241 -225 -160 -142 -44 -100 -46 87 86 90 -170 396 294 95
4017 95 -4 -31 -70 -142 -34 -64 -111 57 58 -144 -268 187 170 -157 256 -398 -202 53 -16 -173 -281 -232 305 -160
4041 -160 83 274 279 -82 -103 -154 -151 168 -259 152 47 8 -74 158 -234 129 61 195 34 255 -49 -47 -5 -14 -174
4066 -174 -17 213 26 -94 171 -186 123 18 -201 -112 -284 56 128 -36 79 -301 -88 -6 22 144 83 305
4088 305 373 338 68 144 17 157 78 12 14 54 34 147 27 -67 -94 -23 -43 184 50 -103 147 -35 74 34 145
4113 145 -181 254 104 151 -17 -167 189 104 -140 136 46 266 294 28 63 119 -100 380 -24 56 2 44 -204
4136 -204 -124 185 -207 170 -26 38 -33 -135 -3 -166 174 -233 129 -141 1 -116 29 -3 -51 -22 -96 -115 -249
4159 -249 -14 48 40 -176 -35 -107 -269 -236 94 -353 -112 -139 -295 113 -109 -143 130 -37 240 -41 141 57 140
4182 140 -8 -97 -1 17 217 32 231 -504 -11 34 -62 -144 -146 78 210 -31 -91 -132 -82 2 -122 200 125 125 68
4207 68 132 291 186 57 94 -32 283 -19 61 -140 -144 -115 72 -52 13 -111 -128 39 -18 103 79 -49 88 -177
4231 -177 220 -79 -70 -316 40 137 264 -48 -201 24 267 151 -166 -183 149 61 -23 -87 224 -133 -145 100 99
4254 99 -46 -144 -104 -60 279 -180 -153 -210 -39 112 95 159 -149 40 -6 -11 204 -22 -164 -239 51 110 213 114 -54
4279 -54 88 -39 2 73 -81 -80 145 -6 152 22 -253 165 44 -8 9 70 19 63 11 -45 -327 -259 23 -6 -279
4304 -279 262 141 210 -305 -33 89 162 -60 107 125 100 79 233 228 -206 34 113 92 133 -114 -185 51 129 -72
4328 -72 76 23 -54 -42 -50 232 120 28 -62 113 145 190 127 -11 -44 225 -215 -64 -66 48 26 -93 -159 211 257 -113
4354 -113 -180 -34 89 150 41 -191 73 -64 170 145 184 110 65 275 72 120 127 82 -17 -14 -334 -95 -70 -143 -156
4379 -156 97 -258 -123 112 -75 104 89 -76 89 -130 42 -82 62 -345 -86 11 -62 -163 107 -45 17
4400 17 49 -130 -372 201 -50 93 -38 79 75 -284 -160 201 314 98 36 -249 74 75 26 233 139 -104 -38
4423 -38 26 62 220 17 -150 140 -45 316 96 17 -10 -137 -33 -221 232 93 -328 -122 123 102 66 54 -63
4446 -63 -71 143 197 -95 56 163 -86 219 213 244 6 -2 -136 17 13 188 119 -136 26 -182 -5 -153 -165 356
4470 356 -150 -128 75 19 -201 40 -17 16 157 234 220 -149 99 151 145 240 64 -113 -184 -159 51 -128 -104 14
4494 14 -78 4 53 -85 -41 -170 84 -6 56 69 84 179 26 -139 -30 -101 65 -102 95 -1 43 -139 -69 112 305
4519 305 -163 -123 43 -279 -533 -45 -21 173 -51 153 66 -1 290 -108 98 218 69 -83 35 273 146
4540 146 -58 -101 101 -204 191 35 103 -171 -246 140 7 -75 11 152 -344 -212 -5 65 -6 -21 -70 11 171
4563 171 -121 -95 -330 160 24 -17 360 -147 -89 -109 311 91 32 -156 -301 -1 44 282 173 84 -255 -146
4585 -146 76 107 -83 -299 -113 -49 100 48 273 187 68 -9 175 -356 176 256 144 -28 -1 104 2 -2 156
4608 156 -106 49 -84 -142 93 67 144 43 -88 42 145 2 210 -109 112 63 -95 186 -70 27 -181 214
4630 214 -133 -85 96 -179 -240 124 92 -3 42 403 -117 193 49 -17 20 -103 -105 65 261 -192 -14 -156 -83
4653 -83 -120 94 58 -170 -44 -20 -61 -65 -50 -53 -130 -459 83 20 50 122 -60 -4 318 -51 -88 248 -77 -218 -187 -5
4679 -5 71 -355 -147 177 176 201 199 -212 -404 8 113 -30 -18 -51 -151 -52 264 204 218 -29 107 162 -298 -157 -241
4704 -241 -3 254 -82 -152 128 -39 273 -172 141 40 -90 -73 -6 144 -329 123 146 7 -64 100 -74 59
4726 59 -142 63 107 7 0 181 66 166 381 38 -52 -147 -135 -197 -231 114 -138 -121 206 85 -107 104 153 -23
4750 -23 163 162 -6 2 -19 -121 32 -148 173 -166 152 137 22 64 162 -174 -33 -43 -107 304 -355 -61 -473 -66
4774 -66 -9 -110 -35 281 23 45 62 -195 -117 50 -215 30 166 -8 159 50 132 -22 -22 53 9 -13 -11 180 -9
4799 -9 -313 -10 256 193 5 -331 -103 -21 -143 165 161 -53 14 90 -107 108 -51 158 -93 -5 -67 111 20 158
4823 158 103 -142 74 63 271 -208 99 127 -238 -34 -24 266 -48 190 -71 365 49 -9 123 20 -17 247
4845 247 -176 -90 464 -189 136 54 -67 -278 -16 57 -115 145 -93 90 -109 -58 -142 8 -16 167 -61 91
4867 91 380 37 -208 183 231 -28 100 120 -279 168 -32 164 -246 119 -120 61 67 -37 147 -56 274 37
4889 37 25 -75 18 -86 -86 295 76 -188 -23 -90 230 -58 -41 3 -65 -191 -118 -48 -269 -85 -223 -7 60 -163
4913 -163 -48 -15 -33 -433 190 -6 -80 -246 3 -204 -217 -24 10 47 -90 233 141 43 29 -47 -173 -76 -41 -147
4937 -147 -155 185 57 171 -235 249 -103 86 219 -290 4 -20 -165 188 65 50 -180 -259 34 -71 -65 165
4959 165 -122 -14 -157 259 -89 -49 128 -106 -63 -197 103 -254 63 101 74 -40 177 26 -292 -100 37
4980 37 -144 -79 49 -194 -66 158 -62 192 73 189 -53 -12 13 424 -12 -105 65 86 -242 99 143 -111
5002 -111 -158 236 103 267 -133 -118 -9 -133 -2 97 -83 52 -69 -110 -49 -434 107 -355 -65 -32 -121 -27 -154
5025 -154 146 -75 -34 71 16 -25 -132 23 127 -33 32 69 -146 159 146 -213 32 -162 -89 -126 30 -82 -149
5048 -149 91 -142 61 234 -54 -13 -433 91 103 120 -335 -179 138 145 -133 -92 77 56 -183 -222 378 -203 135
5071 135 -12 -120 130 142 -96 -143 373 -103 -80 -58 257 29 -252 -161 83 80 -172 293 401 -80 135 270
5093 270 -124 -37 -293 -109 -93 36 62 380 176 217 355 32 -44 -48 -88 75 67 -324 -39 -148 8 -194 -136 -1
5117 -1 -25 144 -257 210 52 -77 -252 225 -62 5 361 -140 92 118 -87 7 297 -7 162 -28 -18 -292
5139 -292 71 93 -64 -178 -163 69 57 -39 -119 106 159 36 -199 -128 -4 44 83 -21 -118 159 123 218 -107 144
5163 144 391 188 84 187 85 -106 -119 138 22 -14 -224 133 42 45 -81 -78 38 40 -8 -10 39 -164 56 -23 30
5188 30 -110 170 31 -38 31 -89 0 22 -72 -187 -173 -25 119 -147 80 109 -138 -115 -106 -67 -7 -247 174 275
5212 275 -16 -90 -206 -312 -363 25 -82 -164 -62 343 127 121 411 96 -48 92 0 180 -84 -223 -14 -66
5234 -66 98 -52 -164 63 91 -179 12 130 101 152 235 72 -162 135 -72 -160 32 108 -26 -41 -72 151 -260
5257 -260 322 174 -236 -45 98 102 20 -133 -131 -129 -220 -7 -213 67 253 76 154 -205 -271 50 -392 150 -41
5280 -41 13 -162 -110 130 -67 -93 147 -79 5 -41 -93 -98 -42 -138 231 60 -144 -126 312 143 -10 -33 62 -7 -54
5305 -54 -15 35 -135 47 -258 -1 25 -26 -310 -177 43 -12 99 16 140 -116 -173 -117 -184 136 -190 26 -223
5328 -223 73 -3 -57 -253 -103 -143 -208 -54 286 39 9 -16 120 -130 42 52 139 10 -68 268 284 174 66
5351 66 131 -140 89 -140 -58 -24 228 39 0 78 -106 -105 65 194 -17 -68 -136 275 -133 -15 -78 -7 -240 16
5375 16 -402 -48 132 -298 76 129 -108 108 -43 72 190 -77 24 -25 122 -56 17 -32 -204 164 145 -96
5397 -96 141 53 -91 85 221 -219 25 -172 -37 70 117 368 -29 -254 6 -175 -113 -187 -97 138 -166 134
5419 134 87 22 254 -136 -177 365 131 -203 8 -190 -84 -73 -20 205 159 201 -297 107 -133 -30 82 -241
5441 -241 48 -24 93 105 -174 -233 1 -11 -162 -83 121 188 12 -165 48 125 268 -155 -73 108 -77 -243 160
5464 160 5 -57 88 212 -57 168 -125 -3 -6 -96 79 21 -23 177 -123 -50 143 -47 -188 89 -213 40
5486 40 -156 -224 -128 -62 46 -86 110 -351 329 -47 -61 -90 -160 160 71 159 242 118 -81 216 -203 31 -241
5509 -241 217 99 -151 -69 -220 149 138 -133 8 258 -15 -176 43 -226 184 -139 -56 173 46 -75 160
5530 160 -92 119 4 -17 132 21 198 -49 215 -104 57 48 -5 145 158 -59 -161 -116 113 -120 -169 53
5552 53 14 -179 -14 32 -137 151 -165 176 -26 107 221 -114 -236 -41 33 -122 150 238 -63 -86 60 257
5574 257 -234 -100 274 14 -226 -262 -66 -33 173 295 -5 -171 88 43 97 524 -70 88 1 -176 -110 -59
5596 -59 -240 -3 157 258 -90 -115 -45 -25 -57 -106 68 163 204 -213 -70 56 -90 -105 162 263 162 -124 137
5619 137 18 54 34 -46 121 155 60 66 36 76 -68 47 -111 163 73 26 -140 146 3 133 1 -85 -114 24
5643 24 289 186 103 -97 -60 125 184 -162 331 -222 45 29 -39 9 203 -134 143 36 2 297 264 98 155
5666 155 -37 103 -137 143 -47 -166 -54 118 14 -177 52 25 70 26 -62 144 -46 -11 184 -190 -392 235
5688 235 130 123 44 -94 19 -233 -18 165 -341 202 -23 5 333 -127 -124 190 533 -129 -201 243 -131 97
5710 97 102 58 209 29 60 -236 -224 -74 -92 -125 -46 33 -127 -33 -100 195 -66 -109 -247 -12 -113 -2 16 143 -156
5735 -156 29 119 226 238 -162 -103 -208 51 201 122 108 -133 -263 -226 -218 -210 13 -111 60 86 -267 -181 143 -300
5759 -300 -154 -163 -161 217 -197 67 143 472 -17 160 -83 -139 408 26 0 148 -147 19 -88 -92 -136 50 10 386
5783 386 -83 46 -28 215 -46 87 162 294 -142 226 -53 83 -302 74 -180 -87 41 -60 -39 107 -265
5804 -265 138 -5 90 30 3 103 33 205 -104 -72 -162 -127 -201 -68 37 -158 -123 -155 110 363 119 -7 83 63
5828 63 -253 -29 133 -292 5 -129 -203 -143 -163 184 177 -42 87 -19 -37 174 -20 -25 109 22 -203 -151 187 -230
5852 -230 27 -103 -226 -159 -27 -80 -239 -32 -280 -219 -20 -157 -263 -102 40 3 -1 49 -147 -86 -201 -101 -294
5875 -294 -58 148 23 -10 -71 49 139 -23 -139 76 -137 50 180 -76 -96 -26 225 -43 23 -60 -25 -247 252
5898 252 0 -120 -88 -93 58 -27 -120 -94 -56 -43 -334 95 30 -273 -149 -163 -11 -334 37 -132 279 -122 -142 -122
5922 -122 -259 95 -17 -51 191 -5 42 70 -61 5 -62 210 -62 -60 27 127 116 -3 -191 381 -148 160 -116
5945 -116 -37 -29 -91 -126 -90 -87 -56 -119 83 -74 305 203 232 129 -233 -158 241 -127 26 4 95 -103 -164 97 -46
5970 -46 116 207 -42 -28 155 95 127 135 27 40 -238 -84 70 -26 39 -26 259 48 -117 -214 -19 150 71 114 112
5995 112 -26 -173 -15 44 -324 23 143 -260 -75 -19 12 61 19 -381 31 -59 308 -143 142 -22 -190 -118
6017 -118 -516 -23 26 -116 24 -72 209 152 -421 -21 -41 50 172 162 -192 -58 184 169 106 7 191 32 -200
6040 -200 19 109 83 49 281 262 17 -115 63 144 -406 143 -90 -37 -466 -114 75 140 43 -124 104 -27 229
6063 229 140 132 -161 -209 35 -243 -37 -94 -240 -4 53 29 12 226 -151 -86 -12 192 128 -7 128 -148 282 -265
6087 -265 26 267 73 157 -84 -242 -113 151 -79 -91 72 95 176 36 198 54 -226 -196 -160 143 257 -82
6109 -82 281 -16 -249 -161 -170 -85 84 -56 -137 -110 40 154 -54 372 158 -262 -151 119 -158 -2 -170 243
6131 243 -178 18 -81 122 186 126 -147 59 43 71 -50 -148 0 30 212 -134 20 193 -103 -189 282 -62 230
6154 230 156 101 -14 55 5 116 -99 -96 30 194 46 -231 -47 89 -153 20 191 296 -38 -95 59 24 -256
6177 -256 -408 -49 -223 -37 -121 148 -41 -129 221 238 -164 120 -201 77 75 3 23 129 -16 -171 -159 -292 -50
6200 -50 -164 57 -100 140 37 20 22 -74 66 -61 -59 -403 -79 207 70 -95 -75 -32 11 -111 187 -129 134
6223 134 146 158 -191 127 19 -235 213 129 -193 -33 -57 -10 -79 255 -40 -106 90 -21 -166 32 76 -53 -31
6246 -31 -228 -226 -436 233 -44 171 208 57 176 -415 86 -9 100 42 6 134 127 136 -44 -148 151 101 -45 44
6270 44 71 181 -46 -350 -255 -99 326 246 -69 119 -157 -119 76 -57 -287 -326 54 -108 -178 50 27 -219 -121
6293 -121 137 -179 206 75 63 2 178 -16 80 39 133 79 -210 -57 -319 -104 -196 165 -9 145 -144 328
6315 328 -137 -15 -275 -34 38 41 77 122 -173 -178 -160 1 -180 -261 -29 -16 47 -105 -180 -107 -202 78 207 -128 -56
6340 -56 -376 187 65 -95 80 342 36 -146 184 361 58 80 85 156 76 -150 267 58 -31 89 -73 -370
6362 -370 22 29 93 27 86 -201 -104 -201 -193 85 -127 -83 96 -192 264 -84 -269 223 -1 89 -217 -25 11 -75
6386 -75 -257 2 -76 -176 -136 46 444 -125 71 12 49 -11 -69 -25 42 122 -263 87 -52 -17 -7 -28 -304 -222 172
6411 172 -31 90 -168 53 264 256 -31 -105 -295 164 5 60 88 40 4 -86 53 -101 236 -51 -95 17 231
6434 231 40 127 -9 112 -180 -267 -52 -172 231 94 -333 -3 -276 194 -167 102 -92 -105 101 82 316
6455 316 -181 171 117 163 -154 82 -160 -72 -129 -35 -111 258 -20 -26 350 -188 77 142 109 286 78 -374 173
6478 173 -48 -171 166 259 42 -21 -226 129 -40 -276 52 39 -99 47 29 -186 -100 235 -29 -89 128 -134
6500 -134 168 -3 -98 136 127 34 141 -222 99 149 32 -37 -221 40 9 73 -135 105 86 -116 71 16 -197
6523 -197 25 154 36 11 182 94 -73 143 34 -183 61 -153 68 -144 -5 -162 -242 228 -68 44 192
6544 192 30 -24 64 -123 108 44 109 -209 -136 -139 -216 362 -24 140 -135 -37 -18 -13 31 137 7 124 -95 -127 -90
6569 -90 -17 204 -39 -239 68 87 326 -10 67 -110 137 40 60 -285 92 52 -359 54 -2 131 73 8 19 75
6593 75 38 45 188 -223 220 -285 76 2 -40 168 29 154 -117 61 -99 179 48 121 275 49 381 120
6615 120 -354 443 56 -32 121 -185 -2 -93 -50 -97 -192 -143 179 251 -138 -69 -15 45 -254 32 72 74 -127 -27
6639 -27 11 301 -119 -245 54 -223 94 220 -108 181 -97 -121 -111 -142 67 7 117 155 53 -75 -62 -206 -96
6662 -96 36 -30 90 306 235 -43 27 -188 171 109 123 68 128 25 117 -111 13 90 -73 18 -70 1 212 -2
6686 -2 84 -81 451 -95 -212 -99 -137 -175 253 44 90 0 -205 -71 83 -281 -10 -37 97 139 -241 -284 99
6709 99 -14 -140 -96 -16 124 21 -120 -109 65 110 12 -374 330 -74 -11 170 -122 -37 202 8 64 -158 65
6732 65 -189 -433 -287 -73 46 -54 59 130 63 192 19 -20 -277 218 228 -326 -16 -148 63 0 46 112 19
6755 19 -15 -74 -69 101 171 132 -109 10 -19 168 -112 227 -19 78 -259 440 42 -382 188 130 -181 -106 -108 -27 18
6780 18 66 178 -135 37 -17 246 36 -157 -19 233 109 -70 -360 -104 -284 -149 -169 -58 -231 -63 -66 138
6802 138 85 -112 -64 -191 231 34 -67 85 8 -46 -172 223 -418 151 153 -84 156 22 -78 2 295 -84
6824 -84 158 -19 -250 -88 66 64 56 -94 -156 -60 -322 289 109 -151 63 56 -139 125 54 -106 87 -44 79
6847 79 53 137 -110 115 -102 258 -226 81 -165 -26 -75 160 56 280 -96 99 -66 242 76 82 147 -212
6869 -212 -81 -5 59 -95 110 -153 -42 2 -2 203 8 -71 -212 -22 -119 -154 -194 -241 296 -8 -124 175 30
6892 30 -62 69 -78 12 160 87 -8 224 -90 83 73 -59 -114 -62 -79 305 -35 -185 29 -39 212 -115 -307
6915 -307 91 -72 -88 119 10 67 153 63 27 85 -261 -201 125 115 185 -60 211 268 -106 -28 -123 -113 -3 58 -14
6940 -14 -145 426 -81 -320 -304 220 126 -124 204 107 50 265 -265 -114 169 79 15 219 6 -231 108 2
6962 2 -234 193 -79 128 -109 85 68 -12 -31 -18 -264 -277 231 -164 -100 81 -161 -200 -85 -158 -135 -226 -317 -112
6986 -112 46 9 -296 -286 -8 -29 -4 -23 63 -119 -88 -241 235 -84 324 66 -275 -127 115 0 -72 16 28
7009 28 65 -228 173 -120 -35 48 -212 26 167 145 162 -128 211 31 197 -3 39 9 205 -159 -91 -111 63
7032 63 88 -289 38 24 14 44 41 143 187 -28 36 24 -147 34 -100 -178 17 195 71 -241 260 -13 -4 -22 -109
7057 -109 -17 252 57 -426 4 146 125 163 -86 197 114 -41 -298 -259 293 154 -151 -108 -71 359 -6 142
7079 142 -114 -9 -20 97 -189 -80 160 26 8 -157 78 -37 193 22 -172 -10 -37 90 105 95 -129 -167
7101 -167 -47 351 304 -189 196 -151 -110 -1 -197 -11 -69 35 -95 -104 -38 -101 -306 24 -25 -85 67 -392 -48
7124 -48 -16 37 89 -248 146 100 -56 40 162 182 123 -31 -31 359 -262 -36 245 216 -24 -59 -376 1 -81 -176 -483
7149 -483 -7 191 238 -52 -47 -234 -227 52 133 -118 -122 70 -42 26 15 -78 156 -160 -105 110 -229 238 107 -95
7173 -95 -25 54 121 216 -44 72 282 -21 -177 75 -70 317 52 -7 -104 380 11 -160 385 -239 -231 164 -33
7196 -33 278 36 255 -75 -177 127 111 -46 -87 -187 256 64 -294 -14 -93 -74 280 0 64 29 10 -119 109
7219 109 160 -88 -48 -18 -142 -293 -51 -169 -73 11 -171 -252 10 66 141 108 6 95 22 -53 75 -14 118 -143
7243 -143 -197 -51 -117 265 -219 92 236 -23 59 -315 70 -18 82 18 -91 0 14 -34 -49 -64 84 -91 87
7266 87 -180 -164 50 200 199 48 -199 -104 84 -66 170 -34 -248 125 -162 -1 -207 -100 -63 -190 -16 89
7288 89 62 36 12 -156 -247 -47 -52 -122 137 3 215 -48 18 141 -20 -60 -24 -257 -183 60 -43 -231 -60 39
7312 39 161 59 -215 -163 -78 -160 54 -176 -30 17 -126 306 -13 -134 -24 164 -75 0 4 121 -142 7 -145
7335 -145 -45 -75 -5 -326 -415 -133 -129 222 -155 40 -254 -168 138 -160 268 -175 -76 62 14 -59 -51 -62 -238 -75
7359 -75 -6 -245 78 -210 -42 5 68 380 292 -45 152 -61 -93 -80 -226 2 -203 -65 150 90 40 249 79
7382 79 -153 26 32 -24 -87 -120 -94 -65 198 74 96 -125 75 -115 -39 144 -30 -94 -396 -276 32 -244 2 47
7406 47 115 169 -191 -244 -13 -193 11 151 94 -344 138 -94 -39 99 18 0 142 -126 -11 -216 -51 169 -137
7429 -137 -142 -119 57 -148 252 81 -403 282 144 -12 70 1 -238 -21 -74 78 -104 3 -62 -35 12 -377 186
7452 186 -95 357 -195 -30 -160 -133 -18 -294 -64 71 -106 10 -135 -78 129 -277 33 43 -396 74 8
7473 8 -71 -217 -45 183 -341 84 207 -17 -33 -131 -56 -86 134 -110 -181 -95 50 -75 -260 -174 -117 -51 -90 -26 63
7498 63 245 113 75 71 180 -19 -10 -5 -180 100 263 88 0 282 -128 -57 -147 -210 -156 144 46 19 118 210 4 -259
7524 -259 -176 165 29 9 41 -168 54 -26 -60 -138 273 331 -226 7 127 -86 -67 97 -167 214 -98 -67 12
7547 12 -66 76 -335 66 -323 -154 259 -112 -265 71 371 197 -61 -265 85 340 46 93 96 2 -29 -274
7569 -274 -155 54 36 -208 -20 181 -77 -56 -309 -11 9 127 15 -133 108 95 56 76 -339 -502 -142 172
7591 172 -194 128 -71 75 1 -150 3 -192 -49 -160 172 -17 91 125 240 60 -147 -208 -10 -85 -98 284
7613 284 -146 139 -273 -265 -148 80 -170 114 -131 -311 179 114 -204 146 228 18 52 4 81 -131 90 34 -150
7636 -150 4 -28 127 -246 63 29 -236 -66 147 231 -54 -66 -216 -34 205 39 80 177 -127 -35 73 -160
7658 -160 -32 65 -24 -123 20 -294 221 26 17 -88 -120 -80 -30 54 -195 2 333 -235 -66 86 85 -151 -64 33
7682 33 -83 -124 -68 -202 -147 -102 -41 -9 103 127 226 136 -70 44 -10 -312 -222 -30 9 215 90 519 -129 54
7706 54 -111 -165 -37 -96 -245 53 -112 -30 -274 22 253 -47 -142 -102 26 -99 116 66 89 -10 10 8 -231 -3
7730 -3 87 294 37 201 -76 -145 -8 80 -211 -26 50 -215 -30 -93 205 284 78 -34 -3 -171 22 -145 -280
7753 -280 -281 178 233 -153 6 -59 36 166 21 0 173 91 8 67 247 3 -42 -204 76 -279 -24 -2 -182 70
7777 70 -109 113 -64 -45 -137 238 20 -238 -55 -91 181 301 171 18 13 265 -161 -93 30 142 -17 14 114
7800 114 -46 -192 -13 -71 122 271 20 126 150 -10 89 -271 47 134 454 141 -34 -1 104 137 44 119 -70
7823 -70 52 233 158 105 259 -205 -20 -155 -229 105 243 -210 -87 -73 169 126 -172 -35 -5 -192 -27 199
7845 199 210 -39 -107 69 170 -303 -31 -45 -371 -233 247 -32 -42 162 -94 245 1 83 165 -44 -26 96
7867 96 -110 -62 108 -289 -1 11 108 -122 -251 -133 -224 -105 -218 147 116 276 -118 -125 -7 106 -249 164 -133
7890 -133 -29 128 35 108 -214 -41 35 -289 -108 -62 -124 57 -101 151 62 -100 -13 -246 -67 -302 0 30 53
7913 53 16 168 102 -43 -186 178 129 198 292 168 -53 -77 -78 -46 122 4 40 -87 -28 35 59 143 163 161 -77 183
7939 183 -23 13 -67 -51 -50 97 225 -194 159 196 237 58 -64 -70 89 50 67 -94 194 159 185 -149 -109 -123 167
7964 167 -76 -350 49 -96 63 -228 -159 -289 -14 -91 -345 -150 -91 -201 -99 245 40 13 -54 -87 249 221
7986 221 -38 -8 92 -192 -60 -118 24 -298 -67 45 164 15 -170 143 101 -154 -190 -150 103 181 44 -94
8008 -94 -117 17 -353 -60 4 17 175 -282 -25 -108 201 33 -167 46 81 -109 -248 -405 66 160 -26 -331
8030 -331 -143 -69 -40 63 -121 8 -227 63 -53 239 136 -300 196 -47 150 -37 33 74 -36 144 145 -76
8052 -76 42 -291 -133 304 -130 -72 27 -212 -337 167 243 108 -282 3 -120 33 158 -19 -68 146 28 2
8074 2 32 -87 204 -80 -17 -99 -157 -120 217 -9 77 37 -26 -92 -52 145 -226 68 71 -33 54 -137 -3 -348 -80
8099 -80 -171 37 -92 109 9 164 68 69 -178 95 -121 93 293 52 -72 -32 -20 279 -86 26 -3 33 -139
8122 -139 -126 185 206 -98 -68 -18 58 -70 27 -282 -275 142 29 158 207 26 77 95 -116 -19 79 161 -27 -116 -239
8147 -239 123 -25 137 126 -6 -85 49 -70 122 -8 -171 34 67 104 -106 -212 -20 284 3 214 259 4
8169 4 -1 57 4 67 -120 43 52 -155 119 -173 -171 -207 124 -31 -255 47 -168 5 40 117 -69 54
8191E4
$$ Imaginary data points
##PAGE= N=2
##DATA TABLE= (X++(I..I)), XYDATA
0 0 0 0 0 0 0 0 8 -8 8 -8 16 -16 19 -24 31 -32 40 -48 56 -68 80 -92 108 -124 143 -164 188 -212 239 -268
30 -268 307 -339 383 -428 478 -533 592 -657 730 -809 896 -991 1098 -1215 1346 -1495 1661
47 1661 -1852 2068 -2322 2625 -2987 3432 -3996 4737 -5759 7269 -9724 14414 -26652 125089
61 125089 296605 112726 76683 122686 148714 97680 126137 153049 98327 19884 59293 128384
73 128384 142957 128971 141318 107806 53384 69625 147891 156778 100883 75289 90770 86660
85 86660 100108 156504 175175 100573 33197 50341 89344 85338 73270 64599 27403 -7031 28677
98 28677 94485 104768 73348 61045 51089 22719 26117 77025 91033 29383 -26818 -18234 12188
111 12188 26088 38224 37741 -4180 -48874 -38336 3163 12907 -7030 -25127 -43516 -59409 -37855
124 -37855 11787 27696 -7508 -42640 -47582 -43509 -35434 -17861 -18405 -58743 -99635 -91629 -51508
137 -51508 -26741 -28810 -43689 -64761 -79777 -66100 -31856 -17067 -37419 -68113 -81525 -73184
149 -73184 -47653 -21266 -18587 -43506 -71243 -76857 -59641 -36411 -26320 -41514 -71703 -85691
161 -85691 -66360 -33428 -13025 -13421 -29623 -49218 -52548 -29396 -2706 -1655 -24370 -46791 -53124
174 -53124 -41836 -17777 2681 -1216 -25541 -42353 -33079 -9592 7288 8405 -7613 -28414 -33219
187 -33219 -12105 16466 27314 16149 -3274 -15421 -9477 12134 29549 23665 -1496 -20423
199 -20423 -18995 -728 20923 31517 21538 346 -8925 4111 26440 38867 31350 10735 -6865
212 -6865 -5473 13903 32854 35119 20347 2090 -5631 5139 25767 35330 22825 168 -10479
225 -10479 -3352 14081 29202 31804 16630 -2403 -5078 11766 29238 30626 17437 -1238 -13515
238 -13515 -8415 10594 24612 19020 318 -12336 -10269 3941 18642 22266 8527 -10904 -18054
251 -18054 -7240 10220 19290 12733 -3499 -16149 -13006 2940 15340 12483 -2352 -17885 -22604
264 -22604 -12154 5499 13163 3596 -12833 -19338 -11435 2898 13590 11593 -3582 -19253 -20108
277 -20108 -5923 8808 10677 71 -13974 -20215 -12041 4062 14201 6752 -9471 -19475 -16239
290 -16239 -2724 10384 12057 1178 -12564 -15158 -4100 10390 16020 7725 -6799 -16255 -12280
303 -12280 2015 13296 11438 -1216 -12660 -12086 -554 13023 17168 7694 -6159 -12077 -5086
316 -5086 8516 16804 12429 -420 -9926 -7715 4447 15353 16182 5590 -7335 -11222 -2443 10215
330 10215 16018 9637 -2369 -9427 -5226 6889 16876 15589 3666 -7931 -8976 -49 11303 14787
344 14787 6805 -5647 -11497 -5055 6997 14351 10573 -732 -10697 -10236 522 11403 12136 2797
358 2797 -8259 -11717 -4832 7164 13513 7197 -5602 -13453 -9659 475 8764 7779 -1656 -12409
372 -12409 -14142 -4510 7126 9877 2470 -8547 -14062 -9491 1145 8939 5855 -5217 -14475 -13284
386 -13284 -3573 5818 7527 -383 -11728 -15730 -9220 2270 7249 2402 -7763 -14641 -12021 -1750
400 -1750 7212 7206 -2294 -12006 -13427 -6036 3830 7551 1818 -8850 -14275 -9508 317 7727 5746 -3300
416 -3300 -11931 -12122 -2907 6520 8078 1107 -8276 -11924 -6566 3862 10034 6027 -4210 -11151 -8993
431 -8993 350 8389 8846 951 -8564 -10610 -3022 7163 11024 5541 -3901 -9075 -5773 3841 10835
446 10835 9379 338 -7581 -7771 429 9563 11608 5451 -4095 -8098 -2505 6823 12012 8910 122
461 122 -6727 -5484 3261 11964 12498 4480 -3685 -5700 -452 8793 13028 8356 -871 -6356 -3144 5721
477 5721 12369 11637 3558 -4513 -4854 2053 10817 12941 6622 -1443 -5657 -1591 7301 12947 10136 1194
493 1194 -5315 -4227 3262 10620 11708 4822 -3901 -5987 -724 7795 11789 7891 -661 -6316 -4123
508 -4123 3796 10650 9716 1586 -5832 -7265 -716 7420 9918 4515 -4299 -8262 -4791 2951 8954
523 8954 6443 -1794 -8885 -7946 -801 6128 7230 1295 -6892 -10180 -5568 2773 6969 2803 -5466
538 -5466 -10667 -8765 -2080 4826 4434 -2219 -10247 -11823 -5439 1652 4189 -50 -7799 -12700 -9530
553 -9530 -1834 3786 1725 -5804 -11656 -11701 -5857 940 3304 -2357 -10038 -12959 -8575 -1257 2528 171
569 171 -6825 -12815 -11330 -4274 2272 2091 -3661 -10192 -12284 -7043 372 4172 69 -7451 -11496 -8376
585 -8376 -1354 3887 3401 -2991 -9596 -9888 -3279 3634 5286 792 -5581 -9094 -5529 1972 6808 4889
601 4889 -1807 -7077 -5954 406 6736 7805 2586 -3974 -5711 -1098 5814 9539 6574 73 -4021
616 -4021 -2351 4364 10236 9677 4083 -1858 -2487 2556 9072 11362 7796 1622 -1790 808 7574 12226
632 12226 10649 4683 -291 238 5564 10761 12099 7996 1644 -841 3067 9391 12379 9821 4018
647 4018 -218 633 6224 11460 11327 6075 381 -625 3415 8746 11322 8059 1931 -2174 283 6087
663 6087 9955 8538 3072 -2011 -2571 2145 8012 8674 4494 -1511 -3576 -1140 4070 7401 5495 -501
679 -501 -4873 -4179 1083 5025 5044 790 -4463 -6504 -3194 2335 4702 1451 -4094 -7461 -5952 -1318
695 -1318 2685 2294 -2909 -8248 -8410 -4263 359 1796 -1436 -6468 -9522 -7380 -1975 932 -516 -5378
711 -5378 -9264 -9088 -4957 -307 323 -3761 -8257 -9751 -6925 -2381 -75 -1603 -6256 -9828 -8415 -3763
727 -3763 -120 -327 -4378 -8232 -8865 -5734 -690 985 -1917 -6357 -8547 -7096 -1801 850 107 -3915
743 -3915 -7215 -7015 -3462 944 1873 -1059 -5784 -7208 -4443 439 2984 1450 -2701 -5805 -5074 -701
759 -701 2989 3376 -328 -4102 -4765 -1805 2307 4501 2518 -2103 -4080 -2216 1873 4838 4117 1040
775 1040 -2636 -2639 699 4607 5302 2639 -1073 -2197 -368 3834 5910 4797 778 -1812 -1030 2238
791 2238 5659 5725 2823 -884 -1639 953 5027 6186 4157 853 -1225 -219 3302 5994 5693 2123
807 2123 -908 -1108 1790 5075 6043 3614 208 -1672 -44 3518 5406 4378 1239 -1500 -1465 1596
823 1596 4885 5200 2231 -967 -2288 253 3284 4622 3081 -91 -2338 -1593 2103 3956 3663 342
839 342 -2195 -2087 -143 3230 3894 1749 -1763 -3197 -1917 1681 3421 2147 -524 -3325 -2832 -234
855 -234 2676 2685 199 -2572 -3405 -1329 1107 2638 1186 -1893 -3770 -2815 -425 2028 1668 -1168 -3454
872 -3454 -3613 -1501 1289 2076 206 -2528 -4072 -2631 324 1810 1041 -1521 -3651 -3405 -894 1639
888 1639 1831 -178 -2956 -3849 -2097 559 2216 896 -1776 -3544 -2963 -490 1696 1601 -670 -2893
904 -2893 -3505 -1150 1393 2101 377 -1771 -3450 -2048 284 2521 1582 -1132 -2858 -2389 -374 1792
920 1792 2479 189 -2018 -2688 -1002 1355 2473 1201 -885 -2437 -1838 445 2567 2693 570 -1957
936 -1957 -2053 -190 1918 2860 1477 -939 -2306 -1030 1254 2887 2356 98 -1976 -1625 486 2480
952 2480 2958 1171 -1020 -1451 -385 1746 2919 2248 -345 -2090 -1390 1431 3121 2805 692 -1207
968 -1207 -1513 26 2302 3246 1789 -896 -1702 -675 1238 2719 2329 6 -1832 -1800 300 2120 2714
985 2714 925 -1359 -2341 -977 1290 2220 1672 -619 -2170 -1655 369 1950 1953 -15 -2039 -2458 -1008
1002 -1008 1180 1908 825 -1529 -2791 -1762 169 1425 1388 -901 -2484 -2737 -713 1109 1253 -180
1018 -180 -2019 -2556 -1636 170 1486 480 -1593 -2512 -2098 -577 1037 1064 -327 -2041 -2810 -1285 438
1035 438 1255 357 -1347 -2504 -2279 -256 1388 1069 -668 -2411 -2426 -743 935 1608 393 -1771 -2191
1052 -2191 -1103 377 1843 946 -988 -2126 -1940 -226 1853 1676 123 -1532 -1975 -486 1117 2267
1068 2267 1510 -718 -1668 -1235 710 2140 2135 486 -1390 -1472 533 2000 2329 1126 -346 -1411 -488
1085 -488 1394 2690 2180 525 -1071 -815 913 2397 2316 798 -473 -1082 456 1710 2623 1688 -85
1102 -85 -1106 -708 859 2456 2004 372 -957 -1112 -76 2010 2520 1325 -717 -1485 -597 1345 1853
1119 1853 1470 72 -1357 -1267 197 1535 1704 481 -1178 -2049 -713 705 1441 755 -1017 -1759 -1443
1136 -1443 128 1129 960 -607 -1825 -2221 -929 739 1031 198 -1394 -2366 -1798 -162 813 579 -938
1153 -938 -2106 -2158 -831 474 938 -450 -1996 -2378 -1720 62 670 78 -1256 -2334 -1966 -617 538
1170 538 853 -533 -1856 -2251 -1029 317 918 190 -1329 -2150 -1388 -122 981 798 -302 -1623 -1747
1187 -1747 -801 983 1522 459 -1042 -1692 -688 667 1814 1330 15 -1156 -667 577 1669 1675 780
1204 780 -542 -721 37 1269 2139 1469 -91 -804 -416 942 2181 1676 586 -587 -431 484 1904
1221 1904 2327 1003 130 -606 104 1446 2329 1920 828 -630 -483 709 1831 2341 1122 -50 -638
1238 -638 280 1664 2470 1424 392 -485 -519 673 1956 1802 581 -410 -995 529 1457 1531 1076 -344
1256 -344 -1089 -212 660 1463 1017 93 -588 -742 -217 826 1234 261 -652 -1335 -479 545 1050 422 -849
1275 -849 -1348 -1378 -359 764 535 -550 -1777 -1610 -729 166 856 100 -1138 -1660 -1301 -309 446 367 -750
1294 -750 -1932 -1843 -1058 209 169 -770 -1641 -2157 -1540 -382 294 -139 -1372 -2069 -1955 -746 209 290 -725
1313 -725 -1692 -2104 -1155 186 -2 -168 -1106 -1729 -1266 -171 343 545 -826 -1070 -1424 -858 274 533 -131
1332 -131 -1074 -1155 -711 284 569 297 -1005 -1243 -1092 -221 527 712 40 -701 -823 -483 873 988 500 -306
1352 -306 -878 -515 239 1093 946 354 -564 -367 159 817 1511 743 -362 -699 -101 807 1657 1287 258
1371 258 -171 -126 883 1560 1224 774 -6 -467 393 890 1513 984 322 -255 -335 893 1284 1329 623 -208
1391 -208 -270 538 1042 1331 679 231 -213 -76 734 1444 772 266 -327 -285 683 904 1010 354 -140 -227 148
1412 148 767 1057 614 -233 -454 -585 216 700 585 299 -541 -543 67 534 620 269 -520 -847 -709 397 589
1433 589 344 -483 -978 -1021 -331 365 303 117 -967 -1023 -760 300 221 33 -807 -1158 -489 -139 559 462 -384
1454 -384 -1052 -1297 -729 117 367 21 -1035 -1271 -999 -260 459 -114 -574 -862 -947 -271 -18 455 7 -874
1474 -874 -1208 -340 591 166 261 -436 -1261 -583 191 372 300 -408 -585 -820 -368 314 513 167 -678 -671 -557
1495 -557 -260 391 590 116 -607 -788 6 549 427 396 -551 -509 -402 364 666 355 -19 -114 -283 254 700
1516 700 811 68 -464 -739 -127 861 609 325 -72 -322 -249 312 933 336 -104 -518 -471 257 734 804 216
1537 216 -377 -335 -265 676 668 245 -238 -318 -231 -89 588 476 194 -153 -556 10 492 531 479 -261 -349 -56 -52 611
1561 611 446 25 -539 -424 -19 504 697 -58 -435 -429 -148 492 755 431 -117 -452 -360 278 454 516 -7
1582 -7 -439 -389 -10 499 332 96 -291 -436 -282 344 651 385 -24 -472 -410 29 572 590 141 -443 -385 -312
1604 -312 431 609 382 -335 -565 -440 150 597 491 240 -512 -212 -255 433 729 393 -129 -282 -100 338
1624 338 496 373 -10 -440 -236 -43 762 1064 197 -388 -509 -387 276 627 195 19 -565 -486 287 385 188
1645 188 124 -27 -369 66 501 734 425 -237 -590 -506 229 596 19 -148 -494 -408 -43 110 266 424 -195
1666 -195 -432 -602 144 352 241 -214 -485 -494 4 241 364 74 -491 -352 -233 -105 161 -14 -217 -623 -382
1687 -382 63 64 307 -317 -504 -704 -317 118 297 -145 -661 -696 -157 200 392 147 -296 -551 -823 -128 89
1708 89 331 -156 -540 -697 -258 345 233 208 -100 -457 -409 -192 258 485 -376 -695 -527 -7 135 132 204 -533
1730 -533 -396 -332 227 445 358 141 -326 -455 222 157 341 329 -131 -307 -268 -80 329 97 -102 -406 -669 25
1752 25 383 322 165 -315 -440 -231 -82 687 -44 -202 2 -265 307 346 598 -251 -253 -500 228 128 606 360
1774 360 -39 -435 -378 349 437 174 -362 -146 -296 235 490 709 -15 -266 -496 -181 118 441 230 -270 -409
1795 -409 -46 38 300 521 -137 -419 -210 -201 273 487 207 -205 -408 -45 -10 452 238 -49 -409 -239 296
1816 296 425 448 50 -171 -514 -139 136 467 177 9 -26 -374 364 241 165 93 -207 -345 -177 228 321 -123
1838 -123 -277 -568 -201 -77 212 172 -3 -287 -281 -3 458 227 185 -465 -374 -140 125 347 214 32 -42 -168
1860 -168 212 503 184 80 -107 -227 121 219 309 119 -284 -434 -312 154 154 313 88 -9 -197 139 56 253
1882 253 176 -111 -418 -91 115 37 -64 -210 -462 -574 -82 693 30 -55 -370 -232 2 12 321 160 -273
1903 -273 -356 -667 21 150 -111 -274 -123 -328 -85 287 313 -112 -113 -325 -183 -125 340 214 -172 -505 -405 -201
1925 -201 267 146 169 -58 -288 -240 211 627 32 -248 -10 -168 188 363 94 177 84 -510 -8 260 481
1946 481 244 -323 -201 -36 199 184 393 39 -47 -20 -64 314 13 377 -131 -104 4 29 442 227 -151 -57
1968 -57 3 178 357 -25 -117 213 -320 40 226 450 178 205 -156 79 31 473 320 -50 -84 42 155 173
1990 173 284 320 101 -20 204 275 286 161 195 -251 -158 -32 120 364 -70 -517 -120 -69 128 229 -70 -199
2012 -199 85 -248 112 473 259 -119 -206 42 -89 261 281 27 -103 -375 -135 436 241 -185 -307 -125 73
2033 73 111 25 65 6 -206 -455 -52 59 15 -56 -188 -284 -240 326 79 -136 -155 -132 -52 -118 209 156 204 -485 -374
2058 -374 82 -38 -65 226 48 -663 -238 39 444 332 241 -338 -98 16 -147 322 -93 -97 -382 -307 -35 212
2080 212 407 -88 -225 22 247 180 285 152 -202 -137 -119 -8 438 467 -157 -391 81 -84 459 339 -1
2101 -1 -230 -148 -32 221 382 96 157 120 48 21 82 108 -337 -198 157 151 -29 171 -60 84 -157 -94 178 123
2125 123 324 -287 85 -30 -125 98 131 -29 -190 150 -13 177 101 25 -335 -64 36 -325 226 126 180 -213
2147 -213 -242 -29 -84 -154 -81 2 -316 33 -203 49 -102 -28 -241 -78 -167 86 88 -106 21 -315 -207 17 83
2170 83 133 -238 -475 -14 -1 -83 59 -188 -253 -265 -7 -96 2 -58 -134 24 60 -192 94 12 -267 -229 -257 1 94
2195 94 283 124 -157 -272 34 -66 -249 128 -111 -336 62 75 260 232 19 -291 -71 -20 28 -86 -72 65
2217 65 -77 48 -14 42 143 -105 -246 94 -251 219 -15 -156 -109 -43 40 -3 150 45 -228 -306 79 427 101
2240 101 -16 69 -123 -107 67 403 209 -27 -7 -426 -50 45 222 326 189 -141 -134 -104 218 144 176 18 100
2263 100 29 160 231 174 -33 -59 -29 135 22 330 22 -217 -81 387 66 -11 125 -97 -109 -4 452 197
2285 197 201 166 -206 -179 -105 252 182 -214 8 20 -34 -248 30 109 70 -195 10 -123 316 116 -132 39 -183
2308 -183 -67 -285 111 14 114 -236 -363 12 -75 -244 -228 -364 -195 8 -96 118 103 -222 -183 232 69 143
2330 143 17 -13 -271 222 -79 173 249 172 -201 -263 -72 -110 -207 169 -229 18 284 -89 258 63 -59 -164
2352 -164 30 -5 63 220 46 -120 100 -317 19 243 39 -231 -251 265 351 76 247 -41 163 -51 10 174
2374 174 163 290 230 -181 -112 342 216 194 72 174 -323 -7 69 29 139 113 -68 -144 -7 94 261 159 17
2397 17 -90 -51 86 -20 191 57 46 13 474 230 216 -262 -270 -153 165 -35 349 6 -195 -18 221 274 9
2420 9 214 45 83 -89 -116 -123 -87 -155 -316 -178 -10 -139 38 60 -306 -60 43 -281 -31 -67 -188 -542 -325
2443 -325 -208 134 -131 -343 -40 -32 -135 59 243 -121 -197 -230 -132 -166 -195 87 -80 -114 -508 -200 -71 29 16
2466 16 142 143 -10 34 62 -104 -151 166 -203 -171 -43 102 105 89 -173 223 -21 97 79 78 -137 85 111 57 -37
2491 -37 0 129 -7 178 -24 216 -63 -93 227 -141 260 226 276 121 -32 -26 37 498 311 104 -294 149 319
2514 319 263 119 219 -189 189 -75 47 143 344 -95 -35 106 191 -47 195 71 2 -78 108 80 85 125 217 22
2538 22 71 -74 -13 453 -17 62 69 -216 -75 -166 36 -65 140 -49 220 -157 -57 -94 -94 -301 60 131 -32 36
2562 36 -19 -86 -27 26 -86 -108 -22 -143 -174 -256 8 173 -25 -335 -138 -205 -198 16 154 -268 -54 -153 20 217
2586 217 62 -301 -207 -94 -384 -459 -256 -142 -102 -295 -84 -147 255 -141 -15 -26 118 78 7 138 50 24 -389
2609 -389 14 -183 -57 18 132 -279 -184 214 -50 -254 54 -6 -181 95 -239 -107 14 -250 -40 -33 280 -147
2631 -147 -52 -10 38 -233 -34 254 -9 148 -305 -97 124 199 229 198 -161 -160 -72 -67 -262 91 -265 -103 -128 -100
2655 -100 -80 44 38 -189 -257 359 14 111 173 -95 222 100 76 -96 -59 17 77 -41 -158 2 60 47 277 94
2679 94 -221 231 90 35 271 -284 -21 29 -49 -83 -9 -121 115 -39 150 -176 -189 238 50 -144 -292 93
2701 93 134 -84 96 216 34 128 43 31 -43 -11 4 286 47 173 47 145 65 -321 138 80 -179 66 -121 75
2725 75 98 69 85 119 26 -170 82 158 100 52 195 -91 -124 102 -51 -163 59 -22 -145 56 -4 267 189 122 68
2750 68 115 153 286 110 87 257 113 51 99 114 -135 108 -99 226 209 -67 44 52 108 -109 -36 86 -120 -89
2774 -89 -185 -152 -213 181 57 -22 106 -140 -133 39 -108 334 -309 94 -168 119 83 177 -38 160 77 234 -136
2797 -136 -105 -81 -139 -124 59 -241 272 109 93 -130 -193 65 -67 72 -318 -308 -226 -363 29 -53 -180 -267 14
2820 14 -307 -34 -195 -56 209 -69 -167 205 -51 45 81 -194 -169 -230 12 103 60 -165 -1 365 69 -3 52
2843 52 -254 -226 -316 211 107 -156 -40 -52 -70 -29 -253 -82 291 318 75 -52 250 -202 148 78 -4 20 -96
2866 -96 -68 -159 -90 136 -364 -143 -205 83 98 -96 -241 78 182 -52 137 62 76 180 -498 69 -104 130 -79
2889 -79 -54 240 172 194 167 101 187 138 11 4 451 143 210 75 13 -69 18 20 -70 11 -3 55 -66 -65 -16 -48 202 -72
2917 -72 187 256 230 361 -138 57 170 -143 28 -41 -93 -255 -216 218 250 10 -189 219 71 106 182 9 50
2940 50 -85 -325 69 67 -11 232 -78 167 10 55 80 -144 -283 6 -32 -72 38 -107 -64 97 125 343 -58
2963 -58 54 -123 6 56 -120 128 -71 171 88 -113 -105 -144 77 8 -13 -69 83 29 -79 151 -83 93 188 54
2987 54 31 237 39 158 247 -155 -164 -159 228 -40 -186 -76 -127 -46 119 84 60 166 -285 294 235 19 -112 -220
3011 -220 -200 -100 171 -22 -308 -390 142 38 207 105 126 -305 319 133 -53 77 47 18 56 -109 16 110
3033 110 -146 -163 -300 135 221 120 -88 25 -35 355 48 297 325 -32 153 96 94 -62 51 74 133 -145 58
3056 58 -71 -183 -201 -244 -23 -159 -74 47 61 -185 -154 53 184 7 -246 -32 -119 160 -13 -38 -4 -294 -171
3079 -171 -210 38 -445 -127 -175 233 171 54 259 267 -172 -14 184 -43 -116 -415 -97 -20 213 418 -20 -49 -262
3102 -262 31 -111 44 -101 -127 -345 -4 -3 -232 -197 228 58 148 -173 107 -162 -27 -4 -69 95 197 -93
3124 -93 -43 121 -122 116 82 173 -11 -162 152 148 -87 -29 0 -23 108 84 43 23 -238 135 -153 -29 377 -328
3148 -328 4 -97 25 -280 -194 47 188 -57 49 35 -97 40 -7 206 131 172 -61 100 -51 -404 -22 -27
3170 -27 99 -28 -257 73 179 -57 -156 15 -10 -386 -37 -236 273 -288 -352 -207 152 -134 82 -143 -51 -18
3192 -18 16 -270 430 -28 -81 -76 -93 101 -75 13 -192 -117 115 68 -31 -270 -187 -134 222 196 -53 146 130 234 -35
3217 -35 -5 -165 299 -174 217 324 58 -120 -68 -220 -22 -138 -90 -10 8 49 -190 -28 64 -30 251 -32 51
3240 51 233 79 -81 -226 195 -398 75 139 -31 117 -215 -231 34 -42 177 -72 54 -218 197 -73 -103 204
3262 204 -188 92 -21 125 40 99 369 14 -198 139 -171 -263 117 -105 -180 36 -27 -276 162 -4 156 -186
3284 -186 116 -177 -78 263 198 20 -229 -92 -34 155 211 -142 -300 -141 -272 99 -277 72 102 55 60 8 25
3307 25 -46 166 -122 -259 -286 35 -44 87 -257 -237 -122 -154 353 -31 -54 17 239 100 153 -159 157 45 156
3330 156 -126 209 117 -116 -60 -277 18 -209 -3 -198 -259 -10 -125 -69 -139 -9 -265 73 -127 -206 262 -113
3352 -113 23 32 -70 138 9 10 -175 18 32 42 82 -101 135 48 99 -6 11 28 107 165 214 62 206 -259 15
3377 15 -169 -72 -41 -21 95 3 -71 237 -56 -36 163 122 114 56 -162 -111 13 78 268 -32 149 -112 -114 103 300
3402 300 263 71 -150 49 -210 -41 268 22 -278 -86 -135 63 135 51 101 -161 -90 277 -95 -12 -38 -39 248
3425 248 -25 183 24 73 -102 96 -84 185 -9 -263 -64 -146 6 109 13 49 -47 33 -43 28 13 245 -107
3448 -107 67 275 272 179 -219 -90 -23 25 -93 -276 295 68 79 235 -228 239 -74 35 7 -198 -127 -19 -63
3471 -63 64 140 188 76 83 -164 -11 -71 -188 196 -49 -55 1 -45 188 13 -192 -294 -75 -56 203 -249 112 -17
3495 -17 97 -13 -154 -203 -61 -168 -140 62 333 54 -139 -340 -197 1 -92 -114 -44 -186 -101 229 -35 125
3517 125 134 -165 50 156 6 52 216 73 73 -248 79 71 -318 -36 112 13 91 84 174 -104 95 175 -13 90
3541 90 69 -95 221 -63 -7 97 86 218 100 113 151 -41 -71 128 49 -11 -196 -56 -252 103 -110 -268 -86
3564 -86 245 166 89 -97 -176 -57 106 61 -229 343 55 17 -143 265 -58 -36 -170 111 72 91 123 48 -66 -36
3588 -36 -135 25 32 -118 75 -538 50 -30 -235 -100 -170 9 100 -62 -20 -274 4 21 8 -162 -61 -223 120
3611 120 42 57 30 -45 77 41 20 -135 -131 -241 -34 -10 68 201 147 247 62 214 -61 -300 -92 -268 260 61
3635 61 -301 -101 245 -370 -34 -53 244 -26 20 -16 -302 40 -18 160 98 45 109 16 -22 359 -43 -214 -381
3658 -381 133 -218 81 -125 -136 110 -125 314 16 23 -88 -111 212 -172 -17 -58 17 -69 -72 217 319 -150 -1
3681 -1 82 -287 -118 -109 -167 7 132 -167 -186 -131 7 89 -321 -183 -289 42 -302 223 1 25 373 282 24 -163
3705 -163 -37 51 -283 -210 -12 -172 -17 -27 -222 137 -45 -171 148 -38 -135 123 -62 -8 2 36 -65 32 41
3728 41 -16 -85 -130 21 -77 75 -54 -440 -129 83 -28 249 -178 182 -78 -45 169 38 290 9 -315 243
3750 243 -151 -192 -54 136 -410 7 -256 -43 -80 127 260 -104 -265 -165 10 -212 2 -244 -146 -329 79
3771 79 274 -143 84 66 -47 159 -4 -84 64 304 36 -90 -95 170 -120 87 35 -105 101 -72 134 42
3793 42 -37 -63 -154 51 138 -49 -74 316 77 -215 249 22 -23 -24 -3 12 -224 -103 47 -273 -436 95 106 -143
3817 -143 52 -22 391 176 12 92 -216 62 -83 -182 202 185 230 359 53 50 -247 -41 213 -126 31 -149
3839 -149 -149 -184 67 -206 -111 -6 34 116 -117 -195 -52 -171 -243 121 -11 -52 -21 57 190 -84 0 -186 39 -57
3863 -57 56 -266 -78 -193 -76 -74 -20 84 -56 28 45 -57 97 -155 -96 -261 19 -40 -58 -12 -197 309 31
3886 31 -64 -229 125 299 4 82 -102 -7 -149 -287 -75 141 54 -41 104 -31 -93 158 -350 110 83 -149 237
3909 237 -216 -94 -93 -42 -20 -208 -13 -3 -29 35 70 62 -161 -342 214 44 94 89 -111 374 159 -76 244 83
3933 83 91 84 -93 35 -17 96 232 -132 239 117 -125 69 -232 169 118 181 36 182 91 -356 -8 57 -114
3956 -114 -86 78 22 -61 92 35 -65 359 -60 2 -53 360 38 109 -45 -119 74 -74 182 290 137 252 190
3979 190 -50 23 -135 148 -258 160 106 54 -216 293 -132 46 -156 -444 -77 -76 170 46 -89 -88 -105 9 -78
4002 -78 283 47 23 257 -213 240 -179 121 -138 -108 45 -50 -288 -26 -141 177 247 130 10 64 192 -23
4024 -23 126 -118 60 165 -114 182 21 -44 -118 -27 152 223 96 7 6 -519 61 -57 32 -53 197 43 -103
4047 -103 154 -48 103 -221 165 307 -36 48 -18 -137 81 9 -226 124 78 96 127 118 255 -43 146 -231 -63
4070 -63 0 2 -128 284 -1 -95 134 23 -121 -430 135 93 -22 118 -131 -228 -169 108 -148 13 -100 -186 14
4093 14 -66 195 78 -314 13 -72 -188 97 -192 -200 102 -170 -63 144 49 239 -263 -178 -97 82 -139 71 -233
4116 -233 -251 292 -283 -133 -66 -40 -93 65 166 113 -191 155 169 46 6 -97 201 126 245 -19 -144 37 83
4139 83 -175 130 184 -34 -13 -105 170 59 -130 11 310 270 111 -61 247 -165 -21 203 -77 -334 31 -63
4161 -63 -38 259 63 237 22 -14 -46 -103 58 153 43 -31 107 -27 -76 -120 -144 182 -251 -121 -3 -85 -191 -225
4185 -225 -40 72 -2 -172 40 -66 262 134 -194 53 -20 104 189 -157 -253 -199 165 192 -97 30 -178 0
4207 0 217 -40 51 230 -35 -123 -3 86 215 94 -117 -195 136 42 -160 -176 43 56 307 -81 -50 60 -91
4230 -91 -109 148 104 -93 -112 179 189 -173 9 13 81 254 -46 227 -219 48 244 304 -61 -81 46 -45 161 85
4254 85 -72 228 46 -93 0 67 -29 148 137 195 106 -133 269 249 -35 -378 80 114 28 -25 224 -11 -288 -94
4278 -94 316 185 13 193 -27 304 -256 -206 -76 -37 -75 147 404 40 -38 64 252 157 -54 -8 -156 64
4300 64 215 -185 -178 329 250 180 -187 72 -70 -29 181 166 -481 -159 -134 198 -55 126 -168 -147 -96 78 159 -204
4324 -204 7 -3 -42 -47 31 -44 105 -208 47 -178 137 -275 127 32 120 181 359 248 71 32 73 -128 -38 -44 -206
4349 -206 155 428 16 -4 10 12 -38 71 -30 -14 219 314 387 -13 290 121 54 -132 -63 238 297 -139 -112 -98
4373 -98 0 -76 -221 5 -93 -35 33 165 188 -38 -236 30 134 -94 91 82 100 -79 -36 0 -86 -7 28 -167 237
4398 237 127 -9 -85 125 -3 -288 -87 -8 -18 -21 4 240 383 -74 62 -194 440 126 23 158 108 9 112
4421 112 64 -100 111 9 -155 7 -12 100 250 181 -278 -259 69 225 -74 -264 141 187 60 73 31 77 -197
4444 -197 56 23 148 -51 319 -294 95 259 -134 63 252 222 81 231 281 -57 131 155 61 1 141 -6
4466 -6 368 6 99 -201 -138 -148 -86 128 -368 84 -35 79 71 -152 -124 -115 177 116 -63 230 175 -154 175 149 -80
4491 -80 -105 36 140 -258 91 -81 -297 68 148 67 -184 217 -56 53 -218 -130 -196 -183 -37 -121 -121 33 -149
4514 -149 125 172 43 396 70 246 215 58 107 -48 -110 -45 131 -221 -317 -183 -20 234 456 36 91 -112
4536 -112 22 66 -152 -93 -8 32 111 196 -145 193 -75 -7 6 26 46 155 5 -37 207 -348 -175 -49 -37 -50
4560 -50 196 -108 -83 198 167 79 25 -22 -172 65 132 62 312 -120 -119 12 -80 -33 182 -151 -42 147 64 -44
4584 -44 153 23 -302 41 -139 -23 -160 -95 -299 -212 -233 -198 -27 39 -299 193 172 -73 91 -105 -97 65 59 54
4608 54 86 220 -242 89 10 138 51 -158 -31 -88 13 16 -90 -48 53 -121 247 49 36 -31 -187 -82 149
4631 149 -196 -281 52 95 0 111 -25 132 -148 -89 10 -13 -113 285 29 38 94 -21 46 112 -1 -82 -12 -29 32
4656 32 -36 55 120 -159 2 199 154 -123 214 -47 -64 171 -80 -35 37 -83 -120 -219 -35 -17 -23 -194 56 -187
4680 -187 -86 -477 83 274 -22 -30 -16 320 -97 -172 -31 239 -125 56 -61 -247 -259 254 -39 15 -189 -7
4702 -7 -148 -288 23 -81 195 -314 -369 -25 -13 30 138 -224 55 -39 -129 147 219 114 -6 -67 97 152 238 -161
4726 -161 217 -172 146 -246 -14 42 -330 139 -83 25 -371 -20 -152 -104 -64 134 94 -333 -163 169 63
4747 63 154 -44 -224 14 127 -112 -239 114 14 26 18 87 167 -214 19 -69 62 79 4 -10 69 -90 -297 -15
4771 -15 -102 -137 -25 -182 92 80 154 -101 171 -80 -157 -8 -38 11 -102 -193 6 292 62 225 26 -82 97
4794 97 -182 312 167 -177 -327 -30 142 -68 55 -73 -42 -45 41 -6 6 295 126 -177 102 -110 97 89 104
4817 104 -64 66 -28 -35 150 133 -124 -73 106 66 -31 -72 24 234 34 201 17 175 14 3 292 150 9
4840 9 168 -95 180 161 47 67 -76 206 -183 -33 97 10 241 157 281 -63 107 -112 64 -8 -172 -298
4862 -298 322 260 25 137 -220 -147 412 -157 394 5 -271 -162 23 300 172 69 6 220 14 218 77
4883 77 96 -8 -107 -171 4 -43 103 23 122 -394 -44 -182 104 -27 55 -176 139 525 123 -161 13 -111 -19
4906 -19 -56 256 -12 -59 -80 78 180 18 442 -26 -108 -111 -43 98 -66 -16 304 361 -151 80 -110 63 178
4929 178 -190 79 139 36 -51 -47 241 10 -132 143 37 -101 -36 -68 -127 -294 -84 55 8 -54 97 115 16 -173
4953 -173 -277 329 202 90 -68 -17 -224 -78 109 -67 63 -164 -258 268 50 -63 -3 -95 -126 -19 49 -17
4975 -17 -96 63 -10 -238 -178 -60 27 41 -232 234 -64 13 99 139 121 -97 -1 -112 -4 24 48 2 -182 -148 -23
5000 -23 129 -39 204 32 -77 64 233 -66 38 -9 -175 -20 -117 -97 101 11 -39 -45 209 70 -179 -5 -227
5023 -227 -353 86 -180 -203 -243 -32 -74 -17 -201 -201 114 -48 -32 94 -280 -157 8 33 -527 387 -71 -158 128
5046 128 115 67 66 118 -219 -92 71 -88 -106 -151 115 -25 -29 -373 -40 -8 -66 36 -79 173 -103 246 -266 95
5070 95 -154 184 196 298 78 197 -239 -30 -51 -56 68 -99 180 -23 23 2 -130 -104 101 -66 96 -94 106
5093 106 -329 73 99 -46 353 120 -204 41 78 195 59 173 263 108 16 180 193 -184 60 -58 11 -60
5115 -60 -50 -249 159 255 -119 198 31 159 3 47 263 24 85 -223 -150 -101 -22 26 -341 -153 -11 -36 -311
5138 -311 56 74 -10 134 41 -225 114 2 -88 -64 11 152 -74 270 -61 -66 81 -24 -16 -208 -81 17 250 110
5162 110 243 -14 -185 20 232 132 -150 -22 39 157 4 53 32 -109 116 -268 77 250 -180 147 266
5183 266 64 -35 363 -90 96 -49 18 6 197 20 -171 141 -81 -72 119 122 -148 133 -220 435 175 353
5205 353 87 -67 -5 -182 -100 -91 -193 -18 3 -20 -200 -119 -148 -297 168 -17 -44 -122 100 126 -291 94 125 -125
5229 -125 -127 171 256 -97 39 -98 -18 -61 68 144 67 146 -35 -30 -72 -77 -31 108 27 -249 103 239 -275 -110 -70
5254 -70 18 -170 187 62 -63 46 -98 -136 147 -146 83 -76 -7 -74 -131 -274 271 -70 -164 10 16 13 -273 220
5278 220 35 24 -254 -88 -292 108 -280 -268 65 -26 -36 162 118 75 -53 -50 115 -71 -232 110 -205 250 -65
5301 -65 48 75 94 35 107 165 -5 -14 -260 43 293 36 8 111 -21 -74 262 -6 201 76 -213 48 -14 -147
5325 -147 104 94 -6 162 -106 253 7 -50 -33 -109 -131 99 -36 183 226 -225 -87 190 -236 -57 -192 40
5347 40 80 -97 -49 -19 -114 182 -56 -85 38 -162 -134 137 110 -447 -98 -125 142 73 22 -261 -256 -115 -29 -22 155
5372 155 -61 -114 57 -20 0 -16 -94 -108 -64 56 178 97 -1 344 -105 -74 86 -249 -100 12 1 -103 -74 -343
5396 -343 -92 222 -185 113 98 101 2 294 46 -213 -103 110 -29 104 -20 -50 422 153 -136 -64 13 -473
5418 -473 166 249 -22 -249 -6 -80 151 30 44 107 -31 -110 168 158 -196 -28 189 -88 200 22 18 -232 158
5441 158 43 19 251 -3 63 67 187 335 240 -80 227 153 224 -109 -57 -161 -347 51 293 198 -232 -240 231 -70
5465 -70 -108 -244 310 -111 205 163 -86 166 121 -20 190 -19 81 271 84 66 -331 151 -172 -71 112 132
5487 132 53 95 -199 20 -364 -171 -19 -8 -62 -318 58 137 62 -89 18 -221 -196 108 76 20 -211 223 -63
5510 -63 251 -131 -97 20 -80 83 -7 -127 -281 201 114 56 104 -10 46 129 -291 -92 -45 -51 -153 120 -131 141
5534 141 -16 180 105 49 -82 -131 -99 43 48 -71 -34 114 64 -15 75 35 156 -58 381 -51 -30 -23 -2 140 222
5559 222 -41 26 289 -157 59 -55 -11 -117 -26 -27 5 -370 -463 -65 -143 158 179 22 -8 -213 -356 -307 -5 -326
5583 -326 117 -230 69 75 -212 -263 32 -58 -66 -48 91 -121 12 124 18 188 -12 -78 -116 -62 93 100 75 -5 -109
5608 -109 -14 -91 48 44 84 20 -116 -294 20 -73 -173 -54 -1 92 126 -54 -37 123 2 28 -165 75 33 288
5632 288 -8 -3 34 126 -87 -150 151 83 158 -18 -179 -50 -50 314 -219 103 232 -151 356 104 -8 126 -262
5655 -262 -168 254 -3 -62 46 -169 96 -92 -289 -185 0 -411 -174 -63 0 -27 -99 173 -56 -22 107 -251
5677 -251 279 -83 -170 -67 -496 -128 14 76 77 -275 128 28 170 -315 -19 -84 -29 213 122 -25 -111 -78 -116
5700 -116 154 54 -113 -150 76 -16 -101 121 196 153 -49 51 99 -65 -118 -23 -151 -107 -85 7 6 -253 -89 -106 59
5725 59 -68 -24 -123 121 189 8 123 132 188 124 -9 -62 185 110 -89 93 -233 -136 96 -230 12 -145 387 -17
5749 -17 -237 -57 142 103 30 -27 86 57 89 -6 343 201 -67 87 122 42 -53 -68 -402 30 72 91 -130 125
5773 125 97 -223 -77 269 89 -79 93 -234 -73 65 -49 14 -109 50 -96 85 -54 -211 193 -134 -61
5794 -61 -172 -183 76 -29 99 -33 -158 111 62 -219 -186 508 -153 150 -47 -260 92 -60 -343 321 -25
5815 -25 -285 -240 20 -133 -40 -105 94 -33 -38 -245 24 8 82 108 37 27 137 15 -92 159 -166 37 -128 156
5839 156 96 -74 371 90 -26 -78 307 67 41 -12 50 155 -34 55 -69 -12 -183 16 -80 23 -67 -87 -12 21
5863 21 -25 84 -318 -24 128 107 37 185 -124 -308 -62 65 -218 51 484 -178 -143 29 -313 -29 -9 83
5885 83 66 25 80 60 376 11 -92 -242 76 -99 -110 25 -103 38 209 152 39 -111 -28 4 -15 41 143 71
5909 71 159 33 -157 -100 -1 299 -70 -55 115 -97 -358 120 113 95 196 -11 205 -106 -207 70 -171 -3 62
5932 62 52 9 9 -104 74 -129 47 -63 -362 222 -19 13 -228 262 -6 -13 87 -58 -155 305 96 -58 261
5955 261 -35 78 82 187 -28 90 -14 -74 -20 -187 -42 87 11 83 -89 -335 -66 -267 130 -119 -48 85
5977 85 66 82 -160 -431 -21 -200 -86 -111 -132 41 -92 26 262 -159 -43 20 20 246 46 240 -30 -109 -40
6000 -40 -38 87 306 -16 -75 173 72 306 176 -77 -132 296 -304 154 -51 1 202 -54 235 81 134 -141
6022 -141 -20 -104 135 139 69 91 127 -131 84 25 20 42 23 68 -56 95 70 -224 145 31 146 -103 23 174
6046 174 -5 86 -105 -52 -79 159 -65 204 240 167 404 124 141 216 -51 40 -263 225 53 26 -9 298 59
6069 59 197 48 -37 28 170 73 -147 3 178 -213 291 54 -146 47 19 169 -81 146 -162 -278 12 163
6091 163 201 -118 207 -76 -236 261 -211 144 -225 -37 88 -29 -20 -143 138 58 -48 26 86 -103 -54 115
6113 115 135 262 -42 -50 39 119 -106 -6 180 -31 29 -82 36 -135 -76 -186 -232 -213 -287 -31 198 92 152 54
6137 54 -2 93 41 -12 145 581 -216 -153 66 -38 -96 -61 56 -79 -298 -29 -4 -103 -31 280 -241 155 -59 -275
6161 -275 -72 23 19 -333 52 -9 29 -101 106 293 -130 -172 -19 56 171 -113 -167 224 3 181 -40 37 36 -110
6185 -110 -88 -145 -235 -99 -84 -156 -224 242 191 -290 194 137 275 -246 -122 -66 -59 162 5 47 -142 -18 -304 -106
6209 -106 228 179 123 23 53 -149 12 -256 180 -41 -118 10 -97 4 -132 -54 -107 34 -278 21 59 130 26
6232 26 72 49 26 238 165 54 -191 -109 118 258 -58 -105 67 -107 186 123 -126 -50 166 317 -148 -108 -139 -57
6256 -57 -54 213 28 -163 217 25 253 -137 -142 -126 36 320 -163 397 103 -34 -155 -155 251 60 -57 185 -7
6279 -7 -67 -10 -54 -20 -13 85 -2 -98 -151 0 -44 -57 60 -90 87 112 -239 37 -147 204 94 30 65 123 169 66
6305 66 94 200 -98 -62 33 -126 -284 -63 -131 -240 -47 -54 -279 -184 373 2 24 -62 15 33 169 -50 -69 72
6329 72 -49 -124 239 266 40 -78 -166 -20 -94 79 -99 -93 49 -211 208 -199 154 -48 130 -56 136 -219
6351 -219 -97 107 -181 137 -26 78 -138 -155 72 -79 -59 -131 110 -32 101 -190 -113 36 -271 147 61 -128
6373 -128 -133 -37 49 -33 -160 12 183 -52 -8 -5 -15 -77 -41 61 -18 -107 -78 -66 41 -106 -111 -277 23 -71 -30 -38 133
6400 133 130 -56 -53 25 -136 -170 123 -77 148 173 -3 102 -209 106 -301 247 212 17 118 -33 -165 -15 171
6423 171 -87 -145 92 147 73 -274 -123 74 199 263 150 345 -93 -493 43 -47 -14 3 -233 141 1 292
6445 292 45 -142 -23 186 -75 120 -111 -126 -48 157 193 -150 -330 -209 -70 -298 22 -11 -144 188 -148
6466 -148 36 -160 -329 -392 123 158 48 117 -45 166 -207 -31 135 -81 -387 100 -91 -3 36 -203 106 -33
6488 -33 56 -104 -67 185 199 -11 -11 68 -58 300 -174 -116 -326 115 169 -68 -42 -68 -298 4 -134 -96 148 -48
6512 -48 -103 -209 42 206 281 -29 102 2 24 16 7 -229 221 -49 -82 57 -31 -116 306 -1 -353 48 8 40
6536 40 136 80 -247 365 -144 -107 35 140 -37 -96 -184 7 28 63 -125 -12 91 141 216 236 -79 509 36 -110
6560 -110 -62 -328 100 -85 211 -40 -115 -49 37 -7 -320 -89 -12 167 -306 -85 37 -60 210 84 -293 113
6582 113 -301 118 -4 51 23 -336 -182 33 70 73 -228 -67 83 -80 149 110 -79 40 -140 21 -33 -5 109
6605 109 50 35 170 -27 -146 1 -38 74 439 -97 -206 83 26 8 97 -277 44 17 183 -12 -384 -170
6627 -170 -32 35 72 -80 -213 37 -75 71 127 -128 108 -6 42 -36 222 -161 -117 -97 -239 113 -60 215
6649 215 -49 -117 492 76 -30 -2 -263 50 30 -21 -270 -65 138 -26 148 289 -217 -20 41 130 77 -146
6671 -146 -134 276 -68 -84 24 34 -192 -97 174 -157 282 176 -243 103 -164 -473 -28 -169 3 143 -317
6692 -317 218 155 -250 -1 -58 -144 103 -86 -86 -112 -48 -140 -87 -73 -174 210 44 12 -56 -75 -200 117 65 -37 212
6717 212 -24 -176 88 -117 114 -85 9 143 -128 -84 -85 303 195 -62 -99 242 44 -124 -295 61 -161 -101
6739 -101 177 -36 -190 -47 53 -361 -48 76 -191 -26 22 -141 -86 -210 -104 -32 -51 5 -133 -197 34 -16
6761 -16 -354 -64 5 55 -13 -121 20 64 281 -128 -164 -171 -188 22 95 5 -95 12 245 28 201 51 -20 128
6785 128 48 -51 300 26 -32 130 68 63 118 -91 -108 8 -172 -5 57 195 193 -126 -131 215 96 217 161 -136 98
6810 98 -132 -93 -189 -124 112 -82 -208 134 1 17 56 68 -9 23 220 79 213 53 -228 167 72 -44 58
6833 58 273 200 -22 -68 -247 107 258 112 205 -32 -54 144 -304 -44 -170 -89 -98 23 20 -59 40 -193 -57 -120
6857 -120 171 38 -65 -290 135 -80 -116 -215 -12 49 -159 225 12 -136 -69 -99 193 26 -55 80 -33 397
6879 397 -54 182 97 89 -109 78 49 -4 -25 5 138 5 259 -76 -90 -60 37 -146 156 -543 213 -72 7 121
6903 121 -175 -59 -150 -25 68 284 -12 193 -93 199 210 -233 176 13 73 233 231 -227 -41 307 63 154
6925 154 255 -44 108 52 134 -162 130 -6 40 149 -135 84 144 1 -32 -261 -55 -3 95 -175 146 -27
6947 -27 -6 16 120 120 86 -219 -176 54 -375 -178 -48 70 -85 101 -64 264 111 -423 -146 242 -237 -160 59
6970 59 -71 -49 -243 -172 115 -80 -19 368 389 -206 144 26 -239 -187 158 -197 254 154 -234 179 -15 67
6992 67 -339 -57 92 -113 9 19 154 132 185 -84 93 -120 238 -31 3 -84 -233 196 -164 -46 143 -121
7014 -121 53 -30 -186 39 -47 -221 -162 119 122 -108 -85 -115 -45 30 -133 -7 39 150 -70 76 82 -1 88 -86 173
7039 173 168 107 75 136 161 105 11 -156 -200 -257 -76 -53 -31 -190 155 54 -178 76 -262 -33 -30 127 -120 -239 52
7064 52 -204 79 108 291 87 214 -27 178 -57 -56 12 -10 -234 88 -202 -54 250 30 85 14 75 65 -189
7087 -189 -154 -8 287 435 215 -14 36 -122 -314 63 -33 -92 118 -3 -298 93 -116 71 193 -83 -97 1
7109 1 -92 -96 -11 -117 -139 -107 34 23 191 82 50 47 -303 -202 -72 -55 0 -39 -16 313 136 89 163 34 -25 251
7135 251 -41 -136 1 -205 58 14 -43 197 104 -54 -74 62 37 -210 80 164 -83 -59 -359 159 -42 168 144
7158 144 216 15 -135 -121 -170 44 24 -209 -47 -358 71 107 -24 221 -88 327 -304 8 45 188 289 -99
7180 -99 40 19 162 -34 113 155 -91 -188 -81 42 160 -146 160 -56 19 -2 -128 -177 413 -104 -18 -72 165
7203 165 221 37 51 -29 277 -72 80 -83 165 -286 169 -52 -137 -128 -17 -11 -242 -148 67 -172 168 121 -149
7226 -149 -46 124 -183 106 -190 -110 108 -138 32 -202 153 -131 -10 -72 181 277 -81 232 226 115 25 219
7248 219 221 13 248 88 211 -157 -1 180 -24 -190 -92 82 351 13 -65 53 167 91 233 332 89 209
7270 209 98 71 -260 98 -167 -417 -24 53 20 30 -151 -124 56 22 162 15 -94 244 -47 94 -71 90
7292 90 -78 59 -113 -88 -87 -321 216 145 20 -72 13 78 256 -315 51 184 -97 -127 316 171 84 -62 223
7315 223 -12 196 13 187 -207 -65 -266 -35 44 34 35 -32 144 -90 -26 -25 -32 -415 24 -74 -4 243 117 -138
7339 -138 69 -92 -48 -179 223 -48 18 194 -45 -60 87 -48 -221 -145 -162 -85 -227 -83 -34 -14 125 -267 -227
7362 -227 -457 -96 112 52 19 -160 -66 46 -233 -237 74 -127 65 242 88 -23 -54 85 -172 -368 348 231
7384 231 -75 -28 -170 361 -87 89 -129 -57 73 -17 36 -188 2 -215 221 71 -52 63 -217 -443 -135
7405 -135 -149 1 45 201 32 -119 376 140 -108 -50 -306 215 -151 63 -23 23 -175 -4 109 311 -127 -138
7427 -138 178 -78 4 70 27 -150 60 179 305 184 -98 -104 -68 -56 277 224 350 -102 -265 260 -69 -76 231
7450 231 -104 -72 -203 -176 111 155 56 -87 -132 -158 30 -241 74 -85 -60 162 83 -53 30 309 -88 87 20
7473 20 -211 215 74 -20 -71 -32 111 -28 -222 -238 120 -89 -53 -80 -162 47 164 -291 181 -45 42 -117 163
7496 163 -178 21 -76 328 -258 86 -4 -321 -140 -97 206 -194 236 132 87 46 422 91 -49 212 54 25
7518 25 19 26 -145 -20 90 111 -35 -65 160 127 133 80 117 -209 225 -12 227 0 -19 -85 -138 76 -195 132 -111
7543 -111 -66 50 -155 -118 -9 118 -251 -175 -196 -134 116 -273 -258 93 431 -263 -346 -26 67 -94 -60 258 -184
7566 -184 -12 -362 13 117 130 -5 -38 92 -283 -98 -114 134 122 -161 71 -91 122 66 -84 49 60 -63
7588 -63 -268 49 -52 205 -92 61 -159 -141 26 7 93 -101 21 218 162 82 77 213 -74 173 273 53 -10
7611 -10 154 82 95 115 -101 -262 43 156 156 84 -83 -55 -91 30 1 -194 98 67 -125 -90 -94 -11 -34 121 243
7636 243 241 58 -179 390 -74 197 20 -242 238 29 61 -4 403 -305 24 18 -119 -71 42 -33 79 -258 -60
7659 -60 135 9 -233 50 50 -57 -56 13 243 162 -232 172 75 -142 -127 -193 -299 -72 218 191 -83 90 171 -46
7683 -46 212 -263 -41 36 165 34 -1 30 -137 46 197 58 -328 103 -204 34 246 -106 -101 53 -47 21
7705 21 220 14 -265 34 -100 82 -24 -196 -69 -150 -177 100 -41 100 50 75 -158 78 -134 -52 -11 -93 -132
7728 -132 -349 -2 -125 250 -219 -37 15 -155 218 -117 18 -48 157 -127 -131 -341 49 -144 -69 -30 -85 -82 29
7751 29 190 7 130 -42 9 0 294 -44 -57 -116 17 -118 -37 -66 -30 92 -8 67 102 64 -30 257 -61 106
7775 106 -224 -161 -245 49 38 134 -123 -46 195 -129 -220 69 34 113 60 218 -94 -6 -58 -88 -45 -232 63 22 -199
7800 -199 -109 -50 -13 -213 -5 -41 -40 -3 -75 114 -63 -60 32 71 204 36 45 -213 -69 -23 299 -164 -295 -11 22
7825 22 52 156 78 11 -198 91 -64 -24 134 38 -180 73 28 158 58 -71 19 98 79 -63 82 15 266 -161
7849 -161 74 18 -162 -69 111 195 6 35 -137 61 31 -61 114 34 21 62 -29 -155 183 -112 165 354 -113
7872 -113 174 80 16 79 124 67 64 119 -63 3 -182 -110 111 11 146 95 -187 210 -142 -277 -220 113 120 -205 6
7897 6 -27 -21 225 -22 78 -249 -128 -6 101 35 67 92 2 139 -17 -14 4 -147 56 137 4 47 61 93 -206
7922 -206 81 112 167 201 110 -158 -51 -217 -125 -84 -226 -91 68 -78 -219 -226 -373 95 -46 182 115 23 -125
7945 -125 -77 -41 -52 48 266 27 -150 71 242 -64 4 139 -31 -25 42 -194 255 -8 162 215 -61 -135 -128 -137
7969 -137 -129 100 -11 66 37 -94 -270 -125 55 50 71 -377 138 110 -216 168 -65 302 -66 150 10 -114 -12
7992 -12 202 230 -208 -5 -168 -106 290 -12 59 117 85 -73 165 75 -201 38 -246 -303 105 -37 168 -97 76
8015 76 -177 -153 51 167 38 -262 -54 -133 13 260 -36 356 216 56 -118 190 -183 -97 -167 -187 272 202
8037 202 104 -49 -250 -240 -60 71 161 -104 198 -116 98 246 56 275 -33 120 153 -267 -52 82 -228
8058 -228 143 106 -4 209 28 -95 83 124 -79 -104 162 18 -245 -158 13 -112 66 -35 72 -279 131
8079 131 -188 -165 -161 20 74 191 -143 -113 -36 -158 70 106 84 -27 -160 23 199 -254 17 -134 -93 83 -227
8102 -227 -178 93 -369 70 -85 -67 213 214 10 -62 188 225 -14 61 -46 -179 115 39 50 1 189 75 -49
8125 -49 -157 -465 1 -129 101 247 68 -153 -76 -92 -71 -211 29 -88 43 -165 -126 17 -54 104 189 150 -229
8148 -229 164 -101 417 135 115 207 -75 241 137 -4 -67 -182 79 230 -292 -89 225 29 242 -299 -330
8169 -330 311 -7 322 -4 2 31 296 -85 40 39 -196 95 -131 140 23 -233 105 48 78 -88 -57 153
8191A53
##END NTUPLES=NMR FID
##END=
