##TITLE=1H_LR-698-i
 CDcl3, 8 sc, 
 30.1.2020
##JCAMPDX= 6.0         $$ Bruker NMR JCAMP-DX V2.0
##DATA TYPE= NMR FID
##DATA CLASS= NTUPLES
##ORIGIN= UXNMR, Bruker Analytische Messtechnik GmbH
##OWNER= root
$$ XWIN-NMR		Version 3.5
$$ Thu Jan 30 15:46:59 2020 Russian Standard Time (UT+4h)  she@DPX200
##.OBSERVE FREQUENCY= 200.1315
##.OBSERVE NUCLEUS= ^1H
##.DELAY= (6, 6)
##.ACQUISITION MODE= SIMULTANEOUS
##.ACQUISITION SCHEME= undefined
##.AVERAGES= 8
##.DIGITISER RES= 18
##SPECTROMETER/DATA SYSTEM= spect
##.PULSE SEQUENCE= zg30
##.SOLVENT NAME= CDCl3
##.SHIFT REFERENCE= (INTERNAL, CDCl3, 0, 15.7039)
##AUDIT TRAIL= $$ (NUMBER, WHEN, WHO, WHERE, WHAT)
$$ ##TITLE= Audit trail, XWIN-NMR		Version 3.5
$$ ##JCAMPDX= 5.01
$$ ##ORIGIN= Bruker BioSpin GmbH
$$ ##OWNER= she
$$ F:/spectra/data/she/nmr/H-F/1/audita.txt
$$ ##AUDIT TRAIL=  $$ (NUMBER, WHEN, WHO, WHERE, WHAT)
(   1,<2020-01-30 15:45:56.53 +0400>,<she>,<DPX200>,
      <created by zg, POWCHK disabled, PULCHK disabled
       configuration hash MD5:
       00 E9 B6 7A A2 85 ED C7 34 08 36 98 17 FE 4E 26
       data hash MD5: 16K
       99 A8 6B C6 82 07 FC 3C E6 8A D8 37 F9 07 96 C6>)
$$ ##END=
$$ 
$$ hash MD5
$$ 66 3A FB 96 F7 89 AB 2E 48 ED 33 DE 00 25 11 87
##$RELAX= 
##$RELAX= 
##$RELAX= 
##$RELAX= 
##$RELAX= 
##$RELAX= 
$$ Bruker specific parameters
$$ --------------------------
##$DU= <F:/spectra>
##$EXPNO= 1
##$NAME= <H-F>
##$PROCNO= 1
##$TYPE= <nmr>
##$USER= <she>
##$AMP= (0..31)
100 100 100 100 100 100 100 100 100 100 100 100 100 100 100 100 100 100 
100 100 100 100 100 100 100 100 100 100 100 100 100 100 
##$AQSEQ= 0
##$AQ_mod= 1
##$AUNM= <au_zg>
##$AUTOPOS= <>
##$BF1= 200.13
##$BF2= 200.13
##$BF3= 200.13
##$BF4= 200.13
##$BF5= 200.13
##$BF6= 200.13
##$BF7= 200.13
##$BF8= 200.13
##$BYTORDA= 1
##$CFDGTYP= 0
##$CFRGTYP= 5
##$CHEMSTR= <none>
##$CNST= (0..31)
1 1 145 1 1 1 1 1 1 1 1 1 1 1 1 1 1 1 1 1 1 1 1 1 1 1 1 1 1 1 1 1 
##$CPDPRG= <>
##$CPDPRG1= <>
##$CPDPRG2= <>
##$CPDPRG3= <>
##$CPDPRG4= <mlev>
##$CPDPRG5= <mlev>
##$CPDPRG6= <mlev>
##$CPDPRG7= <mlev>
##$CPDPRG8= <mlev>
##$CPDPRGB= <>
##$CPDPRGT= <>
##$D= (0..31)
0 1.2 0 0 0 0 0 0 0 0.06 0 0.03 0 0 0 0 0.0002 0 0 0 0 0 0 0 0 0 0 0 0 
0 0 0 
##$DATE= 1580384755
##$DBL= (0..7)
120 120 120 120 120 120 120 120 
##$DBP= (0..7)
150 150 150 150 150 150 150 150 
##$DBP07= 0
##$DBPNAM0= <>
##$DBPNAM1= <>
##$DBPNAM2= <>
##$DBPNAM3= <>
##$DBPNAM4= <>
##$DBPNAM5= <>
##$DBPNAM6= <>
##$DBPNAM7= <>
##$DBPOAL= (0..7)
0.5 0.5 0.5 0.5 0.5 0.5 0.5 0.5 
##$DBPOFFS= (0..7)
0 0 0 0 0 0 0 0 
##$DE= 6
##$DECBNUC= <off>
##$DECIM= 24
##$DECNUC= <off>
##$DECSTAT= 4
##$DIGMOD= 1
##$DIGTYP= 9
##$DL= (0..7)
0 120 120 120 120 120 120 120 
##$DP= (0..7)
150 150 150 150 150 150 150 150 
##$DP07= 0
##$DPNAME0= <>
##$DPNAME1= <>
##$DPNAME2= <>
##$DPNAME3= <>
##$DPNAME4= <>
##$DPNAME5= <>
##$DPNAME6= <>
##$DPNAME7= <>
##$DPOAL= (0..7)
0.5 0.5 0.5 0.5 0.5 0.5 0.5 0.5 
##$DPOFFS= (0..7)
0 0 0 0 0 0 0 0 
##$DQDMODE= 0
##$DR= 18
##$DS= 0
##$DSLIST= <SSSSSSSSSSSSSSS>
$$ [...]
##$SUBNAM2= <"">
##$SUBNAM3= <"">
##$SUBNAM4= <"">
##$SUBNAM5= <"">
##$SUBNAM6= <"">
##$SUBNAM7= <"">
##$SUBNAM8= <"">
##$SUBNAM9= <"">
##$SW= 24.9337058887773
##$SWIBOX= (0..15)
0 0 2 0 0 0 0 0 0 0 0 0 0 0 0 0 
##$SW_h= 4990.01996007984
##$TD= 16384
##$TD0= 1
##$TE= 0
##$TE2= 300
##$TE3= 300
##$TEG= 300
##$TL= (0..7)
0 120 120 120 120 120 120 120 
##$TP= (0..7)
150 150 150 150 150 150 150 150 
##$TP07= 0
##$TPNAME0= <>
##$TPNAME1= <>
##$TPNAME2= <>
##$TPNAME3= <>
##$TPNAME4= <>
##$TPNAME5= <>
##$TPNAME6= <>
##$TPNAME7= <>
##$TPOAL= (0..7)
0.5 0.5 0.5 0.5 0.5 0.5 0.5 0.5 
##$TPOFFS= (0..7)
0 0 0 0 0 0 0 0 
##$TUNHIN= 0
##$TUNHOUT= 0
##$TUNXOUT= 0
##$USERA1= <user>
##$USERA2= <user>
##$USERA3= <user>
##$USERA4= <user>
##$USERA5= <user>
##$V9= 5
##$VALIST= <valist>
##$VCLIST= <CCCCCCCCCCCCCCC>
##$VD= 0
##$VDLIST= <DDDDDDDDDDDDDDD>
##$VPLIST= <PPPPPPPPPPPPPPP>
##$VTLIST= <TTTTTTTTTTTTTTT>
##$WBST= 1024
##$WBSW= 4
##$XGAIN= (0..3)
0 0 0 0 
##$XL= 0
##$YL= 0
##$YMAX_a= 974680
##$YMIN_a= -562925
##$ZGOPTNS= <>
##$ZL1= 120
##$ZL2= 120
##$ZL3= 120
##$ZL4= 120
##$ABSF1= 10
##$ABSF2= 0
##$ABSG= 5
##$ABSL= 3
##$ALPHA= 0
##$AQORDER= 0
##$ASSFAC= 0
##$ASSFACI= 0
##$ASSFACX= 0
##$ASSWID= 0
##$AUNMP= <proc_1d>
##$AZFE= 0.1
##$AZFW= 0.1
##$BCFW= 1
##$BC_mod= 2
##$BYTORDP= 1
##$COROFFS= 0
##$CY= 11.3945322036743
##$DATMOD= 1
##$DC= 2
##$DFILT= <>
##$DTYPP= 0
##$F1P= 16.9975609425685
##$F2P= -3.02152046262296
##$FCOR= 0.5
##$FTSIZE= 0
##$FT_mod= 4
##$GAMMA= 1
##$GB= 0.15
##$INTBC= 1
##$INTSCL= 1
##$ISEN= 128
##$LB= 0.24
##$LEV0= 0
##$LPBIN= 0
##$MAXI= 10000
##$MC2= 0
##$MEAN= 0
##$ME_mod= 0
##$MI= 1.114404
##$NCOEF= 0
##$NC_proc= 0
##$NLEV= 6
##$NOISF1= 3.799351
##$NOISF2= 2.8
##$NSP= 1
##$NTH_PI= 0
##$NZP= 0
##$OFFSET= 15.70392
##$PC= 1
##$PHC0= -9784.48
##$PHC1= 8.40081
##$PH_mod= 1
##$PKNL= yes
##$PPARMOD= 0
##$PSCAL= 0
##$PSIGN= 0
##$REVERSE= no
##$SF= 200.130013532006
##$SI= 16384
##$SIGF1= 3
##$SIGF2= 2
##$SINO= 400
##$SIOLD= 16384
##$SREGLST= <1H.CDCl3>
##$SSB= 0
##$STSI= 0
##$STSR= 0
##$SW_p= 3612.71676300578
##$SYMM= 0
##$S_DEV= 0
##$TDeff= 0
##$TDoff= 0
##$TI= <>
##$TILT= no
##$TM1= 0
##$TM2= 0
##$TOPLEV= 0
##$USERP1= <user>
##$USERP2= <user>
##$USERP3= <user>
##$USERP4= <user>
##$USERP5= <user>
##$WDW= 1
##$XDIM= 8192
##$YMAX_p= 0
##$YMIN_p= 0
$$ End of Bruker specific parameters
$$ ---------------------------------
##NTUPLES= NMR FID
##VAR_NAME=  TIME,          FID/REAL,        FID/IMAG
##SYMBOL=    X,             R,               I
##VAR_TYPE=  INDEPENDENT,   DEPENDENT,       DEPENDENT
##VAR_FORM=  AFFN,          ASDF,            ASDF
##VAR_DIM=   8192,          8192,            8192
##UNITS=     SECONDS,       ARBITRARY UNITS, ARBITRARY UNITS
##FACTOR=    0.0002004,     1,               1
##FIRST=     0,             0,               0
##LAST=      1.6414764,     0,               0
##MIN=       0,             -562925,         0
##MAX=       1.6414764,     974680,          0
$$ Real data points
##PAGE= N=1
##DATA TABLE= (X++(R..R)), XYDATA
$$ [...]
$$ plain form
2660 8516 396 -7552 -10102 -5132 3479 10763 12170 6564 -2352 -8181 -7824 -919 7749 13028 11437
2675 11437 3562 -4282 -7850 -4618 3897 11501 14311 9515 1147 -5780 -6148 -154 8939 14833 14028
2690 14028 6945 -1298 -5771 -3422 4349 12374 15653 12062 4312 -3078 -4779 85 8665 14963 15542
2705 15542 9719 1601 -3817 -2983 3797 11895 16183 13978 6918 -796 -4011 -455 7369 14531 16429
2720 16429 11631 3602 -2563 -3113 2338 10573 16006 15111 8361 827 -3778 -1392 5511 13107 15925
2735 15925 12636 4928 -1995 -3870 524 8495 14902 14840 8862 1094 -4150 -3203 3478 11013 14609
2750 14609 12234 4940 -2254 -5177 -1594 6329 12768 13845 8939 973 -4819 -4601 556 8508 13381
2765 13381 11853 5008 -2327 -5897 -3636 3535 10115 12662 8772 1318 -5123 -6353 -1443 6146 11497
$$ packed form
2660H516q120p948k550M970Q611P284J407n606q916n829L57O905Q668N279j591
2675A1437p875p844l568L232Q515P604K810m796q368o927l68N994R093N894q05
2690A4028p083q243m473K349P771Q025L279l591p750p390j701M864Q580O298N79
2705A5542n823q118n418Q34O780Q098M288k205p060p714l215L556P824P162J898
2720A6429m798q029o165n50N451Q235N433q95o750p534m605K386O903P596K818
2735A5925l289p708o923j875M394P971O407o2n978p768n244R47O681P535L596
2750A4609k375p294p194k923L583P923O439J077m906p966n792K18N157P952M873
2765A3381j528o845p335l570K261P171O580K547l890p454o441j230M910P589N351
$$ plain form
2780 11497 11228 5576 -1959 -6651 -5537 715 8091 11366 8539 2068 -4736 -7397 -3609 3606 9598
2795 9598 10693 5929 -1244 -6666 -6618 -1315 6063 10456 9198 2660 -4165 -7444 -5216 1782 8137
2810 8137 10363 6458 -487 -6194 -7324 -2487 4703 9393 9168 3778 -3537 -7617 -6311 13 6992
2825 6992 9842 7110 587 -5807 -7755 -3695 2994 8542 9179 4400 -2320 -7088 -6887 -1168 5520
2840 5520 9315 7605 1831 -5037 -7988 -5018 1178 7384 9207 5419 -1238 -6914 -7462 -3065 4006
2855 4006 8484 7746 2567 -4518 -8193 -6421 -519 5918 8576 5758 -687 -7027 -8258 -4513 1818
2870 1818 7106 7437 2693 -3790 -8779 -7917 -3055 3867 7240 5215 -488 -6949 -9080 -6712 -334
2885 -334 5037 6451 2755 -3300 -8979 -9001 -4760 1637 5717 4882 -132 -6386 -9719 -8483 -2383 3464
$$ packed form
2780A1497k69n652p535m692J114O252P376L275k827o471o804k661L788P215N992
2795I598J095m764p173n422M8N303P378M393j258o538o825l279K228O998O355
2810H137K226l905o945n707j130M837P190M690k25n390p315m080J306O324O979
2825F992K850k732o523o394j948M060O689N548O37m779o720m768K01N719O688
2840E520L795j710n774o868k951K970O196O206J823l788o657n676n48M397P071
2855D006M478p38n179p085l675J772N902O437K658k818o445o340j231L745O331
2870A818N288L31m744o483m989Q62M862O922L373k025n703o461k131K368O378
2885c34N371J414l696o055n679k2M241O397M080q35n014o254l333J236O100N847
$$ plain form
2901 3464 5621 2994 -3421 -8862 -10079 -6382 85 4729 4645 -185 -6255 -10338 -9255 -4057 2078
2916 2078 4758 2950 -2653 -8776 -10761 -7953 -1575 3399 4406 695 -5808 -10200 -10071 -5679 263
2931 263 4376 3550 -1990 -7716 -10851 -8750 -3233 2748 4331 1126 -4613 -9413 -10616 -6867 -806
2946 -806 3801 3614 -1066 -6650 -10286 -9253 -3889 1568 4196 2137 -3386 -8497 -10540 -7372 -1679
2961 -1679 3223 4233 351 -5500 -9687 -9098 -5192 879 4240 3161 -1634 -7909 -9895 -7594 -1816
2976 -1816 3221 4808 1391 -4254 -9076 -9193 -4914 732 3574 3484 -1387 -6133 -9424 -8130 -2649 2229
2992 2229 5103 2161 -2867 -7786 -9412 -6151 -628 3655 4241 473 -5342 -9039 -8496 -4235 1120
3007 1120 4322 2948 -1881 -7281 -9383 -7116 -2153 2745 4306 793 -4168 -8669 -9127 -5455 118
$$ packed form
2901C464K157k627o415n441j217L697O467M644q4m830o070m083J083N198O135
2916B078K680j808n603o123j985K808O378M974J007l711o503m392J29M392N942
2931B63M113q26n540n726l135K101N517N981J583l205n739m800j203L749O061
2946h06M607j87m680n584l636J033N364N457K628k059n523n111k043L168N693
2961a679M902J010l882n851m187N89L906O071L361j079m795o275j986K301N778
2976a816N037J587l417n645m822j17M279N646K842r0m871m746l291J294N481M878
2992B229K874k942n028m919j626L261N523M283N86l768n815l697N43M261N355
3007A120L202j374m829n400k102K267M963M898J561l513m961m501m58L672N573
$$ plain form
3022 118 4060 3342 -1142 -6658 -9310 -8373 -3444 1672 3837 1556 -3579 -7993 -9509 -6572 -1334 2834
3038 2834 3317 -288 -5734 -9170 -8670 -4406 345 3568 2081 -2611 -7967 -9886 -7461 -2348 2391
3053 2391 3197 196 -5113 -8840 -9361 -5436 -128 3301 2461 -2086 -7079 -9704 -8050 -3308 1680 3419
3069 3419 910 -3951 -8600 -9208 -5864 -883 3033 3071 -525 -5981 -8770 -7967 -3675 1504 3508 2227
3085 2227 -2707 -7202 -8590 -5946 -1208 2974 4017 1169 -3674 -7706 -7305 -3475 1299 4387 3517
3100 3517 -704 -5229 -7360 -5660 -787 3554 5544 3040 -1984 -5929 -6431 -3315 1773 5344 5290 1836
3116 1836 -3206 -5563 -4431 -605 4306 6520 5036 753 -3704 -4943 -2444 2374 6457 6873 3752
3131 3752 -910 -3894 -3581 -15 4971 7376 6580 2773 -1993 -3656 -1761 2677 6721 8403 5638
$$ packed form
3022A18L942p18m484n516k652R37M929N116K165k281n135m414j516K937N238M168
3038B834M83l605n446l436N00M264M751L223j487m692n356j919K425N113M739
3053B391Q06l001n309l727n21L925N308L429q40m547m993k625J654M742M988J739
3069C419k509m861m649o08L344M981L916L8l596n456k789Q03M292N179K004j281
3085B227m934m495j388K644M738M182J043k848m843m032M01L830M774L088q70
3100C517m221m525k131J700M873M341J990k504n024l945n02L116N088L571n4l454
3116A836n042k357J132L826M911K214j484m283m457j239K499M818M083M16l121
3131C752m662k984L13L566M986K405p96l807m766j663J895M438M044J682k765
$$ plain form
3146 5638 1473 -2388 -2758 307 5389 8102 8290 4228 -239 -2840 -1312 2725 6884 8862 7079
3161 7079 2839 -1017 -2028 -4 4589 8480 8802 5476 1047 -2051 -1515 2109 6606 8863 7484
3176 7484 3702 -661 -2474 -296 3624 7433 8666 6104 1596 -1922 -2381 670 5070 8033 7473
3191 7473 3722 -454 -3060 -1804 2307 6009 7323 5821 1565 -2505 -3182 -697 3232 6826 6929
3206 6929 3794 -502 -3497 -2895 432 4410 6567 5208 1093 -2832 -4015 -2115 1621 5215 6011
3221 6011 3231 -1153 -4263 -4303 -1102 2808 5407 4546 763 -3007 -5056 -3778 -136 3628 5228 3190
3237 3190 -1103 -4489 -5150 -2841 1294 4254 4329 1161 -3022 -5512 -5023 -1785 2274 4338 2996 -833
3253 -833 -4426 -5808 -3810 -28 3457 4304 1498 -2600 -5382 -5653 -2277 978 4145 3233 43 -3502
$$ packed form
3146E638m165l861l70L065N082K713J88m062m467k601J528M037M159J978j783
3161G079m240l856j011K024M593L891L22l326m429l098N36L624M497K257j379
3176G484l782m363j813K178L920L809J233k562m508l518m59L051M400K963n60
3191G473l751m176k606J256M111L702J314j502m256m070o77K485L929L594J03
3206F929l135m296k995O02L327L978K157j359m115l925j183J900L736L594P96
3221F011k780m384l110m0L201L910K599q61l783l770k049J278L642L764J600k038
3237C190m293l386o61K309M135K960P5l168m183k490M89L238M059K064j342l829
3253h33l593j382J998L782L485Q47k806m098k782k71L376L255L167r12l190l545
$$ plain form
3269 -3502 -5363 -4002 -1253 4107 4141 2550 -2244 -5175 -5434 -2788 1019 4017 2853 217 -3354 -5187
3285 -5187 -3963 -1446 2874 3776 3007 -719 -4572 -5298 -3464 985 3402 3721 1680 -2417 -5331 -4625
3301 -4625 -1705 2435 4128 3284 294 -3905 -5001 -3626 -185 3352 4073 1856 -1459 -4900 -5019 -2702
3317 -2702 1074 3563 3298 299 -3252 -5461 -4391 -1176 2159 3580 2209 -1672 -4788 -5620 -3722
3332 -3722 29 2749 3137 304 -3380 -6056 -5292 -2595 1233 2863 1724 -1768 -4475 -6411 -4912
3347 -4912 -1485 1408 2310 258 -3854 -6310 -6367 -4164 -505 1815 886 -1843 -5499 -7208 -6274 -3034
3363 -3034 220 1172 -153 -4175 -6839 -7104 -5372 -1395 1406 991 -1792 -5990 -7814 -6965 -3694 -1783
3379 -1783 1166 -1386 -3866 -6705 -7999 -6264 -3233 -864 -582 -1196 -5499 -7829 -8682 -5668 -1592 864
$$ packed form
3269c502j861J361K749N360L4j591m794k931k59K646L807K998j164k636l571j833
3285e187J224K517M320R02p69l726l853p26J834M449K417L19k041m097k914P06
3301d625K920M140J693q44k990m199j096J375L441L537P21k217l315l441j19K317
3317b702L776K489k65k999l551k209J070L215L335J421j371l881l116q32J898
3332c722L751K720L88k833l684k676P64K697L828J630j139l492k707j936J499
3347d912L427K893R02k052m112k456n7K203L659K320r29k729l656j709R34L240
3363c034L254R52j325m022k664k65J732L977K801m15k783m198j824Q49L271J911
3379a783K949k552k480k839j294J735L031K369K82o14m303k330q53L014M076K456
$$ plain form
3395 864 -245 -3582 -6707 -8385 -7204 -4026 -754 12 -1860 -4836 -7331 -8064 -6199 -2750 -45 -341
3411 -341 -2608 -6097 -8026 -7266 -4471 -1439 351 -685 -3815 -6679 -7821 -6105 -2627 -145 383 -1696
3427 -1696 -4966 -7352 -7183 -4402 -1394 708 -89 -2728 -5762 -7079 -5925 -2754 223 1276 -506
3442 -506 -3673 -6188 -6268 -4061 -967 988 753 -1888 -4766 -6410 -5609 -2805 393 1420 660 -2559
3458 -2559 -5185 -5886 -3985 -1089 2317 1524 -541 -3374 -5494 -4446 -2241 236 2111 1281 -853 -4199
3474 -4199 -4517 -3845 -710 2467 2132 -43 -2770 -4071 -4695 -2404 484 2198 1655 -415 -3378 -4847
3490 -4847 -3871 -932 1591 2958 1381 -1274 -4107 -4727 -2708 126 2277 2175 371 -2288 -4191 -3225
3506 -3225 -1478 1439 2901 1994 -451 -3024 -3724 -2580 237 2729 3030 1497 -1394 -3669 -3421 -1424
$$ packed form
3395H64j109l337l125j678J181L178L272P66j872k976k495p33J865L449K705k96
3411c41k267l489j929P60K795L032J790j036l130k864j142J716L478K482N28k079
3427a696l270k386J69K781L008K102p97k639l034j317J154L171K977J053j782
3442e06l167k515q0K207L094J955k35k641k878j644Q01K804L198J027p60l219
3458b559k626p01J901K896L406p93k065k833k120J048K205K477J875q30k134l346
3474d199l18O72L135L177l35k175k727j301o24K291K888J714n43k070k963j469
3490d847R76K939K523J367j577k655k833o20K019K834K151j02j804k659j903R66
3506c225J747K917J462r07k445k573p00J144K817K492L01j533k891k275K48J997
$$ plain form
3522 -1424 1419 3453 2867 406 -1854 -3619 -2649 81 2703 3537 2359 -411 -2677 -3043 -1306 1504
3538 1504 3507 3484 1412 -1145 -3010 -2300 27 2688 4045 3169 391 -1846 -2414 -906 1315 3629
3554 3629 4372 2252 -167 -2208 -2123 103 2514 4228 3615 1417 -1181 -2220 -1212 1288 3759 4180
3570 4180 2999 760 -1495 -1640 -203 2302 4282 4239 2272 -110 -1589 -1060 1057 3642 4891 3498
3586 3498 1196 -1091 -1581 -199 2265 4373 4602 2776 210 -1249 -1255 655 3154 4482 4057 1972
3602 1972 -443 -1849 -679 1739 3922 4460 3214 430 -1538 -1495 -138 2517 4113 4043 1698 -536
3618 -536 -2149 -1235 793 3162 4145 3119 714 -1338 -2246 -916 1409 3509 3920 2134 -318 -2129
3634 -2129 -1960 432 2775 3631 3137 798 -1321 -2357 -1048 1035 2923 3548 2378 -683 -2199 -1928
$$ packed form
3522a424K843K034n86k461k260j765R70K730K622Q34j178k770k266l66J737K810
3538A504K003k3k072k557j865P10K327K661J357q76k778k237n68J508K221K314
3554C629P43k120k419k041Q5K226K411J714o13k198k598j039J008K500K471M21
3570D180j181k239k255j45J437K505J980m3j967k382j479N29K117K585J249j393
3586C498k302k287m90J382K464K108K29j826k566j459oJ910K499J328m25k085
3602A972k415j406J170K418K183N38j246k784j968M3J357K655J596p0k345k234
3618e36j613R14K028K369R83j026k405k052r08J330K325K100M11j786k452j811
3634b129J69K392K343Q56m94k339k119j036J309K083J888O25j170l061j516K71
$$ plain form
3650 -1928 -393 1949 3559 3026 1420 -1139 -2254 -1664 216 2569 3393 2250 -195 -1801 -2497 -783
3666 -783 1597 2767 2865 1330 -830 -2248 -1943 163 2262 3473 2428 340 -1813 -2409 -1088 914
3682 914 2965 3463 1960 -582 -1994 -2051 -482 1844 3277 2685 1145 -1166 -2004 -1563 811 2606 3232
3699 3232 2301 119 -1726 -2105 -829 1658 3141 2941 1333 -584 -2405 -1481 306 2375 3218 2643
3715 2643 257 -1503 -1902 -1067 1226 2854 2962 1882 -378 -1994 -1506 106 2033 3077 2665 883
3731 883 -1305 -2018 -1221 694 2462 3404 1845 -209 -1637 -1842 -341 1464 2708 2836 1300 -1140
3747 -1140 -1836 -1454 371 1833 2705 2053 136 -1502 -2020 -1143 1048 2658 2521 1126 -565 -2064 -1686
3764 -1686 -409 1531 2598 2242 433 -1350 -2108 -1431 653 2209 2546 1657 -214 -1895 -2167 -715
$$ packed form
3650a928J535K342J610n33j606k559j115N90J880K353Q24j143k445j606o96J714
3666g83K380J170R8j535k160j418L05K106K099J211j045k088k153n96J321K002
3682I14K051M98j503k542j412n7J569K326J433n92j540k311q38M41K374J795O26
3699C232r31k182j845l79J276K487J483k00j608j917j821R24J787K069Q43n75
3715B643k386j760l99Q35K293J628J08j080k260j616M88J612J927J044m12j782
3731H83k188p13P97J915J768R42j559k054j428k05J501J805J244J28j536k440
3747a140o96L82J825J462Q72o52j917j638n18Q77K191J610j37j395j691j499L78
3764a686J277J940J067l56j809j783p58O77K084J556L37q89j871j681k72J452
$$ plain form
3780 -715 1460 2565 2386 731 -788 -2190 -1515 161 1795 2761 1683 -85 -1670 -1804 -829 1149
3796 1149 2388 2357 1274 -568 -1753 -1913 -303 1901 2791 2147 470 -1248 -1703 -1077 634 2128 2816
3813 2816 1908 -316 -1459 -1645 -132 1476 2788 2598 868 -660 -1317 -1088 612 2242 2966 2092 272
3830 272 -1577 -1492 -411 1329 2500 2643 1323 -522 -1627 -996 106 1838 2838 2151 730 -1281
3846 -1281 -1291 -451 666 2216 2777 1732 -188 -1485 -1206 -371 1593 2623 2177 973 -1029 -1907 -1053
3863 -1053 319 1787 2456 1347 -106 -1814 -1817 -1169 935 1957 1991 620 -1173 -1741 -1608 -665 956
3880 956 1984 1100 -363 -1480 -2189 -1548 81 1415 1600 401 -993 -2490 -2290 -820 977 847 1447
3897 1447 22 -1525 -2661 -2040 -816 1112 1294 918 -887 -1906 -2943 -1465 -465 1299 1619 -384
$$ packed form
3780g15K175J105j79j655j519j402O75J676J634R66j078j768j585j34R75J978
3796A149J239l1j083j842j185j60J610K204Q90o44j677j718m55O26J711J494O88
3813B816r08k224j143j86J513J608J312j90j730j528o57K29J700J630P24q74j820
3830B72j849Q5J081J740J171J43j320j845j105O31J102J732J000o87j421k011
3846a281j0Q40J117J550N61j045j920j297K79Q35J964J030m46j204k002q78Q54
3863a053J372J468O69j109j453j708lO48K104J022L4j371j793n68J33R43J621
3880I56J028q84j463j117p09O41J629J334J85j199j394j497K00J470J797j30O00
3897A447j425j547j136O21J224J928J82l76j805j019j037J478J000J764L20k003
$$ plain form
3913 -384 -1499 -2612 -1562 -787 664 880 953 -811 -1987 -2782 -1995 -153 845 989 370 -1754 -2206 -2174
3931 -2174 -783 192 690 989 -385 -1586 -2187 -1778 -348 1107 1475 682 -795 -1753 -2183 -877 432
3948 432 1695 1299 516 -1220 -1858 -1394 -76 1178 1663 1202 -435 -1222 -1698 -805 718 1821 1697 781
3966 781 -832 -1643 -1422 -53 1418 2129 1652 433 -864 -1383 -783 393 1446 2161 1358 135 -626
3983 -626 -1201 -90 1574 2522 1961 834 -186 -833 -281 671 2070 2441 1940 670 -533 -1071 129
4000 129 1233 2446 2405 1508 31 -441 -489 307 2024 2520 2202 1077 -312 -984 -448 999 2255 2417
4018 2417 1753 470 -740 -522 412 1689 2211 2364 1195 -523 -614 -298 818 1845 2500 1848 578
4035 578 -207 -801 -329 1112 2291 2047 1093 182 -782 -333 526 1933 2052 1976 899 -103 -889 -222 1127
$$ packed form
3913c84j115j113J050P75J451K16P3j764j176p95P87J842R98J44o19k124m52L2
3931b174J391R75M98K99j374j201o01M09J430J455L68p93j477r58m30J306J309
3948D32J263l96p83j736o38M64J318J254M85m61j637p87m76Q93J523J103j24r16
3966G81j613q11K21J369J471P11m77j219j297n19O00J176J053P15q03j223p61
3983f26n75J111J664R48n61j127j020o47N52R52J399L71n01j270j203n38J200
4000A29J104J213m1q97j477m72m8P96J717M96l18j125j389o72N36J447J256J62
4018B417o64j283j210K18R34J277N22J53j169j718r1L16J116J027O55o52j270
4035E78p85n94M72J441J179k44r54r11r64M49Q59J407J19p6j077j002p86O67J349
$$ plain form
4054 1127 2105 2102 1393 423 -578 -767 710 1799 2600 2088 990 183 -409 -418 771 1994 2116 1955 437
4073 437 -52 -531 356 1503 2280 1929 1285 11 -503 -349 589 1594 2249 1907 1217 2 -408 -28 938
4092 938 2339 2251 1614 313 -227 -82 553 1713 2319 2144 1287 181 -109 149 1094 1951 1949 1888 542 -93
4112 -93 -438 572 1489 2146 2194 1509 575 -572 -69 999 1503 2160 2113 667 -116 -209 250 1411 2098 2109
4132 2109 1391 538 -222 -238 434 1267 2030 1707 669 -189 -581 -328 673 1759 2191 1348 207 -478 -572
4151 -572 266 1332 1880 1705 888 -87 -613 -506 462 1300 1594 1164 334 -650 -968 -52 611 1431 1508 705
4171 705 -284 -1076 -953 -101 1071 1504 1148 149 -738 -1171 -528 113 1150 1370 608 -474 -1004 -1098 -319
4190 -319 630 1187 1071 54 -679 -1225 -1056 -104 812 1118 567 -613 -1416 -1413 -667 258 1175 837 246 -749
$$ packed form
4054A127R78lp09r70j001j89J477J089Q01n12j098q07n92rJ189J223J22j61j518
4073D37m89m79Q87J147P77l51o44j274n14J54R38J005O55l42o90j215m10L80R66
4092I38J401q8o37j301n40J45O35J160O06j75q57j106k90K58R45Q57ko1j346o35
4112i3l45J010R17O57M8o85r34j147N03J068N04O57m7j446p83r3M59J161O87J1
4132B109p18q53p60j6O72Q33P63l23j038q58l92K53J001J086M32q43j141o85r4
4151e72Q38J066N48j75q17r75n26J07R68Q38K94m30q30r84l18R16O63Q20P7q03
4171G05r89p92J23Q52J172M33l56r99q87m33O43O41J037K20p62j082n30r4P79
4190c19R49N57j16j017p33n46J69R52R16L06n51j180q03LP46R25R17l38n91r95
$$ plain form
4210 -749 -1337 -1265 -319 536 1020 283 -402 -1249 -1662 -1156 -99 522 587 -150 -872 -1563 -1426 -1052 -158 215
4230 215 302 -338 -1324 -1914 -1603 -581 -17 521 -283 -1243 -1669 -1838 -1336 -416 -112 -157 -642 -1572 -1961 -1862 -1124
4251 -1124 -441 200 -422 -1261 -1793 -1986 -1847 -883 -125 -37 -513 -1709 -2132 -2112 -1525 -741 -219 -562 -1248 -1963
4271 -1963 -2147 -1821 -1021 -716 -720 -1025 -1640 -2413 -2461 -2237 -857 -376 -498 -1403 -2257 -2876 -2742 -1404 -779 -434
4291 -434 -694 -1644 -2259 -2676 -2412 -1311 -662 -639 -1358 -1946 -2258 -2559 -1752 -1078 -763 -1071 -1545 -2346 -2840 -2290
4311 -2290 -1755 -900 -519 -1200 -1770 -2641 -2672 -2047 -1228 -697 -753 -1698 -2334 -2837 -2305 -1567 -1166 -430 -945 -2047
4331 -2047 -2631 -2362 -2212 -1461 -861 -703 -1389 -1989 -2515 -2515 -1741 -1056 -727 -660 -1519 -2271 -2404 -2281 -1561 -576 -696
4352 -696 -1152 -1790 -2222 -2514 -1881 -1150 -999 -729 -1459 -2136 -2036 -2103 -1605 -891 -905 -1016 -2059 -2405 -2355 -2146 -1087
$$ packed form
4210g49n88P2R46Q55M84p37o85q47m13N06J057O21O5p37p22o91J37L74Q94L73
4230B15Q7o40r86n90L11J022N64N38q04r60m26j69N02R20L04m5m85r30l89R9P38
4251a124O83O41o22q39n32j93J39R64P58Q8m76j196m23K0N87P84N22l43o86p15
4271a963j84L26Q00L05ml05o15p73m8K24J380M81j22r05q54o19J34J338O25L45
4291d34k60r50o15m17K64J101O49K3p19n88l12l01Q07O74L15l08m74q01m94N50
4311b290N35Q55L81o81n70q71l1O25Q19N31n6r45o36n03N32P38M01P36n15j102
4331b047n84K69J50P51O00J58o86o00n26%P74O85L29O7q59p52j33J23P20R85j20
4352f96m56o38m32k92O33P31J51K70p30o77J00o7M98P14j4j11j043l46N0K09J059
$$ plain form
4373 -1087 -714 -740 -1226 -1942 -2308 -2217 -1809 -1069 -802 -996 -1734 -2552 -2371 -2239 -1329 -828 -991 -1326 -1926 -2602
4393 -2602 -2406 -1855 -1165 -740 -760 -1552 -1963 -2640 -2132 -1578 -891 -565 -885 -1817 -2450 -2404 -1741 -1025 -804 -1007
4413 -1007 -1315 -1848 -2552 -2086 -1384 -785 -575 -748 -1620 -2101 -2155 -1909 -902 -525 -674 -1028 -1464 -2052 -2028 -1459
4433 -1459 -758 -356 -614 -1316 -1818 -1922 -1564 -950 -332 -253 -469 -1467 -1740 -1854 -1158 -566 -205 -124 -702 -1190
4453 -1190 -1484 -1335 -883 89 -86 -66 -1156 -1204 -1527 -976 -571 225 185 -557 -870 -1255 -1258 -504 2 342 124
4474 124 -570 -734 -1088 -829 -178 254 511 -100 -719 -1084 -1005 -302 183 703 497 -80 -567 -866 -642 -202
4494 -202 548 692 450 -257 -705 -798 -346 505 766 780 69 -251 -490 -239 -110 506 927 546 77 -445 -546
4515 -546 -504 265 747 737 360 -205 -726 -558 -68 525 934 743 103 -335 -640 -332 231 675 805 500 56
$$ packed form
4373a087L73k6m86p16l66R1M08P40K67j94p38q18J81J32R10N01j63l35o00o76
4393b602J96N51O90M25k0p92m11o77N08N54O87L26l20r32o33M6O63P16K21k03
4413a007l08n33p04M66P02N99K10j73q72m81n4K46J007L77j49l54m36n88K4N69
4433a459P01M02k58p02n02j04L58O14O18P9k16r98k73j14O96N92L61Q1n78m88
4453a190k94J49M52R72j75K0j090m8l23N51M05P96m0p42l13l85lP54N06L40k18
4474A24o94j64l54K59O51M32K57o11o19l65P9P03M85N20k06n77m87k99K24M40
4494b02P50J44k42p07m48r3M52Q51K61J4p11l20k39K51J29O16M21l81m69n22j01
4515e46M2P69M82j0l77n65n21J68M90N93M09j91o40m38l05L08N63M44J30l05m44
$$ plain form
4536 56 -594 -291 105 330 603 757 222 -215 -505 -394 217 372 770 744 133 -578 -574 -46 154 782 617
4557 617 578 -242 -351 -232 273 946 895 544 261 -478 -369 -110 511 965 759 797 309 -63 -89 306 876
4578 876 700 1344 426 -288 -444 140 488 795 1155 842 146 208 -107 160 713 1244 1084 710 527 21
4598 21 -11 581 1008 1044 1244 437 -34 -70 223 1006 1191 1415 877 322 20 20 623 1018 1381 1433 664 91
4620 91 30 67 923 882 1236 1018 583 286 93 112 635 1129 1146 972 293 -148 13 708 1017 1075 998 486 97
4643 97 77 219 793 1064 1181 710 351 23 -15 668 677 837 1023 506 -32 -98 141 412 927 995 488 256
4665 256 -172 -104 11 641 1005 960 380 -116 -263 -340 611 1009 1049 760 435 -418 -118 165 545 886 782
4686 782 532 -2 -84 -37 592 504 907 811 567 62 -297 34 758 924 761 831 280 9 48 299 781 977
$$ packed form
4536E6o50L03L96K25K73J54n35m37k90J11O11J55L98k6o11p11MN28K00O28j65
4557F17l9q20j09J19N05O73n1l51k83p39J09K59O21M54k06L8m88l72k6L95N70
4578H76j76O44r18p14j56N84L48L07L60l13o96O2l15K67N53N31j60l74j83n06
4598B1l2N92M27L6K00q07m71l6K93P83J85K24n38n55l02%O03L95L63N2p69n73
4620I1o1L7Q56m1L54k18m35k97j93J9N23M94J7j74o79m41J61O95L09N8p7n12l89
4643I7k0J42N74K71J17m71l59l28l8O83RJ60J86n17n38o6K39K71N15O8n07k32
4665B56m28O8J15O30L64m5n80m96j47p7R51L98M0k89l25q53L00K83L80L41j04
4686G82k50n34q2M7O29q8M03r6k44n05l59L31P24J66j63P0n51k71L9K51M82J96
$$ plain form
4708 977 1280 364 -9 -109 215 599 1014 855 673 226 -162 208 238 659 1115 1090 579 224 -163 -2 337
4729 337 886 1058 787 559 -7 30 230 715 995 755 724 288 -166 120 105 796 1117 963 213 -53 -150
4750 -150 6 394 786 837 729 175 -18 -609 120 247 786 450 332 -273 -651 18 59 484 950 334 -272
4771 -272 -367 -546 -102 299 337 315 550 -381 -451 -467 -263 537 589 -95 -206 -550 -566 -330 -48 164 441 -75
4793 -75 -587 -812 -1018 -500 -77 -76 -261 -294 -928 -1036 -745 -287 -138 235 -479 -505 -988 -1115 -739 -32 42 -13
4815 -13 -581 -919 -1045 -863 -508 -138 88 -275 -684 -987 -1048 -641 -368 0 -332 -321 -817 -1378 -853 -323 -84
4836 -84 -29 53 -282 -953 -840 -874 -31 -144 69 -313 -557 -979 -708 -577 -138 348 -1 -310 -725 -667 -567 -406
4858 -406 261 293 -57 -105 -437 -345 -292 167 187 131 56 -198 -867 -461 -367 336 791 100 -54 -339 -658 -321 157
$$ packed form
4708I77L03r16l73j00L24L84M15j59j82m47l88L70L0M21M56k5n11l55l87J61L39
4729C37N49J72k71k28n66L7K00M85K80k40l1m36m54K86j5O91L21j54p50k66r7
4750a50J56L88L92N1j08n54j93n91P29J27N39l36j18o05l78O69M1M25M66o16o06
4771b72r5j79M44M01L8k2K35r31p0j6K04Q00N2o84j11l44j6K36K82K12K77n16
4793g5n12k25k06N18M23Jj85l3o34j08K91M58J49L73p14k6m83j27L76P07P4n5
4815a3n68l38j26J82L55L70K26l63m09l03o1M07K73L68l32J1m96n61N25N30K39
4836h4N5Q2l35o71J13l4Q43j13K13l82k44m22K71J31M39M86l49l09m15N8J00J61
4858d06O67L2l50m8l32R2N3M59K0n6p5k54o69M06R4P03M55o91j54k85l19L37M78
$$ plain form
4881 157 440 710 78 22 -519 -764 205 468 580 148 18 -196 -675 -276 57 460 752 167 184 -398 -304
4902 -304 -23 112 674 232 226 -129 -171 -190 54 474 545 373 33 -194 -246 86 557 627 723 73 -166 -339 -365
4925 -365 178 426 398 485 -102 -285 -235 -235 -55 680 692 173 61 -257 -19 15 150 600 629 206 177 -382 -352
4948 -352 76 506 577 338 269 -207 33 175 339 766 897 240 -36 -174 329 394 724 597 972 490 154
4969 154 9 314 501 863 855 849 605 174 59 805 652 1309 1066 668 334 403 303 451 1218 1313 1163 806
4991 806 220 491 427 992 1264 1177 773 722 621 722 326 1523 1406 1240 857 689 448 723 1013 1853 1629
5012 1629 1177 902 559 863 965 1141 1426 1205 884 530 565 558 1037 1434 1709 1317 826 655 436 972 1184
5033 1184 1436 1310 815 809 736 595 1163 1420 1524 1101 764 883 808 789 1097 1267 1485 1320 786 799 661 913
$$ packed form
4881A57K83K70o32n6n41k45R69K63J12m32j30k14m79L99L33M03K92n85J7n82R4
4902c04K81J35N62m42ol55m2j9K44M20P1j72l40k27n2L32M71P0R6o50k39j73k6
4925c65N43K48k8Q7n87j83N0%J80P35J2n19j12l18K38L4J35M50K9m23k9n59L0
4948c52M28M30P1k39o9m76K40J42J64M27J31o57k76j38N03O5L30j27L75m82l36
4969A54j45L05J87L62qok44m31j15P46j53O57k43l98l34O9j00J48P67R5j50l57
4991H06n86K71o4N65K72q7m04n1j01J01l96J197j17j66l83j68k41K75K90Q40k24
5012A629m52k75l43L04J02J76K85k21l21l54L5pM79L97K75l92m91j71k19N36K12
5033A184K52j26m95op3j41N68K57J04m23l37J19p5j9L08J70K18j65n34J3j38K52
$$ plain form
5055 913 1039 1251 1147 1003 548 263 781 848 1471 1563 1214 831 448 407 844 997 1120 1292 838 647 325
5076 325 592 940 1125 1053 1052 684 231 -35 751 579 1047 878 762 630 494 397 650 950 1211 968 485
5097 485 250 245 551 882 1146 867 616 343 328 391 517 943 911 913 493 135 146 307 228 607 1040 828 213
5120 213 205 232 523 858 983 1052 499 168 279 278 724 832 843 856 264 206 -103 422 591 809 899 492 190
5143 190 94 -100 100 800 789 738 129 -14 -391 118 275 662 887 270 332 -455 -312 0 144 440 529 -116
5165 -116 -6 -180 -354 278 506 393 -34 -295 -532 -462 -151 187 355 530 110 -276 -656 -538 -218 209
5185 209 144 118 -594 -703 -519 -225 17 -66 -95 -70 -617 -746 -707 -324 -103 -63 -287 -270 -561 -823 -610 -342 -181
5208 -181 272 -88 -474 -734 -815 -367 -114 324 290 -108 -538 -771 -708 -417 -174 39 -350 -526 -670 -758 -416
$$ packed form
5055I13J26K12j04j44m55k85N18O7O23R2l49l83l83m1M37J53J23J72m54j91l22
5076C25K67L48J85p2jl68m53k66P86j72M68j69j16j32j36r7K53L00K61k43m83
5097D85k35nL06L31K64k79k51k73j5O3J26M26l2Km20l58J1J61p9L79M33k12o15
5120B13qK7K91L35J25O9n53l31J11jM46J08J1J3n92n8l09N25J69K18R0m07l02
5143A90r6j94K00P00j1n1o09j43l77N09J57L87K25o17O2p87J43L12J44K96Q9o45
5165a16J10j74j74O32K28j13m27k61k37P0L11L38J68J75m20l86l80J18L20M27
5185B09o5k6p12j09J84K94K42q3k9K5n47j29L9L83K21M0k24J7k91k62K13K68J61
5208a81M53l60l86k60q1M48K53M38l4l98m30k33O3K91K43K13l89j76j44q8L42
$$ plain form
5229 -416 -207 8 17 -366 -677 -510 -852 -483 -60 265 -154 -253 -649 -734 -426 -532 -673 359 -15 -681 -800
5250 -800 -159 -794 -687 -62 595 -183 -870 -192 -638 -495 -664 74 -373 -472 -442 -806 -562 -389 -237 -93 -117
5271 -117 -465 -1246 -878 -549 -223 -282 -101 -865 -1090 -765 -573 -524 -173 -286 78 -689 -761 -867 -874 -379 83 -812
5293 -812 -835 -748 -703 -790 -603 -275 -411 -74 -189 -519 -893 -492 -606 -399 -74 -263 -161 -366 -1923 -470 -887
5314 -887 -385 -264 -649 -811 -865 -808 -676 -218 -195 -426 -743 -746 -922 -549 -257 -253 -403 -704 -581 -959 -880 -263 -333
5337 -333 57 -328 -378 -941 -998 -566 -341 37 4 -247 -590 -531 -751 -318 -475 125 158 -405 -480 -518 -452 -12 39
5360 39 385 -112 -402 -501 -431 13 13 424 298 397 -484 -527 -250 313 536 545 513 81 -365 -313 -253 201 411 304
5384 304 515 -308 -85 -242 151 536 377 240 -12 24 -102 109 63 267 508 392 -143 243 -424 469 400
$$ packed form
5229d16K09K15Rl83l11J67l42L69M23L25m19r9l96q5L08j06j41J032l74o66j19
5250h00O41o35J07O25O57p78o87O78m46J43j69P38m47r9L0l64K44J73J52J44k4
5271a17l48p81L68L29L26n9J81p64k25L25J92M9L51j13L64p67p2j06pM95M62q95
5293h12k3Q7M5q7J87L28j36L37j15l30l74M01j14K07L25j89J02k05j557J453m17
5314h87N02J21l85j62n4N7J32M58K3k31l17lj76L73K92Mj50l01J23l78P9O17p0
5337c33L90l85n0n63n7M32K25L78l3k51l43N9k20M33j57O00L3n63p5l8O6M40N1
5360C9L46m97k90r9P0M44%M11j26R9q81m3K77N63K23Rl2m32m46N2O0M54K10j07
5384C04K11q23K23j57L93L85j59j37k52L6j26K11m6K04K41j16n35L86o67Q93o9
$$ plain form
5405 400 654 273 191 67 -177 71 209 242 556 397 -240 -167 -158 268 186 193 316 497 -190 -282 8 377 437
5428 437 414 -99 68 -409 -11 -123 404 347 535 -11 -46 -369 -225 -135 452 144 66 -6 -226 -324 -475 -34
5450 -34 216 240 89 -289 -682 -516 -360 200 382 -154 -112 -742 -433 -326 114 95 142 -34 -66 -393 -522 -425
5472 -425 -356 77 66 -141 -411 -837 -476 -87 185 18 29 -555 -450 -448 -557 284 -126 166 -349 -265 -480 -459
5494 -459 -93 15 -56 -1 -45 -675 -431 -533 183 17 153 -46 -227 -293 -555 -281 31 102 45 -113 -347 -510
5516 -510 -499 -173 156 30 176 -80 -391 -167 -316 -285 213 1 -199 -141 -515 -294 -274 91 289 107 -200
5537 -200 -645 -365 -151 9 201 227 -44 -448 -586 -608 -280 -162 80 340 -266 -450 -570 -421 -278 358 429
5558 429 -116 -186 -667 -701 -274 -341 149 131 -246 -373 -651 -509 -150 124 279 82 -180 -489 -736 -809 64 -138
$$ packed form
5405D00K54l81q2j24k44K48J38L3L14j59o37P3RM26q2PJ23J81o87r2K90L69O0
5428D37k3n13J67m77L98j12N27n7J88n46l5l23J44R0N87l08p8p2k20r8j51M41
5450c4K50K4j51l78l93J66J56N60J82n36M2o30L09J07M40j9M7j76l2l27j29R7
5472d25O9M33j1k07k70m26L61L89K72j67J1n84J05Kj09Q41m10K92n15Q4k15K1
5494d59L66J08p1N5m4o30K44j02P16j66J36j99j81o6k62K74L12P1n7j58k34j63
5516e10J1L26L29j26J46k56l11K24j49L1M98k12k00N8l74K21K0L65J98j82l07
5537b00m45K80K14J60J92K6k71m04j38k2L28J18K42K60o06j84j20J49J43O36P1
5558D29n45p0m81l4M27o7M90j8l77j27k78J42L59K74J55j97k62l09k47p3Q73k02
$$ plain form
5580 -138 -23 27 -344 -658 -660 -441 -57 -21 -209 75 -475 -465 -381 -95 -42 202 244 -250 -673 -474 -390 65 186
5603 186 334 -476 -507 -512 -473 -161 224 399 195 -184 -76 -598 -499 22 192 163 18 -259 -409 -264 -6 266
5625 266 363 200 -248 -250 -439 -143 14 7 40 114 -123 -410 -806 -303 142 417 176 -185 -464 -495 -556 -70 357
5648 357 207 -182 -231 -438 -245 -261 -2 535 114 -169 -421 -433 -485 -112 313 552 307 -128 -584 -628 -257 -188
5670 -188 96 474 13 -71 -491 -541 -241 195 232 80 -265 -643 -493 -504 -371 207 224 -109 -237 -559 -315 -618
5692 -618 -76 43 27 -258 -386 -808 -347 -179 -185 40 170 -272 -311 -587 -436 -248 75 -173 -35 -581 -767
5713 -767 -696 -301 52 193 13 -453 -329 -799 -459 -102 310 128 -93 28 -379 -375 -355 62 339 320 -29 -407
5735 -407 -299 -431 110 252 289 272 -43 -418 -474 -110 -2 540 370 431 73 -435 -361 -72 520 489 655 25
$$ packed form
5580a38J15N0l71l14kK19L84L6j88K84n50J0Q4K86N3K44M2m94m23J99Q4M55J21
5603A86J48q10l1nL9L12L85J75k04l79J08n22R9N21J70k9j45k77j50J45K58K72
5625B66R7j63m48kj89K96J57pL3P4k37k87l96N03M45K75k41l61k79l1o1M86M27
5648C57j50l89m9k07J93j6K59N37m21k83k52j2n2L73M25K39k45m35m56m4L71O9
5670a88K84L78m61q4m20n0L00M36L7j52l45l78J50j1J33N78J7l33j28l22K44l03
5692f18N42J19j6k85j28m22M61J68oK25J30m42l9k76J51J88L23k48J38n46j86
5713g67P1L95L53J41j80m66J24m70L40L57M12j82k21J21m07MK0M17K77j9l49l78
5735d07J08j32N41J42L7j7l15l75n6L64J08N42j70O1l58n08P4K89N92l1J66o30
$$ plain form
5757 25 -132 -586 -29 513 914 624 534 341 -109 3 -74 567 410 418 501 13 -177 -106 336 602 586 577 -12
5780 -12 -108 121 -159 564 465 789 469 -40 -267 -268 241 603 565 574 227 134 88 -58 329 748 687 563 25 37
5804 37 -273 242 482 542 469 207 -246 -127 -27 195 450 686 620 43 -104 -149 -22 359 511 564 238 -95
5826 -95 -164 41 195 286 650 267 -176 -110 -97 -20 508 639 398 72 -236 -231 -303 169 68 534 366 79 -119
5849 -119 -455 -517 206 420 150 715 17 -279 -258 14 162 395 708 -247 79 -193 -157 534 360 556 502
5870 502 123 -19 -128 -32 156 479 809 518 33 -221 125 5 413 645 419 136 -165 151 -173 355
5890 355 521 753 456 315 -104 -129 238 664 487 977 372 -74 101 -9 207 683 1005 648 392 307 -87
5911 -87 -119 502 795 528 564 -96 74 -23 290 536 521 832 430 85 -59 272 398 713 552 588 266 109
$$ packed form
5757B5j57m54N57N42M01k90r0j93m50J12p7O41j57QQ3m88j90P1M42K66j6rn89
5780a2r6K29k80P23r9L24l20n09k27jN09L62l8Rl47r3m6j46L87M19o1j24n38J2
5804C7l10N15K40O0p3k62m53J19J00K22K55K36o6n77j47m5J27L81J52N3l26l33
5826i5o9K05J54R1L64l83m43O6J3P7N28J31k41l26l08Np2M72j01M66j68k87j98
5849a19l36o2P23K14k70N65o98k96K1K72J48K33L13r55L26k72L6O91j74J96n4
5870E02l79j42j09R6J88L23L30k91m85k54L46j20M08K32k26k83l01L16l24N28
5890C55J66K32k97j41m19k5L67M26j77M90o05m46J75j10K16M76L22l57k56q5l94
5911h7l2O21K93k67L6o60J70r7L13K46j5L11m02l45j44L31J26L15j61L6l22j57
$$ plain form
5933 109 71 264 445 922 911 423 38 -80 -42 416 648 568 361 370 84 -284 69 288 641 612 192 4
5955 4 -297 -128 298 479 409 433 167 -236 -244 -108 546 143 672 338 41 -442 -448 317 243 657 505 -2 -123
5978 -123 -479 -155 408 299 485 47 274 -227 -477 -146 260 494 308 267 -5 -105 -391 -6 273 471
5998 471 170 -187 -218 -522 -158 -27 192 253 -13 -296 -293 -356 -165 327 597 395 -245 -1 -592 -322 -103 255
6020 255 295 169 -279 -479 -343 -212 90 358 332 -37 -267 -320 -371 46 316 150 247 -193 -451 -614 -299 299
6042 299 147 566 235 -161 -786 -664 -37 42 511 67 40 -582 -584 -550 -312 309 332 147 -69 -322 -448 -213
6064 -213 -146 50 307 -98 -211 -349 -343 -255 -153 430 -28 -158 -490 -428 -474 -127 14 2 99 -369 -414 -290 -126
6087 -126 -167 108 -121 -330 -470 -672 -243 -34 219 347 -192 -382 -478 -674 -243 10 338 158 -434 -566 -681
$$ packed form
5933A09l8J93J81M77j1m88l85j18L8M58K32q0k07Rk86l68L53K19L53k9m20j88
5955Dl01J69M26J81p0K4k66m03qJ36O54m03N29l34k97m83oP65p4M14j52n07j21
5978a23l56L24N63j09J86m38K27n01k50L31M06K34j86m1k72j00k86L85K79J98
5998D71l01l57l1l04L64J31K19O1k66k83Lo3J91M92K70k02o40K44n91K70K19L58
6020B55M0j26m48k00J36J31L02K68k6l69k30n3n1M17K70j66R7m40k58j63L15N98
6042B99j52M19l31l96o25J22O27P9M69m44k7o22kL4K38O21K3j85k16k53j26K35
6064b13O7J96K57m05j13j38OQ8J02N83m58j30l32O2m6L47J41j2R7m68m5J24J64
6087a26m1K75k29k09j40k02M29K09K53J28n39j90r6j96M31K53L28j80n92j32j15
$$ plain form
6108 -681 -585 -104 -152 -147 -321 -532 -650 -866 -378 107 -28 179 -306 -361 -188 -703 -178 99 210 256 -78 -517
6130 -517 -541 -590 -8 207 579 51 -143 -591 -367 -250 47 245 134 -91 -369 -535 -441 -292 275 193 398
6151 398 -292 -468 -526 -188 101 32 133 -96 -148 -345 -549 -278 268 305 264 -157 -276 -773 -419 -69 113 403
6173 403 137 -127 -384 -763 -63 214 362 153 -388 -502 -393 -166 -87 251 354 -25 -333 -558 -582 -424 -111
6194 -111 302 291 -129 -278 -318 -358 -10 -224 360 332 -45 -474 -416 -345 64 110 -28 82 -225 -630 -364 69
6216 69 28 329 536 -129 -398 -402 -502 22 133 331 89 21 -317 -450 -235 237 219 694 191 -207 -304 -43
6238 -43 -136 123 590 174 168 -88 -131 35 119 571 635 222 -49 -196 -367 -170 554 415 480 16 -136 -156 -21
6261 -21 161 677 593 211 -367 -161 -100 199 494 409 710 349 -75 3 -101 73 325 807 642 466 -158 -124
$$ packed form
6108f81R6M81m8Nj74k11j18k16M88M85j35K07m85n5J73n15N25K77J11M6l34m39
6130e17k4m9N82K15L72n28j94m48K24J17K97J98j11k25k78j66R4J49N67q2K05
6151C98o90j76n8L38K89o9J01k29n2j97k04K71N46L7m1m21j19m97L54L50J82K90
6173D03k66k64k57l79P00K77J48k09n41j14J09K27P9L38J03l79l08k25k4J58L13
6194a11M13j1m20j49m0m0L48k14N84k8l77m29N8P1M09M6j38J10l07m05K66M33
6216F9m1L01K07o65k69mj00N24J11J98k42o8l38j33K15M72j8M75n03l98r7K61
6238d3r3K59M67m16ok56m3J66Q4M52O4m13k71j47j71J97P24j39O5m64j52k0J35
6261b1J82N16q4l82n78K06O1K99K95q5L01l61m24P8j04J74K52M82j65j76o24L4
$$ plain form
6283 -124 126 287 463 553 571 9 -23 64 -25 481 557 479 356 -185 265 -75 346 660 589 575 18 -184 135
6306 135 95 544 658 289 410 38 -174 -2 425 525 443 385 119 -168 2 188 88 612 330 187 32
6327 32 -383 -19 -234 380 636 330 257 -143 -88 -174 189 536 429 400 -168 -246 -226 -136 402 420 294 45 -34
6350 -34 -531 -122 300 551 339 236 51 -363 -308 -73 373 314 69 238 -223 -202 -357 -65 294 433 373 188
6372 188 -400 -194 -144 -38 390 257 206 -199 -457 -191 135 -79 565 481 -116 -420 -507 28 257 132 687
6393 687 280 -54 -208 -207 -96 156 525 211 194 -349 -230 155 -11 357 419 301 -71 10 -265 -99 292 325
6415 325 568 503 -103 -114 23 391 405 760 318 260 -129 -139 -285 75 685 414 356 296 -183 -155 172 153 474
6438 474 477 590 -97 -205 -72 -242 79 188 379 -109 -174 -54 -150 335 335 413 104 -10 -181 -184 -136 388 365 232
$$ packed form
6283a24K50J61J76R0J8n62l2Q7q9N06P6p8j23n41M50l40M21L14p1j4n57k02L19
6306A35m0M49J14l69J21l72k12J72M27J00q2n8k66k87J70J86j00N24k82j43j55
6327C2m15L64k15O14K56l06p3m00N5q6L63L47j07k9n68p8K0R0N38J8j26k49p9
6350c4m97M09M22K51k12j03j85m14N5K35M46n9k45J69m61K1j55K92L59J39o0j85
6372A88n88K06N0J06M28j33n1m05k58K66L26k14O44q4n97l04q7N35K29j25N55
6393F87m07l34j54JJ11K52L69l14j7n43J19L85j66L68O2j18l72Q1k75J66L91L3
6415C25K43o5o06j1J37L68J4L55m42n8l89j0j46L60O10k71n8o0m79K8L27j9L21
6438D74LJ13o87j08J33j70L21J09J91m88o5J20r6M85%P8l09j14j71lM8N24k3j33
$$ plain form
6462 232 111 -487 -409 52 103 375 556 110 293 -294 -404 -225 2 249 162 -78 -459 -273 -527 -200 -126
6483 -126 24 275 -302 -245 -667 -551 -419 54 28 -209 -480 -232 -688 -327 81 50 -107 -399 -799 -602 -325
6504 -325 -42 155 -153 18 -85 -561 -655 -291 -118 32 -137 39 -308 -603 -633 -254 -123 36 118 -124 -590
6525 -590 -477 -92 -372 9 249 -78 -197 -630 -328 17 -84 224 149 -556 -441 -648 -597 -374 -4 151 67
6546 67 -164 -507 -540 -250 -117 -87 140 -71 -505 -299 -487 -136 71 132 -82 -253 -305 -478 -476 -185 227 313 126
6569 126 -128 -510 -300 -189 40 214 181 -392 -208 -460 -464 -93 190 138 81 -262 -538 -602 -99 371 206 72
6591 72 -117 -67 -596 -526 -202 284 319 143 -51 -223 -652 -96 34 284 256 -40 -169 -329 -354 -218 239 134
6613 134 188 -94 -561 -558 -43 -13 109 399 193 -130 -160 -472 -310 67 -56 3 128 -396 -636 -181 -264 -86
$$ packed form
6462B32j21n98P8M61N1K72J81m46J83n87j10J79K27K47q7k40l81J86k54L27P4
6483a26J50K51n77N7m22J16J32M73k6k37k71K48m56L61M08l1j57k92m00J97K77
6504c25K83J97l08J71j03m76r4L64J73J50j69J76l47k95l0L79J31J59Q2k42m66
6525e90J13L85k80L81K40l27j19m33L02L45j01L08p5p05J15k07N1K23L70J55q4
6546F7k31l43l3K90J33L0K27k11m34K06j88L51K07O1k14j71n2j73KK91M12Q6j87
6569A26k54l82K10J11K29J74l3n73J84k52mL71K83n2n7l43k76o4N03M70j65j34
6591G2j89N0n29P0L24M86L5j76j94j72m29N56J30K50k8k96j29j60k5J36M57j05
6613A34N4k82m67LN15L0J22K90k06l23l0l12J62L77j23N9J25n24k40M55q3J78
$$ plain form
6635 -86 663 363 -154 -646 -466 -296 -116 261 322 49 -492 -408 -379 -173 173 335 175 206 -320 -299 -19 -27 634
6658 634 452 80 -216 -177 -396 -131 44 324 347 -16 -186 -97 -353 -157 113 377 210 62 -175 -172 66 76
6680 76 278 422 199 -185 -169 -368 -362 300 -122 -234 166 -462 -360 -107 -53 86 113 216 -220 -201 -147 -233 51
6703 51 443 160 83 -114 -454 -607 -154 160 169 -90 116 -273 -189 -204 77 227 -18 -180 -94 -522 -210 -119 -51
6726 -51 407 91 122 -256 -325 -126 341 -7 259 181 -60 -448 -204 -414 276 295 129 347 -371 -438 -243 139
6748 139 49 230 -62 -109 -164 -265 120 432 229 315 282 -149 -86 -173 93 329 570 342 -147 -200 -40 258 213
6771 213 814 509 293 119 52 178 -52 718 688 230 42 -26 40 -38 414 316 509 395 230 -19 -93 108
6793 108 486 931 533 100 -47 -137 -50 479 222 777 569 239 -9 272 -11 49 790 422 388 127 185 20
$$ packed form
6635h6P49l00n17m92J80J70J80L77O1k73n41Q4K9K06L46J62j60L1n26K1K80qO61
6658F34j82l72k96L9k19K65J75K80K3l63j70Q9k56J96K70K64j67j48k37LK38J0
6680G6K02J44k23l84J6j99OO62m22j12M00o28J02K53N4J39K7J03m36J9N4q6K84
6703E1L92k83p7j97l40j53M53L14Rk59K06l89Q4j5K81J50k45j62Q6m28L12R1O8
6726e1M58l16L1l78o9J99M67l48K66p8k41l88K44k10O90J9j66K18p18o7J95L82
6748A39r0J81k92m7n5j01L85L12k03Q6l3m31O3q7K66K36K41k28m89n3J60K98m5
6771B13O01l05k16j74o7J26k30P70l0m58j88o8O6p8M52r8J93j14j65k49p4K01
6793A08L78M45l98m33j47r0Q7N29k57N55k08l30k48K81k83O0P41l68l4k61N8j65
$$ plain form
6815 20 44 572 490 714 477 256 -121 342 473 464 638 496 141 295 93 80 338 766 494 323 309 -14
6837 -14 50 317 345 392 484 145 -150 71 53 199 495 347 224 39 10 -109 143 589 392 424 -71 -184 -162
6860 -162 -31 308 296 441 95 -38 -103 -90 -75 291 150 404 144 182 -36 -118 -104 188 468 -230 -196 -165 -528
6883 -528 -241 42 80 202 470 -61 -279 -331 116 148 432 211 570 -73 356 330 -97 326 179 518 -388
6904 -388 -1082 -235 164 370 1072 569 -62 -319 -199 -103 27 225 500 179 -43 -20 -39 -28 363 506 538 53
6926 53 64 -252 -94 120 380 350 384 -56 163 -125 -380 -38 200 435 338 -121 -400 68 -87 -99 349 730
6948 730 286 135 -154 53 455 328 517 324 126 -73 -263 -171 232 340 163 196 -198 -17 -389 -119 269
6969 269 147 301 30 -486 -161 -384 -16 115 324 407 -286 31 -339 -221 107 90 -90 -190 -484 -479 -227
$$ packed form
6815B0K4N28q2K24k37k21l77M63J31rJ74j42l55J54k02j3K58M28k72j71j4l23
6837a4O4K67K8M7R2l39k95K21j8J46K96j48j23j85k9j19K52M46j97L2m95j13K2
6860a62J31L39j2J45l46j33o5J3J5L66j41K54k60L8k18q2J4K92K80o98L4L1l63
6883e28K87K83L8J22K68n31k18n2M47L2K84k21L59o43M29k6m27M23j47L39r06
6904c88o94Q47L99K06P02n03o31k57J20R6J30J98K75l21k22K3j9J1L91J43L2m85
6926E3J1l16J58K14K60l0L4m40K19k88k55L42K38K35r7m59k79M68j55j2M48L81
6948G30m44j51k89K07M02j27J89j93j98j99j90R2M03J08j77L3l94J81l72K70L88
6969B69j22J54k71n16L25k23L68J31K09Q3o93L17l70J18L28j7j80j00k94NK52
$$ plain form
6990 -227 -172 85 19 6 -193 -278 -369 -405 -7 452 56 314 -171 -533 -241 -341 -86 50 341 -366 -388 -326 -455
7013 -455 -193 288 269 154 -105 -401 -399 -203 65 -68 180 -279 -345 -472 -472 -525 206 78 -25 -252 -684 -458
7035 -458 -341 -235 -39 -52 107 -481 -863 -468 -378 -276 -232 -122 -239 -273 -450 -343 -410 44 303 -101 -554 -504
7057 -504 -293 -230 -282 -25 -118 -129 -311 -483 -308 -220 119 -47 268 -172 -364 -708 -430 -36 114 124 81 -190
7079 -190 -457 -174 -316 365 352 360 -306 -159 -332 -311 -184 349 214 1 -223 -502 -218 -415 112 217 171 -9
7101 -9 -407 -440 -359 -62 232 108 -178 -209 -185 -363 -230 61 70 453 54 -232 -474 -346 -221 69 246 384 71
7124 71 -61 -646 -83 -61 31 275 -26 -450 -129 -284 -325 -197 -194 226 -28 -216 -378 -365 -334 581 -114 175 -76
7147 -76 -374 -651 -229 17 -206 113 74 -379 -449 -426 -22 11 170 93 -91 -179 -695 6 118 186 308 190 -21
$$ packed form
6990b27N5K57o6j3j99q5r1l6L98M59l96K58m85l62K92j00K55J36K91p07k2O2j29
7013d55K62M81j9j15k59k96KJ96K68j33K48m59o6j27%n3P31j28j03k27m32K26
7035d58J17J06J96j3J59n88l82L95R0J02M4J10j17l4j77J07o7M54K59m04m53N0
7057e04K11O3n2K57r3j1j82j72J75Q8L39j66L15m40j92l44K78L94J50J0m3k71
7079a90k67K83j42O81j3Qo66J47j73K1J27N33j35k13k24k79K84j97N27J05m6j80
7101il98l3Q1K97K94j24k86l1K4j78J33K91RL83l99k86k42J28J25K90J77J38l13
7124G1j32n85N63K2R2K44l01m24L21j55m1J28LM20k54j88j62J3L1R15o95K89k51
7147g6k98k77M22K46k23L19l9m53p0K3M04L3J59p7j84q8n16P01J12O8J22j18k11
$$ plain form
7170 -21 -395 -377 -320 70 395 -22 -159 -256 -596 -218 51 -37 466 257 -115 -120 -478 -248 89 24 288 184 -282
7193 -282 -178 -299 137 -103 239 115 -27 -156 -328 -107 -37 267 -91 117 -311 198 -59 97 233 428
7213 428 254 -22 -480 -675 -371 163 370 228 163 131 26 -238 332 290 231 282 252 -56 -336 -199 -149 123
7235 123 555 308 -92 183 -119 -121 19 250 292 105 374 -263 63 54 32 566 522 -32 179 -46 -358 -30
7257 -30 400 118 184 -39 -121 -125 -330 51 381 344 389 -111 -73 -268 -254 347 71 9 -145 -153 -161 -131 -84 102 267
7282 267 97 81 -211 -218 -93 -339 243 193 -250 118 -113 -498 -120 365 146 361 -26 -307 -307 -185 168 -25
7304 -25 48 73 -160 -72 -85 29 326 180 -69 22 -104 -351 -88 132 -6 278 151 -102 -515 -236 -62 77
7326 77 448 542 70 -264 -124 -259 -73 181 441 147 -16 -239 -467 -120 318 243 51 180 109 -423 -317
$$ packed form
7170b1l74J8N7L90L25m17j37r7l40L78K69q8N03k09l72nl58K30L37o5K64j04m66
7193b82J04j21M36k40L42j24j42j29j72K21P0L04l58K08m28N09k57J56J36J95
7213D28j74k76m58j95L04N34K07j42o5l2j05k64N70m2n9N1l0l08k80J37N0K72
7235A23M32k47m00K75l02kJ40K31M2j87K69o37L26rk2N34m4n54K11k25l12L28
7257c0M30k82O6k23q2mk05L81L30l7M5n00L8j95J4O01k76o2j54qqL0M7J86J65
7282B67j70j6k92pJ25k46N82n0m43L68k31l85L78M85k19K15l87k81%J22L53j93
7304b5P3K5k33Q8j3J14K97j46k49R1j26k47K63K20j38K84j27k53m13K79J74J39
7326G7L71R4m72l34J40j35J86K54K60k94j63k23k28L47M38p5j92J29p1n32J06
$$ plain form
7347 -317 -220 393 177 335 -200 -178 -424 -117 -240 99 194 119 -178 -478 -181 -432 56 83 -167 -118 -363 -633
7369 -633 -281 -131 -53 157 128 67 -271 -422 -143 -57 367 -97 -212 -280 -432 -298 -287 -236 -215 317 -96 -176 -554
7392 -554 -13 16 306 306 -90 -131 -122 -372 -28 23 361 438 -64 68 -117 -227 207 321 162 30 -70 -223 -297
7415 -297 -65 329 235 582 20 -236 48 -185 -75 206 501 69 48 -221 -173 -113 -144 216 117 359 87 -221
7437 -221 76 -1 81 489 529 38 333 -165 42 154 492 391 531 39 65 -177 114 244 394 285 -72
7458 -72 155 -82 182 434 293 391 215 201 201 193 -240 234 410 216 521 89 292 66 -89 231 429 462 168
7481 168 138 -270 -26 227 415 337 180 -14 106 -31 52 501 397 311 190 -228 -74 -164 266 207 363 363 -74
7504 -74 -117 -326 -162 230 422 225 561 172 215 -104 83 172 205 285 -36 16 -128 169 -173 421 354 4 73
$$ packed form
7347c17R7O13k16J58n35K2k46L07j23L39R5p5k97l00K97k51M88K7k50M9k45k70
7369f33L52J50P8K10k9o1l38j51K79Q6M24m64j15o8j52J34J1N1K1N32m13q0l78
7392e54N41K9K90%l96m1Rk50L44N1L38P7n02J32j85j10M34J14j59j32j00j53p4
7415b97K32L94r4L47n62k56K84k33J10K81K95m32k1k69M8O0l1L60r9K42k72l08
7437b21K97p7Q2M08M0m91K95m98K07J12L38j01J40m92K6k42K91J30J50j09l57
7458g2K27k37K64K52j41R8j76j4%qm33M74J76j94L05m32K03k26j55L20J98L3k94
7481A68l0m08K44K53J88p8j57j94J20j37Q3M49j04q6j21m18J54r0M30n9J56%m37
7504g4m3k09J64L92J92j97L36l89M3l19J87Q9L3Q0l21N2j44K97l42N94o7l50O9
$$ plain form
7527 73 -134 -34 294 37 301 172 151 -59 -168 -37 207 230 192 414 310 -270 9 -436 358 181 160 260
7549 260 26 -329 -131 50 262 309 45 -1 -248 -51 -32 160 306 436 71 -109 -468 -482 -17 -114 323 149
7571 149 59 -125 -456 -26 58 307 90 406 231 -107 -132 -37 183 205 128 61 -37 -284 -287 158 90 493 276 209
7595 209 40 -103 153 228 399 515 194 -137 172 -242 166 322 172 387 149 -5 -197 7 72 304 272
7616 272 249 -127 -213 -42 -267 -3 21 -6 41 -170 -296 -85 -250 28 424 179 325 -199 -233 -44 -250 31
7638 31 106 121 -129 -227 -372 -293 182 163 360 171 -171 -207 -241 211 100 293 41 238 -351 -354 -115 -106 457 236
7662 236 246 -37 -90 -75 185 158 -15 303 -19 -406 -242 -649 -4 -53 258 117 -166 -647 -171 -218 -85 180
7684 180 -31 -13 -315 -202 -154 -103 -88 -14 99 -152 -514 -432 -420 36 221 101 21 -390 -531 -739 -482 169 -66
$$ packed form
7527G3k07J00L28k57K64j29k1k10j09J31K44K3l8K22j04n80K79m45P94j77k1J00
7549B60k34l55J98J81K12M7k64m6k47J97J9J92J46J30l65j80l59j4M65r7M37j74
7571A49r0j84l31M30Q4K49k17L16j75l38k5R5K20K2p7o7r8k47lM45o8M03k17o7
7595B09j69j43K56P5J71J16l21l31L09m14M08J56j50K15k38j54j92K04O5K32l2
7616B72k3l76q6J71k25K64K4k7M7k11j26K11j65K78L96k45J46n24l4J89k06K81
7638C1P5J5k50r8j45P9M75j9J97j89l42l6l4M52j11J93k52J97n89lK39RN63k21
7662B36J0k83n3J5K60k7j73L18l22l87J64m07O45m9L11j41k83m81M76m7J33K65
7684A80k11J8l02J13M8N1J5P4J13k51l62Q2J2M56J85j20q0m11j41k08K57O51k35
$$ plain form
7707 -66 -234 -278 -128 -644 -266 -241 -163 189 -354 -44 -593 -255 -622 -280 328 -161 -128 -607 -687 -227 -421 -133
7729 -133 -140 -284 -496 -320 -545 -266 -397 -70 -68 -155 -280 -572 -607 -181 -165 -224 -129 -24 -301 -788 -680 -154 -234
7752 -234 -202 7 -217 -570 -559 -312 -158 50 -272 -136 -633 -645 -345 -78 -163 -136 -103 -452 -440 -190 -670 -70
7774 -70 198 -87 -58 -590 -375 -283 -192 -15 125 160 -268 -428 -326 -540 -19 174 487 234 -273 -431 -309 -224
7796 -224 172 257 193 -67 -85 -416 -134 52 83 82 -191 96 -320 -266 -317 -130 274 239 80 -15 -225 -45 -51 -22
7820 -22 215 97 40 -69 -454 -221 22 245 198 146 188 -250 -40 -1 52 437 369 194 149 -212 188 193 361 414
7844 414 482 107 -174 -171 -56 85 396 663 79 -45 -132 -183 505 443 428 459 178 187 128 -32 44 329 637 314
7868 314 -22 1 -147 -78 224 422 477 120 104 -35 104 219 84 493 561 194 -85 -338 -268 41 379 463
$$ packed form
7707f6j68m4J50n16L78K5P8L52n43L10n49L38l67L42O08m89L3m79q0M60j94K88
7729a33pj44k12J76k25K79j31L27Kq7j25k92l5M26J6n9R5J05k77m87J08N26q0
7752b34L2K09k24l53J1K47J54K08l22J36m97j2L00K67q5K7L3l49J2K50m80O00
7774g0K68k85K9n32K15R2R1J77J40L5m28j60J02k14N21J93L13k53n07j58J22Q5
7796b24L96Q5o4k60j8l31K82J86L1jk73K87m16N4n1J87M04l5j59r5k10J80oK9
7820b2K37j18n7j09l85K33K43K23m7n2M2m38K10L9N3L85o8j75m5l61M00NJ68N3
7844D14O8l75k81LJ15J41L11K67n84j24q7n1O88o2j5L1k81Rn9j60P6K85L08l23
7868C14l36K3j48O9L02J98N5l57j6j39J39J15j35M09O8l67k79k53P0L09L38Q4
$$ plain form
7890 463 287 -159 -60 -292 -262 376 605 371 95 111 -62 -391 2 511 136 173 -76 -417 -320 -259 260 308
7912 308 360 365 -124 -350 -105 27 110 536 263 -105 -261 -221 -31 132 437 57 163 -83 -142 -310 -74 518
7934 518 443 245 -35 307 -204 -310 87 342 -13 200 400 -133 29 -165 467 237 458 225 -103 -286
7954 -286 -7 -117 326 278 637 410 -51 -17 -28 93 269 366 386 70 91 3 162 385 251 348 156 126 129 185
7978 185 149 386 553 50 -77 73 -293 216 294 112 388 316 -62 154 135 236 310 444 440 193 178 -105 66
8001 66 171 333 436 328 -110 -124 16 151 484 510 464 153 92 -129 21 263 309 440 348 1 -33 -273 -70
8024 -70 131 417 558 152 226 -109 -12 80 308 327 334 264 131 -33 -286 199 145 519 149 397 35 -723 657
8047 657 5 -235 -47 -212 -70 -30 -186 362 158 417 482 384 -468 102 16 80 548 483 259 -235 -377 88
$$ packed form
7890D63j76m46R9k32L0O38K29k34k76J6j73l29L93N09l75L7k49l41R7O1N19M8
7912C08N2Nm89k26K45J32Q3M26k73l68j56M0J90J63L05l80J06k46n9j68K36N92
7934E18p5j98k80L42n11j06L97K55l55K13K00n33J62j94O32k30K21k33l28j83
7954b86K79j10M43m8L59k27m61L4j1J21J76R7K0l16K1q8J59K23j34R7j92l0LN6
7978A85l6K37J67n03j27J50l66N09P8j82K76p2l78K16j9J01P4J34mk47j5k83J71
8001F6J05J62J03j08m38j4J40J35L33K6m6l11o1k21J50K42M6J31r2l47l4k40K03
8024g0K01K86J41m06P4l35R7R2K28J9Pp0j33j64k53M85n4L74l70K48l62p58J380
8047F57o52k40J88j65J42M0j56N48k04K59O5r8q52N70q6O4M68o5k24m94j42M65
$$ plain form
8069 88 102 276 359 270 -29 -79 -316 20 77 196 444 -33 81 -144 -382 51 185 158 146 -21 -106 44 -291
8092 -291 202 109 -167 -206 21 -79 -445 -179 27 145 242 88 -18 -98 -265 -96 -147 413 62 -159 -163 -219 -186
8115 -186 95 -156 -52 -71 112 -355 -341 71 166 652 71 32 -466 -556 -245 -359 124 95 -111 -254 -505 -366
8137 -366 -512 -57 195 -43 -265 -311 -213 -597 -326 -223 207 -105 -293 -254 -430 -577 -189 275 85 -403 -340
8158 -340 -656 -464 -219 84 476 -123 -59 -531 -459 -508 -126 80 141 -137 -194 -453 -491 -506 -45 90 -95 -244
8180 -244 -167 -446 -408 -161 48 -242 -101 -654 -398 -480 -400
$$ packed form
8069H8J4J74Q3q9k99n0k37L36N7J19K48m77J14k25k38M33J34k7j2j67q5J50l35
8092b91M93r3k76l9K27j00l66K66K06J18R7j54j06q0j67J69n1N60l51k21mn6L3
8115a86K81k51J04j9J83m67J4M12R5M86n81l9m98r0L11j14M83k9k06j43k51J39
8137c66j46M55K52k38k22m6R8l84K71J03M30l12j88L9j76j47L88M64j90m88O3
8158c40l16J92K45L03L92n99O4m72P2m9L82K06O1k78n7k59l8j5M61J35j85j49
8180b44P7k79L8K47K09k90J41n53K56q2Q0
8191d00
$$ Imaginary data points
##PAGE= N=2
##DATA TABLE= (X++(I..I)), XYDATA
$$ plain form
0 0 0 0 0 -8 8 -8 16 -16 24 -25 35 -41 57 -65 83 -98 121 -140 171 -195 234 -265 314 -359 414 -472 541
27 541 -610 699 -780 886 -992 1114 -1244 1392 -1545 1725 -1909 2122 -2352 2604 -2881 3194
43 3194 -3529 3918 -4343 4830 -5379 6012 -6749 7624 -8666 9961 -11587 13729 -16674
56 -16674 21010 -28061 41541 -76910 371681 974680 722309 561886 348028 388597 527789
67 527789 784556 914284 907364 703692 492558 369665 460124 663632 877559 935033 831628
78 831628 610622 433340 390223 528193 741848 903340 888746 718455 494390 369832
88 369832 408474 586146 778710 868094 786488 583649 382372 314773 418535 620742 779176
99 779176 790015 643254 430578 279191 279662 428545 625628 735044 676643 481744 275465
$$ packed form
0@%%%qJ6j6K4l2M0m9O0p6R8j22J48j81K19k61L11l66M29m99N79o73P73q86J013
27E41j151J309j479J666j878K106k358K636k937L270l634M031m474M956n485O075
43C194o723P447q261R173j0209J1391j2761J4373j6290J8627k1548K5316l0403
56a6674L7684m9071O9602j18451M48591O02999k52371j60423k13858M0569J39192
67E27789K56767J29728o920k03672k11134j22893R0459K03508K13927N7474j03405
78H31628k21006j77282m3117J37970K13655J61492j4594j70291k24065j24558
88C69832L8642J77672J92564Q9384q1606k02839k01277o7599J03762K02207J58434
99G79176J0839j46761k12676j51387M71J48883J97083J09416n8401j94899k06279
$$ plain form
110 275465 184313 258324 439828 606320 645782 525890 314187 140835 113457 244475 439042
121 439042 561549 526427 353087 148161 34194 76081 241670 419134 485237 388456 186368
132 186368 6317 -40700 65887 248736 385080 383554 240019 40018 -92865 -76448 73555
143 73555 254173 340656 274849 97959 -79906 -149916 -72810 98350 250448 281735 167891
154 167891 -20630 -162815 -169545 -40845 135520 244004 214535 64704 -111784 -203307 -152212
165 -152212 8015 171623 229829 144568 -27259 -175262 -205568 -100784 71664 201074
175 201074 203405 76620 -97745 -204911 -175405 -28836 138653 220041 164569 9800 -144520
186 -144520 -197933 -114669 52541 196680 224869 120421 -47280 -167434 -161851 -34382 134200
$$ packed form
110B75465r1152P4011J81504J66492L9462j19892k11703j73352k7378J31018J94567
121D39042J22507l5122j73340k04926j13967M1887J65589J77464O6103r6781k02088
132A86368j80051m7017J06587J82849J36344j526j43535k00001j32883J6417J50003
143G3555J80618Q6483o5807j76890j77865p0010P7106J71160J52098L1287j13844
154A67891j88521j42185o730J28700J76365J08484k9469j49831j76488r1523N1095
165a52212J60227J63608N8206q5261j71827j48003l0306J04784J72448J29410
175B01074K331j26785j74365j07166K9506J46569J67489Q1388n5472j54769j54320
186a44520n3413Q3264J67210J44139K8189j04448j67701j20154N583J27469J68582
$$ plain form
197 134200 237110 210140 71251 -89035 -164222 -104871 51987 205269 257173 176284 17895
208 17895 -115466 -137207 -32045 133827 254316 253080 131368 -30192 -125146 -92288 47619
219 47619 203643 277173 222484 75528 -68788 -115957 -35817 121435 253033 274221 172418
230 172418 15312 -95930 -90165 27778 181563 273081 241600 107948 -41738 -110905 -55526
241 -55526 87129 222622 263748 183520 33563 -90668 -111403 -15410 133369 237271 226844
252 226844 108289 -43206 -130411 -100005 25870 164137 224459 165298 22083 -114209 -157281
263 -157281 -81595 60968 175462 185399 83094 -67592 -172349 -166148 -55308 86252 164743
274 164743 125798 -7912 -151452 -214171 -159213 -25068 98436 130629 47419 -99830 -218745
$$ packed form
197A34200J02910k6970j38889j60286p5187N9351J56858J53282N1904q0889j58389
208A7895j33361k1741J05162J65872J20489j236j21712j61560r4954L2858J39907
219D7619J56024P3530n4689j46956j44316m7169Q0140J57252J31598K1188j01803
230A72418j57106j11242N765J17943J53785R1518l1481j33652j49686o9167N5379
241e5526J42655J35493M1126q0228j49957j24231k0735R5993J48779J03902j0427
252B26844j18555j51495q7205L0406J25875J38267O0322n9161j43215j36292m3072
263a57281P5686J42563J14494R937j02305j50686j04757O201J10840J41560P8491
274A64743l8945j33710j43540o2719N4958J34145J23504L2193q3210j47249j18915
$$ plain form
285 -218745 -234558 -139198 2239 95951 77966 -40797 -184448 -264499 -231955 -109736 20648
296 20648 73551 11418 -127175 -254017 -288287 -211126 -76004 28273 33333 -65255 -206147
307 -206147 -299931 -287855 -178789 -45583 23617 -17698 -142033 -270201 -321180 -263863 -137199
318 -137199 -22881 4147 -75281 -209842 -313062 -318118 -223411 -91215 -7479 -26485 -134366
329 -134366 -263667 -330120 -291812 -172120 -50019 -4135 -64313 -191057 -300711 -323259 -245088
340 -245088 -115476 -17120 -13764 -107194 -236641 -317403 -296207 -186302 -59326 3656 -36475
351 -36475 -152741 -269187 -310226 -248464 -121501 -11728 10497 -67505 -194352 -286164 -282402
362 -282402 -185629 -57341 21365 888 -103952 -224597 -281089 -234971 -115589 187 39192
$$ packed form
285b18745j5813R5360J41437R3712j7985j18763j43651q0051L2544J22219J30384
296B0648N2903o2133j38593j26842l4270P7161J35122J04277N060r8588j40892
307b06147r3784J2076J09066J33206O9200m1315j24335j28168n0979N7317J26664
318a37199J14318K7028p9428j34561j03220n056R4707J32196Q3736j9006j07881
329a34366j29301o6453L8308J19692J22101M5884o0178j26744j09654k2548P8171
340b45088J29612R8356L356r3430j29447q0762K1196J09905J26976O2982m0131
351c6475j16266j16446m1039O1762J26963J09773K2225p8002j26847r1812L762
362b82402R6773J28288P8706k0477j04840j20645n6492M6118J19382J15776L9005
$$ plain form
373 39192 -21824 -141354 -240219 -254769 -173632 -48419 42052 39689 -51995 -171134 -238934 -210492
385 -210492 -104451 12503 66562 24350 -84630 -189257 -220041 -155905 -37380 60129 74452
396 74452 -817 -115328 -194129 -185272 -93396 23199 91691 68041 -31226 -139848 -185724 -138657
408 -138657 -27591 75623 107076 47492 -63401 -153321 -162432 -83178 33774 114347 106365
419 106365 17211 -94391 -154879 -124075 -21085 88576 135128 89817 -17637 -116538 -140849
430 -140849 -74190 40992 130261 137372 59712 -51894 -124076 -109801 -16440 95463 154613
441 154613 123428 23850 -78557 -116631 -65280 42115 137051 159443 96417 -10861 -91795
452 -91795 -93616 -14243 94349 163756 149308 61826 -40928 -92259 -59184 37805 136758 173816
$$ packed form
373C9192o1016j19530r8865j4550Q1137J25213R0471k363r1684j19139o7800K8442
385b10492J06041J16954N4059m2212j08980j04627l0784O4136J18525R7509J4323
396G4452p5269j14511p8801Q857R1876J16595O8492k3650r9267j08622m5876M7067
408a38657J11066J03214L1453n9584j10893q9920r111P9254J16952Q0573p982
419A06365q9154j11602o0488L0804J02990J09661M6552m5311j07454r8901k4311
430a40849O6659J15182Q9269P111p7660j11606p2182J4275R3361J11903N9150
441A54613l1185r9578j02407l8074N1351J07395R4936K2392o3026j07278q0934
452i1795j821P9373J08592O9407j4448q7482j02754n1331L3075R6989R8953L7058
$$ plain form
464 173816 126243 25105 -62642 -80192 -15934 88488 166292 168401 93323 -9835 -74045
475 -74045 -56888 30815 132394 182192 148736 53981 -39768 -71889 -21634 79404 165779 181344
487 181344 116420 13575 -60495 -57695 20782 123083 183308 163001 75700 -22137 -68260 -31546
499 -31546 63555 155535 184098 131744 31826 -50258 -62038 3062 103154 173182 168092 90769
511 90769 -8862 -66887 -45615 40104 134183 175764 138216 45420 -42886 -70486 -20050 75421
523 75421 154101 163921 98306 52 -68123 -62745 11455 106495 160335 137718 53543 -39417
535 -39417 -80496 -43924 45985 129819 152688 100010 5747 -70706 -79897 -16623 77056 140267
547 140267 131461 55748 -38326 -89380 -66509 15677 102357 137527 98055 8757 -73109 -94930
$$ packed form
464A73816m7573j01138q7747j7550O4258J04422P7804K109p5078j03158o4210
475g4045J7157Q7703J01579M9798l3456r4755r3749l2121N0255J01038Q6375J5565
487A81344o4924j02845p4070K800P8477J02301O0225k0307q7301r7837m6123L6714
499c1546R5101R1980K8563n2354r9918q2084j1780O5100J00092P0028n090p7323
511I0769r9631n8025K1272Q5719R4079M1581l7548r2796q8306k7600N0436R5471
523G5421P8680R820o5615r8254o8175N378P4200R5040N3840k2617q4175r2960
535c9417m1079L6572Q9909Q3834K2869n2678r4263p6453r191O3274R3679O3211
547A40267q806p5713r4074n1054K2871Q2186Q6680L5170l9472q9298q1866k1821
$$ plain form
559 -94930 -43451 47783 118370 122544 57508 -34923 -95383 -85908 -13176 76077 123059 97239
571 97239 14613 -70933 -104914 -65171 21675 99226 117232 64323 -26032 -95915 -99827 -35487
583 -35487 54852 112987 100898 26366 -61932 -107223 -80729 521 84099 115864 75166 -11307
595 -11307 -87922 -104838 -50916 38142 104964 106097 42091 -46369 -101406 -88146 -14481 71606
607 71606 114368 86193 6666 -73332 -101227 -59715 24112 96618 111259 58566 -26385 -88560
619 -88560 -88105 -24365 60653 112497 97697 26934 -53801 -92614 -64295 13371 90333 116872
631 116872 75906 -5164 -73762 -85262 -32335 50741 110733 109408 47089 -35352 -84924 -68786
643 -68786 2557 82720 120361 90546 13163 -61337 -85489 -43651 37844 105546 115639 61669
$$ packed form
559i4930N1479R1234P0587M174o5036r2431o0460R475P2732Q9253M6982k5820
571I7239q2626q5546l3981L9743Q6846P7551J8006n2909r0355o9883l912O4340
583c5487R0339N8135j2089p4532q8298m5291K6494Q1250Q3578L1765m0698q6473
595a1307p6615j6916N3922Q9058O6822J133o4006q8460n5037J3260P3665Q6087
607G1606M2762k8175p9527p9998k7895M1512Q3827P2506J4641n2693q4951o2175
619h8560M55O3740Q5018N1844j4800p0763q0735l8813K8319P7666P6962K6539
631A16872m0966q1070o8598j1500N2927Q3076N9992j325o2319q2441m9572J6138
643f8786P1343Q0163L7641k9815p7383p4500k4152M1838Q1495O7702J0093n3970
$$ plain form
655 61669 -21334 -80343 -76888 -13254 68745 115757 97724 26044 -53514 -88794 -58539 18377
667 18377 91066 112361 68277 -12898 -78445 -87054 -33383 46720 101513 94959 31250 -49178
679 -49178 -94107 -75844 -6402 67906 98729 66032 -9330 -79608 -99671 -57533 18873 78998
691 78998 83661 29606 -49113 -102356 -96161 -36012 38716 78780 57811 -11013 -84687 -115813
703 -115813 -84932 -13326 51994 67624 23726 -52559 -113075 -118968 -67255 7479 57098 47703
715 47703 -15250 -90554 -131319 -111539 -44353 25443 52768 18529 -54785 -121579 -138392 -95050
727 -95050 -19999 36876 38617 -15855 -92558 -141413 -132098 -71082 2011 38879 15902 -53051
739 -53051 -123362 -149546 -115496 -44004 18779 31537 -13332 -87670 -143127 -144358 -90992 -17527
$$ packed form
655F1669q3003n9009L455O3634Q1999M7012j8033p1680p9558l5280L0255P6916
667A8377P2689K1295m4084q1175o5547q609N3671Q0103N4793o554o3709q0428
679d9178m4929J8263O9442P4308L0823l2697p5362p0278k0063M2138P6406O0125
691G8998M663n4055p8719n3243O195O0149P4728M0064k0969o8824p3674l1126
703a15813L0881P1606O5320J5630m3898p6285o0516n893N1713P4734M9619r395
715D7703o2953p5304m0765J9780O7186O9796K7325l4239p3314o6794j6813M3342
727i5050P5051N6875J741n4472p6703m8855R315O1016P3093L6868k2977o8953
739e3051p0311k6184L4050P1492O2783J2758m4869p4338n5457j231N3366P3465
$$ plain form
751 -17527 27929 15827 -45201 -116253 -151407 -127826 -61969 4624 28117 -5630 -75336 -135545
763 -135545 -147284 -102904 -32132 20690 20566 -30654 -101159 -143782 -131897 -72609 -3896 29816
775 29816 7421 -56119 -119839 -141397 -107298 -39446 19176 31005 -11507 -80275 -130283 -128732
787 -128732 -76163 -6204 36257 23948 -34170 -100209 -131315 -106348 -40818 22545 43991 9375
799 9375 -58050 -113962 -121662 -75480 -5447 43950 41425 -11272 -79025 -118000 -101842 -41263 24969
812 24969 54943 29329 -34589 -94633 -111613 -74793 -7751 47216 54489 10024 -56810 -102073
824 -102073 -96937 -44068 22638 60213 44778 -12596 -74745 -101204 -74950 -12389 45950 62487
836 62487 27738 -35993 -87241 -92503 -48265 16711 61407 56683 6274 -57060 -91928 -75675
$$ packed form
751a7527M5456j2102o1028p1052l5154K3581O5857O6593K3493l3747o9706o0209
763a35545j1739M4380P0772N2822j24n1220p0505m2623J1885N9288O8713L3712
775B9816k2395o3540o3720k1558L4099O7852N8622J1829m2512o8768n0008J551
787a28732N2569O9959M2461j2309n8118o6039l1106K4967O5530O3363K1446l4616
799I375o7425n5912p700M6182P0033M9397k525n2697o7753l8975J6158O0579O6232
812B4969K9974k5614o3918o0044j6980L6820O7042N4967P273m4465o6834m5263
824a02073N136N2869O6706L7575j5435n7374o2149k6459K6254O2561N8339J6537
836F2487l4749o3731n1248n262M4238O4976M4696m724n0409o3334l4868J6253
$$ plain form
848 -75675 -18556 42303 68101 42303 -18401 -74064 -88640 -52427 11340 61361 65526 21791
860 21791 -41811 -83691 -76319 -24544 38169 71587 54279 -2051 -61492 -84331 -56477 4794
872 4794 59598 72390 35663 -26984 -74267 -76446 -31364 32030 72384 64546 13059 -48188 -79074
885 -79074 -60173 -3118 55002 76800 48729 -10530 -62848 -74375 -36951 24863 71951 73387
897 73387 28657 -31997 -70276 -60320 -9348 50974 81214 62516 6554 -48503 -68364 -39225
909 -39225 19821 71377 81818 45407 -14418 -57951 -57382 -12560 47403 84117 74506 24235 -32482
922 -32482 -59304 -38693 16519 70346 88784 60083 3129 -44835 -52382 -14815 43639 86077
934 86077 84360 40738 -16286 -50251 -38539 11591 67771 94141 73718 19535 -31960 -48124
$$ packed form
848g5675N7119O0859K5798k5798o0704n5663j4576L6213O3767N0021M165m3735
860B1791o3602m1880P372N1775O2713L3418j7308n6330n9441k2839K7854O1271
872D794N4804J2792l6727o2647m7283k179M5082O3394M0354p838n1487o1247l0886
885g9074J8901N7055N8120K1798k8071n9259n2318j1527L7424O1814M7088J436
897G3387m4730o0654l8279R956N0972O0322L0240j8698n5962n5057j9861K9139
909c9225N9046N1556J0441l6411n9825m3533N69M4822N9963L6714r611n0271n6717
922c2482k6822K0611N5212N3827J8438k8701n6954m7964p547L7567N8454M2438
934H6077j717m3622n7024l3965J1712N0130N6180K6370k0423n4183n1495j6164
$$ plain form
946 -48124 -18463 38681 85992 93269 55693 -2105 -42352 -39174 5969 63339 96741 83814
958 83814 34049 -21259 -45399 -23273 31347 83167 98082 67271 10196 -35522 -40556 -1669
970 -1669 55905 94926 90133 45149 -11602 -42535 -28686 21702 75121 97490 73892 20128
982 20128 -29049 -41975 -10588 44154 87336 91083 52630 -2668 -39444 -33989 9845 63199
994 63199 92299 77687 29154 -21982 -42701 -19996 31219 77856 89836 59222 5701 -35709
1006 -35709 -39258 -2027 51877 87223 81137 37351 -15444 -43677 -28909 19614 69851 89268
1018 89268 65607 13849 -32645 -43473 -11622 41828 83071 84557 45697 -7978 -42567 -34862
1030 -34862 10134 62643 88945 72430 23330 -26416 -43931 -18298 33772 78845 87787 54896
$$ packed form
946d8124K9661N7144M7311P277l7576n7798m0247L178M5143N7370L3402j2927
958H3814m9765n5308k4140K2126N4620N1820J4915l0811n7075m5718n034L8887
970a669N7574L9021m793m4984n6751l0933J3849N0388N3419K2369k3598n3764
982B0128m9177j2926L1387N4742M3182L747l8453n5298l6776N455M3834N3354
994F3199K9100j4612m8533n1136k0719K2705N1215M6637J1980l0614n3521m1410
1006c5709l549L7231N3904L5346o086m3786n2795k8233J4768M8523N0237J9417
1018H9268k3661n1758m6494j0828L1851N3450M1243J486l8860n3675l4589P705
1030c4862M4996N2509K6302j6515m9100m9746j7515K5633N2070M5073Q942l2891
$$ plain form
1042 54896 1915 -36708 -36283 2925 55706 87776 78598 34579 -15584 -39664 -21846 26244
1054 26244 73419 89818 64391 14784 -27262 -34605 -2421 48562 85625 85079 47112 -3004
1066 -3004 -33201 -23658 19463 68158 91523 73771 27565 -17980 -32774 -7403 41843 82938
1078 82938 89708 57618 7622 -28086 -25949 12264 62307 90877 80656 37123 -10681 -32054
1090 -32054 -13455 33497 78081 91550 64396 15307 -24716 -29872 3363 52953 86940 82663
1102 82663 43398 -5944 -33445 -21343 21651 68134 87439 66980 19715 -23749 -36103 -8787
1114 -8787 39262 76699 79727 45304 -4201 -36443 -32417 5861 53152 77939 64424 20605
1126 20605 -25233 -44021 -24389 20819 61682 71461 43645 -3860 -41562 -44524 -12291 34101
$$ packed form
1042E4896n2981l8623M25L9208N2781L2070r178m4019n0163k4080J7818M8090
1054B6244M7175J6399k5427m9607m2046p343L2184N0983L7063n46l7967n0116
1066c004l0197R543M3121M8695K3365j7752m6206m5545j4794K5371M9246M1095
1078H2938O770l2090m9996l5708K137L8213N0043K8570j0221m3533m7804k1373
1090c2054J8599M6952M4584J3469k7154m9089m0023n156L3235M9590L3987m277
1102H2663l9265m9342k7501J2102M2994M6483J9305k0459m7265m3464j2354K7316
1114h787M8049L7437L028l4423m9505l2242M026L8278M7291K4787j3515m3819
1126B0605m5838j8788J9632M5208M0863R779k7816m7505l7702k962L2233M6392
$$ plain form
1138 34101 64532 58560 19762 -27588 -52489 -40075 1104 44164 60696 39624 -5983 -46608
1150 -46608 -57431 -30548 14809 49298 50265 16458 -30242 -60633 -55152 -17628 26932 49164
1162 49164 34298 -8144 -51248 -67599 -46495 -2764 35778 42857 14392 -31998 -66481 -66853
1174 -66853 -33068 11789 39815 31480 -7795 -52283 -74011 -58655 -16777 24347 38043 15263
1186 15263 -29424 -67200 -73340 -44703 309 32485 31611 -2808 -47832 -74528 -65838 -27316 15609
1199 15609 36050 20098 -21666 -61558 -74391 -51907 -8220 27909 33725 5829 -37795 -69003
1211 -69003 -67147 -33444 9760 36018 27257 -10318 -51166 -70062 -53754 -12455 26710 38751
1223 38751 16448 -25333 -60096 -63939 -35210 8204 38851 36288 3222 -38480 -62072 -51544
$$ packed form
1138C4101L0431n972l8798m7350k4901J2414M1179M3060J6532k1072m5607m0625
1150d6608j0823K6883M5357L4489R67l3807m6700l0391N481L7524M4560K2232
1162D9164j4866m2442m3104j6351K1104M3731L8542P079k8465m6390l4483l72
1174f6853L3785M4857K8026q335l9275m4488k1728J5356M1878M1124J3696k2780
1186A5263m4687l7776o140K8637M5012L2176q74l4419m5024k6696Q690L8522M2925
1199A5609K0441j5952m1764l9892j2833K2484M3687L6129N816k7896m3624l1208
1211f9003J856L3703M3204K6258q761l7575m0848j8896J6308M1299L9165J2041
1223C8751k2303m1781l4763l843K8729M3414L0647k563l3066m1702k3592J0528
$$ plain form
1235 -51544 -13586 27608 45350 28813 -10897 -48329 -58234 -34312 8338 42200 46272 17581
1247 17581 -24506 -52449 -48255 -14037 28442 51700 41104 3783 -35465 -51310 -33526 7325
1259 7325 44440 54820 31471 -9841 -42175 -44598 -14753 27391 55356 51290 18185 -22897
1271 -22897 -44281 -32419 5027 43866 60157 42232 2752 -32647 -41228 -16840 24408 55922
1283 55922 57960 29062 -11750 -37870 -32466 1491 41490 61864 49915 13118 -23780 -38176
1295 -38176 -19605 19104 53337 60953 36766 -2699 -32583 -33459 -4063 35392 60351 53989 21117
1308 21117 -17394 -36812 -24448 11353 47655 60816 42257 3967 -29409 -35920 -12138 27165
1320 27165 55938 55613 26353 -13222 -37184 -30881 2257 40358 58285 44783 8091 -27701
$$ packed form
1235e1544L7958M1194J7742j6537l9710l7432r905K3922M2650L3862M072k8691
1247A7581m2087k7943M194L4218M2479K3258j0596l7321l9248j5845J7784M0851
1259G325L7115J0380k3349m1312l2334k423K9845M2144K7965m066l3105m1082
1271b2897k1384J1862L7446L8839J6291j7925l9480l5399q581K4388M1248L1514
1283E5922K038k8898m0812k6120N404L3957L9999K0374j1949l6797l6898j4396
1295c8176J8571L8709L4233P616k4187l9465k9884q76K9396L9455K4959o362l2872
1308B1117l8511j9418J2364L5801L6302J3161j8559l8290l3376o511K3782L9303
1320B7165K8773l25k9260l9575k3962O303L3138L8101J7927j3502l6692l5792
$$ plain form
1332 -27701 -40160 -20706 17510 49428 54945 29350 -10241 -38561 -37470 -7565 30971 53694
1344 53694 45172 11258 -26592 -43617 -29485 6608 41133 51405 30606 -7716 -38658 -43059
1356 -43059 -17662 20338 46095 43365 13681 -23966 -45569 -36650 -4510 30984 46090 31445
1368 31445 -3924 -37227 -47016 -27287 8874 38067 41456 16346 -20344 -45963 -43197 -14706
1380 -14706 21387 41799 32824 426 -34554 -49717 -34800 -57 32078 41278 20217 -16143
1392 -16143 -45014 -47940 -22325 14784 39115 34969 5256 -30488 -50081 -39797 -6702 27920
1404 27920 41203 25304 -9931 -41415 -48839 -27340 9490 37193 38535 12386 -23945 -46844
1416 -46844 -41551 -11602 23758 41850 31174 -1664 -34345 -46242 -29407 5049 35296 42155
$$ packed form
1332b7701j2459J9454L8216L1918N517k5595l9591k8320J091K9905L8536K2723
1344E3694q522l3914l7850j7025J4132L6093L4525J0272k0799l8322l0942m401
1356d3059K5397L8000K5757k730k9684l7647k1603Q919L2140L5494J5106j4645
1368C1445l5369l3303r789J9729L6161K9193L389k5110l6690k5619K766K8491
1380a4706L6093K0412q975l2398l4980j5163J4917L4743L2135R200k1061l6360
1392a6143k8871k926K5615L7109K4331m146k9713l5744j9593J0284L3095L4622
1404B7920J3283j5899l5235l1484p424K1499L6830K7703J342k6149l6331k2899
1416d6844N293K9949L5360J8092j0676l2838l2681j1897J6835L4456L0247O859
$$ plain form
1428 42155 21067 -13836 -40250 -40039 -14333 20646 42837 37719 9251 -24656 -41072 -30052
1440 -30052 2262 34360 46207 30364 -2979 -31781 -37339 -15989 18751 44507 44550 19682 -14656
1453 -14656 -35348 -29169 200 33689 49834 38617 7024 -23948 -34334 -16889 16638 44999
1465 44999 49865 28088 -6175 -29793 -28428 -2364 31469 51312 44431 15075 -17031 -31879
1477 -31879 -19080 12471 42841 52056 34493 1339 -25517 -29313 -7194 26262 49470 47274
1489 47274 21173 -11894 -31148 -23525 5431 37012 50583 37696 6177 -23491 -32222 -14500
1501 -14500 17933 43835 46167 23777 -9441 -31706 -29511 -4393 27815 45054 36799 7734
1513 7734 -23339 -36591 -23495 6329 34149 41650 23290 -9042 -34623 -36676 -15442 15864
$$ packed form
1428D2155k1088l4903k6414K11K5706L4979K2191n118k8468l3907j6416J1020
1440c0052L2314L2098J1847j5843l3343k8802n558K1350L4740K5756M3k4868l4338
1453a4656k0692O179K9369L3489J6145j1217l1593l0972j0386J7445L3527K8361
1465D4999M866k1777l4263k3618J365K6064L3833J9843o881k9356l2106j4848
1477c1879J2799L1551L0370R215j7563l3154k6856l796K2119L3456K3208k196
1489D7274k6101l3067j9254P623K8956L1581J3571j2887l1519k9668q731J7722
1501a4500L2433K5902K332k2390l3218k2265K195K5118L2208J7239q255k9065
1513G734l1073j3252J3096K9824K7820P501j8360l2332k5581k053K1234L1306
$$ plain form
1525 15864 36652 33321 7327 -24190 -41413 -33511 -5251 23380 34732 20592 -9560 -37263
1537 -37263 -44739 -26719 4000 27514 28550 6115 -25892 -46396 -42719 -16818 12622 28159
1549 28159 18419 -10045 -39149 -50632 -36503 -6443 19566 24796 5987 -25253 -48745 -49449 -26826
1562 -26826 3837 22900 17763 -8376 -38548 -53189 -43181 -14859 12864 22697 8051 -22006
1574 -22006 -47610 -52079 -33183 -2435 19733 19493 -3357 -33372 -51612 -45871 -20082 8909 23004
1587 23004 12623 -14663 -41814 -50739 -35452 -6149 18337 22881 4033 -25179 -46262 -44957
1599 -44957 -22103 7604 25028 19280 -5506 -33449 -45827 -34747 -7030 19390 28310 13464
1611 13464 -14897 -37859 -41010 -21272 8107 28883 27591 5482 -23073 -38967 -31794 -5965
$$ packed form
1525A5864K0788l331k5994l1517j7223P902K8260K8631J1352j4140l0152k7703
1537c7263p476J8020L0719K3514J036k2435l2007k0504L677K5901K9440J5537
1549B8159r740k8464k9104j1483J4129L0060K6009N230j8809l1240k3492p04K2623
1562b6826L0663J9063n137k6139l0172j4641J0008K8322K7723R833j4646l0057
1574b2006k5604m469J8896L0748K2168k40k2850l0015j8240N741K5789K8991J4095
1587B3004j0381k7286k7151q925J5287K9303K4486M544j8848k9212k1083J305
1599d4957K2854K9707J7424n748k4786k7943j2378J1080K7717K6420Q920j4846
1611A3464k8361k2962l151J9738K9379K0776j292k2109k8555j5894P173K5829
$$ plain form
1623 -5965 22167 34520 23812 -3357 -28453 -35685 -19362 9791 32980 36106 16770 -11735
1635 -11735 -31097 -28516 -5039 23639 39935 33015 7641 -18919 -30245 -18004 9707 34949
1647 34949 42003 26585 -1490 -23501 -25025 -5175 24050 42828 39949 17445 -9833 -24687
1659 -24687 -16687 8548 35127 45658 33718 7512 -16289 -21829 -5984 21514 42526 44033
1671 44033 24989 -2495 -20242 -16706 5642 32429 46468 38443 13754 -10844 -20425 -8615
1683 -8615 17798 41069 45820 30088 3207 -17450 -18335 1588 28343 45567 41785 19102 -6867
1696 -6867 -20457 -12027 12546 37226 46028 33263 7124 -15885 -20325 -3821 23399 43479 42715
1709 42715 22578 -4542 -20843 -16041 7047 32806 44643 35120 9992 -14275 -22204 -8720
$$ packed form
1623e965K8132J2353j0708k7169k5096p232J6323K9153K3189L126j9336k8505
1635a1735j9362K581K3477K8678J6296o920k5374k6560j1326J2241K7711K5242
1647C4949P054j5418k8075k2011j524J9850K9225J8778k879k2504k7278j4854
1659b4687Q000K5235K6579J0531j1940k6206k3801n540J5845K7498K1012J507
1671D4033j9044k7484j7747L536K2348K6787J4039q025k4689k4598r581J1810
1683h615K6413K3271M751j5732k6881k0657q85J9923K6755J7224l782k2683k5969
1696f867j3590Q430K4573K4680Q802j2765k6139k3009m440J6504K7220K0080p64
1709D2715k0137k7120j6301M802K3088K5759J1837r523k5128k4267p929J3484
$$ plain form
1721 -8720 17019 38699 41717 24519 -2131 -20411 -19720 236 26321 41396 35356 12751 -12148
1734 -12148 -23270 -13824 9913 33000 39800 26594 1111 -19438 -22965 -6059 19135 36683
1746 36683 35326 15790 -9255 -24373 -18845 2630 26881 37600 27525 3718 -18416 -25837
1758 -25837 -12402 12337 32423 35043 17715 -7783 -24994 -23143 -3852 20955 34624 28181
1770 28181 5945 -17998 -28233 -17943 5815 27332 33145 18905 -6496 -25923 -27500 -10067
1782 -10067 14923 30831 27884 7397 -17344 -30245 -23355 -769 21924 30752 19617 -4143
1794 -4143 -25179 -30675 -16482 7952 26328 26971 9644 -14888 -30846 -27661 -7774 15509 27845
1807 27845 20349 -1360 -23907 -32645 -21714 1172 21404 25927 11819 -12009 -30012 -30803 -13847
$$ packed form
1721h720K5739K1680L018j7198k6650j8280O91J9956K6085J5075o040k2605k4899
1734a2148j1122R446K3737K3087O800j3206k5483k0549l527J6906K5194J7548
1746C6683j357j9536k5045j5118N528K1475K4251J0719j0075k3807k2134p421
1758b5837J3435K4739K0086K620j7328k5498j7211J851J9291K4807J3669o443
1770B8181k2236k3943j0235J0290K3758K1517N813j4240k5401j9427j577J7433
1782a0067K4990J5908k947k0487k4741j2901O890K2586K2693Q828j1135k3760
1794d143k1036n496J4193K4434J8376O43j7327k4532j5958L185J9887K3283J2336
1807B7845p496k1709k2547q738J0931K2886K0232M523j4108k3828j8003p91J6956
$$ plain form
1820 -13847 9921 24855 21512 1653 -21476 -33342 -25881 -4096 17589 25404 13746 -8604
1832 -8604 -28462 -32508 -18074 5061 22836 22241 5093 -18300 -32828 -28150 -8796 14211 24843
1845 24843 16459 -5090 -25609 -32756 -21292 1472 20563 23520 8893 -13880 -30483 -29927 -11928
1858 -11928 10936 24274 19733 -24 -22118 -32053 -23425 -2112 18302 24831 12678 -9696 -27934
1871 -27934 -30250 -15465 7298 23049 21806 4341 -18039 -31049 -26159 -6633 15077 24512 15879
1884 15879 -5481 -25069 -30850 -18906 2894 20454 22529 7801 -14928 -29814 -28371 -10889
1896 -10889 10388 22582 17407 -2331 -23004 -32193 -23456 -3038 16248 21029 8743 -12534 -29842
1909 -29842 -31891 -17031 4375 18259 15817 -1435 -23061 -34449 -29309 -9908 9464 17658 7813
$$ packed form
1820a3847K3768J4934l343j9859k3129j1866P461K1785K1685P815j1658k2350
1832h604j9858m046J4434K3135J7775n95j7148k3393j4528M678J9354K3007J0632
1845B4843q384k1549k0519p147J1464K2764J9091K957j4627k2773j6603N56J7999
1858a1928K2864J3338m541j9757k2094r935Q628K1313K0414O529j2153k2374j8238
1871b7934k316J4785K2763J5751j243j7465k2380j3010M890J9526K1710R435q633
1884A5879k1360j9588n781J1944K1800J7560K075j4728k2729j4886J443J7482
1896a0889K1277J2194n175j9738k0673r189Q737K0418J9286M781j2286k1277j7308
1909b9842k049J4860K1406J3884k442j7252k1626j1388N140J9401J9372Q194r845
$$ plain form
1922 7813 -12692 -31691 -36255 -24508 -3646 12607 13124 -2307 -24324 -38251 -35949 -18338 1977
1935 1977 12619 5575 -13655 -34164 -41645 -32381 -12321 5980 8956 -4140 -25496 -41756 -42427
1948 -42427 -27216 -6771 6242 2603 -15265 -36028 -46473 -39897 -21159 -2198 4319 -6237
1960 -6237 -26342 -43866 -47933 -35135 -15110 -250 -316 -15706 -36375 -48878 -45865 -28802 -9224
1973 -9224 212 -6774 -25240 -44082 -50696 -40906 -21401 -4642 -1597 -13949 -34183 -48963 -48774
1986 -48774 -33478 -13588 -1415 -4978 -22159 -41282 -50306 -43013 -24121 -6054 -51 -10138 -29757
1999 -29757 -45964 -47762 -34562 -14344 162 -1166 -15764 -35633 -46297 -41709 -23694 -4632
2011 -4632 4105 -3254 -21546 -38906 -43406 -31991 -12264 3685 5932 -7108 -26358 -38657 -37025
$$ packed form
1922G813k0505j8999m564J1747K0862J6253N17j5431k2017j3927K302J7611K0315
1935A977J0642p044j9230k0509p481R264K0060J8301K976j3096k1356j6260o71
1948d2427J5211K0445J3013l639j7868k0763j0445O576J8738J8961O517j0556
1960f237k0105j7524m067J2798K0025J4860o6j5390k0669j2503L013J7063J9578
1973i224R436o986j8466j8842o614R790J9505J6759L045j2352k0234j4780J89
1986d8774J5296J9890J2173l563j7181j9123r024P293J8892J8067O003j0087j9619
1999b9757j6207j798J3200K0218J4506j328j4598j9869j0664M588J8015J9062
2011d632Q737p359j8292j7360m500J1415J9727J5949K247j3040j9250j2299J632
$$ plain form
2024 -37025 -20777 -816 9763 5635 -10978 -28881 -35518 -27337 -8055 9002 13767 3849 -14667
2037 -14667 -29037 -29845 -15650 3680 16647 15522 1253 -17149 -26568 -21015 -3937 14846 22107
2050 22107 14681 -2658 -18200 -21989 -10713 8275 22984 24714 11910 -6098 -17984 -15221 434
2063 434 18986 28757 24091 7791 -9093 -15208 -6904 11204 27752 31658 20728 2677 -10891
2076 -10891 -11178 2555 21323 33110 30417 15379 -2474 -10816 -5070 12240 29100 34835 26176
2089 26176 9004 -6577 -9185 2205 20206 33375 33543 19771 1974 -8880 -5708 9581 27008
2102 27008 35178 29042 12546 -3562 -9578 -798 16499 30971 33421 22293 4704 -8077 -8099
2115 -8099 4792 22021 32360 28978 14073 -3007 -10747 -4705 10664 26386 31475 22472 5307
$$ packed form
2024c7025J6248J9961J0579m128j6613j7903o637Q181J9282J7057M765r918j8516
2037a4667j4370q08J4195J9330J2967j125j4269j8402r419N553J7078J8783P261
2050B2107p426j7339j5542l789J1276J8988J4709J730j2804j8008j1886K763J5655
2063D34J8552R771m666j6300j6884o115Q304J8108J6548L906j0930j8051j3568
2076a0891k87J3733J8768J1787k693j5038j7853q342N746J7310J6860N735q659
2089B6176j7172j5581k608J1390J8001J3169J68j3772j7797j0854L172J5289J7427
2102B7008Q170o136j6496j6108o016Q780J7297J4472K450j1128j7589j2781k2
2115h099J2891J7229J0339l382j4905j7080p740O042J5369J5722N089r003j7165
$$ plain form
2128 5307 -8913 -11365 -321 16138 28692 27852 14773 -2441 -12739 -9241 5349 21628 28908
2141 28908 22448 6166 -9100 -14029 -5139 11410 25034 26649 15340 -2007 -13400 -12124 909
2154 909 17670 27002 22591 7818 -8269 -14729 -8100 7932 22688 26560 17307 819 -12112
2167 -12112 -13262 -1742 14864 26409 24706 11291 -4593 -13509 -9184 5848 21420 28012 21074
2180 21074 5855 -8465 -11622 -2456 13586 26757 27984 16703 367 -9887 -8102 5318 21331
2193 21331 30143 25657 11615 -3285 -8862 -1555 13818 27722 31367 22172 6625 -5022 -5687
2206 -5687 5823 21714 31787 30208 17530 2241 -5247 -866 13806 28307 34173 27022 11754
2219 11754 -1124 -3647 5617 21580 32893 33217 22223 6527 -2753 -286 12019 27470 35004
$$ packed form
2128E307j4220k452J1044J6459J2554q40j3079j7214j0298L498J4590J6279P280
2141B8908o460j6282j5266m929Q890J6549J3624J615j1309j7347j1393J276J3033
2154I09J6761R332m411j4773j6087o460O629J6032J4756L872r253j6488j2931
2167a2112j150J1520J6606J1545j703j3415j5884q916M325J5032J5572O592o938
2180B1074j5219j4320l157R166J6042J3171J227j1281j6336j0254J785J3420J6013
2193B1331Q812m486j4042j4900n577P307J5373J3904L645r195j5547j1647o65
2206e687J1510J5891J0073j579j2678j5289p488M381J4672J4501N866p151j5268
2219A1754j2878k523R264J5963J1313L24j0994j5696r280K467J2305J5451P534
$$ plain form
2232 35004 29904 15956 1438 -3484 4154 19114 31702 34284 24618 8867 -2196 -2457 8748
2245 8748 24159 33587 30457 17297 2533 -4705 433 14121 27758 31941 24254 9176 -3475
2258 -3475 -5810 3481 18469 28911 28005 16494 1337 -7724 -4768 7360 21146 27610 21790 7361
2272 7361 -5963 -10457 -3045 10665 22168 23645 13736 -1014 -11345 -11061 -828 13261 21047
2285 21047 17838 4725 -9092 -15898 -10429 2286 14890 18354 10348 -4043 -15696 -17435 -8497
2298 -8497 5336 14961 13708 2003 -12282 -20437 -17323 -5224 7782 13580 7477 -6377 -18999
2311 -18999 -22878 -15030 -943 9913 10518 503 -13762 -23475 -22120 -10866 2792 10010 5984
2324 5984 -6656 -19939 -25150 -19198 -6168 5728 8607 530 -13136 -24014 -24140 -15015 -1385
$$ packed form
2232C5004n100j3948j4518m922P638J4960J2588K582r666j5751j1063k61J1205
2245H748J5411R428l130j3160j4764p238N138J3688J3637M183p687j5078j2651
2258c475k335R291J4988J0442r06j1511j5157r061K956J2128J3786O464n820j4429
2272G361j3324m494P412J3710J1503J477r909j4750j0331K84J0233J4089P786
2285B1047l209j3113j3817o806N469J2715J2604L464q006j4391j1653j739Q938
2298h497J3833R625j253j1705j4285q155L114J2099J3006N798o103j3854j2622
2311a8999l879P848J4087J0856O05j0015j4265r713J355J1254J3658P218m026
2324E984j2640j3283n211N952J3030J1896K879q077j3666j0878j26R125J3630
$$ plain form
2337 -1385 7385 5984 -5058 -18451 -25390 -21543 -9648 2781 7753 2114 -10724 -22469 -25072
2350 -25072 -17203 -3848 6153 6824 -2214 -16013 -24261 -22296 -11530 1217 8019 4096 -7456
2363 -7456 -19484 -24115 -17905 -4902 6049 8646 619 -12216 -22027 -21987 -12217 672 8892 7189
2377 7189 -3791 -16461 -22393 -18234 -5923 5935 9817 3394 -8734 -19627 -21681 -13032 7
2390 7 9207 8643 -750 -13675 -21282 -18773 -7636 4696 10309 5372 -5610 -17267 -21206 -14505 -2539
2405 -2539 7877 9604 1661 -10785 -19464 -19502 -9978 2532 9690 7169 -3350 -15066 -21106 -16408
2419 -16408 -4605 6091 9728 3342 -8332 -18447 -20008 -12045 75 8729 8371 -806 -12796
2432 -12796 -19951 -17487 -6755 4650 9967 5385 -5774 -16292 -20040 -13169 -1738 8339 9074
$$ packed form
2337a385Q770j401j1042j3393o939L847J1895J2429M972n639j2838j1745k603
2350b5072P869J3355J0001O71r038j3799q248J965J0766J2747O802l923j1552
2363g456j2028m631O210J3003J0951K597q027j2835r811M0R770J2889Q220j703
2377G189j0980j2670n932M159J2311J1858L882o423j2128j0893k054Q649J3039
2390GR200n64r393j2925p607K509J1137J2332N613m937j0982j1657l939O701J1966
2405b539J0416J727p943j2446q679l8R524J2510P158k521j0519j1716o040M698
2419a6408J1803J0696L637o386j1674j0115j561P963J2120Q654l58r177j1990
2432a2796p155K464J0732J1405N317m582j1159j0518l748O871J1431J0077P35
$$ plain form
2445 9074 1282 -10029 -18291 -17478 -8356 3756 10213 7054 -3206 -13755 -18663 -13924 -2399 7546
2459 7546 10515 4187 -7320 -16198 -17065 -8478 3114 10626 9589 462 -10346 -16702 -13362 -2849
2473 -2849 8129 12456 7506 -3016 -12743 -14919 -8318 3194 12245 12972 5249 -5996 -13269 -11819
2487 -11819 -2495 8451 14862 11562 2110 -7758 -12010 -7093 3683 13379 16257 9735 -1217 -9234
2501 -9234 -9500 -1603 9435 16495 15242 6644 -3885 -9224 -5918 3912 14313 18116 13542 3167
2515 3167 -5591 -7994 -838 9073 17644 17751 10312 -79 -7261 -5252 3693 14229 19054 15644 5953
2530 5953 -3347 -6628 -1642 8305 17389 19128 12492 1818 -5835 -5423 2367 12568 18846 16879 7966
2545 7966 -1869 -6566 -3261 6317 15685 18562 13233 3282 -5103 -6950 -494 9742 16836 16866 8862
$$ packed form
2445I074p792j1311q262Q13R122J2112O457l159j0260j0549m908M739J1525R945
2459G546K969o328j1507q878q67Q587J1592P512j037r127j0808o356L340J0513
2473b849J0978M327m950j0522r727k176O601J1512R051P27p723j1245p273J450
2487a1819R324J0946O411l300r452r868m252M917J0776R696K878o522j0952q017
2501i234k66P897J1038P060j253q598j0529n339L306R830J0401L803m574j0375
2515C167q758k403P156R911Q571J07p439j0391p182K009Q945J0536M825l410r691
2530E953r300l281M986R947R084J739o636j0674p653M12P790J0201O278j967q913
2545G966r835m697L305R578R368K877n329r951q385j847O456J0236P094L0q004
$$ plain form
2560 8862 -1518 -7025 -5456 3073 12784 17015 13339 3762 -5330 -8383 -3219 6282 14446 15786 9254
2575 9254 -821 -7795 -7528 -195 9328 15134 12811 4494 -4840 -9109 -5886 3440 11876 14384 9085
2590 9085 -124 -8040 -9283 -2991 6616 13659 12877 4984 -4263 -9837 -7643 971 10154 14007 10125
2605 10125 1041 -7052 -9760 -4640 5045 12442 13490 6732 -2398 -8886 -8045 -713 8875 14346 11792
2620 11792 3472 -5555 -9016 -5083 4156 12117 14517 9234 -121 -7314 -7412 -1073 8022 14481 13292
2635 13292 6074 -2703 -7421 -4700 3408 11913 15240 11568 3062 -4680 -6574 -1382 7385 14319 14822
2650 14822 8708 -172 -5857 -4607 2331 11163 15794 13853 5813 -2512 -6052 -1890 6649 13922 15926
2665 15926 10812 2159 -4621 -4984 1444 9978 15593 14552 7288 -1261 -5680 -3103 4967 12915 15894
$$ packed form
2560H862j0380n507J569Q529R711M231l676r577r092l053N164R501Q164J340o532
2575I254j0075o974K67P333R523N806k323q317r334m269L223R326Q436K508n299
2590I085r209p916j243O292R607P043p82p893r247n574K194Q614R183L853l882
2605A0125r084q093k708N120R685P397J048o758r130o488Q41P332R588N471k554
2620A1792q320r027l461L933R239P961K400n283r355p193r8O339R095O459j189
2635A3292p218q777m718K721Q108Q505L327l672q506p742j894N192Q767O934N03
2650A4822o114q880n685J250O938Q832M631j941q040q325l540M162Q539P273K004
2665A5926n114q653o780l63O428Q534N615j041p264q549m419K577Q070P948K979
$$ plain form
2680 15894 11738 3254 -4129 -5519 -332 8070 14509 14114 7653 -913 -6595 -4854 2459 10298 14052
2695 14052 11085 3389 -4544 -7107 -3241 4925 11988 12595 7229 -1087 -7580 -6934 -877 7214 12019
2710 12019 10234 3158 -5191 -8926 -6025 1439 8529 11000 6832 -1455 -8388 -9512 -4392 3257 9271
2725 9271 8691 2659 -5472 -10564 -9088 -2370 5359 8647 5919 -1731 -9338 -11737 -7585 250 6489
2740 6489 7312 2358 -5912 -11765 -11270 -5239 2410 6791 5178 -1941 -9635 -12775 -9902 -2746 4160
2755 4160 6229 2052 -5655 -12017 -12782 -7580 1 5349 4653 -1473 -9421 -13178 -11535 -4428 2432
2770 2432 5536 2409 -4906 -11540 -13292 -8969 -1479 4368 4858 -250 -7920 -13052 -12204 -6385 1196
2785 1196 5084 3389 -3392 -10321 -13126 -10127 -2849 3475 5244 942 -6264 -12016 -12388 -7654 0
$$ packed form
2680A5894m156q484p383j390N187Q402O439l95o461q566n682J741P313P839L754
2695A4052k967p696p933k563L866Q166P063O07n366q316o493O46O057Q091M805
2710A2019j785p076q349l735K901P464P090K471m168q287o933j124N120P649O014
2725I271n80o032q131n092J476O718P729L288k728p650p607k399M152P835O239
2740F489Q23m954q270n853M95O031P649M381j613p119p694l140K873P156O906
2755D160K069m177p707o362p65N202P581N348o96o126p948l757J643P107O860
2770B432L104l127p315o634j752M323P490N847M90n108p670n132Q48N819P581
2785A196L888j695o781o929k805K999P278O324J769m302p206n752l72M734P654
$$ plain form
2800 0 4709 3969 -1833 -8967 -12963 -11065 -4232 2564 5276 2073 -4938 -11204 -12601 -8375 -1016 4158
2816 4158 4534 -838 -7804 -12282 -11368 -5724 1487 4845 2887 -3632 -10254 -12587 -9269 -2395 3249
2831 3249 4824 595 -6379 -11815 -11942 -7046 23 4348 3264 -2542 -9309 -12774 -10417 -4245 2279
2846 2279 4387 1119 -5671 -11368 -12312 -8423 -1685 3244 3574 -1702 -8520 -12713 -11569 -5975 826
2861 826 3847 1597 -4153 -10730 -12946 -9553 -3148 2289 3597 -824 -7495 -12018 -11942 -7110 -612 3409
2877 3409 2347 -3105 -9439 -12716 -10523 -4380 1479 3327 542 -5902 -11327 -12313 -7996 -1386 3077
2892 3077 2856 -2267 -8298 -12174 -10795 -5347 908 3853 1349 -4556 -10252 -11852 -8535 -2202 2948
2907 2948 3489 -857 -6531 -11413 -10592 -5953 759 4032 2777 -2697 -8953 -10990 -8671 -2663 2886
$$ packed form
2800@M709p40n802p134l996J898O833O796K712l203p011o266j397M226P359N174
2816D158L76n372o966m478R14N644P211L358j958o519o622k333L318O874N644
2831C249J575m229o974n436j27M896P069M325j084n806o767l465K357O172O524
2846B279K108l268o790n697r44L889O738M929L30n276o818m193J144N594O801
2861H26L021k250n750o577k216L393O405N437J308m421o671m523P6M832O498M021
2877C409j062n452o334l277K193O143N859J848k785o444n425r86M317O610M463
2892C077k21n123o031l876J379N448O255K945k504n905n696j600L317O333N150
2907B948N41m346n674m882Q21M639O712L273j255n474o256k037K319O008N549
$$ plain form
2922 2886 4786 1385 -4900 -9889 -10383 -5780 353 4554 4406 -380 -6575 -10133 -8304 -2926 2916
2937 2916 5486 2926 -2814 -7972 -9482 -6238 77 4973 5179 1069 -4908 -8526 -8023 -3216 2609
2952 2609 5965 4509 -828 -6694 -8847 -6408 -527 4366 6039 2732 -2806 -7361 -7828 -3676 2307
2967 2307 6094 5481 635 -4978 -8119 -5529 -895 4219 6507 3558 -1490 -7095 -7946 -4125 2132
2982 2132 6421 5785 2149 -3467 -7650 -6673 -1782 4361 6231 4464 -407 -6101 -7306 -4822 806
2997 806 5210 6311 2590 -2846 -7113 -7183 -2790 2635 6126 5172 374 -4664 -7531 -5812 -420 4400
3013 4400 6553 3509 -1854 -6385 -7124 -3843 1636 5874 5672 1851 -4137 -6697 -6345 -1502 3801 6369
3029 6369 4414 -239 -5230 -6766 -4294 1146 5353 6463 3071 -2266 -6487 -5786 -1688 3418 6555
$$ packed form
2922B886J900l401o285m989m94M603O133M201j48m786o195l558J829N378N842
2937B916K570k560n740n158j510L244O315M896K06m110n977l618N03M807N825
2952B609L356j456n337n866k153K439N881M893J673l307n538m555m67M152N983
2967B307L787o13m846n613l141K590M634N114K288k949n048n605q51L821O257
2982B132M289o36l636n616m183R77M891O143J870j767m871n694j205K484N628
2997H06M404J101l721n436m267p0M393N425L491r54m798n038k867J719N392M820
3013D400K153l044n363m531p39L281N479M238k02l821n988k560L52M843N303K568
3029F369j955m653m991j536K472N440M207J110l392n337m221P01M098N106L137
$$ plain form
3044 6555 5805 1239 -3571 -6003 -4468 658 5730 7312 4521 -716 -5005 -5418 -1986 3309 7102
3059 7102 7047 2842 -2176 -5271 -3710 925 5625 8041 5974 728 -3485 -4985 -1840 3632 7563
3074 7563 8255 4678 -392 -3657 -3306 743 5991 8951 7445 2911 -1618 -3708 -1498 3284 7839
3089 7839 9013 6165 1487 -2351 -2653 180 5548 9255 8703 4908 -228 -2713 -1443 2810 7442
3104 7442 9756 7750 3082 -1348 -2279 432 5072 9004 9255 5872 1094 -2417 -1291 2479 6874
3119 6874 9601 8319 4062 -563 -2479 -322 4416 8385 9389 6415 1917 -2198 -2340 1389 5908
3134 5908 8761 8275 4245 -296 -2719 -1439 2832 7190 8252 6332 1595 -2256 -3401 -691 4067
3149 4067 7595 7390 4171 -932 -3854 -3823 770 5208 7207 5402 1326 -3036 -4687 -2553 1721 5472
$$ packed form
3044F555p50m566m810k432J535N126N072J582k791n237m289m13L432N295L793
3059G102n5m205n018l095J561M635M700K416k067n246m213j500L145N472L931
3074G563O92l577n070l265L51M049N248K960j506m534m529k090K210M782M555
3089G839J174k848m678l838l02K833N368L707n52l795n136k485J270M253M632
3104G442K314k006m668m430r31K711M640L932K51l383m778l511J126L770M395
3119F874K727j282m257m625j916K157M738L969J004k974m498m115j42L729M519
3134E908K853m86m030m541k423J280M271M358J062j920m737l851j145K710M758
3149D067L528k05l219n103k922L1M593M438J999j805m076m362j651K134M274L751
$$ plain form
3165 5472 6249 3276 -1769 -4643 -4839 -1351 2829 5576 4410 816 -3847 -6002 -4255 -390 3662
3180 3662 4855 2504 -2028 -5711 -6299 -3561 942 3751 3718 -106 -4218 -7009 -6112 -2227 1784 3295
3196 3295 1971 -2160 -5953 -7233 -5094 -962 2385 2964 -78 -4241 -7197 -7261 -3886 265 2976 1616
3212 1616 -2222 -5828 -7946 -6278 -2106 1642 2800 773 -4061 -7140 -7630 -4850 -179 2311 1666
3227 1666 -1194 -5623 -7704 -6500 -3254 981 2703 976 -2949 -6461 -7517 -5093 -905 2384 2626
3242 2626 -228 -4302 -6544 -6474 -3308 576 3258 1977 -1485 -5580 -6968 -5077 -1267 2115 3412
3257 3412 972 -2742 -6289 -6386 -3607 702 2783 3029 -174 -3761 -6114 -5118 -2051 1263 3603 1746
3273 1746 -1214 -5804 -5241 -4153 624 3083 3442 537 -3511 -5793 -4981 -2470 2122 4037 2461 -1048
$$ packed form
3165E472P77k973n045k874j96L488M180K747j166l594m663k155J747L865M052
3180C662J193k351m532l683n88K738M503K809l3l824m112k791Q97L885M011J511
3196C295j324m131l793j280K139M132L347N79l042m163k956o4L375M151K711j360
3212A616l838l606k118J668M172L748J158k027m834l079m90K780M671K490o45
3227A666k860m429k081J204L246M235J722j727l925l512j056K424M188L289K42
3242B626k854m074k242P0L166L884K682j281l462m095j388J891L810L382J297
3257C412k440l714l547r7K779M309K081K46l203l587k353R96L067L314K340j857
3273A746k960m590N63J088M777K459L59k905m048k282Q12K511M592J915j576l509
$$ plain form
3289 -1048 -4651 -5797 -4117 -503 2664 3678 1183 -2895 -5447 -5771 -2884 1039 3502 2488 -659
3304 -659 -4323 -5985 -4922 -1134 2152 3478 1326 -2357 -5742 -5967 -4052 -117 2632 2197 -294 -4007
3320 -4007 -6288 -5565 -2700 991 2664 1552 -1833 -5649 -6800 -4830 -1174 1798 2110 -14 -3791
3335 -3791 -6280 -6386 -3392 230 1901 1322 -1843 -4927 -6904 -5330 -2328 1375 2342 446 -3064 -6034
3351 -6034 -6541 -3977 -457 1999 1877 -1143 -4500 -6357 -5449 -2552 919 2343 907 -2222 -5181 -6184
3367 -6184 -4213 -246 2103 2490 235 -2994 -5825 -4394 -2007 881 3243 1789 -539 -3518 -5960
3382 -5960 -4394 -698 2303 3479 1794 -1926 -4478 -4410 -1972 1910 4102 2577 373 -1911 -3535
3397 -3535 -3083 2 3382 4407 3451 241 -2731 -3236 -1348 2143 4798 4822 2742 -322 -2556 -2075
$$ packed form
3289a048l603j146J680L614L167J014k495m078k552l24K887L923K463j014l147
3304f59l664j662J063L788L286J326k152l683l385k25J915L935K749m35k491l713
3320d007k281P23K865L691J673j112l385l816j151J970L656K972L12k124l777
3335c791k489j06K994L622J671n79l165l084j977J574L002L703R67j896l510k970
3351f034n07K564L520K456j22l020l357j857R08K897L471J424j436l129k959j003
3367f184J971L967K349L87k255l229k831J431K387K888K362j454k328k979k442
3382e960J566L696L001J176j685l720k552O8K438L882K192j525k204k284j624
3397c535M52L085L380J025r56l210k972n05J888L491K655K4k080l064k234M81
$$ plain form
3413 -2075 417 3587 5549 4562 1865 -1091 -2232 -1028 2213 5168 5823 4057 710 -1336 -1504 910
3429 910 3797 5930 5854 2910 91 -1347 -664 2508 5457 6402 4913 2008 -745 -1190 877 4222
3445 4222 6485 6538 3784 1115 -945 -440 2038 5231 6688 5666 2667 161 -821 894 3347 6029
3461 6029 6512 5641 1109 -571 -311 1552 4588 7364 5857 3141 525 -1924 181 2791 5963 5604
3477 5604 5116 1831 205 -415 1202 4178 6087 5794 4161 798 -1079 -197 2540 5292 6450 5585
3493 5585 2929 10 -998 837 3677 5955 6189 4379 1619 -458 -561 1838 4763 6457 5734 3550
3509 3550 477 -868 267 3059 5739 6311 4956 2002 189 -301 1321 3966 6165 6118 4147 1016
3525 1016 -613 370 2653 5308 6285 5113 2535 83 -537 1238 3553 5823 6004 4195 1400 -392
$$ packed form
3413b075K492L170J962r87k697k956j141J204L241K955O55j766l347k046j68K414
3429I10K887K133p6k944k819j438O83L172K949R45j489k905k753m45K067L345
3445D222K263N3k754k669k060N05K478L193J457j022k999k506r82J715K453K682
3461F029M83q71m532j680K60J863L036K776j507k716k616k449K105K610L172l59
3477E604m88l285j626o20J617K976J909k93j633l363j877Q82K737K752J158q65
3493E585k656k919j008J835K840K278K34j810k760k077j03K399K925J694p23k184
3509C550l073j345J135K792K680N72j355k954j813m90J622K645K199m7j971l131
3525A016j629R83K283K655R77j172k578k452o20J775K315K270J81j809k795j792
$$ plain form
3541 -392 -255 1935 4436 5944 5675 2536 300 -667 404 2826 5439 5997 4310 1540 -566 -767
3557 -767 1454 3938 5219 5219 3133 619 -999 -150 2464 4774 5465 4524 1858 -317 -1190 489 2891
3574 2891 5095 4986 3158 389 -994 -1001 939 3509 4861 3787 1652 -632 -1546 -413 1676 3913
3590 3913 4476 2834 -28 -1910 -1706 272 2390 4161 3644 1529 -990 -2118 -1268 925 3093 3949
3606 3949 2509 77 -1865 -2388 -696 1504 3491 3559 1557 -729 -2189 -2032 -51 2424 3562 2618
3622 2618 287 -1995 -2670 -1432 1165 2958 3269 1832 -637 -2328 -2590 -733 1382 2969 2927 973
3638 973 -1503 -2687 -1879 511 2555 3434 2037 -482 -2450 -2554 -912 1309 3303 3043 1242 -1303
3654 -1303 -2729 -2451 96 2187 3068 2570 167 -2156 -2451 -1120 1200 2816 2880 1437 -806 -2386
$$ packed form
3541c92J37K190K501J508k69l139k236r67J071K422K613N58j687k770k106k01
3557g67K221K484J281%k086k514j618Q49K614K310O91r41k666k175q73J679K402
3574B891K204j09j828k769j383pJ940K570J352j074k135k284r14J133K089K237
3590C913N63j642k862j882K04J978K118J771n17k115k519j128Q50K193K168Q56
3606C949j440k432j942n23J692K200J987O8k002k286j460J57J981K475J138r44
3622B618k331k282o75J238K597J793L11j437k469j691k62J857K115J587m2j954
3638I73k476j184Q08K390K044Q79j397k519j968j04J642K221J994k60j801k545
3654a303j426K78K547K091Q81m98k403k323k95J331K320J616O4j443k243j580
$$ plain form
3670 -2386 -2077 -317 2079 2837 2707 632 -1165 -2611 -1558 484 2436 3393 2096 -195 -2116 -2195
3686 -2195 -481 1167 3353 2868 1177 -899 -2372 -1839 391 2157 3038 2222 127 -1603 -2197 -1129
3702 -1129 1081 2600 2920 1579 -783 -2116 -2195 -161 2079 2883 2273 184 -1686 -2271 -1714 325 2476
3719 2476 2645 1696 -351 -2051 -2217 -708 1142 2587 2533 713 -1454 -2340 -1852 -59 2238 2851 1686
3736 1686 -525 -2181 -2588 -1105 677 2497 2156 939 -992 -2319 -2209 -566 1487 2723 1862 -103
3752 -103 -1887 -2397 -1471 588 1908 2499 1523 -517 -2358 -2388 -476 1237 2460 1748 356 -1541 -2563
3769 -2563 -1597 198 1849 2607 1558 -311 -2109 -2318 -942 869 2225 2288 854 -1021 -2043 -1747
3785 -1747 -441 1732 2455 1673 282 -1650 -2060 -1167 632 2052 2584 1183 -418 -1944 -1987 -608 1235
$$ packed form
3670b386L09J760K396P58j30k075j797j446J053K042J952R57j297k291j921p9
3686b195J714J648K186m85j691k076j473N33K230J766Q81q16k095j730n94J068
3702a129K210J519L20j341k362j333p9K034K240Q04o10k089j870n85N57K039K151
3719B476J69r49k047j700j66J509J850J445n4j820k167q86M88J793K297O13j165
3736A686k211j656m07J483J782J820l41j217j931j327J10J643K053J236q61j965
3752a03j784n10R26K059J320N91r76k040j841l0J912J713J223p12j392j897j022
3769b563R66J795J651P58j049j869j798k09J376J811J356O3j434j875j022K96
3785a747J306K173P23p82j391j932m10Q93J799J420N32j401j601j526m3J379J843
$$ plain form
3802 1235 2415 1967 413 -1513 -2145 -1478 4 2081 2534 1668 -389 -1898 -2197 -1038 1115 2006 2324
3819 2324 679 -1259 -2177 -1682 -322 1458 2112 1532 -217 -1565 -2146 -1269 137 1871 1887 758 -1000
3836 -1000 -1845 -2207 -790 799 1695 1374 -266 -1740 -2699 -2129 -486 935 1377 926 -1261 -2444 -2461
3853 -2461 -1520 30 1520 1382 -187 -1754 -2694 -2152 -910 807 1353 787 -457 -2108 -2729 -1826 -258
3870 -258 1275 1131 102 -1532 -2627 -2476 -1153 561 1227 852 -443 -2240 -2846 -2029 -437 1025 1312
3887 1312 528 -1397 -2208 -2348 -1556 572 1017 1694 100 -1161 -1837 -2411 271 947 2314 914 -739
$$ packed form
3802A235J180m48j554j926o32O67J482K077M53q66k057j509k99J159K153Q91L18
3819B324j645j938r18M95J360J780O54n80j749j348n81Q77J406J734J6j129j758
3836a000q45l62J417J589Q96l21j640j474r59N70J643J421M42m51k187j183j7
3853b461R41J550J490j38j569j567r40N42J242J717N46n66j244j651o21R03J568
3870b58J533j44j029j634j095J51J323J714O66l75j295j797o06Q17J592J462K87
3887A312p84j925q11j40P92K128M45O77j594j261o76n74K682O76J367j400j653
$$ [...]
8191E76
##END NTUPLES=NMR FID
##END=
