##TITLE=1H_LR-698-R3-MK1-TFA
 CDCl3
 8 sc, 
 28.9.2023
##JCAMPDX= 6.0         $$ Bruker NMR JCAMP-DX V2.0
##DATA TYPE= NMR FID
##DATA CLASS= NTUPLES
##ORIGIN= UXNMR, Bruker Analytische Messtechnik GmbH
##OWNER= root
$$ XWIN-NMR		Version 3.5
$$ Thu Sep 28 16:35:18 2023 Russian Standard Time (UT+4h)  she@DPX200
##.OBSERVE FREQUENCY= 200.13135
##.OBSERVE NUCLEUS= ^1H
##.DELAY= (6, 6)
##.ACQUISITION MODE= SIMULTANEOUS
##.ACQUISITION SCHEME= undefined
##.AVERAGES= 8
##.DIGITISER RES= 18
##SPECTROMETER/DATA SYSTEM= spect
##.PULSE SEQUENCE= zg30
##.SOLVENT NAME= CDCl3
##.SHIFT REFERENCE= (INTERNAL, CDCl3, 0, 15.7039)
##AUDIT TRAIL= $$ (NUMBER, WHEN, WHO, WHERE, WHAT)
$$ ##TITLE= Audit trail, XWIN-NMR		Version 3.5
$$ ##JCAMPDX= 5.01
$$ ##ORIGIN= Bruker BioSpin GmbH
$$ ##OWNER= she
$$ F:/spectra/data/she/nmr/H-F/1/audita.txt
$$ ##AUDIT TRAIL=  $$ (NUMBER, WHEN, WHO, WHERE, WHAT)
(   1,<2023-09-28 16:34:13.09 +0400>,<she>,<DPX200>,
      <created by zg, POWCHK disabled, PULCHK disabled
       configuration hash MD5:
       00 E9 B6 7A A2 85 ED C7 34 08 36 98 17 FE 4E 26
       data hash MD5: 16K
       5A 72 02 FC 8E 94 38 D4 D0 A3 37 D0 31 45 8C 1A>)
$$ ##END=
$$ 
$$ hash MD5
$$ 2E 72 AC EF 8A 83 94 B0 A8 D0 97 00 6B 18 CA A2
##$RELAX= 
##$RELAX= 
##$RELAX= 
##$RELAX= 
##$RELAX= 
##$RELAX= 
$$ Bruker specific parameters
$$ --------------------------
##$DU= <F:/spectra>
##$EXPNO= 1
##$NAME= <H-F>
##$PROCNO= 1
##$TYPE= <nmr>
##$USER= <she>
##$AMP= (0..31)
100 100 100 100 100 100 100 100 100 100 100 100 100 100 100 100 100 100 
100 100 100 100 100 100 100 100 100 100 100 100 100 100 
##$AQSEQ= 0
##$AQ_mod= 1
##$AUNM= <au_zg>
##$AUTOPOS= <>
##$BF1= 200.13
##$BF2= 200.13
##$BF3= 200.13
##$BF4= 200.13
##$BF5= 200.13
##$BF6= 200.13
##$BF7= 200.13
##$BF8= 200.13
##$BYTORDA= 1
##$CFDGTYP= 0
##$CFRGTYP= 5
##$CHEMSTR= <none>
##$CNST= (0..31)
1 1 145 1 1 1 1 1 1 1 1 1 1 1 1 1 1 1 1 1 1 1 1 1 1 1 1 1 1 1 1 1 
##$CPDPRG= <>
##$CPDPRG1= <>
##$CPDPRG2= <>
##$CPDPRG3= <>
##$CPDPRG4= <mlev>
##$CPDPRG5= <mlev>
##$CPDPRG6= <mlev>
##$CPDPRG7= <mlev>
##$CPDPRG8= <mlev>
##$CPDPRGB= <>
##$CPDPRGT= <>
##$D= (0..31)
0 1.2 0 0 0 0 0 0 0 0.06 0 0.03 0 0 0 0 0.0002 0 0 0 0 0 0 0 0 0 0 0 0 
0 0 0 
##$DATE= 1695904452
##$DBL= (0..7)
120 120 120 120 120 120 120 120 
##$DBP= (0..7)
150 150 150 150 150 150 150 150 
##$DBP07= 0
##$DBPNAM0= <>
##$DBPNAM1= <>
##$DBPNAM2= <>
##$DBPNAM3= <>
##$DBPNAM4= <>
##$DBPNAM5= <>
##$DBPNAM6= <>
##$DBPNAM7= <>
##$DBPOAL= (0..7)
0.5 0.5 0.5 0.5 0.5 0.5 0.5 0.5 
##$DBPOFFS= (0..7)
0 0 0 0 0 0 0 0 
##$DE= 6
##$DECBNUC= <off>
##$DECIM= 32
##$DECNUC= <off>
##$DECSTAT= 4
##$DIGMOD= 1
##$DIGTYP= 9
##$DL= (0..7)
0 120 120 120 120 120 120 120 
##$DP= (0..7)
150 150 150 150 150 150 150 150 
##$DP07= 0
##$DPNAME0= <>
##$DPNAME1= <>
##$DPNAME2= <>
##$DPNAME3= <>
##$DPNAME4= <>
##$DPNAME5= <>
##$DPNAME6= <>
##$DPNAME7= <>
##$DPOAL= (0..7)
0.5 0.5 0.5 0.5 0.5 0.5 0.5 0.5 
##$DPOFFS= (0..7)
0 0 0 0 0 0 0 0 
##$DQDMODE= 0
##$DR= 18
##$DS= 0
##$DSLIST= <SSSSSSSSSSSSSSS>
$$ [...]
##$SUBNAM2= <"">
##$SUBNAM3= <"">
##$SUBNAM4= <"">
##$SUBNAM5= <"">
##$SUBNAM6= <"">
##$SUBNAM7= <"">
##$SUBNAM8= <"">
##$SUBNAM9= <"">
##$SW= 18.05172834244
##$SWIBOX= (0..15)
0 0 2 0 0 0 0 0 0 0 0 0 0 0 0 0 
##$SW_h= 3612.71676300578
##$TD= 16384
##$TD0= 1
##$TE= 0
##$TE2= 300
##$TE3= 300
##$TEG= 300
##$TL= (0..7)
0 120 120 120 120 120 120 120 
##$TP= (0..7)
150 150 150 150 150 150 150 150 
##$TP07= 0
##$TPNAME0= <>
##$TPNAME1= <>
##$TPNAME2= <>
##$TPNAME3= <>
##$TPNAME4= <>
##$TPNAME5= <>
##$TPNAME6= <>
##$TPNAME7= <>
##$TPOAL= (0..7)
0.5 0.5 0.5 0.5 0.5 0.5 0.5 0.5 
##$TPOFFS= (0..7)
0 0 0 0 0 0 0 0 
##$TUNHIN= 0
##$TUNHOUT= 0
##$TUNXOUT= 0
##$USERA1= <user>
##$USERA2= <user>
##$USERA3= <user>
##$USERA4= <user>
##$USERA5= <user>
##$V9= 5
##$VALIST= <valist>
##$VCLIST= <CCCCCCCCCCCCCCC>
##$VD= 0
##$VDLIST= <DDDDDDDDDDDDDDD>
##$VPLIST= <PPPPPPPPPPPPPPP>
##$VTLIST= <TTTTTTTTTTTTTTT>
##$WBST= 1024
##$WBSW= 4
##$XGAIN= (0..3)
0 0 0 0 
##$XL= 0
##$YL= 0
##$YMAX_a= 144540
##$YMIN_a= -159553
##$ZGOPTNS= <>
##$ZL1= 120
##$ZL2= 120
##$ZL3= 120
##$ZL4= 120
##$ABSF1= 10
##$ABSF2= 0
##$ABSG= 5
##$ABSL= 3
##$ALPHA= 0
##$AQORDER= 0
##$ASSFAC= 0
##$ASSFACI= 0
##$ASSFACX= 0
##$ASSWID= 0
##$AUNMP= <proc_1d>
##$AZFE= 0.1
##$AZFW= 0.1
##$BCFW= 1
##$BC_mod= 2
##$BYTORDP= 1
##$COROFFS= 0
##$CY= 11.3945322036743
##$DATMOD= 1
##$DC= 2
##$DFILT= <>
##$DTYPP= 0
##$F1P= 15.7292609196834
##$F2P= 12.9074282941183
##$FCOR= 0.5
##$FTSIZE= 0
##$FT_mod= 4
##$GAMMA= 1
##$GB= 0.15
##$INTBC= 1
##$INTSCL= 1
##$ISEN= 128
##$LB= 0.24
##$LEV0= 0
##$LPBIN= 0
##$MAXI= 10000
##$MC2= 0
##$MEAN= 0
##$ME_mod= 0
##$MI= 1.114404
##$NCOEF= 0
##$NC_proc= 0
##$NLEV= 6
##$NOISF1= 3.799351
##$NOISF2= 2.8
##$NSP= 1
##$NTH_PI= 0
##$NZP= 0
##$OFFSET= 15.70392
##$PC= 1
##$PHC0= -21708.96
##$PHC1= 7.052711
##$PH_mod= 1
##$PKNL= yes
##$PPARMOD= 0
##$PSCAL= 0
##$PSIGN= 0
##$REVERSE= no
##$SF= 200.130013532006
##$SI= 16384
##$SIGF1= 3
##$SIGF2= 2
##$SINO= 400
##$SIOLD= 16384
##$SREGLST= <1H.CDCl3>
##$SSB= 0
##$STSI= 0
##$STSR= 0
##$SW_p= 3612.71676300578
##$SYMM= 0
##$S_DEV= 0
##$TDeff= 0
##$TDoff= 0
##$TI= <>
##$TILT= no
##$TM1= 0
##$TM2= 0
##$TOPLEV= 0
##$USERP1= <user>
##$USERP2= <user>
##$USERP3= <user>
##$USERP4= <user>
##$USERP5= <user>
##$WDW= 1
##$XDIM= 8192
##$YMAX_p= 0
##$YMIN_p= 0
$$ End of Bruker specific parameters
$$ ---------------------------------
##NTUPLES= NMR FID
##VAR_NAME=  TIME,          FID/REAL,        FID/IMAG
##SYMBOL=    X,             R,               I
##VAR_TYPE=  INDEPENDENT,   DEPENDENT,       DEPENDENT
##VAR_FORM=  AFFN,          ASDF,            ASDF
##VAR_DIM=   8192,          8192,            8192
##UNITS=     SECONDS,       ARBITRARY UNITS, ARBITRARY UNITS
##FACTOR=    0.0002768,     1,               1
##FIRST=     0,             0,               0
##LAST=      2.2672688,     0,               0
##MIN=       0,             -159553,         0
##MAX=       2.2672688,     144540,          0
$$ Real data points
##PAGE= N=1
##DATA TABLE= (X++(R..R)), XYDATA
0@%%%%%%%%%%%%%%%%Pj5J6j6J6j6K3l1L2l6M4m9N7o8P6q6R8j12J27j42J58j74
38i1J94k18K42k68K96l25L60m00M41m86N35n88O47p15P90q72R66j069J187j327
58g01J490j683J917k206K577l071L755m767O417r519J7151o6888n8882K50632
72A36222m8524j87630J18747R8135n6330L6560n0792r5988J02888O6958p6353
83D3893o081m0295n6152R6955J6197j20273J8364K9984m8690O9361J9117j21922
95i9542L5928P3756p3535N6515J08393j26914p0632J29963L3037l1785J9006m6626
107G564j7013P5599k648l2003J1788n5014j3841Q5996j9662o1697L5883k8607
119a3655n7712P3434L1694o4574Q934N308l8411N5032L7317p0892k022N4602j7940
$$ y = [0, 0, 0, 0, 0, 0, 0, 0, 0, 0, 0, 0, 0, 0, 0, 0, 0, 7, -8, 8, -8, 8, -8, 15, -16, 16, -20, 24, -25, 32, -36, 40, -46, 52, -60, 67, -75, 83, -91, 103, -115, 127, -141, 155, -170, 190, -210, 231, -255, 280, -308, 339, -376, 414, -458, 508, -561, 626, -701, 789, -894, 1023, -1183, 1394, -1677, 2078, -2689, 3728, -5791, 11360, -55528, -114410, 136222, 87698, -99932, 18815, 116950, 60620, 97180, 46388, -49600, 53288, 120246, 43893, 37812, -2483, -58635, 38320, 54517, -65756, -47392, -17408, -66098, 3263, 22380, -99542, -63614, 10142, -63393, -6878, 101515, -25399, -96031, 33932, 66969, 35184, 54190, 7564, -9449, 66150, 63502, 31499, 43287, -11727, -25568, 60428, 40766, -20931, 14952, -13655, -71367, 2067, 33761, -30813, -21879, -16571, -54982, 50, 37367, -33525, -35547, 19055, 1115]
132A115m112K8264j9143j0766J2804p504J6908J4928l4409k073J7048l0440P818
145i562L8955l2690k3987L4513j2411k4321L1729L420k2411J5882n12j8409K4240
158D436J2808k6723N39J3057m999O858N071j3767l879o64j793J6203K729k2564
172a2688j033P566q321J0829J4779j8851j2452J4870N628J319P818p501j0446
185h483Q292R027L211J314p432q436L878O603K826j549r756o997L109K891N87
200i15R27o397r266L184R373J202l824j386q93p1P832Q119l522m765L330J428
216D356M19R079J638j0098k878M440m85K855J373r556n861L465P41L13O36p117
232f680l798L030m11L866M574p845m497Q152K085J594O941o214o758R965M100
$$ y = [1115, -2997, 25267, 6124, -4642, 8162, 658, 17566, 32494, -1915, -3988, 13060, -17380, -9562, 29393, -3297, -27284, 7229, -5182, -29503, 2226, 5646, -16765, -883, -1395, -19804, 4436, 17244, -9479, -8940, 4117, -882, 5976, 11047, -2720, -6599, -7263, -9056, 7147, 9876, -12688, -13721, -6155, -14476, -3647, 11132, -7719, -20171, -5301, 327, 1646, 9464, 1963, -8483, -191, 8836, 12047, 13361, 5929, -2507, 1371, 7974, 10800, 9251, -505, -7502, -4393, -1502, -915, 12, -6385, -15651, -12467, -3094, -1892, -5716, -7102, -7995, -8066, -234, 7885, 4363, -402, 2928, 4356, 4775, 13854, 15492, 5394, 2516, 6956, 6471, 9326, 10699, 1143, -4718, -1253, -512, -199, 437, -6680, -10478, -7448, -7859, -3993, 581, -7264, -11761, -3609, -1524, 70, 7011, 797, -5961, 4004, 8104]
247H104l946O045j636j0529M641O530m375J518j290j0778K292O943m457J07j03
262i34j0214K734R525m672j481N256q180q48J2406j351l846N625n300l127J1783
277G376J312p271L719k634n360Q976J982p913J860j948o705P564L601q602J099
292b944J080p114O607P176q780q72N046n618L449R247o282l613N592l176L62Q869
308I029m623n767M505k405j439P398l290p480L577o37l198P085j428q435L729
323c379J522l498N657K294q078J601M744k948L893L428o694n63N243k080J435
338B577L704o159k437N223k072j19L412n746l508N020p71j482L239l514m303M724
354b212J653k187L127j058m694L903L480j990K033o2l874K123L858j948M63J75
$$ y = [8104, 4158, 10203, 8567, -1962, 2679, 9209, 4834, 6352, 5062, -5716, -3424, 3519, -938, -831, -934, -11148, -8414, 1111, -3561, -5042, 214, -7966, -8814, 3592, 2241, -1605, 4020, -1280, -4407, 7376, 8688, 1417, 5136, 2502, -2858, 6118, 8100, 187, 2047, 99, -6606, 958, 4559, -4043, -2944, -1864, -8978, -2371, 4805, -3975, -4847, 199, -5419, -1970, 7277, 995, -2618, 2974, -202, 160, 9029, 4406, -1361, 3144, 739, -700, 6698, 3408, -4072, -495, -1132, -4330, 2755, 1327, -7108, -3379, -1857, -5355, 302, 2596, -5482, -3881, 863, -2085, 1808, 5236, -1458, -2021, 3222, 1142, 2577, 6281, 122, -2315, 2908, 836, 717, 4129, -1617, -5125, -105, -876, -2358, 881, -2633, -6936, -2212, -559, -2746, 381, -677, -5371, -1468, 2012, 22, 2055, 1993, -1881, 242, 4100, 2152, 2615, 2790]
370B790m312J250L720k105p95M86l627j26L869r64j310R84k985p80M228N13k244
387a408J137q88j162L409J773k010l5j15q21K487J396k257l85k70r43J594J516
404C018j808j521j47p17Q42J842j486j599M19n40Q99K067q42j953N55M43O00J750
422A822k59j618KJ55R91J164O1k226k98P24j44P59o6j574j219P61P18J26j54r81
442a256p39N89J034P83n23p61n39M02J454R19m32p75o47M21L42J114Lj039j160
461h10L43N58L86k04r41r43J77R85M21m40q43l63P1Q40N06j55j98m02J04J246
481C38Q51q6j116k79N33Q95N22n08r39n56M68J33L00p3p64q72K05P09M81o29m04
502g91q97O01J128J89l40j74k39L61N21O22o0m86k71J80O66N84l04r98m97K31
$$ y = [2790, -1522, -272, 3448, 1343, 548, 1034, -2593, -2719, 1150, 186, -1124, -140, -3125, -3905, 323, 836, -1408, -271, -1159, -2321, 1088, 2861, 851, 816, 701, -120, 2367, 3763, 1506, 1121, 851, -92, 1502, 3018, 1210, -311, -458, -1175, -333, 1509, 23, -1576, -1157, -1697, -798, 1269, 427, -1526, -971, -528, 72, 1822, 1563, -55, -53, 102, 1093, 2257, 2318, 92, -206, 518, 374, 1133, 1067, -507, -1726, -965, -247, -121, -275, -1256, -1995, -1406, -372, 411, -112, -873, -1412, -1010, 444, 1363, 931, 156, -491, -70, 272, 1386, 1389, 350, -810, -467, 91, 477, 273, -668, -1611, -1434, -449, -28, -468, -1311, -1674, -1603, -763, -257, -412, -610, -1012, -908, 338, 1189, 1103, -13, -292, 241, 1136, 1658, 1150, 211, -345, 123, 256, 556, 483, -281, -1153, -948, -239, 242, -387, -791, -1688, -1087, 41, 230, -110, -284, -523, -162, 359, 981, 921, 435, 164, 344, 1010, 1594, 1290, 292, -205, 26]
522B6P03J27p78j89l79l66L88P34n84r9j25k48O51R59p13n45Q7N7M90P15r0j051
544b30O49L1k19N88K2j046j19K85j32N24O47j711m9O91J18K28J09q06k30L61J69
565a20N33L20q13l28M99k18N20O26j151p97R91K1k84L92n48o35O48L68r96J005
585C3Qj356Q20J054o08O0N16j236N73R83j23l31J41p40L17P78n13l10N36j041
605d39l50P99o3j68j8p36l81J246l21m44P33j54j095J715K48p76J25N55p08J108
625H76N54j269M34Qp42P23Q38j355m83N43m72j22P01n18q12M28k04kO69k56o79
646a140Q23k61K51Q89m51m91P98L4J26O10k80n32J21K04n79P07q6j052R5O85j111
667f40K89N38j259R0N69m70J51M90n67m3P92p6l22O19j35l54R13R5l83N54l76
$$ y = [26, 729, 856, 78, -111, -490, -856, -468, 266, -318, -417, -542, -790, -139, 820, 107, -438, -351, -294, 196, 911, 821, -230, 419, 450, 231, 819, 841, -205, -324, -39, -171, 353, 1000, -711, -760, -69, 49, 277, 386, -420, -650, -289, -120, 413, 733, -80, -408, 91, -127, 393, 1019, -132, -929, 62, 83, -201, 191, -357, -992, -344, 24, -972, 33, 41, -1315, -495, 559, -49, 11, 527, -709, -136, 847, 724, 393, 534, -206, 111, 889, 376, 66, 602, -439, -789, 10, -53, -221, -239, -975, -1356, -110, -431, -875, -142, -296, -1391, 324, 572, -204, -79, 476, -232, 876, 1430, 161, 595, 603, -139, 584, 1422, 67, -416, 127, -345, -467, 234, -284, -1096, -668, -872, -874, -205, -461, -1140, -317, -578, -327, 562, 111, -380, 418, 452, 578, 1188, 908, 376, 497, 701, 122, 829, 743, -309, -214, 471, -640, -351, 187, -1072, -982, -413, -883, -732, -242, -809, -852, -60, -136, -458, 161, 26, -328, 585, 680, 297, 851, 475]
688D75n36Q16P9j74K4n10o79M79K05q63P30m31o10N59K93n18l3M05l94L61P06
709C84j71k78P6o8K61M58k77l9R6k48j06N58p5n69L7l38R8M56m02l45K19k61J46
732c88L1Qn9L5P0J39J39PL5k0M5k35N47K20n01K52L8j16nJ5j76j39J62k43rK31
758H3k61q6j75K33J9J86l90J03J15j16K29L4k10K82J0K2L15k2j73Oj56R3L33q7
782C87m04k14j49L20J70K4k38k0L29m77K73O8L0j26m3j22J69j57R3l12J80J93
804b6J41n8K74m20k31L07J58J20l67%n5K9K59J14l5m10J76P9K63j48q9k22Q1K15
828A55j05K66l31j24k3N4k4R3K85m35j36M38j92m5K12j29q0J84l3J92L9j93q3
851a5L71q0j91K53l44J81j05J06j30jJ78m54K27k6l11K78k75j23L60o0K69k44
$$ y = [475, -61, 755, 834, 660, 684, 174, -505, -26, 179, -684, 46, -385, -995, -436, -143, -661, -694, -289, -683, -322, 384, 213, -65, 11, -57, 204, 662, 385, 346, 442, 194, 88, 646, 571, 2, 39, -299, -201, 255, -147, -492, -273, -534, -388, -357, -349, -408, -373, -303, -164, -25, -18, 17, -3, 42, -193, 354, 574, 73, 325, 363, 247, 242, 257, 81, -58, 104, -139, -148, 83, -178, -264, -439, -206, -187, -1, -391, -288, -173, -289, -60, -26, -236, 46, 56, 78, 393, 371, 198, 204, 48, 141, 474, 387, -17, -231, -380, -60, 110, 134, -104, -124, 205, -272, 1, 69, 99, -27, -70, -192, -23, -180, -87, -399, -219, -26, 115, 57, 331, -89, -320, -13, 145, 265, -102, -102, -157, -128, 131, 245, 210, -200, -24, 55, 318, 170, 81, -141, -60, 155, 50, 316, -15, -139, -162, -108, -132, -39, 246, -189, -325, 113, -79, -124, 88, -41, -121, 63, 30, 222, 261, 68, -15, 356, 276, 85, 338, -6, 175, 70, 176, 46, 45, 223, -231, -4, -30, -341, -63, -338, -461, -101, -161, 108, -136]
873a36J42L1k03J60m5J03Q6M1j46K07k85L43k83j2K5K06j12k12k5J04o2J74o8
896C3o5j89j47P5J84j05k45K50J70j7J19K6j48O5J33J5j1J09N1l09R3J42j05O
920A30j63J30Rj08j10k25J15q9O3N8K24l28p5M6M9L55k16J50J67m46L90k29K58
943A55k43J92J22Nj63l1L09Nl80l7J51j6p8L7ok07K58k35K21k34N5k03K15J56
967D8l61J99o1K30j9lj11K08o4k18K18J67k0k29L56j79j00L4j7p0K13l48R8j44
991a73N2m2M4J34Qj16k94N6K38K30L7k83J2J83k5%m2N1L3j09K84k37p6J03j44
1016g6L68k26j48R6L5q3l5R9l55K66l28K41j95J45M45k08j98J64n7K15m61L49
1038E3j14K92k66r9K19r5L9J38k0j24j43L10j12k08J45l27J46J62Jj37JQ8j15
$$ y = [-136, 6, 37, -166, -6, -51, 52, 138, 179, 33, 240, -45, 298, 15, 3, 28, 234, 122, -90, -115, -11, -73, 101, 33, -32, -221, -368, -293, -109, -214, -459, -209, -39, -56, 63, 89, -59, 6, 139, 154, 143, 252, 303, -6, 87, 229, 124, 130, -33, 97, 106, -2, -112, -337, -222, -311, -248, -190, 34, -294, -369, -323, -274, 81, -135, 15, 182, -264, 126, -103, 155, -88, 104, 226, 231, 68, 37, 346, 351, -29, -66, 85, 69, -9, 28, 22, -185, 73, -162, 59, -175, -120, -323, -108, 48, -313, -114, -175, 55, 36, 33, -78, 130, 66, -152, 66, 233, 213, -16, 340, 161, 61, 95, 78, 8, 221, -127, -29, -173, -121, -163, -119, 15, 23, -93, -387, -331, -93, 137, 174, -109, -97, 86, 61, 61, 19, 70, 103, -6, 278, 41, -35, 68, -76, 292, 66, -82, 14, 49, -34, -69, 30, -325, -59, -387, -146, -341, -196, 249, 41, -157, 7, -50, 165, -296, 53, -61, 231, -35, -134, 85, -10, 29, 167, 147, 23, -120, 190, 78, -130, 15, -312, -166, -4, -3, -140, -139, -51, -166]
1061a66J20j1k5K57l26j04J44J74m6J07j1J41k27K25j90J08k4k59J18p6J93k00
1083g8J95j32l5J7K21k33r2N9M7K0k26L34j17j92K97L3k05J10P7r4R2k27L41n11
1107b99J47L56l0j2l16Q0J86j83r3k8L36l43K45J82l60K71K1m23r9L94oOj41L34
1131B25m1l36K15m16L19l15L86j62L08j74NQ5k82K56j29M3J00m7k87M01k64o9
1153a79M22q1k78J39K8j77J57j67j75L65j96K55J57k39j72K21l17N20j48k12Q6
1174IJ59k05o9K22j97L3p8Q9J15J35j53pj28O4p1O7K17m28M7K30r0J16j61j73
1198b57J19K11J77r3j03j67K58j70J61q3J78l02q5L41l76K87k08J06K6j14O7K00
1220A73k00K21k78P4K4l37J14M2L19j18j85J53k08K58j9M1m2J42j40Q5j32R8k96
$$ y = [-166, -46, -57, -82, 175, -151, -255, -111, 63, 17, 124, 113, 254, 27, 252, 62, 170, 146, -113, 5, -71, 122, -78, 117, -15, -50, -33, 188, -45, -137, -78, -31, -11, -237, 97, -20, -212, 85, 118, -87, 23, 100, 6, 98, -129, 212, -299, -152, 204, 174, 162, -154, -74, 112, -71, -164, -192, 144, -199, 46, 228, -132, 139, 160, -263, -362, 32, 26, 32, -109, 225, 184, -152, 63, -353, -34, -349, 37, -125, 183, 9, 14, 99, -183, 73, -56, -13, 87, 40, -247, 154, -110, -179, 243, 162, -116, 23, 51, -126, 31, -136, -311, 54, -142, 113, 270, 31, -141, 80, -237, 283, 135, -77, 9, 168, -37, -106, 116, -81, -48, -126, -37, 78, 213, 60, 53, -75, -11, -82, -15, 202, -226, -179, 51, -39, 77, -84, -257, -138, 73, 250, 157, 54, -113, 145, -25, 136, 53, 231, -71, -156, 185, -191, 96, -112, -6, 20, -94, -27, 173, -27, 194, -84, -10, 14, -323, -209, -167, 152, 34, -151, 2, -206, 52, 33, 74, 32, 174, 34, 119, -13, 85, -211]
1243b11K07J14l35J86n0J26M3p4qj09N1K32k39m8O7j21L1K62N9j14p4p2l9K84
1267A68j52k32L32k09K32j33o5mJ74k2J46k54Q6K3l62p7J68K92k72K16K56r8k28
1290a5J27J07m56J23J41L9N4J38m31K26k57J40K38k48L38j70J10lk15l2J55j17
1312hl9l8J66l83K30J81j41J3j65K46O5k34L0%J1J45j01M2K8j39K36j55j73L53
1336A70m17K84n9n8J24o7l4K37l31R4q1r7K46r6j91PL02j97o9n1J94J37k56J54
1360e5K17P0r7m2o2M3k69L13l12J87p0l5J21J61j47o2J90k3k70j7mk76L34J43
1384C8j09O0P7q4R1pq0j7J24k5j56R5P0K3M2L05o51J01K35K60l91q8J26J02Nm14
1410b68Q2J44J75j53l9o6n8J75M4j72N9k0K68k02M4m3L7J79l22J20R2Ql2r7Q5
$$ y = [-211, -4, 110, -225, -39, -89, 37, 80, 6, -2, -111, -60, 172, -67, -115, -48, -169, -138, 124, 183, 69, -5, -77, -116, 168, 16, -216, 116, -93, 139, 6, -59, -63, 111, 89, 235, -19, 67, 90, -272, -349, -181, 111, -161, 55, 311, 213, -15, 112, 219, -237, -114, 27, 66, 120, 258, -173, 53, -204, -64, 174, -74, 264, 94, 204, 201, -14, -46, 109, -8, -47, -85, 81, -302, -72, 109, -32, -19, -184, 62, 127, -107, -77, -77, -66, 79, -22, 20, 48, -91, 145, -10, -183, 170, -247, 37, -22, -80, 44, -23, -57, 180, -151, -57, -138, -235, 11, -85, -276, -269, 33, -164, -233, -284, -90, 47, -209, -55, 162, 232, 135, 93, 31, 74, -195, 118, -194, -7, -77, -112, 9, 170, 23, -39, 151, 128, -142, -159, -163, -439, -105, 38, -71, -11, 66, -18, 73, 66, -14, -31, 93, 68, -88, 7, 77, 100, 142, 447, -204, -103, 132, 392, 1, -87, 39, 141, 146, -268, -186, -42, 133, -20, -59, -125, -183, -8, 36, -136, -77, -97, 171, -31, 13, -30, 7, 186, -136, -16, 76, 84, 52, -45, 40]
1435D0k02K47r7j27K19l00L94k51J70J70j25l84K84O2L9J33j28J6K2l83K59j24
1457f6Q0J6j53o2O0j19P1L95l2j92j64L36j24l1J38l60R4Q6j19J26J41j38J50
1480A33J06o8l36L06l2r3m3J2L7O8l68L04j76N0J6L5n1M3j4j4J49j87L04j70Q0
1505I1r5j77J01Q0j50K52P3k76K8O9j18M2K69l44K09j98K40j87M4P0Lj52J85k63
1529b04O5K26j23K15j82j24r9M09n5l76L90j39L7J82j98j13K33k47k3j4p1J14
1551i7K04l14P4J18K63j81l5J2j16j40J17J04m2K01k42J74K69m28K34m3k98J6
1573a50J29O4L1j09n8J80q5j32m4K96l38L24j62m9j21K86q4lj20j1J66O7N7j69
1597c5K94l24R5j31M7K4J17j06J65j9j4r7M5K5l18J34j4j04J54M4J3K8j07J79
$$ y = [40, -162, 85, -12, -139, 80, -220, 174, -77, 93, 263, 138, -246, 38, 100, 139, 272, 144, 160, 182, -201, 58, -66, 14, 30, -123, -185, -125, -244, -173, 222, 190, -2, -166, 170, 46, 15, 153, -207, -113, -27, -146, -20, 121, -17, 133, 239, 171, -165, 141, 109, 16, -27, -15, 22, 90, -278, 26, -150, -100, -84, -49, -100, -57, -71, -85, 64, -123, 181, 11, 91, -4, -181, -80, 0, -150, 102, 175, -101, -73, -4, -122, -80, 189, -155, 54, -144, 96, -91, -47, 23, 26, -126, 59, -204, -139, 87, -36, 179, -3, -127, -226, 183, 128, -248, 142, 3, 40, 222, 24, -89, 144, -103, -126, -140, -211, -97, 107, -207, -133, -15, 248, 67, 32, 44, -72, -212, -95, 9, -33, 168, -74, 100, 369, -59, 175, 132, -166, -150, -21, 43, 74, -35, -93, 87, 2, -130, -174, 122, -216, 108, -54, -103, -224, 62, -22, -25, -145, -156, 10, 77, 134, -35, 259, -65, 30, -101, -54, -30, 87, -19, 146, 127, 113, 16, 61, 86, -232, -98, -112, -216, -62, -18, -5, 23, -84, 95]
1621I5K39m08K5m3j41M72j95k00M48j47k91K52P1k79J60k1j16j91J53P7L9J70
1643A69k88Q7j87J58J26j15J9J40M1j41p1j18M93j63q1j41K66j13k68Q6L44l99
1665a56K49K5q3k07K35L26l18j03o3k02L05pqQq0Jr9k0K44J53k05l07N31L3l47
1690i5J24J99n4j35j83J77p6k0o0J65M8K9N7j61k93M48j51o7J40r1m0K44o1mr4
1715D6k24K3J62N2l72M84m4R2k95J00r8R7j37J67N1j54Q7K4M1k47M26k71K57m03
1739a36L65l32J53m17L95j22J38R4j71J08k13L64k04K8k1J89j32j05J54j14m6
1760b5m71M90J17k34J06l08K51J03Q9j63j48Q9j16J52K89k26M7R0j87RJ28o8j00
1783h6J33j21K92n2l5k41K91k18k9J70n4J64q4m3J2l84L41q8J63q2j15m1J81K6
$$ y = [95, 334, -74, -49, -92, -233, 239, 44, -156, 292, 145, -146, 106, 177, -102, 58, 37, -79, -270, -117, -40, -1, 169, -119, -32, -219, -61, 65, -50, -31, 109, 150, 9, -62, -180, 313, 150, 69, -72, 194, 81, -187, -101, 243, -156, 93, 118, 35, -172, 63, 389, 71, -32, -95, -297, 8, 1, -7, 1, -79, -78, -177, -197, 47, 200, -5, -312, 219, 252, -95, 29, 228, 174, 39, -144, 33, -43, -63, -123, 42, 90, 119, 176, 15, -278, 170, 19, -48, 92, 1, -39, 205, 144, 140, 46, -178, -155, 7, 59, -313, 171, 127, 219, -76, 24, -74, 23, -114, 53, 104, -50, 37, 61, 102, -145, 281, 10, 267, -136, 229, -103, 50, -367, 28, -94, 44, 138, -33, 75, -138, 226, 22, 50, 29, 218, 86, -19, 135, 21, -25, -496, -6, 111, -123, -17, -325, -74, 29, 118, -45, -193, -104, -220, -68, 221, -5, 42, 132, -55, -46, 82, 14, -86, 47, -74, 218, 166, 131, -110, 181, -37, -66, 104, 50, 214, 130, 87, 99, -285, 56, -32, 131, 49, -66, -107, 74, 100]
1807A00j5l93L04o3j53K09l41L82J5j11J1J35j20J45J21j63l37M36q7p0j36K10
1829G9m2k65K75l2R4r7K44l26K17P9k49k70K08R7J15j23k02J29M9J47Q5k5k82
1852i5J57Nk62L17Q4l42J12j95M84l69K10r4P1j84J6L28l50K86j36r9R5k3j4R9
1876A01j28m0pk5J67j24p1J47J11k69K14j5j3Q5k02q6N4J79j90L50j67J70l09
1899f8K86l15N6O3P3k82J10n6L4J49j10o0J74j40L0J11N4j23q3J78Kl4n1K3j05
1924h4L9M7M4M1j69j27M52m12L52k04M7j38J91r8rK69l91J28m3j11J85j0qR2k69
1949a86m2K38k34L03l11M3J29K51j3j49k13J72L1o4OQ3j32K54j17j05K0r2J84
1972E6J21q0k28J36j78L31K4o3j37K7k4Q4k12K32k15K05J9j18j76P3n3L6k07K73
$$ y = [100, 85, -308, -4, -67, -220, -11, -352, 30, 45, -66, -55, 80, -40, 105, 226, 63, -274, 162, 75, 5, -131, 79, 37, -228, 47, 15, 109, 12, 256, -70, 147, 226, -23, -293, -85, 12, 127, 4, -198, -69, -20, 127, 212, 187, -95, 62, 67, -195, 122, 206, -136, -24, -219, 265, -104, 106, 12, 83, -101, -85, 243, -107, 179, 43, -56, 39, 16, 2, 101, -27, -67, -74, -99, 68, -56, -127, 20, 131, -138, 76, 61, 48, 133, -69, -155, -101, 78, -112, 238, 71, 241, -68, 218, -97, -41, 22, 95, -187, -77, -133, -99, 50, -60, -120, 54, -86, -56, 55, 109, -14, -97, 81, 83, 49, -2, 21, -84, -45, 2, 46, 87, -82, -209, 243, -169, 183, -21, 26, -112, 79, -19, -28, 241, -150, -22, -65, -176, 9, -1, -9, 83, -186, -228, 10, -224, 79, -232, -189, -60, 191, 178, 29, -184, -12, 19, -45, -39, 44, -88, 166, 49, -56, -36, -128, 56, 177, 97, -131, 5, -173, 158, 182, 119, -18, 9, -15, 69, -143, 89, -126, 79, 98, -20, -196, -123, -176, -140, -347, -74]
1996g4J46M1j8k01J78j4K59k38j14qj29K29p8P9k15j83K32L0L4K38n2j70Q7p9
2020b0k00L81k57J16J22r8o9j60K30O1mj92j02L05j69J51K6M0k86j00K45K26l77
2043a31J61k53J51q1L51k20n2Q2n7l4J31N7l37R5K16k07j38N34j80j45k9L4O53
2066F01o27J93l74L86k13k8J03J46j80k79Q7k6L99j91n3K40l18Q8J59l45K04J66
2088A38k17k9L95k92L4o5R1n4j17J12m1J80j03j09r1N2n7n4L68Qk08K38k38J36
2112G7P1j36j43K33O0l23K64rk06L08k53J16j52m4J05J22k77J48pj79M48l93K00
2135C0j08N7J9p7r2L64r1Mk10J69k74J83j23n2J06j52R1K40J50j37o3r7M7j14
2159a30O5M17j84j83m9J13J16k50J53J74q7k56R5j8K03k32K76m30L12O9k36k50
$$ y = [-74, 72, 113, 95, -106, 72, 58, 317, 79, -35, -43, -172, 57, -21, 58, -157, -340, -108, -78, -44, 194, 142, -28, 59, -20, -220, 161, -96, 20, 142, 44, -25, -185, 45, 106, 102, -90, -192, 113, -56, 95, 121, 161, -125, -225, 20, 246, -131, 30, -223, -72, -153, 198, -22, -74, 8, -49, -83, 48, 105, -232, -137, 79, -128, -266, 268, 88, -57, -86, -52, 601, -26, 167, -207, 179, -34, -62, 41, 187, 7, -272, -185, -211, 188, -3, -56, 184, -134, -46, 113, -232, -28, 138, -79, -108, 287, -5, 29, -36, 55, 1, -116, -4, -45, 135, 32, -77, -168, -116, -173, -227, 141, 149, -59, 179, -59, 77, 148, 12, -131, 102, 162, -161, 103, 94, -112, 196, -57, 59, -93, -137, -32, 90, -187, -39, -46, -225, 223, -170, 30, -78, -21, -2, -79, -171, 193, 102, 106, -104, 65, -209, -26, -149, -201, -95, -247, -156, 84, 234, 97, 34, -63, -16, -130, -65, 352, 168, -15, -64, 49, 165, -85, 68, 242, 155, -101, -6, -24, 179, -53, 223, -207, 105, 174, -62, -312]
2181c12M53k75K19p5k69J84p5J62J04J34m71K5J46kK69pj02k32J54k18P4J40O5
2204I1K7j98K50l63J31j24l6J84j28J92p8j41K30m4M1K25j42m41J60L84j6k75
2226g1q8j0K50j91J25j01M5p8K7J83k28R9Q1j62K08K70j30k70N5j33J84k32QJ40
2250a9J29j49j0J72P6k69PJ26j2L38l65l9j70K11m0j5m0J62k48J00Q6P1j40L55
2274C17M4l88N5o5k20K42K6j63K41l36N6P4K09O7k02J26j35P0J30j79O5j46j54
2297b66KP6P3L34q9p8j75J67R4k18j93K25K29m76K05K70q8K01m20L20k67J01M5
2320G2K7O9k90K05m3k0n5R7j13K08k09J04k79K83j72p5L52m8o0j01L6q1K64j94
2344b3J00k6J02l4l33M78k02M6o4O9J02k45l05N24j78N4p5O8Q6l05J34l1K04p9
$$ y = [-312, 141, -134, 85, 10, -259, -75, -150, 12, 116, 250, -221, -196, -50, -52, 217, 210, 108, -124, 30, -188, -114, 26, 91, 118, -80, 170, -193, -62, -186, -222, -38, -166, 26, -52, -193, 37, -7, 34, 259, 117, -324, -164, 220, 204, -71, -159, -169, 81, -110, 15, -86, -41, -119, -92, 91, -137, -38, 43, -119, 89, 359, 229, -41, 14, -119, 65, -167, -159, -19, 110, -39, -49, 123, 199, -70, -63, 63, 51, 389, 24, -15, -185, 26, -14, -29, -69, 93, -155, -55, 31, 102, -38, 317, 361, -27, 28, -37, -257, -15, 11, -152, 89, -247, -191, -117, 92, 159, -43, 83, -52, 18, 148, -31, 34, -112, -266, -264, -188, -115, 219, 130, 52, -123, 44, 138, -80, -273, -48, 181, -295, -90, 180, 92, 293, -127, 193, -74, 27, 72, 99, 168, -122, 83, 40, 20, -35, 62, -51, 157, -52, 52, -227, 56, -116, -191, 161, 113, 53, -48, -12, -93, 171, -23, 77, 51, 153, 119, -214, 264, 62, 108, 44, 113, 215, -30, -335, 189, 11, 65, -10, 58, 144, -161, -27, -58, 146, 67]
2368F7k9p2%j70K14J41L8k18pJ17q9J79n0k0m6J06k89J7j27K02k2J37K70l29J06
2393A26Nj86R9L0k2j22J2l7o1PL7J34q9O9K24m45M13J92m39L8M8k49J41J0j89
2418b54J59L4m5L20l41P3K67p3q5k20J60j57R1q1J50j35J54O1o5q8J41j83k6L2
2442a11J04j6l5M3J77l16J34m1Q6j06R1j5j10K72l68J47qq5J22J47j59q9J66K00
2466B30N1k95N5k99K56M8K16k63l9l9J24J43j61j04N1j53K35j80K53k50o1K76
2488I4O6j54N1k80M61j11j48J69j81j22M6m4K78j7j25K1n5o0qK6J54K94l90K31
2512A96m14J72j13J52J77j54J42j22N0O9l2J63l66J51N9k57J42P4k53J73J8j15
2534h8J63k2Rj48m8P0K45k33m4o5K98l14L32j24j48p7j7Q7L45r1K32n03L0J49
$$ y = [67, 38, -34, -34, -204, 10, 151, 189, -29, -36, 81, -8, 171, 121, 101, 55, 161, -128, -111, -238, -36, -58, 79, 349, 20, 126, 131, -55, 44, 74, 52, -70, -58, -95, -156, -149, -112, 22, -67, 2, 226, -219, 194, 386, -53, -15, 33, -216, -75, -65, -254, -95, -61, -106, 214, -127, -54, 213, 140, 55, -165, -5, -162, -71, -152, -2, -137, 17, 78, 13, -75, 66, -117, -143, -111, -7, -23, -58, -15, 162, -154, -20, -61, 25, -81, 10, -5, -115, 157, -211, -64, -72, -157, -35, 112, -47, -136, 30, 230, 281, -14, 41, -258, -2, 46, 262, -1, -40, -79, 45, 188, 27, -77, -26, -179, 56, -124, 129, -121, -182, 94, 160, 6, 57, -223, 238, 127, -21, 148, -33, -155, -109, -153, 125, 108, -17, 4, -51, -111, -119, -93, 61, 355, -35, 196, -218, -46, -159, -7, 170, 16, 158, 36, 86, 155, 123, 286, -80, 71, 130, -127, 15, 89, -164, 9, 27, -88, 75, 53, 62, -86, -134, -64, 181, -52, -96, -161, 137, -177, 155, 31, -117, -194, -211, -124, 221, 130, 362, -141, -111, 38]
2558C8k24K16M3k70J21J57k07J21J55j24K25l38J73M2k10J14J73l78Q4l3J73Q
2580E9P2r7J29j37j04Q5L4q0m3L4j01J55J04o9q1J72K0n7k5j79K71k48O9j62K02
2605B3J51j02mj81K60L3k19m5J87k38L0K08J39j49J39O3k01j20L59l97J13r7K78
2628B30j69j75L66j95N4j1q1Nn9J65Ok15n8M9k28P0M73k72j5K29J07j79Q3m23
2652b43J66J61Q3k69j0J18j27J19j15n4J11K15j79k62O75j62k58lN6M7j61L87
2674B95l33K38k64K16l43L1J03k6n9K47j39R5J04J73j24j52n8j90K15o9o9k7K49
2697A13j31r8N2R3P0o6r1Q6j02nJ14Q0k76P9j01J74O0M2L5l09K22Jj02M2J10J23
2723B15k32k4j2K74k26j43L4k11L10o1J3r5J72M9j43j70P3L28j99j25N0L16J0
$$ y = [38, -186, 30, 73, -197, -76, 81, -126, -5, 150, 26, 251, -87, 86, 128, -82, 32, 205, -173, -89, -122, 51, 59, 131, 34, 163, 26, -78, 7, 41, -39, -82, -48, -149, 6, 110, 41, -40, 132, 152, 95, 70, -109, 162, -86, -17, -179, 23, 174, 72, 68, -113, 147, 180, -39, -84, 103, -135, -105, 103, 242, 93, 232, 295, 94, -26, 333, -64, 49, -48, 230, 61, -114, 252, 57, 111, 100, 19, 24, -35, 130, 136, -79, -137, -88, -316, -246, 227, -45, -60, 169, 276, 97, 180, -243, -77, 84, 167, -102, -112, 6, -121, -2, -117, -171, -60, 155, -24, -286, 389, 227, -31, -34, 22, 69, -92, 295, -38, 200, -64, 152, -191, -160, -57, -83, -142, 105, -34, 61, 165, 338, 214, 62, 4, -186, 29, -40, -109, -136, 113, -18, -116, -64, 29, 99, 33, -58, 28, -74, -79, 35, 115, -161, -82, -183, -9, 51, 93, 128, -181, 41, 42, -60, -18, 92, 215, -17, -41, -53, 221, -5, -148, -114, -325, -15, -76, -63, -158, 14, 63, -80, -250, -177, 151, -48, -173, -123, 193, 203]
2746B03k94J88ol14J40L06l56J41o9K8j95K69O6Kj36k6Ko2L04k35j61L93J40l60
2770c2J29j07Q9j2k09M3J20P8Q6l18L44l63J02NK9J32k36K42j38Q7j56N8J0J42
2794A25k79K86j12r8L00j27k13L78k79j71L40p7q7L30j13n05J09L14l07L30O2
2815B06n4j14J82k57k1Kp5N2M2L6R0k36J68J7j88J65Pj42K53r7J78Nk09J15J51
2840B76j86k27l6j03K10q5o6J65J23k14p9L71k27J00m2N0k3j3J1r9l0K15O7p3
2864H5j66o6J15K20L2m15J57N2J51p3Jk3j80L85j64k06O8R7J04k01M6nO5k23M9
2889i5m1J52m3J95k10k7J72l30M19l04j41K90O1L1o9l2r4j53J23k29L41k74K25
2912c3J6K5l10M5K68O7q1PJ46j91Q3j96J05K19N3l63J46J28o9L5J02k57K57k00
$$ y = [203, -91, 97, 91, -223, -83, 223, -133, 8, -61, -33, -228, 41, 107, 109, -27, -53, -51, -113, 191, -44, -205, 188, 328, -32, 97, -10, 79, 67, -142, -99, 21, 99, 185, -133, 211, -152, -50, -45, -16, 116, -120, 122, -16, 71, -85, -27, -17, 125, -154, 132, 20, -78, 222, 95, -118, 260, -19, -190, 150, 73, -14, 316, 203, -302, -193, 121, -186, 144, 206, 152, 38, 220, -37, -58, -56, -131, -79, -37, -1, 89, -147, 21, 38, -150, 15, 22, -120, 133, 36, 214, 219, 10, 125, 276, 90, -137, -173, -276, -66, -151, -217, -52, 71, -143, -222, 149, -78, 22, -20, 30, 7, -6, 5, -94, -124, 91, 158, 85, -81, -147, -32, 188, 220, -195, -38, 14, 165, 92, 93, 70, -110, 275, 111, -95, -27, 70, 174, -27, 19, 14, 79, -144, -95, -136, 16, -27, 168, -42, -69, 103, -227, 192, -112, -253, 37, 98, 129, 60, 28, -66, -219, -96, -325, 16, -258, -33, -17, 8, -302, -257, 11, 78, -3, 4, 150, -41, 42, -154, -49, 170, 223, -140, 6, 134, 65, 100, 202, -55, 202, 2]
2936Bl27K28q2J97O7j17l1J71k9k59L25j77m0K23j41N8K1l85L57k2K47n34M18
2959A70j31k14K58k43L1K60j6r0r4l4J23m3J22n9OOK03k25k62K32J56j68J95k70
2983h7J93j10o4M0j59J61q0O4PP8J00k39J75j30N5l5J25m8k9m3Jq0K15J78k96
3008hL1P4o3P7j19j32J27J24o7j47p9o1L25L8k84K25j30J73p1k62J66j1j17L15
3032A24J92j80J15k62J64k72L38k71q3J80p6Q1R7j26L7J2j36K21n9j82j80Q3J95
3055A2m0J77k20K56j1k11O2k37J31l10M09L4j4P1k18J62k78J24J10O1j76l0L21
3078A85n6p5p2Q1J84k87j5J23k93K36N2lK3j37k4K6P5Q3m7P5j44k1p2J18M7k4
3104C8O4J3pn7rL0k10O7Q8o7J65J3j1k12Q9M2o1R1r6j85K06N7J17l08K7O7k24
$$ y = [2, -325, -97, -179, 18, 85, -32, -63, 108, 79, -180, 145, -32, -72, 151, 10, 68, 89, -296, 61, 39, 286, -248, 170, 39, -175, 83, -160, -129, 131, 115, 25, -69, -103, 20, -23, 99, 40, 46, 52, 255, 30, -232, 0, 156, -12, 183, -87, 106, -4, -68, -28, -187, -26, -106, -42, -35, 43, 143, -96, 79, -51, 4, -31, 94, 46, 17, -26, -25, -105, 110, 288, -8, 23, 97, 34, 111, -8, -140, -13, 111, 44, -103, -182, -243, 82, 120, -164, 61, -69, 104, 33, -229, -63, -74, -191, 124, 316, 136, 251, -11, 153, -119, 219, -52, -135, 45, -31, 50, 147, 21, 58, 70, -66, 155, 96, -86, -266, -183, 12, -28, 149, -71, 185, 174, -37, 25, -212, -81, -391, 18, 52, 38, 109, -109, 53, -225, -101, 9, 70, -106, -136, 185, 129, 54, -18, 63, 247, -40, -55, 68, -225, 11, 63, 60, 83, -54, -78, -52, 23, 106, 59, 134, -10, -31, -103, 15, 62, 38, 102, 115, 108, 51, 42, 72, -138, -71, 17, -50, 115, 128, 117, -95, -6, 36, -25, 66, -30, -215, -9, 48, 165, -143, -116, -49, -273]
3131b73L96k35j2J12n6L4N0J11j17p0K12j48p1J14m2l2l6O1j08K9J95k02j15M16
3155B13m73K61l7L16j27l7k30K74l96K61K8j6r0j9K74l15K73j17q4M2K66rj59
3178I9j17Q3k71L27j82k42L60K2k66K87j91n4K92l64J85QR1k9m9n5j42L67k44
3201h5Ol50K12K48R2l36L12k98K22R5O8l94L39l83L65k8N7k71L9J33M7j9j07J17
3225H1p4q8k20L77K8j14J13j26Q7P0j45k05K68j81L7K53k72J69j53J2j40M66l34
3248i1j17K72M9m0L7k57J75K58k71l3r7k4R5q5J51N8L6M4k42jJ69q0j59L52l32
3273a33Q3N2j09j47K43O8r7Q8k33K42L5Jk8J60j35pK0J73k86J31o1k84K14q2J79
3298H7Q3j36M4R8l72J96L9rJ74j24Kp9K0J36L8k98K15j31J22m02K71k1J86j33
$$ y = [-273, 123, -112, -124, -12, -68, -34, 16, 127, 10, -60, 152, 4, -67, 47, 5, -27, -63, -2, -110, -81, 114, -88, -203, 213, -260, 1, -36, 280, 153, 116, -114, 160, -236, 25, 53, 37, -53, -72, 202, -113, 160, 43, -41, 1, 267, 258, 99, -18, 65, -206, 121, -61, -303, 57, 79, -187, 100, -91, -145, 147, -217, -32, -24, 67, 38, -11, -66, -208, 159, -85, -79, -429, -217, 31, 123, -213, 99, -199, 23, 118, 186, -208, 131, -252, 113, 85, 142, -129, -90, 43, 90, 71, -36, 81, 7, -81, -301, 76, 104, -10, 103, -23, 64, 134, -11, -216, 52, -129, -92, 161, -111, 58, -95, -83, -223, 243, -91, -208, 64, 113, 73, 110, -147, 28, 286, 15, -18, -115, -139, -44, -129, 22, 80, 116, 160, -82, -83, 86, 6, -153, 199, -133, -50, 2, -107, -254, -11, 57, -40, 48, -185, 57, 92, 93, 65, 225, 90, 83, 103, 276, -10, 121, 60, -224, -10, -92, 87, 170, 34, 78, 176, -196, 0, 39, 30, 204, 80, 82, 3, 23, 159, 197, -101, 114, -17, 105, -297, -26, -47, 139, 6]
3322Fj55K75j55MM0k1p0O6n1J38o5J02k00M8n0J34j86L34l41N8M9L2%L0mq0j22
3349a84J40k7J66j69k4j15L6K90k12M9j44OP6M9j8K09p1P3Kj95m4J28J55k92J52
3374C6j03n2L22P3k94J24k13J24J5j02J60R0k15J36j51K34k49Q1N1k27M0K59k4
3397A15k34L7K85r3j31L74m04J34q3O6j68K16p0J8r6k58K10K56j61R7k65k6L59
3420A78M2j89j33J00oO7J10j34r6p2K4j7j2K67j35N3O0J17k18k5j9Q7m0j10J01
3445@Nm1O9J2r9j52J67K48j89r1o8j0L20j43j72J87%l2j87J42n7n6j51J67oL52
3471B15m34K76j13K02o1l8m7j04J22P5k83L97l12R0j16J79J9l26M37l34l8J70
3493b4Q3O2k04J43J24j53Q5j60J40j95J84J4j81K45j96k9J76J2m4l29Q3L05Pk60
$$ y = [6, -149, 126, -29, -25, 15, -6, -76, -10, -61, 77, 12, 114, -86, -38, -88, 46, -140, 194, -147, -89, -40, -8, -8, 22, 18, -62, -184, -44, -71, 95, -74, -98, -213, -177, 113, -99, -50, -194, -188, -112, -63, -81, 128, 57, 130, 132, -63, -107, 21, 176, -116, 36, -67, -119, 203, 276, -18, 106, -107, 17, 32, -70, 90, 180, -35, 101, -50, 184, -65, 16, 67, -160, -120, 139, 115, -119, -82, 203, 110, -21, 353, -51, 83, 0, 66, -102, 114, 44, 62, -34, -292, -82, 174, 13, 110, -155, -181, 178, 220, 31, -102, -2, -8, 59, 169, 35, -61, -133, -109, -126, -138, 129, -6, 47, 107, 224, 6, -19, -38, 49, 9, -101, 0, 5, -36, 33, 45, -54, -206, -39, 209, 20, -71, -139, -149, 171, 28, -144, 43, 43, 11, -176, -34, -91, -147, -298, -131, -137, 215, -219, 57, -56, 146, 85, 47, 0, -104, 18, 93, -190, 207, -105, -15, -131, 48, 67, -259, 178, -156, -194, -24, 59, 121, -83, 60, 184, 31, 116, -44, 96, -99, 85, 99, -82, 163, -33, -62, 114, 126, 82, -247, -164, 141, 148, -112]
3517a12J91j12p2J14L79n23N5J04R5q1O7k59J26J23k96K95j5J28k09k01m6J26
3539a23K60j57m1O0K62m00l8J4j13L33o8J71Kl15J42J85n4k88P7K56k62N1m3J1
3563g8p1J3K68q6m3n7K27l17O2K25k31r8J91l5j57J98L0j11L9J13K05m88K73j79
3587a07K24m32L26p9m2J44m6J13p1j61j01J76P1J70K2l46K65L6j23k33K67l9j00
3610f6J21j83n5L4L65k49J11k90L1J72k2J8J9M8R1l00M8L01r0k00jq9J48K0N6
3635C8Qk18O8K41l27Q9K7Q0j30J20N6K1k76K32P2q7j10K02j58o4J05j33K11j03
3659c6j04J03l0K6k6K55k31J98l83J83J11p9Oj04L2p3M2K9r1M39j22R2j15p3J55
3684B04m37K13K01j10lj60q7K32O6j46j00P3K04j96k31N9J00J08j15Q3J14K4%
$$ y = [-112, 79, -33, -105, 9, 388, -135, -80, 24, 119, 38, 105, -154, -28, 95, -201, 94, 79, 207, -2, -203, -249, -123, 137, -20, -61, -1, 261, -139, -177, -163, -276, 57, -11, 160, 162, -153, -11, 174, 120, -168, -91, 165, -97, -46, -89, -78, -149, -136, 132, 46, 3, -54, 173, -144, -82, 143, -88, -186, 5, -30, -187, 11, 41, -70, -31, 82, 287, -201, 72, -107, 117, -315, 11, -68, -110, 34, -12, 101, 30, -131, -232, -56, 15, 185, 207, -139, 126, 162, 39, -194, 73, 34, -66, 55, -128, -183, -149, 216, -33, 78, -212, -181, -9, -31, -13, 6, 54, 145, -155, -107, 194, 104, -96, -97, -186, -38, -18, 38, 46, -172, -104, 137, -190, -101, -74, 6, -124, -4, 52, 73, -203, 29, 101, 14, -96, 106, -52, -116, -11, -144, 67, -36, -140, -37, -67, -41, -67, 188, -43, 155, -228, -45, 66, -13, -7, -111, -79, -152, -110, -81, -172, 267, 145, 237, 122, 49, 204, -233, -20, 181, 71, 68, -92, -179, 53, 119, -27, -127, -54, 150, -46, -277, -218, -118, -10, -125, -42, 72, 96, 96]
3707I6j78J41j76pK18q8l7n9r9K39L0M4k05k5K5N2O4pK54k69R6L7k32K44m44L40
3733E4j41M6o4o1K94j59l80M96J35l34L06l09L4J72j07oj1k19L25qp4K05k67J77
3757A04l52j0M46k74j56J57J3j66L15j43J80l36K67o9Oj6P8j46jM41l73J94j64
3780eJ9J84l01P0k39N6P1j57M92k94Q7P6j2k03K06j33J15OJ29k62K87Rm25K19
3804eJ24k47n3Q9n8mJ57j5Ok21K45j65J85k6q8J52K6p6j6j15M97m96J00j27K22
3829I1k21K05N9k1n8pL62m48j82J24J6L16k52r5N56l29p2k22K72M8O9l42J71k60
3853b20L52j21j03R1mj43L30N9k05K5j4J13l27P2o7J25Q0Q9M1j91r9M2QJ12O5
3878A10M8j20o8k1j10L2j35L44q8O3k09J45l5Q5K6J46q7l60K30j56K55Rk46k61
$$ y = [96, -82, 59, -117, -124, 94, 6, -31, -90, -189, 50, 80, 124, -81, -106, -81, -29, 35, 28, 282, 13, 109, 146, -86, 158, -286, 54, -87, -41, -105, -166, 128, -31, -411, 85, 220, -114, 192, -117, -83, 89, -18, -24, -35, -254, 71, 63, -11, 194, -73, 104, -248, -258, 188, -86, -242, -85, -72, -238, 77, -66, 114, -222, 45, -24, -18, -34, 44, -102, -103, 338, -35, 159, -5, 14, 198, -103, -33, -272, -216, -145, -302, 190, -104, -17, 59, 47, -156, 50, -83, 32, 38, 167, -95, 192, 201, -224, -5, 119, -128, -181, -92, -150, -154, 3, -12, -6, -227, 18, -147, 38, 12, -76, 76, 102, 26, 10, -105, 392, -104, -4, -131, 91, -130, 75, 134, 113, 55, 48, 410, -38, -220, -96, -80, 236, -16, -111, 445, 116, 44, -178, 94, 142, 211, -131, 40, -220, 132, 11, -92, -1, -5, -148, 182, 241, 36, 61, 47, 160, -167, -95, -162, -37, 43, 132, 173, -18, -117, -75, -67, 45, 110, 158, 38, -30, -51, -161, -129, -264, 80, -8, 55, -154, -9, -44, 41, 67, 213, 126, -234, -4, -160, 95, 104, -142, -403]
3902d03L49J66l9j14J00j08p4j9j8J49K4j22J4M9j9J37M2j49J55k42J12J02j85
3925i3J82j0j39k08K93k82K24O7k47N4K10j2M9j89J15J6J95j03K2j47j4J03j71
3948h5L64j27k88R4L0L0r7K7J5K8m2K6k2K9J36k38L04o37O41j5j62j97J49O7J4
3973D4p6J2q9k2J51N9J48m09K11J22j97J9l1J3L15k40J36j88j07L7K14k53K95
3996A64j5n9j48j82L41k15J94m0o9j76J36M6o4n1L4l18L12L29p5j55n7R0J94l66
4020a50j73L72J84k17N5k64L48k63L15j32l2j90J76L11k95jk34M05o8k57K28J46
4042B64k96N9Q3l2O9l54K84L4k47M3J79j42j9K7Lj1K47m1j5k18L25j75M9o2j13
4067e9J56j1M3m62M96k2j65j04j4J43N6q9L1k03j9M2K00K44l36j0K45j98R6k59
$$ y = [-403, -54, 112, 73, -41, 59, -49, -123, -142, -160, -11, 13, -109, -95, -46, -65, 72, 114, -35, 120, -122, -10, 92, -93, 89, 79, -60, -268, 25, -257, -33, 34, -213, -159, 51, 39, 88, -101, 14, 30, 225, 122, 144, -3, -17, 86, -85, 279, 152, -136, -42, -12, 18, -79, -52, -37, -9, -51, -25, -47, -18, 118, -120, 184, -453, 188, 173, 11, -186, -37, 30, 44, -32, -20, -109, -131, 20, 79, 227, -182, 29, 151, -46, -27, -58, -45, 270, 30, 166, -22, -129, -92, 122, -131, 164, 149, 90, -58, -240, 101, -114, 80, 40, -29, -205, -69, -23, -87, -138, -104, -422, -110, 219, 144, -11, -68, 22, 216, -150, -323, 49, 233, 16, 71, -193, 155, -108, 207, 75, 43, -147, 29, 340, 45, 44, -190, 215, 147, -110, 118, 264, -32, 27, 110, 78, 147, -207, 77, 111, -136, -93, 86, -56, -75, -48, -45, -56, 191, 150, 135, -83, 242, 67, 116, 54, -59, 97, 86, 129, -333, 163, 141, -24, -128, -142, 1, 57, -32, -1, -204, -223, -181, 19, 263, -73, -83, 162, -36, 60, -199]
4091a99K36m0Rj25J4J99P6l3k23J36O8J51l45j5o3J28J16k16N1Q1j86L07j42M2
4115B7j45Q9k37M2L53k56O2P6qN9k35K14j16J9p0K95j49j60L16k15L1P4J10k10
4139c4j9J98k25P0j44P0l0J68k09K57k10P3M8L7j46M5j54K80k79R5N0J76j59q3
4163a25K24l5p6j77L99l09K45l55K90J3j75K7L2J09l7Mj70L30l03k7R1lL2O3l47
4188b80L19J6k69K64m0K21m95K98J35N5j91R1j57q4J70N2j59M2L5n4Q3j17J06
4211D1J13l5q3k9L0j30J07Q6k15K40l49K14L9J52k43j47Q6o6J91j60J98j82J47
4234EP0j7n3mJ79K03l59J5P7o1J9j77N0K30k51J69k62K06L09j06k27K18j73M5
4258A05M6k79K38m2J65m72J74Q3J66j50Rm6p9J23j38J07k35J78M7n1P8j12K38
$$ y = [-199, 37, -3, 6, -119, -105, 94, 170, 137, -86, 50, 118, 269, -76, -91, -154, -26, 90, -126, -75, 6, -180, 127, -15, 27, -118, -29, -266, -224, 129, -127, -65, 11, 3, 62, -173, 41, -75, -56, -126, 169, 20, -140, 176, -39, -8, 66, 176, -34, -53, 145, -80, -10, -154, -84, -114, 54, -155, 102, -108, -35, 13, 50, -96, -51, -205, 75, -204, -109, -59, 117, -42, -125, 99, 64, -12, -189, 210, -99, 146, -209, 81, 94, -81, -54, -22, 87, 50, 54, -116, 214, -89, -116, -25, -28, 4, 67, -280, 39, 55, -214, 50, 10, 231, -264, 34, 169, 224, 33, 124, -33, -117, 53, 105, -54, -12, 23, -31, 52, -65, 41, 154, 119, 36, 7, 37, -93, 14, 100, -115, 125, -224, -10, 29, 181, -62, -209, -123, -189, 2, -158, 40, -142, 5, 75, 58, 5, 1, 180, 383, 24, 39, 116, 55, 74, -103, -53, 177, -74, 95, -167, 39, 348, 242, 15, 233, 60, 105, 151, -128, 110, 68, 233, -239, -65, 18, 184, 34, 43, -3, -82, 41, -97, 10, -225, -47, 0, -51, 27, -85, 153]
4281A53j93n0K90k65J9J42L9j89K38j00j05K7K28m29j1K17J30j84J03K33l76J52
4303F9j47J74j12j8L25n05J7J33j5K8j14K02j27l4J86p8j85N4J43J11o3Q4k04
4326g6J29j3J07k79M14k33O1r2j46J96m5j42lK05L12m89J46J39j68M4j65L3P8
4349A3Pm2j25K35J43n5l63K65o7J21k42K49j38j13L96m68J03k36J17L03k48K73
4371A28k27J50j57R9Q9j65Q8m1J34k5j84N7J55k9r7j38K67k02J52r5K01m07J00
4394a47K67K0j74k8L87j90P2j38o4K7n0l5K59k52J86M3k63K24M2R6k46k89L04
4417E1k68N2J22J94p2J67l92J56j32J11j39J71q7L49p7j98mj97N7J42J75j66j27
4440a12%j70M08m0j59J12J50j69p7Q5q8K98k56J8K18k91J23k67J86N9l5j8o7j18
$$ y = [153, -40, -90, 200, -65, -46, 96, 135, -54, 184, 84, -21, 6, 234, -195, -206, 11, 141, -43, 60, 293, -83, 69, -78, 96, -16, -34, 291, -214, -197, -64, -79, -51, -165, 37, -90, -124, 62, -16, -201, -147, -4, 107, 44, 128, -76, 53, 40, 147, -132, 282, 49, 110, 18, -128, 68, 23, -119, -122, 83, 395, -94, 52, 191, 23, 67, -98, -65, 13, 20, -22, -147, 88, 231, 176, -187, 78, 11, 132, -110, 139, 1, -112, 284, -184, -81, -317, -200, 103, -145, 128, -99, 51, -106, -7, 82, -83, 5, -36, 98, 73, -111, -54, 101, 72, -25, -163, 104, -98, 54, -41, 160, -247, -147, 120, 140, -34, -62, 325, 135, 207, 69, 5, 32, -18, -53, 206, -46, 140, 183, -80, 144, 186, 282, 36, -253, 51, -217, -165, -43, 151, 79, 246, -146, 10, -122, -11, -150, 21, -66, 283, 206, 8, 4, -193, -136, 6, 181, 15, -112, -112, -282, 126, 86, -73, 39, 189, 20, -57, 28, -60, 238, -18, 0, 218, -73, 50, -217, -31, 28, -7, -25, -92, -210]
4464b10J84j15M5K50k00J20n3K6K24j87m39M30j03j53O8J43J86m18K99k74L14
4485A37k47j9K14lm1L9j4R2k95RJ63j31m6q1L22L0m60K67K22j18%np4J06n4M8
4511F1o5Q3p9J21j69J21j39K42k40P8j49J27l6P3j98M72l36P2L6K57l18k6M6j16
4535h2q9J00R6l9N3j44J11k03Q2J16j31K26J7k67L33k65r2L94k92o8p6O8K33L6
4559A17k00J38m2J14m6j91J99n1K65l59ql6J00r5r0M37k95J81l56K95nm8RJ5P6
4584A24l54J03O2P0j38J35P2j89J11j64K78k38J48j30O3R7j06m0l7K72K5L2k06
4607a0m6J35k42J16J5J20k11m2J26K09p1j05M29n14L7k24L60k54K05rr6P2O8J80
4631B48l06O9j16J53J23j97J55j72k4K7J82J47j74K3j38m1J60r2j71K63m9n6k31
$$ y = [-210, -26, -141, -96, 154, -46, 74, 21, 47, 271, 84, -355, 75, -28, -181, -113, 30, 216, -202, 97, -177, 137, -110, -129, 85, 82, 41, 80, 66, 158, -137, -128, 35, -96, -142, -223, 99, 129, -331, -64, 158, 40, 40, 35, -39, 67, 13, 61, -4, 79, 0, 121, -48, 73, -66, 176, -64, 14, -135, -8, -44, 29, -169, 303, -33, 39, 75, 332, 14, -12, 34, -82, -171, -71, 25, -14, 39, -105, 6, -197, -115, 1, -130, 96, 113, -154, 179, -86, -178, 216, -76, -144, -220, -152, 81, 117, -83, 55, 13, 127, 81, -110, 89, 38, 303, -56, -64, -100, 0, -95, -185, 252, -43, 138, -218, 77, 72, 24, 33, 48, 124, -230, -127, -65, 5, -133, 2, 74, -115, -4, -168, 110, -128, 20, -110, -47, 50, -56, -96, -133, 139, 164, 196, -10, -56, 79, -163, -47, -32, 88, -123, -165, -39, 170, 99, -6, 423, -91, -54, -278, 82, -172, 33, 24, -72, 0, 68, 248, -58, 11, -105, 48, 171, -26, 129, -43, -67, -40, 142, 289, 115, 138, 0, -41, 119, 27, -144, 119, 70, 14, -217]
4654b17K87k46M9K11J36j48j11r1jJ88n4R1k61K36P1j72J58j12k67K57R5l22O8
4677a55K9J52K5k14R4LJ58j25j0J79j37L1N4k13K96l42K33o5k60K80K1%j24j43
4701b33K34k3J9p6O9J75j71o2r8J1J02l4J00k55J37J56r2L4l35L92k60R6J7O5
4725c2J84k46J56o6j13J35J05O8q5j95J60J33L9k84m5k3J70R3k89K14N9j68k31
4748b61L20L5R5j93m1N5j03K59l74K19k66N02k70k43K67j45J22j87K60r7j5K1
4770d0j8k7K3oJ38%j71J39N0p3Lj78O3k2K72j52k6K61l50K26j54rn5K30p9j90
4796a45L20J9l85J07j44J44RK30q9P3j34N1P4J04o13K55J2L02n4l1n8k56L78l98
4820b29L75k95L27k17k02J66M05j73l28K18k6j82K58j36N9k8n9P2J42l9k98L50
$$ y = [-217, 70, -176, -127, 84, 220, 72, -39, -130, -131, 57, 3, 94, -167, 69, 140, -32, 126, 14, -253, 4, 99, -223, -155, -126, 26, 51, -163, -69, -66, 92, -33, -43, 136, -1, 30, 84, -129, 167, -175, 58, -7, -267, 13, 34, 34, -90, -233, 1, -22, -3, -79, -10, 165, -6, -68, -166, -155, -53, -87, 13, -242, -105, 51, -41, -7, -342, 50, -210, -114, -97, -32, 152, -94, 62, -4, -117, 18, 123, 191, 106, -89, 71, 204, 243, -41, -86, -109, 61, 154, -135, 79, 138, -30, -261, 59, 94, 189, -4, -45, 10, -93, 166, -208, 11, -255, 247, -23, -266, 1, -144, -22, -209, 51, -46, -61, -40, -58, -85, -62, -68, 70, 70, -101, 38, 88, 15, 18, -160, -97, -119, 153, 1, -25, 236, -114, 112, -42, -51, -106, 124, 45, -145, 175, 194, -191, -84, -228, -84, -75, 155, 66, 139, 5, 56, 130, 234, -379, -124, -112, 190, 136, 105, 47, -209, 169, -229, 146, -149, 178, -39, -241, -75, 330, 157, -171, 47, 21, -161, 97, -39, 20, -8, -67, 5, 147, 108, -190, 160]
4842A60k90K1J66j99Q4K96j95J7l56J65J13J05l2j40o7N5K1j4J02l27J45J00K04
4865A34j86j44J31K37L7k90J17m3j07K39q3p6J73j51K21l48p5L16k71N9K35j64
4887c9Q1k37J64j19J09P9Lj47J45j96n9J08L0p6J69j30NJ65j59K46j64k2k80J94
4911a30P6j51L78j02J6k1Q0k77J24r0O4j74J95j55oJ85m6J37j6J86k70K08l11
4934a00K12M5k11Q1O0j01k7K1Q2J3O9j74L0j25j0Po0J51j1m1K37k56O4J67j54
4959c1M7J42l41J86j67K40N2k23j70J72K72l73q4L68l05K69O1j17J66k13K67k16
4981Bj05P9j4l8l8J19n5K39j57j7oK1k3Rj12L92l92K43k31J91l56L34o3j6l2P9
5007E3l0J02m07L8L02Q7l11M00k79J99j36Q5k06J20k37J72j4P8K3N7R4l17O7L8
$$ y = [160, -130, -109, 57, -142, -58, 238, 43, 60, -296, -131, -18, 87, 55, -85, -152, -97, -76, -90, 12, -315, -170, -70, 134, -52, -196, -65, 172, 209, -81, 36, -7, -114, 125, 42, -34, 139, -12, 209, -139, -214, 102, -169, -110, 125, -39, 42, -195, -31, -150, -41, 38, 41, -106, 39, -157, -216, -108, -78, -154, 15, -115, -110, 55, -104, 142, -22, -44, -324, -130, -54, -205, 173, 71, 87, 66, 146, -131, -7, -97, -33, -207, -12, -167, -173, 12, -34, 103, 87, 273, 3, 211, -100, 112, 157, -54, 27, 87, -14, -41, -20, 62, 75, 144, -30, 0, -125, -135, -128, -188, -37, -48, -89, 148, -108, -44, 123, -31, 16, 158, -183, 3, -164, 76, 128, -95, -265, -93, 179, -194, -278, 90, -215, 54, 115, -2, 164, -49, 218, 2, -103, -24, -38, -76, -114, 5, -50, 189, 32, 15, 9, 30, 7, 16, -96, 296, -96, 147, -84, 107, -249, 85, 22, 6, -26, 53, 23, 125, -282, -244, 58, 145, -166, 234, -45, 154, 18, 103, -103, 17, -220, -48, -62, 16, 39, 96, 190, -127, -60, -22]
5031b2j5K23J8l29K19k67K6K2R1J2j4J97j47j4R2j41J9K80p7l63J0Q4m04M14K17
5056A31j92j3J33k72M13l90K43J62l26j0j08K32%J51j83J58J12pk32j05K42j65
5078b6R3o6Q3M3l02K10m3j7k10L44j45k00J33K55o9j25M4k50L54k49j37L34kq8
5102c6R9j35q8J09J56Q5k74K58r4j99k2J12K7L1l9R0K11Rj13k66l1j46J73L3j
5127e1L1J71Pk11l0J66j37p4M27l96P3j27p3L47l26M16l17PL3P9j49K69q5L0q5
5152eJ58l40J44j06j6J9j06K22L22K3l30j35O07m07J36k1k02K03r9JQ5j80k4J12
5176F1J12k11n4%J20k63J02J34K14k89R9M0n6J74L2j37q8j07M5J67j29L3j38M4
5200i5J58M1j23J00k53K32k0O6J98m19N08k81k02J79j64j14L60r4k67K05j7K80
$$ y = [-22, -37, 186, 204, -125, 94, -173, -147, -125, -34, -22, -36, 161, 14, 0, 92, -49, -30, 250, 173, -190, -180, -96, -500, -86, 131, -61, -74, 59, -213, 200, -190, 53, 215, -111, -121, -229, 3, 3, 154, -29, 129, 241, 234, 2, -103, 139, -26, 67, 1, 84, 127, -175, 35, -8, -25, -235, 109, -36, -236, -103, 152, 83, -42, 2, -248, 106, -143, -280, 54, 52, -36, 63, -72, -160, -51, 105, 190, -84, 174, 80, -119, -141, -29, -2, 29, -10, 80, 291, 300, 187, -79, -110, -256, -83, -50, -51, -20, 151, 158, -53, -83, 83, -54, -128, 299, -97, -24, -151, -224, 123, -203, 213, -104, -97, -64, 15, -134, 135, 50, 80, -5, 153, -187, -43, -149, -165, -146, -252, -30, 292, 315, -15, -150, 457, 50, 186, 165, -37, 166, 67, 68, 153, -27, -51, 61, 173, -38, -92, -92, 28, -235, -133, 1, 215, -74, 25, 65, 9, 183, 215, 78, -10, -117, -72, 95, -34, -1, -139, -95, 63, 104, -19, 81, -172, 60, 40, 106, 304, -115, 393, 112, -90, 89, -75, -189, 171, 77, -190, 15, -2, 278]
5222B78j18K8j80K30k87QK12o9j96k7K00K9J36l17K33l41K88J01o1k74K91j09
5244E5p7J84n5Ojo8R6j35N6l40K24L7k28L01j9J12p3p1J79m71J67J23L0K7j96
5269a37K5L03k21O6J58l00M33l75L02j06j38j61K14P6k27j04J79qO6j05j07L03
5291A36j45j2K35m52L18l4l29L55l45K06j0N6J13j06p7K26j57Q6l07K71q1q9n4
5314a96jJ58j50L04kk85M08j87J75j28J06p9Nj96j9J96q7j18J34m7J45K29k89
5337G6p5K45j75l5j75K13p9L5k35K97k0L8J6jO5l46J26k5p8K00r5j72J73J82r3
5362F2j95J70N7k89L76k75P3J41j3Jp3K6j48J07k66L25p3j12L42n1K8j56l25J03
5386a65l03M36J31k26L5K73L2k12PN7j02j95N9J76J41j2j26p5j21L06p6Rj82R7
$$ y = [278, 160, 188, 8, 238, -49, -41, 171, 102, -94, -121, 79, 108, 244, -73, 160, -181, 107, 208, 147, -127, 164, 55, -22, 162, 107, 113, 112, 44, 140, 5, 61, -279, -55, -18, -246, 55, 36, 148, 75, 4, 183, -288, -121, 2, 32, 59, -137, -112, 191, -30, 36, 194, -106, 327, -48, 254, 148, 10, -151, 63, 139, -88, -192, -13, -21, 45, -60, -167, 136, -9, -21, 214, -238, 80, 46, -283, 72, -273, -67, -77, -21, 92, -14, -91, 135, -22, 64, -243, 28, -53, -142, -196, -197, -39, -189, 115, 113, -172, 236, 49, 224, 96, 202, 123, 128, -68, -87, 109, 22, -96, 38, -9, 136, 365, 76, 1, 246, 71, 36, -139, 74, -5, 30, -205, 92, 72, 110, 126, 125, 190, -156, -30, -55, -133, 67, -28, -200, -27, 155, 62, -133, 37, 94, -195, 181, -94, -21, 120, 107, 108, 35, 61, -87, 20, -246, 79, 6, -106, 236, 185, 213, 57, -268, -165, -468, -32, 99, -127, -92, 181, 213, 1, 8, 65, -37, -232, -173, 3, 144, 132, 6, -69, -190, 116, 40, 49, -133, -36]
5410c6J2J89k07p8R6j74J87O3p2j13J81j31J60p4L3j08L5j95K62j41p6K79k5N
5434G2j20q8K38j08Q3o8oJ39j04j27j4K23k35J15j6J10o0K06k31N9n0J5j02j12
5458a81J53K29j79l1m1K9j8O6K7o5J73jj0p1o9P6k39J8R1J2l3j34J28j79K82o9
5484c6j67K81j06k04L07l2j35m2J41K21j92l6J88l20J62p6L4k3M2RL22l74j31
5507a67oJ57J59n7Lk39J07k04J50J35J52k46J47J1M9k11R2j53L16j26j36oj8j6
5531a07J28m4J34l14J00j0J54p6P1k4L4l00J51K01k63R0o2J54O1p6k12L64l00
5554a46Q4J68r2M5K10l64j78K77j88K83q4N3m7J3KL5k93M13j21j33K87k05M0R6
5578A55k09J15k08k06Q2K43jJ09q1J42j08l1k13L46k43J73j10k8n2K53p4j0J34
$$ y = [-36, -24, 165, -42, -120, -24, -198, -11, 52, -20, -133, 48, -83, 77, 3, 36, -72, -37, -232, 30, -111, -187, 92, 67, 72, -48, -136, 102, -6, 77, 9, 3, 142, 38, -89, -103, 120, -115, 0, -16, 94, 34, 240, 9, 68, 18, 33, -69, -181, -28, 201, 22, -9, -50, -21, -39, 27, 54, -11, 162, 161, 151, 80, 11, 87, -152, -134, -43, -31, -64, -198, -70, -249, 33, -36, -203, 78, -28, -232, 75, 43, -92, -134, 7, 228, 36, 0, 188, -132, 30, -46, -12, -35, 7, 16, 338, -36, -167, -173, -16, 143, 86, 89, -150, -43, -247, -97, 38, 190, -56, 91, 102, 151, -60, 32, -121, 195, 69, -67, -73, -91, -107, 21, -23, 111, -203, -103, -113, 41, -35, 36, 12, 46, -254, -103, 98, -165, -75, -137, 17, 78, 2, -210, 154, -146, -62, 106, 14, 59, 269, -95, -273, 4, -184, 99, 15, 68, 21, 34, 36, 71, -222, 191, 70, -63, 224, 19, 59, 155, -54, 61, -147, -353, -271, -28, -29, 80, -1, 141, 33, 2, -211, 135, -108, 65, -45, -73, -125, 128, 54, 44, 178]
5601A78j98j56J47%M6J85j47r5L27l56N2K13m93K19M9o4K26j55j74Q8J04M6k13
5624a71J54P9k88J14J50r7M06o8k33n3j34K11j88K94k06j10L85p4k36kk29K94
5646bJ03k79L72l82Q4L2Q3J38k12J07J68j16M1k26K79l70L37j29rJ12J33k75K97
5669B86k09j35mQ8J97j64l9o3K9J21l3j09J30J24j98j98K53j29J1k6L53r1j74
5692B0j79J17J95k35N7q8K99n7j88M4M1l6K55m21K32O6j53l7K74l36J75K42k59
5715B8o5J66k6j74J14P5J2j04Q8k27ln2N07k71j51R5K4ol16L31o7K56j00n3j93
5740a12q7K49O3k21K03m7mO0k86M1R4p0j4J14k48M20j75K04j44k67J71J76L0o0
5764I0j45P1M0ko5l7p3O6J34r8l6R1j46J26L9q7l1k04K18Q1R7M2l3k12J32k4l6
$$ y = [178, -20, -176, -29, -29, 17, 202, 55, -40, 287, -69, -17, 196, -297, -78, -29, -93, 133, -22, -196, -108, -4, 42, -171, -17, 62, -226, -112, 38, -59, 347, 279, 46, -7, -141, 70, -118, 176, -30, -140, 245, 171, -65, -67, -296, -2, 101, -178, 194, -188, -104, -72, 11, 149, -63, 44, 212, 96, 137, -89, 190, -180, 157, 28, 19, 131, 264, -11, 286, 77, -58, -62, 26, 223, 59, 20, -43, -14, 107, 74, -35, 95, 219, 21, -177, 76, -53, -42, -68, 285, 194, 20, -159, -42, 153, -82, -25, -113, 186, 129, -59, -15, 26, -10, 245, -176, 56, 122, -31, -68, 206, -130, 45, 287, 28, -37, 129, 103, -71, 43, 118, 130, 26, 114, -113, -116, -168, 339, 68, -83, 12, 36, 30, -286, 45, -22, 234, 134, 81, -112, -199, 50, 113, -108, 95, 48, 44, 104, -182, -141, -47, -117, -131, -17, -265, 155, -20, 184, 40, -227, -56, 120, 150, 90, -55, 16, 56, 54, -11, -48, -121, -55, 79, -19, -55, 36, -110, 16, 55, -32, -63, -267, -49, 32, 129, 171, 138, -74, 58, 34, -2]
5791bO1k38K77m1K3o9n0J28l59M50n3j5k7k4k51J51K29p6j14k53J25K72k86P3
5815f9m3k4m6J89k28J49J88k41K57l53K51k41k6K19j02J39K1l10K43q2K47r3j09
5838f4J01j94J86k56M09p8j07J29k37J10k30J09K41J23q3k21l7l6L93k63lQ0r2
5861b0p7J86K1k58J76J38j46J55k37j57K63p7N3Rj01q0O8K99j83j48L30j78j71
5884a35J86j60K69k42R9j5j4j06M2K48l0j35Q8r4Q5L5l6j00K54j50j1m4k16L58
5908A76n4j63m5K9j70K41J31P2o6k62J14P2k7k84L62r5Q7m7l44K48K42j10p7m3
5932a3J85l14J23r5J16q0J50l6k00J98l58N56k66K35l13K82j75K98j35l79K10
5953a1q1J03J01J65m47J15P5j18r6K60O7j96j5J6P5j9J23j16J8j87L10M8k35r
$$ y = [-2, 59, -179, 98, 57, 80, 11, -39, 89, -270, 180, 127, 112, 85, 61, -190, -39, 190, 114, 0, -253, -128, 144, -142, -69, -112, -136, -182, 7, -221, -72, 116, -125, 132, -221, 30, -211, -237, -18, -120, 19, 40, -270, -27, -109, 138, 45, -64, 37, -157, 29, -227, 182, 104, -3, 126, -111, -1, -231, -122, 119, 242, 159, -62, -99, -135, 258, -5, -8, 72, -20, -97, 89, 110, -148, 28, 166, 20, 175, -62, -219, 44, -33, 20, 29, -72, -152, -84, 215, 32, -116, 214, 36, -135, 51, -109, 160, -82, 17, 2, -12, -118, -76, 172, 142, 7, 95, 1, 86, 121, 85, -15, 239, 89, 78, 34, -182, 176, 122, -41, -86, -57, -227, 14, 145, 217, 151, -111, 3, 75, 48, -236, 126, 31, 118, 71, -273, -25, 217, 107, 30, -13, 172, -142, -19, -114, 2, -78, 72, 36, -164, 34, -324, 232, -34, 201, -112, 170, -5, 293, 158, -221, -11, -92, 11, 112, 277, -170, -55, 20, -98, -194, 66, 133, -63, -78, -62, 13, -6, 117, 1, 19, -168, 142, 190, -45, -54]
5977e4O1r8K1pK82l83K89l42J31J31j50K26RQ7M5p0j75N6p3M6k1J64k71K30Ql59
6003b17K22j20o1K85O2j83R1q7p8m0O7K1K43n8j53N1j31r6K07m0M1J44j23J08
6027A55j51J0j30m5J57J7LJ8J75j10j32o5J69k88J66p4L00q2j27J77Rk42J25j22
6051h7J52r0p4L04l46L4O6Q0J35j58k54K76j52L4P4J9K0J87j32k43K80p3m0k71
6075b59J78K49q8q9k0N1j04K57r3J7k56J09O6J8k61L17N3l39j46M41k03n1J00
6098e3R1n1j79K88j39m0K6J70J04l37O2J67p1K13j70k49M72k52j71J59j93K18
6120F5m2M8k39L86n90L00n6k51K23P6K44j57K38m59L03O9j09K22m67K11q3J76
6142A08N4j33Q3r0J81k38J36n9O2k6j54k6j1j29K49p2J20j84P4P5Q6K1q0p6k2
$$ y = [-54, 7, -91, -70, -77, 205, -178, 111, -231, -100, 31, -119, 107, 116, 203, 248, 178, 3, 59, -14, 32, 11, 175, -96, 134, 142, -217, 5, -115, -176, 109, 171, -12, 79, -8, -86, -126, -59, -38, 205, 147, -6, 45, -86, -182, 25, -15, 26, 170, 47, 155, 4, 14, -116, -161, -4, 13, 16, 34, 209, 99, -33, -98, 71, -217, -51, -125, 175, 93, -34, 143, 152, -90, 35, -87, 65, -25, -99, 205, -141, -107, -41, 39, 174, 16, -238, 38, -114, -80, -6, 13, 33, 220, 88, -155, 125, 52, 12, -259, -81, 168, 80, -9, -29, 22, -82, 175, 82, 99, -157, -48, 18, 36, -225, 92, 145, -194, -340, 101, -102, -153, -53, 38, -13, -192, 96, -43, -83, -57, 113, 217, -120, -58, 109, 38, 251, 81, -168, 304, 52, -119, 40, -153, 65, 23, 71, -168, 218, -372, -72, -128, -379, -156, -80, 164, 7, 245, -214, 89, 158, 49, 271, -196, 15, -68, 108, 162, 29, 112, 22, 203, -35, 101, 42, 104, 78, -76, -102, -113, -242, 7, -65, 55, -129, -55, 20, 106, 127, 47, -29, -51]
6167e1j32J71j15O4q1J14K58R3l73K71j66p0L9q0J63L2o4o2N1M8l6m7J23j30J77
6192A97k03J04j27k1j16J33k52L94k49L23m06K94N8J08j61j3n2J5j24j3J70o5
6214fl21M33Jn6J86l11r2J58R2j91J2K06j36o8L02k86J01m6J81l00M84l14k21
6237a92L70K5j58M1j5l9k19L48N4P0k98j31k2J91J52l13o2r8K52k9n4J43n7k2
6261f3K56l5j33J17j26j60K36k99j00K64L05n54K00n4k7N9K0R1L6j43K26k67j6
6284a67K89j64n3O5k53N78j08k20q9K12k34m4K29M0p4K1K42n43M16j68R1o9J43
6307A40l06L84j40j67K29k00N0J12k29J49k06J29O4k15K80k39P8J61k56R1n2J38
6329eJ20l13J02M6J55j51Q6L3l1m6R0j67J29J07j63J13k19J56j18J94p1m0j85
$$ y = [-51, -183, -12, -127, -63, -144, -30, 228, 321, -52, 219, 53, -17, 22, -58, 105, 137, 73, 11, 62, 110, 74, 27, 150, 20, 197, -6, 98, -29, -50, -166, -33, -285, 109, -140, 183, -223, 71, 129, 237, 76, 63, 11, 26, -98, -111, 59, -6, -327, 106, 107, 51, 237, -74, -166, -8, 84, -107, -95, 111, -25, -93, 209, -77, 24, -22, 159, -141, 343, 29, -192, 178, 203, 45, 86, 71, 32, -187, 161, 215, 285, -13, -144, -166, 25, 177, -136, -198, -296, -44, -73, -127, 16, -41, -63, 193, 158, 25, 142, 16, -144, 92, -207, -307, -43, 262, -292, -92, -146, -173, -114, -94, -3, 33, -110, 116, -151, -167, 122, -42, -95, -30, -283, 295, 187, -33, -122, 90, -144, -188, 41, 81, 7, 28, 270, -273, 143, -25, 66, -3, 140, -166, 218, 78, -89, 140, -60, -10, 102, -127, 22, -184, -55, 9, -206, 74, -165, -87, 74, -182, -91, -143, -5, 115, -198, -96, -50, 105, -46, 40, 73, 42, -4, 86, -81, 48, 155, -8, 105, -114, 42, -76, 118, 47, 7, -178]
6352a78L54n51N37K9j96J26k82J95j53J75j47Q2J99l37J14J55J51k94J61n4k33
6373a47j4J06p7J54j16p0J70k04K16k63J36J67L3j39K6K0j52J79J42k56J92l59
6395b56L72j48oL1R8j80J70k33K35k19L51n7k82O4J37q4jJ89m02L97j38L16l58
6418dp1J52k35M44l77J23J05k41J36j91K82o3L0k31J84J10l14Q6n7J97k3Q4j53
6441b7j09L05m9k46p8j04M30N3k03Q0k1j09J1o1J07P3R0j06m5J5j13L6L4R0P5
6466A28k27J57k83J55J53o7J03k72K52rL9k20L6J82J28j31j95L61k66l52J43P9
6488a06R1m1J16P8j85K61j99j84L02k12J28j87p4O2M05k83J09k72K43k94L62l75
6510b55J42J78j07K77j36k60pK06J30j28j98K60k27J03j20M13l22J09L0q6J24
$$ y = [-178, 176, -375, 162, 191, -5, 121, -161, 34, -119, 56, -91, -9, 190, -147, -33, 122, 273, -21, 140, 86, -147, -161, -55, -132, 22, -94, -164, 6, -198, 18, -245, -109, 58, 91, -48, -22, -2, -154, 25, 167, -89, 103, -256, 116, -32, -38, -7, 91, -89, 81, -152, 83, -136, 215, 158, -124, -60, 77, -7, -8, 181, -221, 176, 38, 354, -4, -75, 77, -158, 286, -91, 32, 137, -104, 32, -159, 123, 60, 90, -141, 43, 153, -161, -75, -132, 65, 42, 126, -27, -136, 169, 120, -126, -204, -308, 122, 175, -28, 52, 31, -78, -67, -128, -21, 52, 142, 36, -9, 6, -107, -71, -37, 53, 128, -99, 58, -225, -70, 83, 16, 119, -153, 99, 90, 129, -91, -55, 127, 255, 124, -71, 290, 24, -328, -185, -106, -15, -56, 60, 138, -47, 214, 15, -169, 133, -79, 49, -138, -212, -150, 255, -28, 81, -191, 52, -242, 120, -255, -113, 65, -42, 235, 99, -161, -168, 38, 168, 40, -158, 102, -125, -22, -142, 271, -51, 58, 88, 2, 126]
6531A26j0k18k0j75L16q7m0Q6K7m4J40O0l79O8J75P6j39R7j41j76Q4J34P3p8j39
6556a84L94p3j09N0O0k8k54J84k44L05J96l13j0l2Q7k0N2j75j01L55L4l44L87
6579B17j67M7%k92N8L13n05M24m3k22J78m5o1O3L96k91j15o7O1j7O5J92j18M6
6603A17k21l3J44j23J07j95L06j18L40m67R3KJ93k98O6J09J18j84M4J45l41K44
6625D8O5k19P7q6J80m6k04L1J56K93J6m71O2J22J68q9k7j41r2J05L2J33j79k8
6649i4L7Qn2n1M3L50k49J06o6J2J87J9k72n9J48m0J5j84K19j59K31kk40K05k89
6674a77L58l43m1Q8j06L30J69m12J08k14K81L8j82m3j42L57M6l03Q5J3J73Qk68
6697a77L73l7k32mJ7j69L44j03R6j85J6J48n3N4j17J07n9J38k47L4rj23rRO1L18
$$ y = [126, 116, -102, -122, -297, 19, -68, -108, -22, 5, -39, 101, 161, -218, -150, 25, 101, -38, 59, -82, -258, -174, -40, 33, -45, -184, 210, 137, 28, 78, 138, 110, -144, 40, -204, 101, 297, -16, -26, -58, 29, 9, 61, -114, -215, 140, 174, -170, 217, 50, 97, 97, -195, -137, 176, -329, 95, 52, -170, 8, -37, -98, -35, 361, 70, -45, -112, -51, -68, -3, 189, 71, 117, -104, -137, 7, -116, -9, -204, 102, -16, 324, -143, -50, -48, 145, -153, -87, 22, 140, -44, 0, 145, -196, 48, 113, -106, -29, -115, 65, 19, -185, -154, 2, 295, 311, -160, -98, 24, 192, 103, 76, -65, -157, -52, -20, 113, -66, -94, -57, -49, -101, -152, -109, 241, -8, 98, 32, 44, 231, 250, -22, -81, 67, 27, 42, -142, 77, -82, 149, 147, -93, 112, -177, 181, -162, -203, -115, -221, 109, 278, -134, -26, -240, 41, 79, -103, -146, -288, 69, 115, -188, -103, -90, 83, 91, -177, 196, 159, -73, -77, -60, -229, 115, 12, 108, -77, -61, 87, 34, 88, -29, 78, 19, 157, -90, -56, -65, -188, -197, -188, -127, 191]
6723A91l5k07P5J45rL2k21K1j09K64k44L11j95r7K18k70M8R2j81K58K87l55K47
6746B66j18m65M31k07O9K6K16k15J06k22J30j88J00O9j06K56j03l9M4jQ5l4j85
6769h5K9M0M5pJ31k58r3k5M08l13J82M55n37J73j71J17r1qO0j62j5O7O4k8k4q4
6795a30P4P%M3J19l91M47j64M39l70Nj13J73j68M5j27K3O7j13J1M43k42p2o3M8
6820ij79K87Jm34L78J4k11J00J86j64M9n08M15K21j60Q0k97J11k7K09r6j11L8
6843a07Q1o0q5j02K20O6J78m8j69J0R3j95J81k6Q4O6j45J79k33n1k5k7k2K09p5
6868cJ37j17P8j4j83K4K09k34J51l03K15P6m5q1J7K27j92O0p0R6J29J8k37j9Q8
6893B7q8K9j93L77k96J32J21n4J2o0k33L77n8P5k81RL48p6n1j79N5R7l26J60J88
$$ y = [191, 156, -51, 24, 169, 160, 192, -29, -8, -117, 147, -97, 214, 19, -78, 140, -130, -82, 10, -171, 87, 374, 19, 266, 148, -317, 114, -93, -24, 2, 218, 3, 109, -113, 17, -171, -71, -2, -108, 148, 45, 6, 50, 49, 134, 100, -85, -56, -16, 29, 22, 153, -105, -198, -223, 185, -128, 54, 509, -28, 145, -26, 91, 0, -8, 52, -110, -125, -58, 6, -22, -46, -130, -56, -49, -49, -6, 113, -278, 169, 5, 444, 74, 79, -34, 139, -29, 16, -111, -88, -21, -134, -123, 320, 78, 6, -57, -9, -188, 99, 100, -334, 44, 58, -153, -53, 133, -31, 18, -490, -75, 146, -14, 66, -231, -120, -147, 62, -34, -145, -107, -26, -86, -171, -273, -53, 13, 191, 143, -26, -16, 77, -118, 63, 37, 121, 187, 42, 221, -12, -63, -88, -115, -137, 72, -3, 134, 17, 95, 81, -102, -78, 131, -103, 48, -255, -40, 36, -9, -90, -73, 154, -38, 22, -48, 48, 177, 195, -42, -61, 27, -61, -32, -225, 152, -144, -12, 109, 55, 67, 7, -226, 151, 93, 168, -113, -104, 244, 168, 117, -62, -7, 90, -236, -76, 112]
6918A12P0l71J57Q1j22M26l61J72o6o9p4r7K19k13Nl4K86j4q6j10j10K00j19j06
6942b24J69m7R6n0J02j12k88K68N7r3K53k42r0j05N27m06K16j02J98J67m14J63
6964D3P4Q2k74L2J11P3j5NL4m70L39o2l42N48j25l9k27K26ON8j99J29k34L61k28
6989i4m2K39N0j87K17l11K36j41J6N0LK01n3j84j25J85l00L10J06j07J2n2R7k59
7013a33MJ5K71j16L6j39n4p1J40j4J20j84K36m09K66K66j93K5k49oM15K6j70J18
7037B00l29p2J75K3K93r4j99j30J45o7J5n0K04j03J24j83n1q7K32Lk6l11J25L4
7061a29J05J69k41q9J91R3K3j09jk51K51q7J49j65P8r9oK08j83Q9j19K32m24K03
7085a12L57m32n6M11l0k43M54n39O1K50m5k27k0n5J70K83j11K32m54J72k04M2
$$ y = [112, 182, -189, -32, 49, -73, 353, -8, 164, 98, 29, -45, -142, 77, -136, -131, -165, 121, 107, 21, -89, -199, 1, -118, -224, -55, -102, -6, -56, 46, -66, -354, -86, -29, -122, 131, -111, -201, -306, 221, -185, 31, -71, 127, 294, -120, 43, 117, 199, -75, -43, 68, 141, 126, 131, 165, -305, 34, -28, -370, 178, 53, 14, -213, 13, 19, 77, -122, 7, -227, 134, -94, -136, 103, 153, -34, 183, -128, 108, -33, -17, 33, 36, 237, 184, 0, -125, 60, -240, 70, 176, 69, 81, 29, 126, -133, -129, -114, 157, 41, 77, -62, -116, -187, -47, -61, 59, -125, 111, -298, -32, 234, 41, 66, -183, -189, 226, 252, 82, 200, -129, -201, -26, -3, 290, 196, -3, -133, 12, -55, -40, -90, 114, 11, 135, -48, -99, -186, 46, 49, 23, -288, -163, -129, -24, 145, -96, -185, 6, 99, 122, 13, 12, -239, 12, -75, 74, -91, -13, -112, -118, 90, -93, -4, -123, 109, -315, -112, 245, -187, -243, 168, 138, -105, 349, -190, -129, 121, 76, -151, -171, -226, -56, 227, 116, 348, -106, 66, -138, -96]
7107i6L27l28J80j69L1K42l91J04L7j82K62n0J04k85J77q2K33j0r4J82j17k15
7129a40J81m8K1q2K83j97O5j31j6j8r1q5N52m60J97R2K8j64j90K61l1J15k18R3
7153A7P7K8j48o7P6J09j04k51L61R1k28J86k68J12j26K63j99J36K1p4K06k52O6
7176C2j41L0J98j55L4Qn7q1K89R0k73j16K52p7j1K60l20j31J28L1j28J03k82L54
7200C7m19L45J27l4n7J3k56L56m7j7o0M2N3o5J17k09l3L5J31r2l28L84j86M1M9
7225g3M7L3j6M2j68J39j07L75j95N3J2j7r6mJ02j89p0J96n0L9m3OJ45J13j27j24
7251B3M1j68N4j05k8L79L9l68J58j43n1K87J32j79J42j57J15j22N8mJ46j27l70
7274b48M12q9J7j95K16r8p2L0J04P4k09L3jl1J39k62K19K8j55J59N6j2M6l1k83
$$ y = [-96, 231, -97, 83, -86, -55, 187, -204, -100, -63, -245, 17, -33, 71, -214, -37, -119, 114, 104, 10, 192, 75, -140, 41, -7, 14, -68, 215, 18, 83, -48, -64, -82, -173, -258, 294, -166, 31, 123, 151, -13, -203, 58, 27, 142, -76, 17, 94, 122, -26, -93, -17, 92, -12, -263, 98, 189, -39, 147, -121, -9, -135, 128, -71, 65, 86, 12, 218, -34, 32, -109, -79, 119, -36, -2, 6, -51, -132, 157, 247, -26, -142, 110, 33, 22, 282, -38, -169, -41, -10, -138, -35, -317, 37, -382, -37, 90, 56, -1, 12, -244, 112, 65, 48, -12, 30, 83, 18, 135, -74, -107, -72, 59, -33, -361, 23, -163, -122, -73, -26, 7, -9, 33, -135, 4, -103, 272, 77, 130, 142, 125, 29, 25, 127, -62, -132, 64, 14, 53, 10, 16, 161, 274, 147, 23, 64, -104, -50, -155, -183, 196, 235, -133, 25, -118, -169, 118, 250, 71, 213, 56, 171, 49, 107, 103, 249, 122, -248, 164, 75, 92, -103, 113, 15, -57, -27, 77, 151, -58, -25, -26, -57, 82, -180, 39, 67, -88, 71, 127, 115, 161, 130, -153]
7299a53M85l63j10p6K44l5q2j19L63Rm48L54n1K08m7k61J06k03j23M01r0J42j8
7322A33k5O4k83K63r7k04J45Qr2M9q0J08K40j77J82j2l20j5rJ86j6mj6j12K55
7347A71k93K99j96qJ51j90L05k96j98L59n6k57K79k9mk45K01n9J67k53J00R6l6
7370Hj83L3n3K90M0k98K30j43R9K44j79j84K89j60J20Mj92R4n6n8N5j92K33q6
7394d5j85J94r0K22j56K00rj68J14J07k68L8J79l8K08l61J09r8O4m0J84n1Ok21
7418a05L50l77J18j3K52ml59K06l16J2M00m05J85r7k7K59p1n3p9p7J84l4l7n7
7442a45jQ4J47k25P0N3o7K10k20M31m19J6k06M27j73J61Qj2l59PJ87k0J1J29k23
7467a29P4L14j51k45M8K32j98J87k36L13j65N3k01K22m1P9l35K16P7k54J18J80
$$ y = [-153, 332, -31, -141, -217, 27, -8, -90, -209, 154, 163, -285, 69, 18, 226, 179, -82, 24, -179, -302, 99, 9, 151, 133, 108, 172, -111, 152, 55, -149, -4, 4, -88, -39, -119, -11, 229, 52, 234, 222, -98, -113, -122, 64, 48, 44, 28, -84, 171, -122, 177, -19, -27, 124, -66, 239, -57, -255, 104, 48, -209, 70, 41, 37, -208, -7, -66, 101, -152, -52, 44, 8, -175, -142, -195, 95, 135, -163, 67, -76, 23, 267, 88, -96, 193, 33, 153, 157, -35, 59, 3, -55, 0, -192, 41, -45, -230, -36, -126, 96, -60, 140, 131, -37, 77, 184, -84, -46, 133, 95, 303, -58, 51, -47, 17, -23, 161, 110, 116, -105, 245, -132, -14, -27, 225, 221, -138, 68, -248, -236, 164, -241, -56, -153, -180, 79, 8, -45, -124, -201, -17, -51, -88, -145, -146, -62, 85, -140, -70, -17, -84, 126, -94, 337, -82, -66, -272, 155, -18, 143, 151, 139, -220, -213, -26, -46, -35, 94, -129, -55, 259, 108, -137, -89, 143, -55, 132, -104, 209, 44, 97, -104, 118, 77, 156, -179, 37, 114, -140, -22, 158]
7489A58j17j30NJ55j02q0l3J94J06j73o3P0J44l43K82N1j02o7r8K3Q0J63q0l6
7513Gq2k1L16o7j32j39L42m11L07k5L4j51q2j55N51k56n2J10J50l36j57K33l8
7536e4J15J2j49j81M13r4J81k99Q3j8j1j06J1J27k86K29j14J67P4l2J43Q6j58
7559A39k44N2N6J16k14M5j4K5m6K25K0k44J3K09k01K6m7J00R0l93M42m9j58O3
7583A1J40k77m3J28L24m09K01o5j59K82j9j01n8K2j33L18l15J56M0j46n7NJ7L7
7607a01R0k0k45L26K70k50j84k6k45L92L50m94J77K03N4l08J89l42L23k42j63
7628b46K35K2J19j83J78k61j5K77l50K71J51l72K85k87K48k06J26r8J84l39L1
7649b30Q6L1K8Q0LJ05l83L84J6j63J78j4j43K27j56k49K72j10J5R9j47J9K7j20
$$ y = [158, 41, -89, -84, 71, -31, -111, -144, 50, 156, -17, -80, -10, 134, -209, 73, 124, 22, -45, -143, -120, -40, 123, 43, 7, -75, -96, 220, 153, 21, -118, 224, -187, 120, 95, 129, -22, -104, -259, 292, 36, -16, 94, 244, -92, -249, -16, -54, 61, 73, -76, -257, 156, 62, 243, -56, 27, 9, -2, -108, -97, 30, -256, -27, -141, 26, 100, 68, 211, 297, 139, -105, -53, 3, 119, -95, -50, -64, -39, -85, 140, 160, -84, -71, 138, -63, -37, -84, 16, 106, -287, 155, 106, -52, 11, 151, -126, -169, -41, 283, -126, 75, 10, -149, 133, 114, 13, -45, -23, -156, 162, -153, 3, 43, -103, -160, -155, -138, -101, -11, -31, -276, 50, 320, 70, -114, -140, -385, 7, 357, -137, 40, 243, 297, -11, 178, -164, 159, -83, -246, -11, 11, 130, -53, 125, -136, -151, 126, -224, 47, 198, -174, 111, -176, 72, -134, -8, -106, 78, -261, -230, -144, -113, -85, -5, -2, 103, -280, 104, 120, -43, 135, 121, -22, 205, 49, -200, 72, -38, -23, 76, -71, -52, -25, -145]
7673a45j8J32K88k05k58M0L52j05k10m2O4l2M5J99j42p8j8J2J95k4j45j73K96
7696B8M6j14p8J39J19j71J15k96L77l7j84j17K60k20j38M62k35j26M82j79j32
7717Aq2k31L47K43k76l3k68L33N2j19l2J73k54M7k2R3L43k71J06l28Q5l1J49k04
7741a79J66oj4j73k07M14L3k03M5L26j15k04J47o0L2j42K23l33K38n7J36k9m23
7764c85L54q6J53L32l86O6R2J4j66p5K0j07J72j36m6M7n2J91m5l5O0J8K8j35J06
7789ao8J08K4o0j83Jp4K88J0j7n0J56p7J22N0k75N9O4o9P3k08L2J77m2j92J74
7815B2j28J74j97R3N3j61K44k3m3J65m13L83L2p8l3k59K62k31l8K16j20q3J70
7838GQ4Q2j43J98n15K27n6L26k84R0J25l37J13l9L91k58j0j25J50j48mM6o4L94
$$ y = [-145, -163, -31, 257, 52, -206, -166, 186, 81, -129, -171, -107, -139, -94, 105, -37, -115, -133, -121, 74, 50, -95, -268, 28, 74, -40, -118, 21, 140, -31, 84, -212, 165, 128, -56, -173, 87, -133, -271, 191, -44, -170, 312, 133, 1, -81, -312, 35, 278, 2, -31, -299, 34, 86, -33, -65, 108, -146, -99, -121, -28, 315, 44, 150, -178, -93, -124, 25, -179, -13, -19, -33, -206, -413, 1, 34, -169, -124, 202, 87, -117, 30, -30, 2, -140, 83, -250, -12, -69, 67, 38, -385, -31, -117, 36, 368, -18, 48, 140, 154, -12, -87, -67, -174, -2, -138, -184, -137, -189, 2, -43, -78, -18, 0, 28, -107, -1, -69, 39, 63, 3, -180, -179, -253, 35, 45, 28, -22, 134, 57, 179, 229, -46, 13, 77, 8, 81, -127, -95, 82, 40, -152, 22, -106, 68, -129, -36, 17, -144, 100, 77, 34, 199, -214, 169, 201, 123, 90, -169, 93, -138, -176, 40, -80, -163, 7, 91, 173, 30, 228, -287, -60, -116, 210, -74, 16, 141, -196, -83, -122, 269, 11, 1, -124, 26, -122, -126, -80, -144, 250]
7862B50k57o5j5j30K43n6p5K65k23j84O4J69o6J10m7p4K24o1lJ13j36J56l59n
7886a62J45q5K56p6J12j49k45L25J54l29k5J05J51k79P9J64N8o9ln3j03N0m7j33
7910a59J40Q9j2O0j89K0R5j4p9n6mK71l69J19P6Q2j18K42L4l26J39k66M10j64
7934B1j96j36J46K19k1q2K55j69n3k07K59jQ0J9k91k6k5j3K33n1l2J77j99K49
7958A56k59L6J94N0j14q6k05L93m5J11k48j46R0m2K51j97n9P5l1M8k29K70L8l4
7982A7J23j80j37M51k47j30J07J82k06L43k51J02o6l29J81J8P2J02k18KQ2j00
8004h2K05J4n9k13LJ19JJ01k1k11M9N8O6m4N5J18j70P1J63n04J52K93J22l12J41
8029A15O0m50L66k05L72k64J43k54L46r0J0j4O1k44K38k28K9j34J79j63L1j41
$$ y = [250, -7, -72, -87, -217, 26, -30, -105, 160, -63, -247, -183, -14, -80, 30, -17, -91, 133, 72, 69, 182, 46, 202, -157, -162, -17, -102, 154, 78, 190, 41, -204, 121, 275, -54, -79, 26, 177, -102, -23, 141, 199, 130, 127, 74, -29, 21, -26, -159, -19, 70, 58, 118, -71, -51, 44, 30, -49, -105, -109, 162, -207, -88, -12, 70, -48, 194, 228, -98, 41, -225, 185, 21, -175, -311, -165, 54, 33, -49, 206, 37, -16, -223, 36, 35, 115, 134, -157, -183, -208, -221, 12, -39, -71, 106, -93, 156, -103, -67, 127, 177, 63, -23, -228, 165, 120, 231, -17, -163, -73, -115, 136, -61, -120, -45, -76, -28, -257, 13, 51, 17, 140, -40, -177, 274, 27, -103, 4, 186, -20, 323, 72, 174, 108, -221, -40, -22, 50, 152, -66, -64, 18, -82, 123, 137, 78, -135, -132, -13, -12, 89, 68, -143, -94, -36, 30, -14, 41, 159, -11, 60, 223, -281, -129, 164, 286, -26, 115, 175, -275, 91, -114, 258, -6, 137, -117, 229, 139, 149, 135, 196, -48, 190, -38, -9, -143, 36, -127, -96, -237]
8051b37M2K12k42L28j50J56J7l73L66k29K09q6q1o6J52O9Kj15KJ3Q9L2p8K83k02
8076A13o9j39L35k09Q9j19m5J13k95K41j4O8k93M62l58L57j31k58K94l59L04j03
8098a6N5Rj16k21K54r3J12k39L14j15K21j49l8J15k27Q4J20j73K30R5k97K15j15
8121B5R8j34J1K4k93J16k6K53j55P4J74j85J29k32R5j17kK87l18J84j23Q8k48
8144b75P0J83j23J43N9q4M1Q4J40k68M5J8M2k4j35k2K82j90o0nQ4k7K09k21k73
8169c07K62J70j7k72K4k0K01J12j45K30m70M03k90J26k93J66Q1J90l34N8K82k06
$$ y = [-237, -195, 17, -225, 103, -47, 109, 126, -247, 119, -110, 99, 13, -68, -134, 18, 87, 89, -26, -24, -11, 78, 110, 32, 315, 113, 44, -95, 240, 31, 120, 1, -44, 69, -226, 15, 1, 69, -224, 238, -120, 237, 106, -152, 142, -217, 87, -16, 39, 48, -68, -289, -35, -128, -16, -255, 59, -56, 165, 16, -22, 93, -134, -50, 70, -103, 127, 222, -75, 140, 25, 123, -11, 0, 24, -269, -153, -179, 74, -81, -7, 167, -18, 111, -121, -26, -143, -145, 142, -176, 8, -115, -27, -275, -205, -22, -145, -2, 57, -27, 14, 98, 238, -30, 15, 33, 75, 51, -84, -106, 176, -14, -74, -79, 5, -22, 187, -34, -307, -45, 125, 108, -164, -140, -160, 41, 153, 8, 238, -232, 171, -119, 7, -286, -120, -39, 151, -183, -125, 157, -49]
8191d9
$$ Imaginary data points
##PAGE= N=2
##DATA TABLE= (X++(I..I)), XYDATA
0@%%%%%%%%%%Pj5J6j6J6k4L2m0M8n6P2q8J04j20J39j63J92k24K56k95L40l88M40
33B33m97N63o35P15q02Q97j002J116j242J380j528J690j869K063k275K507k762
50a448L045l355L697m077M500m978N519o136O851p689Q682r887J1388j3313J5884
65H683j9518K5083l4766N6399j95434L6435K34806j74377L8215j7215j15760Q3159
77g4290J59907o7604q484o058n6602Q1955J03476q4342k6180k595n2629Q5638
89E2192R2348j25965o0141L5048l9533M9209P6944j37755m9938J28914m0212q1296
101a00185R6666L237q0297N1432L5722k8128L2523j0918l1245N9406R142l8118
113g63M6726l144n1197N6540J0488q3834L3542N6040n3748n272J5822n7521J8017
$$ y = [0, 0, 0, 0, 0, 0, 0, 0, 0, 0, 0, 7, -8, 8, -8, 8, -16, 16, -24, 24, -32, 40, -48, 56, -64, 75, -88, 104, -120, 136, -159, 181, -207, 233, -264, 299, -336, 379, -423, 474, -528, 588, -654, 726, -802, 888, -981, 1082, -1193, 1314, -1448, 1597, -1758, 1939, -2138, 2362, -2616, 2903, -3233, 3618, -4071, 4611, -5276, 6112, -7201, 8683, -10835, 14248, -20518, 35881, -159553, -123118, 111688, -62689, -24474, -41689, -157449, -74290, 85617, 18013, 9529, 3471, -53131, 28824, 132300, 47958, 21778, 19183, -33446, 52192, 144540, 18575, -41566, -6518, -46051, 3158, 80102, -57653, -107591, 21323, -18889, -100185, -3519, -282, -80579, -29147, 6575, -21553, 10970, 52, -31193, 28213, 37355, -763, 45963, 42819, -8378, 48162, 58650, -25184, 8358, 64398, 10650, 5378, 21200, -36321, -18304]
126a8304N7774n0716k3811M6249k5516k2959M6433N20k8487O088m71J6864L1161
139C4825k6108k1794J9440j0307Q010M5841k8117m7885K9878J1218k2944K4867
151A6924M515m0471O708J9337j4029J0561Q613l1579k15K9197o02o202J117j1477
165g603J125J3572K78L835m69j9707J219J7211p957l550J0259j4719j2750J6258
179b998M893r926K204k305q148P974Q602j853k24k059m169O420Q171K250n08m868
195C456l832N276N239p92j42n624q542K549Q354j549p875m442k087l67N035M509
211h34o136q398L262N005J132O422J609r032j362J0624M554R28J692o479l142
226a55Q180M199k197j174n858l778N253M05j976L79q157o498Q207K958n304K446
$$ y = [-18304, 39470, -11246, -35057, 11192, -14324, -37283, 9150, 9670, -18817, -12729, -13200, 3664, 34825, 8717, -13077, 6363, -3944, 4066, 49907, 21790, -26095, 3783, 15001, -7943, 16924, 21439, -19032, -12324, 7013, -7016, 3545, 12158, -19421, -19636, 9561, 8959, 2757, 3874, -7603, -6478, 7094, 7372, 11207, 10738, -8969, -7750, 9461, 1504, -2046, 8213, -6506, -19256, -2998, 1895, -8031, -5827, -8132, -16280, -8306, 296, -1557, -1781, -3840, -8009, -1589, 6582, 8832, 8324, 3456, -376, 4900, 10139, 9347, 9205, 3581, -4961, -2412, 5942, 4393, -3482, -7924, -10011, -10378, -5343, -834, -6970, -15368, -12106, -7101, -5969, 453, 2062, -6970, -8332, 2292, 6846, 7774, 9466, 2987, -155, 8025, 12224, 10027, 8853, 2995, -783, 4470, 4875, 2899, 3278, -4879, -11377, -3170, -212, -5516, -3070]
242c070m293p260R475P195o711J963L118p677N166J0937m436j182K605o391K621
257B060R922m107m316J813o476l12R946m992p200M120m904m465J0514k97r205
272g899L917j058m626J0743L208r899K617L288l998P234N409q807J23L831m283
287b00N012N372r382k259N003n400K612O968r510n123O728k702j348P853n438
302a814o737O673N93k269P770k444p575O024K672k932N982l88q409M334L763l871
318A372M009K81r222K318N036m535J516K381q350n78O729k851k76L474n887j542
334f125P081n89j240L771m109k489O967L86k638L529k912m300N833K005m286K009
350B893j880n169M517L152m786K01P0m613K589M367l127q58J224l296J579M994
$$ y = [-3070, -7363, -14623, -5148, 2047, -4664, -2701, 417, -7260, -2094, 8843, 4407, 3225, 5830, -561, 2060, 11982, 7875, 3559, 5372, -1104, -1416, 8530, 3538, -3662, 458, -4446, -8911, 1603, 1306, -7899, -3982, -5040, -9666, 1077, 4285, -5614, -2997, 291, -3707, 3527, 8936, 129, 252, 4083, -200, 4812, 10184, 802, -1457, 3546, -1854, 758, 7726, -1784, -6907, -179, -2881, -4229, 3624, -1814, -8551, -1878, -1285, -3554, 4216, 1772, -5803, 221, 2893, -39, 5943, 5555, -2854, 1480, 5243, 1372, 5381, 5662, -3560, -1242, 3794, -741, 775, 3156, -5194, -5772, 957, -1894, -2170, 1304, -4583, -6125, 956, 367, -873, 2898, -1211, -3700, 3267, 3653, 1015, 4544, 1632, -2668, 3165, 5170, 884, 2893, 1013, -4156, 361, 3513, -1273, -1072, -1002, -5615, -3026, 1341, -1786, -2644, -1420, -4716, -3137, 1857]
366A857j919j342J903k229Q27M852j379k353J289j558n23M498r61l128N64j087
382f89j286L441K62l887j10P44j690K334J412k656r73J296q4J811J719k291j102
399a749J248L18J568J778j927j828J303M14L25J394j557k210N78K70L08J061j095
416A99k301L49J287K90L28m76j704O01R37J064P46k75j740j43J833J035o3j91
434A776j398l45J229P65l72n91j096p94O73J071l78n94j028n19R33J065J66j016
452d53j050J07J092J041K12l29q36m73J254R93J08p28n95l74K78J122q2j141r21
471g75j09N00N96j87o19r99k85N12R28M48o17j163K49J067J036k15n0q24j10J222
491F05L77J53l91k69o31L64Q82J71j073n89n60J0J317q3j248l42J36L19L91L12
$$ y = [1857, -62, -1404, 499, -1730, -903, 3949, 2570, 217, 1506, -52, -575, 3923, 2962, -166, 398, -689, -1975, 1466, 1728, -2159, -2269, -1525, -3215, -881, 531, -2125, -3098, -1802, -1886, -75, 1644, -647, -1749, -501, -183, 1385, 3163, 1236, -592, 711, 1125, 1450, 2844, 1287, -923, -345, -75, 233, 1294, 199, -2102, -1753, -466, -176, 152, -324, -2028, -1427, -490, 574, 1320, 1045, -695, -838, 995, 2030, 1967, 1776, 378, 33, 1262, 2027, 1655, 1064, -32, -826, -153, 918, 540, -54, -1082, -1601, -668, 397, 563, -453, -1503, -1396, -304, 737, 949, 620, -216, -689, 565, 1558, 1666, 938, 343, -31, 247, 1369, 1287, 146, -775, -884, -384, 212, 25, -594, -1593, -1878, -1366, -438, 10, -607, -1770, -1521, -454, 582, 367, 317, -507, -617, 605, 982, 1135, 744, 475, -156, 208, 1090, 1261, 188, -401, -961, -951, 366, 283, -965, -1307, -1171, -852, -461, -149]
511a49m80m89M5O08O93N5l46l44P4N79J060j51p36o79L20M89L31R4p47m49K24
532Bk26M06O43q62r40L93J33KO95l60p88K04J011j16K06K44j002R0P06M8k0L59
554H28j237j34J339k04l14Q6p02m14P84K58j73Jo90k45J023N0O0M90j062l89J326
575F81K60p74L99m47n10R43O4q58L25M0j123O12R86r27q25P56m90L10N89J27p89
596f51M39J21j5J272l59o38M35j98l93P81L49j009K86j74o19R10r2j185N18j05
616c27q84Q66L81j249L23P45q33O51O78q29l11J206l79L48R02j082j33J012k28
635H57m80J043n86j319J070m3o27M95q8j293N19m8l81N92M6j056L70M54k14L61
655c28J73n73P54L88j77M68K25p34J00J052n98NM12q19m84J062p85k24L89m95
$$ y = [-149, -629, -1118, -1073, -465, 228, 283, -63, -407, -333, 246, 1306, 1155, 419, -260, 60, 549, 880, 974, 227, -222, 2, -224, 182, 825, -37, -977, -584, -451, -449, 246, -114, -902, -698, 313, 197, 403, 647, -355, -265, 441, 489, 469, 828, -409, -543, 796, 592, 278, 364, -338, -752, 32, 290, 117, 118, -572, -817, 206, 256, 316, 806, -256, -645, 681, 941, 167, 566, 119, -391, 552, 616, -242, 83, 123, -1000, -388, 598, -329, -1154, -398, -888, -578, 11, 138, -651, -212, -91, -106, 1166, 807, 169, 604, 406, 13, 794, 1143, 134, 420, 246, -373, 537, 445, -740, -222, -327, -1211, -345, 36, -1213, -890, -145, -978, -327, 351, -478, -789, 417, 38, 386, 1288, 206, 73, 1085, 857, 377, 1420, 834, -485, 585, 542, -85, 410, 322, -971, -452, -500, -881, -289, -243, -1299, -929, -475, -689, -328, -155, -728, 26, 414, 237, 705, 930, 196, 296, 1348, 750, 755, 1167, 348, -136, 926, 141, -83, 306, -189]
675a89o17N23J43q18M16q9n04P39L53l92K98k24oM95M06k35M0J52j41J29M11m52
697D38K3%k86R7N09n62m57L42o00k01M89j00l83M47m52j14Q06j60m46N87k42J72
719i3M20J90k55r7K2J69K94M5o20p6L84k23J8pl51P0K0nj56N0l80K81q1L7M6J83
745a15j77R0J39K35j43K04j10J19J64m4N0k30O4j46J02J79j29k32Ok00O0r7J96
768a5j65q0J63k71K36J91k21L78l33n1J02M50l72J54k31J11q6J19k5%j33K64N6
791B41j33j03K7j16J04j95M09l51K92m68K13MK68r6l79J66N0J50k6O7k2l36K74
814D0j3O3J03j64r7j31J52p8J64q3j79L16K28l37J77K18k22j57J28m8K29j20k56
837f7j31J16rJ33j75J46k99R7J47o2N7j39l7L36l7J1K99k70m31N16j40Q9R7k60
$$ y = [-189, -806, -283, -140, -958, -542, -631, -1135, -396, -43, -435, -137, -361, -367, 128, 534, 299, 339, 491, 350, 479, 890, 438, 461, 461, 175, 272, 781, 219, -238, 104, -496, -697, -208, -308, -691, -244, -696, -810, -4, -164, -610, -23, -265, -93, 327, 517, 262, 165, 187, 356, 650, 695, 75, -1, 383, 160, 178, 171, -180, -110, -90, -95, -251, -201, -581, -300, -381, -344, -298, -115, -292, -202, -63, 172, 29, 233, 123, 242, 406, 362, 412, 182, 246, 100, 202, 381, 252, 20, 26, -174, -114, -211, -15, -180, -260, -97, -368, -132, 59, -162, 216, -117, -168, -66, 384, 12, 166, -65, 46, -40, 79, 54, 54, -79, 185, 241, 108, 5, 32, -84, 20, -175, 234, -117, 175, -293, -80, -76, 192, 96, -283, -117, -67, 83, 57, 124, 102, -234, 40, 27, 90, 193, 29, -68, -199, -47, -125, 39, -44, -223, 93, 321, -16, 161, 379, 157, 0, 128, 80, 309, 189, -67, -198, -82, -91, 42, -133, 13, -286, -189, -42, -104, -47, -186, -223, 113, 76, 87, 386, 116, -315, 201, 61, 150, 247, -13]
861a3J11J33K22m91O7j51J76k63M17k36l50K30J4j94J59j19o7J89J07j08J45k3
883d5J15L0k6l12L48k65K37J48j04Q5KJ68n05L43j57k00K40j4q3j17J92k74j9
906b13K8l1Q2j60J03J6K87Mol24K27N3L44m55j13M31j0k70L97r5k78j60K22J19
930A98j68j42L4L4Jj10qP8r9J78k98M21l33J96n3j84K79j40o5K18p4J86L18l67
954A00j5N2l5Q8k3q9Oj73J73J05j02k4j78J1n1k6K79j28J14k00O6l7O0K67j39
979A01l50K48K00l43L80o1k79J11lR9p3K94k66p3J89l0j84k2R4k74L40k42j96
1002c40K03Q0k20O0Q2J74l08J98J45m2j14J54J24j30LL53l35J28r9k40L60j47
1024H9o0n3J19k98m0L0K97j21M4k20L7l1J67K3o2O2j53L31j86p0L34l24J47kO8
$$ y = [-13, 98, 231, 453, -38, 29, -122, 54, -209, 208, -28, -378, -148, -134, -328, -169, -288, -355, -166, -59, -167, -22, -45, 70, 100, 74, -238, 110, -155, 82, 230, 126, 211, 213, 381, -124, 219, 62, -138, 102, 88, 5, -112, 80, -194, -213, -185, -216, -134, -294, -191, -175, 112, 116, 110, -214, 13, 66, 410, -45, -158, 273, 263, -7, 390, 295, 17, -143, 79, 198, 30, -112, -78, -44, -43, -153, -161, -83, -182, -4, -302, 119, -214, -18, -71, -255, 24, -116, -181, 37, -37, 149, 467, 100, 85, 137, 102, 190, 167, 78, 84, -89, 84, 189, 87, 63, -115, -104, -155, -181, 98, -30, 84, -116, -50, -87, -27, 240, 101, -249, -1, 199, -144, 236, 175, -104, 7, 4, 103, 30, 324, 58, -15, 174, 144, -40, -62, 32, -242, 98, -144, -340, -137, -57, -277, -217, -135, 39, -269, -71, 74, 32, -82, 72, 196, 66, 69, 422, 87, 215, 116, -124, 236, 89, 29, -24, 95, -203, -243, -213, 84, -37, 7, -213, -176, -207, -40, -17, -79, -17, -170, 161, -25, -95, 239, -85, 62, 60, 128]
1049A28J73j55N2j20K3k32J49L7M0MJ61l65P9j77K66m7m5o4L17k35n0L0p2K39
1073A36j35Ro7K5J08J05P4k9o9L05m42N3n3L1R8k14K46j63N4J09k70N0j33R4L
1098g5k74M34o6p7N0k19J66j50J77R2k09K51p7R4l9j13j99J30L18j48n1l1Qj35
1122a43K77j10j06J82N2j67j01J23m0J24n0K8l69M54k13n4J51o1J8p2k50L60J8
1145E1J46r3Q7j47p1J59j32p1K20k45L1J01r1K4P2n1J8K4L5j32M25l05J65k73
1169e3K84m5l67J38J98j77J70j42j49J89KQ5j98J25Q2j86j38L75k53j1n4K21p8
1192A8j70K72j25J33j77M7Nj28J84m19L18K9j04L68N1l91K23j43j53J32J46p7
1214C9J01o9k55M03l94K38j20Q6J31j16L3qk01j16K66k04o8J22J99j7j43J02q7
$$ y = [128, 301, 146, 198, 78, 101, -131, 18, 55, 95, 99, 260, -105, -26, -203, 63, 16, -29, -93, 224, -11, -61, -31, -103, 136, 1, 10, -57, -32, 76, 181, 255, 226, 157, 462, 20, 73, 20, 51, 149, -65, 181, 18, 72, 181, -89, -39, -172, -78, -75, -349, 85, 19, -58, -8, -227, -61, -211, -34, 58, -151, 100, 23, 117, 78, -35, -234, -104, 214, 66, 15, -16, -8, -143, 134, 24, -82, 100, 152, -15, -116, 7, -33, 91, 41, 69, -300, 154, -59, -113, 38, -23, -5, -77, -327, 33, 51, 197, 104, 191, 44, -27, 132, 0, -71, 149, -96, -65, 36, -55, -31, 41, -10, 8, 32, 67, -65, 360, 55, 220, -53, 231, 186, -181, -43, 155, -22, 148, 6, -143, 46, 48, 133, -65, 60, 142, -44, -182, 193, -60, -71, -125, 96, 18, -152, 120, -5, 128, -49, -2, 3, -125, 59, -360, -42, -13, -117, 251, 302, -89, 134, -9, -162, -30, 116, 39, 140, 71, -184, 219, -175, 63, -57, 29, 160, 44, 77, 69, -132, -248, 18, -186, -254, -132, 67, 50, -93, 9, -78]
1237g8J36k69L18l29P0K18j17q6M8K2J1J4K3J58P6n52K88J10l7j31K09j88J06
1260B0O6m1q3N2O2k83J19mN1K5j46P3J19m2L63N2l60K12k30N4j45K39q9P9q7j56
1286h0J41l8q2L2O8O7l04K89k04J22j4K48l57L33r0l9J49j02k5j00l9l8J52j44
1310e5O4qJ04J07j84J98k15N9l1J52k42J18N9j98JQ0nn0j67m2M44m35J62p9J24
1335c9j00P8K59j8j40j89L83k97J76K34l00Pk46K28J27q5L7k58L08l08j4J38K57
1358B38l57K04n7q0L00j36k05M2K99k35j42j5L7J12j6r4J93N0k36J16n9j35J49
1381b7J24J11k08J24J24k07j46QN9Q5r4K18j1l8kj35J84j79K08j62p9J45j40J67
1405A29J04k25o7m6N8l1M0J76J25n93J95J77J66l20Q3O8M5k56J81j02K9J36k23
$$ y = [-78, 58, -211, 107, -222, -152, 66, -51, -137, -89, -67, -56, -42, -19, 139, 215, -337, -49, 61, 24, -107, 102, -86, 20, 86, 45, -38, 14, 76, -207, -88, -92, -41, -16, -162, -89, 30, -12, 351, 403, 43, 255, 25, 79, -66, 173, 84, 163, 76, -80, 61, 23, -59, -27, 41, 108, -196, 93, -111, 11, -3, 245, -112, 221, 131, 92, 241, 139, 114, 14, -25, -63, 89, -55, 9, 1, 105, 212, 28, 226, 11, 70, 39, 191, -51, 67, 126, -72, -71, 9, 4, -46, -213, -255, 189, -246, -84, -163, -39, -139, -61, 198, 180, 40, -149, 234, -63, 113, 347, 47, 54, -192, 36, 163, 78, 115, -143, 165, -143, -157, -19, 238, -119, 85, 28, -52, 248, 112, -93, -51, 248, 13, -129, -144, -107, 5, -11, -105, 88, 138, -98, 18, -41, -176, -27, 97, 208, 0, 124, 248, 41, -105, -97, -38, 47, -47, 171, 160, 122, 120, -15, 169, -10, 198, 36, -43, 102, -38, 129, 233, 8, -59, -105, -47, -78, -38, 138, 263, -330, -135, 42, 208, -112, -29, 39, 84, -172, 9, -93, -64, 72, -151]
1428a51J70j79K60P6j71j70M20k46o1O9P6j2p6jK02l65K62q2m0l3L3j12Q8o7O
1453a04L1m7N1K86j62lj70J82q7j7j91J92j01L32k3K8l63J2J52Q1o5J43j54L07
1477C10k66M4R2l87J14k8Q5nk01P4K64j3J4j72J45J02j78J22n4r3K24k52mQ4r3
1502g2K01m9j13q9L5R5k80L42j20K6K35k39j80K27k9J92r1R5r3j4j55j3J81j42
1526e0R5j08K74k29J9o5J45j63J51O1p7j85q0M43j27l67J32QJ07o6J85l3j42J46
1550G4j72r7J46LJ11j64K09K6j25o0J09j63K19j26Q1%j79K79Mj01L1j1k3j72K68
1575A67j60n0J36k36J43M7R6J09j74k21j04K89j80p5L06q5q5M7j27K36j54J18
1597D3j3Oj60j28K49l8N7J05j15L10l91J75m6J86k52j5J14n3P1K4k10pj8k4J24
$$ y = [-151, 19, -160, 100, 176, 5, -165, 255, 9, -52, 17, 93, 81, 5, 4, 206, -159, 103, 21, -19, -52, -19, -131, -43, -110, -104, -73, -120, -69, 217, 55, 52, -118, 64, -23, -40, -231, -39, -140, 192, 169, 197, -166, -154, -2, 79, 14, 157, 3, 310, 44, 88, 180, -207, -93, -121, -36, -41, -242, -168, 96, 83, 97, -75, 70, 172, -6, 116, 62, -31, 193, -59, -63, 21, -72, 129, 80, -33, -122, -87, 8, -272, 70, -50, -24, 211, -28, -208, 19, -10, 182, 91, 186, 93, 79, -76, -89, 92, -50, 45, -63, 211, -18, 1, -64, 81, -82, 69, 130, 53, -132, -212, 231, 104, -263, -131, -123, -16, -82, 103, 70, -72, 74, -98, -195, -49, -46, 65, -99, 110, 136, 11, -49, 60, -103, 116, -10, 71, 71, -108, 171, 175, 74, 105, 94, 71, -101, 167, 7, -43, 93, -143, 0, 47, 143, 252, 78, -143, -247, 42, -138, -213, 93, 8, -77, -30, -157, 79, -75, 43, 30, 36, -124, -252, -3, -41, 16, 121, 6, 316, -75, 100, 54, 240, -12, -27, 87, 34, 105, 129, -81, -88, -106, -130, -6]
1622fK13j12k57K1PJ85j50J30j43O6KK11l2P8j4j95No9l4J63j38J96j27j81R5
1647h6J00k8K6j94K23j49K57m14J25P1j43J28J06K4j73J21J4O1m4l2q4K2K4k84
1671c29L85k34J36Q2K30k34L9j07q7jjQ7l9L62m36K76K03j38l21J79n5j20K63
1694A40L7j91j19K67jk84J92k08K93r7p2M3o5J52p4n4K03l17K66M5j80K11k60
1717g3L4j56J44j10L56L9n7k31o4K73k75J13j84J18K63k48J8J6J97j65jk08K55
1740E4j36P4J06k00m0n0L34m2r1o5p0L23j21K3k54j16P6J39R2J37j42k18K53N8
1764A24k46J55j06j58R0J07Q1j36K82j85P8J18k35JR3J94m94N00k31j9j13Q1J85
1787A66Qk98J02q2J61J48k3Qk15J71p2j78M09l24J07j41j9o2o9J41J6m6K00k25
$$ y = [-6, 207, 95, -162, -141, -134, 51, -99, 31, -112, -46, -44, 167, 135, 213, 199, 4, 9, -60, -94, 69, -69, 127, 0, -181, -86, 14, -14, 12, -182, 41, -108, 149, -265, -140, -69, -212, -84, 22, 46, -127, -6, 8, 69, 25, -7, -91, -69, -45, -329, 56, -178, -42, 40, 270, 36, 75, -32, -119, -120, -121, -34, -73, 289, -147, 129, 332, 194, -127, 52, -3, -123, 140, 177, -14, -133, 134, 133, -151, 41, -167, 126, 29, -43, 0, -65, 87, 13, -41, 162, -155, 111, 156, -24, 187, -73, -39, -195, -51, -161, 195, 234, 177, -54, -118, 155, -120, -7, -191, -73, 190, -58, -40, -24, 173, 8, 7, -201, 54, -82, -8, 98, -102, -142, -192, 142, 100, 9, -56, -126, 197, 76, 99, -155, -271, -195, -56, 36, 173, 31, -187, 66, 124, -122, 33, -73, -231, -141, -34, 47, -89, 193, 8, 86, 204, -31, -30, 63, 257, -237, 263, 32, 13, -100, -19, 166, 174, -124, -22, -104, 57, 205, 182, 190, -25, 146, 74, -104, 305, -19, 88, -53, -72, -134, -203, -62, -46, -92, 108, -117]
1811a17J73r4q1L11J10m95K05J83p3P2j62r9J99J4k30L68m21J60j30K90l03J26
1833Fl76M03j0r5J37j30K8p9K56l5m2j38J50p0k08K47q1O2J11l55J79K75l34j4
1857a13J66J34k8k33L5R0j37l5J02p8Po9J02n3J45q8L0L5o2O7J01K02k90k24K28
1882C4L01l18P6k98K45j42J91j51J43n1J41l04Q4L1P6J54k21J40k89J75j71Q4
1904g0J03k24J13j61J36Q1j3o5L5k40K93R2N7J35l90K16k61M76j66k34P5L01k33
1927E6k8l7K31q3j9j29p4J60J03l24Q7k01L08l6k35O6L04l99K8J19J81j53J57
1950H2k40K44J12j06k44n5J09j08M41k92K5k21J03j12N00j07j30j66J06om0J98
1972I3p7l4Q9j55K1K40r4j0o3k05K25k21K43n1M8r0Rr4J25J88J19j31Kl12j37
$$ y = [-117, 56, -38, -119, 192, 302, -193, 12, 195, 122, 194, 32, -67, 132, 146, -84, 284, -137, 23, -107, 183, -120, 6, -370, 33, 23, -72, 65, -65, -37, -116, 140, 105, 63, -75, 75, 5, -203, 44, -37, 25, 136, -219, -40, 235, -99, -113, 53, 187, 159, -74, -39, 51, -86, -121, -19, -97, -90, -159, -57, -110, 35, -53, -23, 12, -50, 17, 118, 320, 30, -194, 34, 335, 17, 93, -205, 40, -102, 89, -62, 81, 30, 171, -133, -49, -18, 58, 212, -9, 131, -158, 17, -154, -70, 33, -191, -78, -239, -103, -22, -35, -100, -65, -305, -12, 80, 137, 272, -118, 98, -163, 313, 147, -87, -12, 289, 56, 28, -9, 222, 139, 120, -9, -83, 77, 180, -144, -57, -258, 50, 14, -221, -155, 149, -250, -222, -103, 78, -75, 82, -158, 86, 198, 92, -152, -207, -98, -206, 235, -57, -32, -253, -150, -262, 238, 131, 1, -165, -59, -65, -105, 93, 16, -18, 71, -84, -63, 177, 83, 73, 10, -195, 30, -191, 52, 1, 49, -41, -32, -126, -1, 187, 306, 175, 177, -135, -272]
1997b72L94j41j01J77j78J35j9l4K87k68J34J29l85O8N9PP4n5P0j16O1J45O7j94
2021D4J26p5j45N5N2j19j61K15L20l44N7j79Q4j9L31j55k4p5o3M21l53R6p4JL9
2046E5k79K8L89l31L15j42r0j9K15j40P9j19K33j36j59j70K74J56k03n6P0Q5K
2069E7J32j60O7J85j73o3j87LL17l72J39Q1N3J55J4k33l05L49m2p5j76K03Q9j28
2093g0j98K72k17J55K39j46J12k84K72j76r5R9R6k92K16j83K05o8M3N2L2l0j01
2116f7q4K8lP2J51m29K08K07Lr5k18J93M6L1R3j04N0r6P0j09M2j41L34k48J91
2141A25rJ55k29J20l10P2L5J4k8j58L23m03pL57n4J00K8R6k57N9j39j40M37n26
2165c39K44L76j82K38l96j62K16M1r4L7K7j26L8k37K07J28p9K12R1k41l36M39
$$ y = [-272, 122, -19, -120, 57, -121, 14, -5, -39, 248, -20, 114, 243, -142, -74, -15, -8, 66, 11, 81, -35, 26, 171, 238, 44, 170, 95, -50, 5, 57, -62, -223, -8, 312, -32, 25, -154, -70, -89, 242, 87, 63, -12, -75, 346, -7, 89, 15, 16, 55, -224, -196, 193, -138, 177, 35, -55, -74, 141, 1, 80, -39, 194, 58, -101, -271, 3, 159, -44, -100, -30, 55, 57, 189, 29, 96, 281, 108, 45, -142, -139, 178, -194, -55, 26, 79, 234, 248, 15, -290, 59, 17, -58, -234, -31, 58, -70, -268, 4, -213, -58, 181, 35, 147, -137, 135, -41, -136, -37, 59, -233, -17, -200, 5, -63, -20, 32, 64, 34, -67, -151, -123, -126, -54, 97, -332, -124, 83, 86, -9, -227, -34, 12, 43, 136, 32, 82, -14, 56, -53, -11, -152, 182, -66, 125, 116, 271, 42, 162, -148, -76, -41, -27, -55, -213, 110, -293, -300, 57, 3, 103, 131, 227, -30, 29, -110, -250, 187, -339, -95, 281, 99, 337, -59, -221, -5, 36, -58, -21, 6, -120, -82, -319, -112, 16, -63, 149, 240, -1, -337, 102]
2187A02M4k35N6J99J37k65o8r0J32J59j20j09P3m8k8J12j00R7j10R2Ll0o4p2J00
2212c3J44o5J29j88k11K20J43m04L07J19K3p4k48L17m8l90m3K56m2N5K62j64j98
2235a33J14K5j04K07m36L60o3R0MN5j67L09l7k92N2J8j90K47O8mM3k59L63k73
2259cj31j15O4J66K85k37K49k45j19k9j7J64R3j80J71ol1j45J7K8P5L2j0l53J96
2284h1J09j44J70P0no6j0k7o3L3P3J09k43J78j25j14Q1k1J27l9m1P0M9j06K71
2309B55l09K85n2k25K15l11L09j31Nm6N9Q7J7K9k55J32k0o2QQ6k85K97m56L78
2333A0j11O2q6Q9M7r0J45J49m90L86J7j10J27j37j70K33R1n77N07m8j6O4j32q7
2357a27K37K2j80M9j03J27j50K7J52N8l23K10J7l9K95m40K55r4JK4J94j60j70
$$ y = [102, 146, -89, -33, 166, 303, 38, -30, -120, 12, 171, 51, -58, 15, -33, -61, 51, -49, 48, -62, 30, 33, 3, -61, -133, -33, 111, 46, 175, -13, -224, -4, 139, -265, 42, 161, 184, 110, -138, 179, 131, -259, -302, -46, -88, -33, 229, 65, -133, -19, 6, -98, 109, -327, 33, -30, 60, 64, 119, -48, 261, 224, -68, -16, 2, -188, 59, 127, 123, 166, -93, 270, -3, -134, -249, -185, -19, 266, 29, 278, 33, -86, -115, -132, 32, 125, -55, 116, 110, 79, -66, -49, -21, 54, 86, 76, -277, -81, 28, -116, 54, 124, 119, 53, 43, 16, -47, -14, 59, 168, -75, 103, -22, -136, -55, -76, 51, 12, -29, 41, 90, -16, 255, -54, 231, 179, -46, 169, -142, 167, 36, 41, -5, 54, 141, 158, 187, -68, 64, 44, -18, -10, 76, -209, 88, -368, 10, -101, -39, -125, -36, 11, -79, 66, 215, -275, 111, 128, 18, 145, 8, -162, 71, 162, -415, 92, 44, 28, 92, -40, -127, 110, 132, -48, 1, -102, 25, -125, -98, 54, 112, -211, -1, 16, -23, 272, -168, 87, -7, -6, 18, 212, 52, -118]
2380a18J37J26K0r8k96J35Jj4L01Q2k81k19J46K4J00j66R0n4J87m3j22J3M8l9
2404d0J35r8nj56N7k29K69K91k83j22M1K52K2P9j14j45r8q7M43n19L22j85K67
2427I7j47P1j53j3K90l17M61l07k7j27K08%j21P8q0O9j1P9k15L94k33o9K31j38
2451B0K30k38Lj19L15k76J23j74j03J51K06J9l3Q4k71p8J54K21j15j87K15j62
2473a5p1J27k4J03m5l24K53M7P2k11K68m4M8k36K37j97q7K32q8M3k27k1J32J65
2497A37k42K87k16K5n4J47l06J64P4Q6j13J2K1l21K17J1j43J71Jp2M5P4j0J22
2521A17j14O1j82j75L68m8p8j09K42M8K4m77J73N3K46j92j5o9L41q5k99J5K59
2544A04j50O5J08k35Q2Q2j00J29m5m4K13j88k75L24k86K61J69m29L06j11Q7%l25
$$ y = [-118, 19, 145, 165, 67, -229, -94, -93, -107, 194, 276, -5, -224, -78, -54, 46, -120, -30, -84, 103, 60, -62, -49, -1, -40, 95, -3, -8, -164, -107, -336, -67, 224, -59, -181, -140, 112, 134, 213, 99, -46, -144, -231, 212, -307, 15, -170, 97, -50, 21, -132, -145, 145, -172, 289, -18, -45, -172, 36, 36, -85, -7, -87, -18, -29, 50, -165, 229, -4, -73, 158, 20, 250, 12, 15, -104, 211, -65, 58, -116, -219, -68, 138, 157, 124, 208, -63, -141, 13, 234, 119, -68, 147, -15, -86, 41, 17, 120, 75, -249, 4, 51, 123, -88, 180, 136, 184, -52, 185, -12, -99, 133, 45, 88, -139, -160, -28, 137, -105, 182, -34, -9, -63, 84, -222, -58, 16, 102, -11, 1, 22, -299, -82, -71, -214, -43, -42, -114, -69, 5, -5, 117, 3, 64, -118, -293, 75, 27, -51, -160, 82, 130, 154, -323, -150, -97, 149, -43, -58, -127, 214, 129, -170, -155, 104, -46, 19, 127, -108, -26, 56, -44, 85, 40, -4, 209, 21, -254, 70, -216, 45, 214, -215, 91, -20, 67, 67, -258]
2567b58K78K2p1j66K47j29N0k8Q6L2K90l56O9J0l86M22j09O9k39L27o7m6J4J04
2591A65j01k3q6J35j84J32m0J41j68J81nmn19J81K96k16J29j28J64qj83L22l78
2614a97J95j22K2K94jk83L6j03j3K4J11J30Q8J47m88J75R5P3j02K9j12q0NK01
2638A24k63K67j69J4J70j36J59m89L34P4J65j94k81K84L35m03K09r9j81k7L08
2659B01l47J59N4j35J2j45K86j30k4r7L21l56K13k28J72N7k03K49Q7P9j98k21
2681a94j76L53nL50m16L2J51k98J73J10j44K33l29K27jn4j79J38J8o4L01l93K33
2704F6l5l3k4J46R6k94J60n5k22L72k46O6K20q6Q0m4j73K9J33J69l25M0j44Q5
2728a9K74l01J36o7oJ09k86K76r1o9M6lk7J28j33J80j05K22j96p7O6O3l07o5J29
$$ y = [-258, 20, 42, -29, -195, 52, -77, -27, -55, 31, 63, 353, -3, 66, 76, -310, 112, 3, 72, -167, 160, 93, 47, 61, 165, 64, 41, -45, 90, -94, 38, -2, 139, -29, 152, 147, 143, -376, -195, 101, -115, 14, -114, 50, 42, -141, 181, -197, -2, -124, -102, 192, 191, -92, -56, -159, -172, -148, -37, 93, 181, 328, -160, 15, 110, 183, 81, 110, -2, -82, -77, 124, -139, 128, -41, -27, 143, 7, 166, -323, 11, 85, 250, 56, -225, 59, 394, -9, 200, 101, -80, -107, 201, -146, 13, 67, -68, -56, -201, 85, -45, -69, -166, 155, -201, 12, -216, -44, 13, -190, 59, 146, 225, 27, -194, -370, -17, -22, 328, -88, -56, 95, -203, -30, 80, -64, 169, -160, 67, 66, 12, -167, -29, -11, -75, 226, -167, 66, 31, -2, -26, 120, 216, -78, 82, 27, -195, 177, -69, -3, 217, 131, 211, 167, -6, 23, 156, 325, 0, 40, -104, -19, 255, -46, 90, 23, 17, 126, -160, 116, 25, -44, 2, -1, -28, 100, -33, 147, 42, 264, 68, -9, 57, 120, -187, -252, -123]
2753a23MP9M7L1j05J44l4l1K56l80n1J70l2Q2P2j13j5m24N75n74L39P8jO4k00
2778a42K63k06R9r5J82Rk89R8J15m8J51J01l87K04J01j16L7l20J98O1j6j52l1
2801a83J86o8K46J08j01r7M3p5J89j21k22J02Q2j49M3R4l9n9J43k30J39P6j25
2824a8J03J6l16L56o4P2l42L10L8k17N9J68K8l88j52N6L44j47J32N1N3p5q3r1
2848a07k43N94k77J13m15M45K60o4m01p6L70l19J92k1n9r8N0j02L18j60m8o0J98
2871I0q0Q4K33p24L59J57q9r8L32l98K28q3r0R3o4M9k83M66k04j61J39J40j83
2894h7K87j50R9k97K16J4J83j39j36K85q2j67J17l27L53K4j58Q2r3kl8k92M56
2917A48l69M11J9j32l5J8l8q7J13j27j21J65N2P2m7J16pj39n5N4L3L1O8l25J88
$$ y = [-123, -119, -40, 7, 38, -67, 77, 43, 12, 268, -112, -163, 7, -25, 57, 129, 16, 1, -423, 152, -422, -83, -5, -6, 58, -142, 121, -85, 14, -81, 101, 110, -179, -81, 34, -14, 137, 238, -149, 55, 156, 40, 77, -243, -45, 16, 0, -152, -183, 3, -65, 181, 289, 188, 91, 134, 59, 248, 127, -95, 7, 89, -60, -17, 77, 38, -21, 122, -108, 31, 107, -18, 85, 101, -215, 141, 77, 149, -193, 117, 155, -62, -3, 165, 193, -195, -347, -291, 53, -94, 38, 89, 142, 67, -16, -107, -350, 244, -33, 80, -335, 110, 370, 306, -95, -171, 199, -120, 72, 51, -8, -106, -56, -158, 160, 0, -48, -108, 90, 10, 94, 327, -397, -38, 119, 30, -68, 264, -134, 94, 11, -79, 14, -50, -1, -284, 182, -22, -183, -44, 96, -87, 200, 50, 149, -148, 68, 82, 265, 126, -10, 275, 193, 26, 143, -184, 169, 193, 35, 117, 24, 22, -16, -308, 148, -221, 190, 209, 77, 42, 60, 22, -65, 48, -79, -200, -35, 17, 89, 42, 158, 151, 12, -43, 11, 44, 75, 143, -182, 6]
2942Fl5K5PJ22l5j99L77l16O3l33M38k05J94j39j18J05j80K75j81L03j74k11R1
2965a20K80m1P4j21j69J44m2KK70l18J63j83L15l12J50j84J63j52K48j41J3j64
2987a25K01j65J92p9O5N4n1l40N6L12j30J14OKK02j20l75O6K31J74j22j36L2Q
3011G2J03j20J26l83K25j99M19l63J70K2J86n38L39N3l0L0j07j30J63j55o4M16
3033B35l66mJ15J81N3k35K37l33J91J5Mj85q7L86k81K22j49J29j95J40j6j9r5
3056e7j70K87J6k73M2K12p1l1J4k19J42K82Om9j85P5R5k12J88J70m79J65J82q0
3080E0k11OL37j25j78J68k15N29k99J7K3q9j42K31j03j20J28J37N2j67j25K94
3102A98k92k2J06k69N22m1k89o9J77k5r1J91r7k46N6j02K64K18k67Q2m6o1r0j0
$$ y = [6, -29, -4, 3, 125, 90, -109, 268, -48, 15, -318, 120, -85, 109, -30, -148, -43, -223, 52, -129, 174, 0, -211, -120, 160, 119, 193, 72, -97, 47, 5, 7, 277, -41, 122, -61, 254, -58, 92, -92, 71, -81, 167, 26, 39, -125, 76, -89, 103, 24, 89, 143, 92, -248, -192, 120, -10, 104, 110, 112, 314, 194, -181, -115, 116, 290, 168, 32, 64, 72, 175, 55, 181, -202, 23, -176, 243, -120, 50, 72, 258, -280, 59, 112, 82, 112, 5, -125, 38, -117, -181, 235, -131, -135, -20, 161, 214, -21, 216, -117, 74, 89, 93, -92, -179, 207, -74, 148, -1, 128, -67, 73, 57, 38, -57, -227, 60, 76, -197, -155, 57, -14, -45, -31, -250, -108, 174, 180, 131, -54, 21, 116, -96, 92, 262, -217, -52, 130, 50, -161, -155, 182, 57, -121, 47, -168, 361, 62, 79, 102, 13, -129, 102, -1, -121, 7, 144, 196, 29, -96, 198, -94, -116, -10, -279, 243, 202, -87, -156, 21, -4, -95, 96, -1, -247, -191, -293, -29, 189, -78, 4, -42, -103, -193, -203]
3126b03K28j85K63r1K9p9k0l8J52K9%j43J56j67P2P6k24J18n0n5J18R9jj69J04
3151A9M2k35J09P5N8k69K41K05l38k01L34j85J97%K84l28P4kK69j70j16k32P1
3174i8O2n7J15n2j7n0K05M9K6l89K75qj38j01J00L59k75j11J17k3Mm4K53j91j67
3199a56L4M9j34K56m6j17K6J26n5N0j42J80R2k03rJ59k23J68R8k73L13k37q1N3
3223g2j25K38j73k4K54k34J39J6rN6j07m67N38j18j19RR1p6J41m6K92q8k26K11
3247A01k90K45j06Jj14O4L10j77J2L4k50K25K24n80L53J93k62J86j10J13m6k49
3269a23J30k06J09K11k00j1L03l89K05k16K11J4K65j71k33J04pK72j76j12j28
3290a48M9qJ87j7k88K81J5l4J23O2k53n7j7j33N4K78o0r3q6J0L02k73J21J53k09
$$ y = [-203, 25, -160, 103, 12, 41, -38, -58, -96, 56, 85, 85, -58, 98, -69, 3, 79, -145, -27, -77, -132, -14, 85, 84, -85, 19, 61, -174, -65, 10, 68, -201, 40, 245, -93, -294, 40, -145, 52, 52, 336, 8, 82, 80, 349, 179, 63, -169, -98, -36, -93, 22, -30, -47, -97, 108, 157, 183, -206, 69, 61, -77, -178, -78, 281, 6, -105, 12, -11, -7, -51, 202, 11, -156, -122, -73, -207, 49, 3, -114, -88, 38, -17, 33, -109, 71, 163, -40, -49, 110, -113, 55, 153, -120, 193, -44, -125, -72, -197, 41, -132, -156, 98, -136, 3, 19, 10, 66, -41, -508, 30, -88, -207, -198, -107, -183, -42, -88, 204, 116, -110, 101, -189, 56, -50, -49, -163, -99, 211, 34, 46, 80, -170, 55, 279, -301, 52, 245, -17, 169, 59, 172, 126, -123, 7, -199, -90, 121, -79, -90, 213, -176, 29, -187, 24, 38, 303, 132, -101, 3, -4, 268, 92, -20, -148, -99, -107, 80, 63, -225, 56, 71, 37, 160, 222, -31, -88, -105, -238, -184, 94, 34, -59, -145, -135, 167, -106, 15, 168, -41]
3315d1J81l7N6m09L82j16o8j55K48K4k34K7J26m2J12j52K31k67L23k29K01j61
3337@j54K73j97J59r8Q6pj33j24K4N7J65K9k09N9K34m41L56k31L18j07j23NJ61
3361A02j23o8Q9j13J78J47n1o1J4n4LMj29j80M20J92k54n0n7j54J21o0J19r5q8
3386a48j0K02k08J70M8mk20K03rk04L83k10Q0l74J94j62M53k18j1k5l56L51J13
3409C8j15L5j38K77j07O2R5j41N9k85K81k99J46L30m8j26M8p3j75M6M1J16k16
3432a49L10j7j02J9k9M7p4j45J82K83l52p4J09m4K80k04k50J62J02R2K7k64M3
3455d8J40l19K72k8n9O1J30j14J73k3j94N9J32q5k67k2J03J35j96j07L01J96l17
3478g7j77L05KMj79J42j76K08P2j63O4M3k09L10M7j65n9L21l20kJ31j12N1n6R6
$$ y = [-41, 140, 103, 159, -250, 132, 16, -52, -207, 41, 65, -169, -142, -16, -58, 54, -98, 133, -134, 189, -40, 161, 0, -154, 119, -78, 81, -17, 69, 62, -71, -195, -171, -114, 51, 80, -129, -70, 164, -277, 79, -152, 166, 59, -64, -59, 102, -21, -89, 0, -113, 65, 212, 161, 100, 114, 60, 63, 67, -62, -242, 178, 370, 116, 66, 9, -145, -24, -84, 35, -60, -148, -158, 44, -164, 6, 54, 50, -170, 33, 24, -180, 203, -7, 73, -301, -107, -269, 184, -34, -45, -70, -426, -75, 38, -77, -42, -180, 97, -10, 52, 147, 6, 65, -220, 61, -238, -92, 238, 190, 64, 112, 39, -136, -90, -49, 67, -149, 161, 144, 42, 61, 32, 79, 5, -140, 42, 325, -27, -101, 8, -36, 244, 40, -210, -48, 54, 146, 173, -91, -48, 92, -227, 45, 17, -42, 19, 149, 35, 208, 185, -9, 50, 182, 97, -170, -192, -89, 46, -150, -257, 44, 240, -77, -254, 51, 53, 57, -122, 20, -156, 52, 124, -39, 25, 68, -141, 169, 216, 51, -8, 313, -7, -9, 122, 10, 61, 5, 101]
3503A01k35j1J33r5J8n5K71k66J63j68J4J12M0J04j45J2kL40q9m3j86k07K20p2
3527d6pj7qJ50R8k73K06oj41l6j42J08L92k76J81l99J45K51l46K63j49J8J68j81
3551d7o0J69k2j9J84k30M2j35J80k8l32K49J22k79Q5J54J28Ol53L14l74O6J15
3574f5l2L86l37K9rJ5j11J70k2j30J29j3k3J41j33J2j55K24Q5j16k34M34o4q5
3598I6J95l30Q4j76P6p2J63J12j24k30J38P0Q3M5K8p6j03J52k84J49j05N2N7R7
3622I7j7p6j73J12K9n6J37k24J53j23K41k16J20N1R1k56K11k50K14K44l12j59
3644a62J59J15l7j79K69j48k22J22K35kk29J71J64Jl24J03l7K8O5l01K51K1p8
3667a5o2j14J93j49M5mK23N8J6p6k15Q5K49m88J13L90m65K35K02O6k72pK19m64
$$ y = [101, -134, -145, -12, -107, -89, -144, 127, -139, 24, -144, -130, -18, 22, 126, -19, -7, -9, 331, 242, 199, 13, -194, 26, -46, -53, -70, -78, 72, 170, -103, 103, 97, -44, -80, -222, -114, 278, 2, 183, -216, -71, 180, -166, 97, -52, -34, 134, -47, -107, 62, 40, 21, 205, -25, 17, -118, 62, 34, -298, -49, 73, -206, -121, 33, 161, 167, -186, 128, -246, -180, -65, -97, 289, -48, -19, -28, -13, -124, 46, 24, -106, 23, 10, -13, 128, -5, 7, -148, 76, 161, 45, -189, 245, 181, 96, 291, -39, 45, -131, -55, -127, 36, 148, 24, -206, -68, 2, 85, 130, 158, 82, -21, 131, -153, -4, -109, -57, 0, 97, 80, 4, -169, -57, -28, -84, 53, -171, -18, -141, 100, -116, 4, 55, 146, -110, 101, -149, 65, 309, -3, -162, -3, 112, 75, -104, 165, 17, -205, -83, 152, 150, -79, 92, 256, 257, -67, 36, -1, 27, 92, -209, 42, 63, -15, -77, -191, 2, -147, -102, -106, 117, 175, 191, 115, -100, -15, 234, -254, -141, 249, -216, 19, 221, 287, 15, 8, 227, -237]
3691b37J22K12M5j19K39l41J03J34l93J04J25j24J77j05J7j17J80l3L2j07L5L41
3713B90m24R8j7m6J28q4m0K28j01k2j53K2N1P2J11p8k14K64J15k42O0n6k1j89
3737b48J29K45M5j39j81N0K77k10LP4j71J9J70J80l30J03M9j16O7J95m34J42K12
3760A31k88K72k19J15N3P5Om7r6R4q8n9J31j20J06R0j02j06N0P7k38J69j38J67
3784C5j66R8Q1Q1j61o6j1L05j4j40L36l65J8m4q3RK6R5o7J2N1J3k21R4K59p8o5
3811C2J30j55j21j43L01M44m08n4j45O8K4J05Q7j65j41J82o5nJ39j82L5L2k0J59
3835A34j47j15J28o6k8J49ml5RK8j94k2k3K15j75K2J24PJ29P7l32K85l3r7q0j09
3861a53J80q5J73Jj49J67q0N7j71j22J29Q1p5o4J3K29j40n8J11p0j35N6Q2J14
$$ y = [-237, -115, 97, 142, 23, 262, -79, 24, 158, -235, -131, -6, -130, 47, -58, -41, -158, 22, -11, 21, -86, -51, 290, -134, -36, -53, -99, 29, -55, -95, 133, 32, 10, -143, -121, -70, 2, 113, 35, -179, 85, 200, -42, 18, -38, -59, -248, -119, 126, 171, 32, -149, -99, 178, -32, -29, 45, -126, -107, 63, 243, -87, 16, 65, -51, 16, 211, -223, -81, 131, -157, 115, -104, 11, 64, 139, 145, 98, 2, 96, 8, -51, 80, -40, 66, 156, 54, -52, -2, 75, -163, 6, -132, 35, -131, -33, 48, 129, -32, -98, -109, 196, 182, 42, 378, 13, 31, -13, -96, -87, -61, 34, -33, -21, 30, 43, -178, -84, 175, 97, 32, 162, 7, -114, -257, 44, 488, 80, 26, -119, -51, -27, 78, 165, 0, -141, 41, -24, -29, 110, -72, -37, -5, -25, 134, -13, -128, 0, -66, -94, 55, 51, 16, 25, 53, -141, -163, -186, 29, -146, -124, 0, 7, 136, 213, -119, 166, 133, 36, -44, -153, 27, -58, 115, 116, -33, 134, 54, 111, -60, -182, -53, 28, -47, -111, -98, 131, -9, -67, 44, -26, -161, -105, -23, 91]
3885I1l5j51O5r4K24J12k40j43K54l20J09QJ51J62j69r2J26J1L8k13J52k5M0j90
3909a29M28k34m7P0m08K01l8J97j06N5n8K08Kj10j31M65l96j42J75j33M03l10
3931c8k3J31L3k26P6N2l7J73l02K56j45kn9J92j19l0J42j70j08K00Q5m8Q2j79
3955f4J43r8L4k06J50J1Q8q8M5m5j1j12qK32j72J58M2k95K47k4k51K41k02O0J40
3980A5n1J53o1l15K84om4j59K25O0j8k42M09n49L90j73j34K70j96J05J87k63K23
4003A10K6j92J16JO0P2k34L24l50K26k17J56J71l60J40j58L8j5K6M0QJ39M4k69
4027i8M17j25l5Nk4j23l7N5J01r2J12j43M32m47j51o1J22L4O7mj64K93j65Qm6
4052f9j20K51n2Q5l44l0K02J37J28l14J26K04m2j93j01m0J64q8K84Oj76J24l9
$$ y = [91, 56, -95, -30, -124, 100, 212, -28, -171, 83, -237, -128, -120, 31, 193, 24, -68, 58, 69, 107, -106, 46, 21, 61, -129, 299, 65, 18, 88, -320, -119, -157, 40, -66, -11, -69, 139, 141, 31, -100, 365, -31, -173, 2, -131, 272, -38, -61, 70, 103, -123, -47, 5, -32, 141, -161, 95, -50, -52, -111, 81, -38, -68, 74, -96, -204, -4, 81, 33, 115, -64, 79, -19, 15, -191, -41, -30, 58, -30, 15, -30, -41, -153, -161, 71, -101, 57, 99, -196, 51, 27, -224, 17, -185, -125, 15, -36, 117, 56, -259, 25, 19, -25, -184, 41, 101, 83, -159, 250, -299, 91, -82, -216, 54, -142, -37, 150, -113, 110, 136, -56, 60, 61, 121, 193, -41, 283, -67, 159, -58, 98, 269, -91, 49, -109, -71, -86, -60, -20, -12, 127, 171, -98, 319, 194, 159, 164, 140, 17, -20, 35, 136, 44, 156, 13, 445, -2, -153, -214, -92, -58, 9, 5, -159, 134, -31, -23, -69, -189, 62, 10, 95, -249, -279, -77, 60, 188, -126, 0, 204, 162, -31, -132, -172, -8, -96, 188, 194, 18, 142, 103]
4075A03J22l45L14n15l4O5K66Q8p8n2K5n5R7j44N9M47j80k33p6J22J47k37J6J40
4099F2j49N3J34K4o6m7j10J67q0J39k5m1k4j34K14q9J40j63k58J09K7J32n2J65
4123A28p6o4k63N06N6m85K89j51O7j0n1p4J43oqO3j36J16m7R0q6J4J22j71r0J40
4149A6j56Q4J84j54L2R7k77N8J61J4J62L8n34L96m0l46N07j39l87L03l2J71j65
4172gJ21o7k01L63j34o8P5j49q8K46r7q5R2K63m3j66l09L19p8J53j18j18K37k08
4196f7L09l05k0J77q7j63K77j64M48m64j29J83J31j78O9N3k1j97K54O3O2j26k8
4219G7k8qj15J40j18j08J82Q5K6Q0k28J21k0j68p4J04k8K9L42q0k03O8j90K50
4243A36k14K91j29q5j08J23P7k37J34k11J42l27N12n5m0J60k13oP3j44O2N6q4
$$ y = [103, 225, -120, 194, -321, -355, -290, -24, 64, -14, -66, -41, -96, 1, -143, -84, 363, 183, -50, -126, -4, 143, -94, -78, 62, -87, -34, 100, 124, 58, 11, -99, 68, -12, 127, 102, 61, 37, -97, 117, 28, 168, 5, -253, -144, -117, 15, -37, 128, 52, -12, -275, 231, 287, -198, 91, -60, 7, -3, -54, -128, 15, 9, 1, 64, -72, 44, -3, 87, 1, 15, 137, -34, -124, 16, -140, -56, 128, -26, 6, 103, -174, -116, 45, 59, 221, 259, -275, 121, 81, -265, 242, 103, -284, 19, -13, 158, -7, 114, 47, -154, 209, 75, 7, 82, -67, -155, 91, -6, -91, 1, 264, 221, 55, -254, 65, -13, 140, 22, -96, 141, -67, 242, -63, -83, 94, 7, -156, 121, -43, 405, -59, -188, -5, 126, -52, 17, 70, 49, -148, 106, 169, 231, 105, 77, 49, 41, -74, 66, -52, -160, 22, 107, 133, 213, -15, 106, 86, -82, -156, -52, -80, -51, 291, 211, 8, 76, -114, 136, -78, 213, 84, -1, -109, 14, 91, -146, -12, -223, -81, -408, 104, 49, 9, 169, -44, -50, 23, -121, -59, -3, -87]
4266h7k3Q4M44m80J82j09j6k23J80J74mM2j97r1L06j34j0o2J38l66L28m1J09j34
4290A0N5k59K27j84P5J25n0j69J63M4j64l1R8M71m75J44K46j30kj9k97K94m4l69
4314b41M30j30k11j7N1L5J84l4M0j21J14j40j54k0L20k34L35p8q7j54J36J77k05
4337dj06K78k60J53J00J9k96l6J26L4J19j35K37k29n3r2L9l2J83l9l8j18K30k05
4361a25j03K21j24L31j87k38J48j58K87J86j27K49l82J99J09k90J97N1l72R7m8
4382g9K19j50%k9M2J60m71J60K28j49J38%o5j13R1N6l8j07J34L25k20j96J60q0
4406A6L7J70J33n58K96N9l2j17J2n5j47J05n4K4J38r9M0j33K9J21J2PR2m8k61
4431b13J10N8l1J88k45j89L93J43p5N6j16k02K66p5l32N18j96k44J79R3k00K49
$$ y = [-87, -110, -26, 418, -62, 120, 11, -5, -228, -48, 126, 122, 164, -33, -124, 182, 48, 38, -24, 114, -252, 76, 35, 144, 10, 65, -194, 33, -151, -76, 49, -1, -170, -7, 37, -127, -158, -60, 411, -64, 80, 326, 196, 194, 175, -122, 172, 128, -241, 189, 59, -152, -169, -118, -83, 101, 67, 107, -14, 100, -40, -194, -214, 106, -128, 207, 129, 42, -112, 24, 201, -4, -110, 168, -92, 61, 161, 180, -116, -152, -26, 8, 127, -8, 229, 0, -53, -145, -106, -138, 45, 6, -32, -150, 80, -125, -228, -7, -131, 200, 13, -225, -77, -235, 52, 238, 111, 360, -22, 177, 286, -4, 193, 244, -128, -31, -79, 140, -10, -10, -39, 3, 163, -308, -148, 80, -69, 69, 69, 4, -109, -18, 38, 0, -107, 27, 352, 132, -64, 96, 16, 53, 223, 356, -202, 94, 153, 121, 4, 16, -39, -186, -81, -135, -111, 27, -72, -32, -165, -136, -15, -3, 4, 96, 48, -213, -103, -45, -76, 112, -133, -322, 71, 214, 139, 195, 79, -123, 143, 68, -264, 254, 58, -186, -7, 86, -114, 135]
4453A35l29J67K75k75P6q1Q1P5j30p5J62J44l90K37j06j69L9P9j51K47K64k04
$$ y = [135, -194, -27, 248, -27, 49, -32, 49, 124, -6, -81, 81, 225, -165, 72, -34, -203, -164, -85, -236, 11, 275, 71]
$$ [...]
8191I5
##END NTUPLES=NMR FID
##END=
