##TITLE=1H_LR-698-R3-FK
 CDCl3, 8 sc, 
 27.1.2020
##JCAMPDX= 6.0         $$ Bruker NMR JCAMP-DX V2.0
##DATA TYPE= NMR FID
##DATA CLASS= NTUPLES
##ORIGIN= UXNMR, Bruker Analytische Messtechnik GmbH
##OWNER= root
$$ XWIN-NMR		Version 3.5
$$ Mon Jan 27 14:31:42 2020 Russian Standard Time (UT+4h)  she@DPX200
##.OBSERVE FREQUENCY= 200.1315
##.OBSERVE NUCLEUS= ^1H
##.DELAY= (6, 6)
##.ACQUISITION MODE= SIMULTANEOUS
##.ACQUISITION SCHEME= undefined
##.AVERAGES= 8
##.DIGITISER RES= 18
##SPECTROMETER/DATA SYSTEM= spect
##.PULSE SEQUENCE= zg30
##.SOLVENT NAME= CDCl3
##.SHIFT REFERENCE= (INTERNAL, CDCl3, 0, 15.7039)
##AUDIT TRAIL= $$ (NUMBER, WHEN, WHO, WHERE, WHAT)
$$ ##TITLE= Audit trail, XWIN-NMR		Version 3.5
$$ ##JCAMPDX= 5.01
$$ ##ORIGIN= Bruker BioSpin GmbH
$$ ##OWNER= she
$$ F:/spectra/data/she/nmr/H-F/1/audita.txt
$$ ##AUDIT TRAIL=  $$ (NUMBER, WHEN, WHO, WHERE, WHAT)
(   1,<2020-01-27 14:30:12.68 +0400>,<she>,<DPX200>,
      <created by zg, POWCHK disabled, PULCHK disabled
       configuration hash MD5:
       00 E9 B6 7A A2 85 ED C7 34 08 36 98 17 FE 4E 26
       data hash MD5: 16K
       F3 72 7E ED A4 19 E0 60 25 1A B3 45 35 A9 15 12>)
$$ ##END=
$$ 
$$ hash MD5
$$ 0F 2C B2 C5 E1 D8 7F 99 B5 56 54 35 F7 6E E3 3E
##$RELAX= 
##$RELAX= 
##$RELAX= 
##$RELAX= 
##$RELAX= 
##$RELAX= 
$$ Bruker specific parameters
$$ --------------------------
##$DU= <F:/spectra>
##$EXPNO= 1
##$NAME= <H-F>
##$PROCNO= 1
##$TYPE= <nmr>
##$USER= <she>
##$AMP= (0..31)
100 100 100 100 100 100 100 100 100 100 100 100 100 100 100 100 100 100 
100 100 100 100 100 100 100 100 100 100 100 100 100 100 
##$AQSEQ= 0
##$AQ_mod= 1
##$AUNM= <au_zg>
##$AUTOPOS= <>
##$BF1= 200.13
##$BF2= 200.13
##$BF3= 200.13
##$BF4= 200.13
##$BF5= 200.13
##$BF6= 200.13
##$BF7= 200.13
##$BF8= 200.13
##$BYTORDA= 1
##$CFDGTYP= 0
##$CFRGTYP= 5
##$CHEMSTR= <none>
##$CNST= (0..31)
1 1 145 1 1 1 1 1 1 1 1 1 1 1 1 1 1 1 1 1 1 1 1 1 1 1 1 1 1 1 1 1 
##$CPDPRG= <>
##$CPDPRG1= <>
##$CPDPRG2= <>
##$CPDPRG3= <>
##$CPDPRG4= <mlev>
##$CPDPRG5= <mlev>
##$CPDPRG6= <mlev>
##$CPDPRG7= <mlev>
##$CPDPRG8= <mlev>
##$CPDPRGB= <>
##$CPDPRGT= <>
##$D= (0..31)
0 1.2 0 0 0 0 0 0 0 0.06 0 0.03 0 0 0 0 0.0002 0 0 0 0 0 0 0 0 0 0 0 0 
0 0 0 
##$DATE= 1580121012
##$DBL= (0..7)
120 120 120 120 120 120 120 120 
##$DBP= (0..7)
150 150 150 150 150 150 150 150 
##$DBP07= 0
##$DBPNAM0= <>
##$DBPNAM1= <>
##$DBPNAM2= <>
##$DBPNAM3= <>
##$DBPNAM4= <>
##$DBPNAM5= <>
##$DBPNAM6= <>
##$DBPNAM7= <>
##$DBPOAL= (0..7)
0.5 0.5 0.5 0.5 0.5 0.5 0.5 0.5 
##$DBPOFFS= (0..7)
0 0 0 0 0 0 0 0 
##$DE= 6
##$DECBNUC= <off>
##$DECIM= 24
##$DECNUC= <off>
##$DECSTAT= 4
##$DIGMOD= 1
##$DIGTYP= 9
##$DL= (0..7)
0 120 120 120 120 120 120 120 
##$DP= (0..7)
150 150 150 150 150 150 150 150 
##$DP07= 0
##$DPNAME0= <>
##$DPNAME1= <>
##$DPNAME2= <>
##$DPNAME3= <>
##$DPNAME4= <>
##$DPNAME5= <>
##$DPNAME6= <>
##$DPNAME7= <>
##$DPOAL= (0..7)
0.5 0.5 0.5 0.5 0.5 0.5 0.5 0.5 
##$DPOFFS= (0..7)
0 0 0 0 0 0 0 0 
##$DQDMODE= 0
##$DR= 18
##$DS= 0
##$DSLIST= <SSSSSSSSSSSSSSS>
$$ [...]
##$SUBNAM2= <"">
##$SUBNAM3= <"">
##$SUBNAM4= <"">
##$SUBNAM5= <"">
##$SUBNAM6= <"">
##$SUBNAM7= <"">
##$SUBNAM8= <"">
##$SUBNAM9= <"">
##$SW= 24.9337058887773
##$SWIBOX= (0..15)
0 0 2 0 0 0 0 0 0 0 0 0 0 0 0 0 
##$SW_h= 4990.01996007984
##$TD= 16384
##$TD0= 1
##$TE= 0
##$TE2= 300
##$TE3= 300
##$TEG= 300
##$TL= (0..7)
0 120 120 120 120 120 120 120 
##$TP= (0..7)
150 150 150 150 150 150 150 150 
##$TP07= 0
##$TPNAME0= <>
##$TPNAME1= <>
##$TPNAME2= <>
##$TPNAME3= <>
##$TPNAME4= <>
##$TPNAME5= <>
##$TPNAME6= <>
##$TPNAME7= <>
##$TPOAL= (0..7)
0.5 0.5 0.5 0.5 0.5 0.5 0.5 0.5 
##$TPOFFS= (0..7)
0 0 0 0 0 0 0 0 
##$TUNHIN= 0
##$TUNHOUT= 0
##$TUNXOUT= 0
##$USERA1= <user>
##$USERA2= <user>
##$USERA3= <user>
##$USERA4= <user>
##$USERA5= <user>
##$V9= 5
##$VALIST= <valist>
##$VCLIST= <CCCCCCCCCCCCCCC>
##$VD= 0
##$VDLIST= <DDDDDDDDDDDDDDD>
##$VPLIST= <PPPPPPPPPPPPPPP>
##$VTLIST= <TTTTTTTTTTTTTTT>
##$WBST= 1024
##$WBSW= 4
##$XGAIN= (0..3)
0 0 0 0 
##$XL= 0
##$YL= 0
##$YMAX_a= 288087
##$YMIN_a= -254539
##$ZGOPTNS= <>
##$ZL1= 120
##$ZL2= 120
##$ZL3= 120
##$ZL4= 120
##$ABSF1= 10
##$ABSF2= 0
##$ABSG= 5
##$ABSL= 3
##$ALPHA= 0
##$AQORDER= 0
##$ASSFAC= 0
##$ASSFACI= 0
##$ASSFACX= 0
##$ASSWID= 0
##$AUNMP= <proc_1d>
##$AZFE= 0.1
##$AZFW= 0.1
##$BCFW= 1
##$BC_mod= 2
##$BYTORDP= 1
##$COROFFS= 0
##$CY= 11.3945322036743
##$DATMOD= 1
##$DC= 2
##$DFILT= <>
##$DTYPP= 0
##$F1P= 16.9975609425685
##$F2P= -3.02152046262296
##$FCOR= 0.5
##$FTSIZE= 0
##$FT_mod= 4
##$GAMMA= 1
##$GB= 0.15
##$INTBC= 1
##$INTSCL= 1
##$ISEN= 128
##$LB= 0.24
##$LEV0= 0
##$LPBIN= 0
##$MAXI= 10000
##$MC2= 0
##$MEAN= 0
##$ME_mod= 0
##$MI= 1.114404
##$NCOEF= 0
##$NC_proc= 0
##$NLEV= 6
##$NOISF1= 3.799351
##$NOISF2= 2.8
##$NSP= 1
##$NTH_PI= 0
##$NZP= 0
##$OFFSET= 15.70392
##$PC= 1
##$PHC0= -9788.664
##$PHC1= 16.2008
##$PH_mod= 1
##$PKNL= yes
##$PPARMOD= 0
##$PSCAL= 0
##$PSIGN= 0
##$REVERSE= no
##$SF= 200.130013532006
##$SI= 16384
##$SIGF1= 3
##$SIGF2= 2
##$SINO= 400
##$SIOLD= 16384
##$SREGLST= <1H.CDCl3>
##$SSB= 0
##$STSI= 0
##$STSR= 0
##$SW_p= 3612.71676300578
##$SYMM= 0
##$S_DEV= 0
##$TDeff= 0
##$TDoff= 0
##$TI= <>
##$TILT= no
##$TM1= 0
##$TM2= 0
##$TOPLEV= 0
##$USERP1= <user>
##$USERP2= <user>
##$USERP3= <user>
##$USERP4= <user>
##$USERP5= <user>
##$WDW= 1
##$XDIM= 8192
##$YMAX_p= 0
##$YMIN_p= 0
$$ End of Bruker specific parameters
$$ ---------------------------------
##NTUPLES= NMR FID
##VAR_NAME=  TIME,          FID/REAL,        FID/IMAG
##SYMBOL=    X,             R,               I
##VAR_TYPE=  INDEPENDENT,   DEPENDENT,       DEPENDENT
##VAR_FORM=  AFFN,          ASDF,            ASDF
##VAR_DIM=   8192,          8192,            8192
##UNITS=     SECONDS,       ARBITRARY UNITS, ARBITRARY UNITS
##FACTOR=    0.0002004,     1,               1
##FIRST=     0,             0,               0
##LAST=      1.6414764,     0,               0
##MIN=       0,             -254539,         0
##MAX=       1.6414764,     288087,          0
$$ Real data points
##PAGE= N=1
##DATA TABLE= (X++(R..R)), XYDATA
0 0 0 0 0 0 0 0 -8 8 -8 8 -8 16 -16 24 -24 32 -40 44 -52 64 -72 83 -97 113 -129 147 -168 191 -217 245
30 245 -276 311 -347 390 -434 485 -537 598 -664 736 -815 902 -998 1105 -1225 1358 -1509
47 -1509 1681 -1880 2107 -2380 2707 -3108 3617 -4282 5196 -6538 8714 -12853 23622 -116138
61 -116138 -254539 -129319 -61076 4214 -7109 -35256 -76389 -63539 -36141 -8178 -11315 -9381
73 -9381 -6533 7516 16847 29971 25561 13928 3651 17992 43074 65935 69493 59466 40592
86 40592 30607 38347 61581 80055 82332 66483 47234 37339 46027 65395 81058 80626 66651 49608
100 49608 42684 50395 66890 77499 73851 59739 46845 43129 51031 64300 71598 65954 51693
113 51693 41920 43005 52056 61980 65872 60552 47832 38346 41229 52611 60362 59902 53810 44962 38520
128 38520 40725 50780 58743 56446 46965 39777 38126 40962 47221 52823 50967 42316 34552 34242 39550
143 39550 44422 45875 43268 36752 30451 29692 34515 39317 38949 33753 28038 24264 24518 27740 30970 29923
159 29923 24245 17796 15099 17244 20887 22196 19489 14062 9147 6862 8893 12654 13647 9792 3281
174 3281 -743 -860 1476 3951 4304 414 -5398 -9423 -8226 -4481 -2118 -2701 -6541 -11317 -13785 -13133
190 -13133 -9053 -6567 -8041 -12005 -15490 -16516 -15505 -12513 -10325 -11906 -15301 -18252 -18118 -15950 -13746
205 -13746 -12886 -13200 -16009 -18742 -18340 -15666 -12969 -13486 -14952 -16823 -18155 -17335 -14975 -12227 -12822 -15400
221 -15400 -17182 -16250 -14437 -12860 -12076 -12369 -14141 -15545 -15034 -12501 -10578 -10415 -11983 -13511 -13790 -12968 -11231
238 -11231 -9314 -9149 -11172 -12648 -12613 -10994 -9005 -7870 -8509 -9858 -11577 -11189 -9194 -6578 -5761 -6991
254 -6991 -9037 -9495 -8695 -6902 -4938 -4569 -5898 -7502 -7864 -6167 -4269 -2946 -2809 -4098 -5369 -5656 -3904
271 -3904 -1820 -677 -1271 -3090 -3813 -3345 -1963 -194 894 -168 -2008 -2516 -1748 17 1705 2095 1111
288 1111 -329 -1340 34 2281 3916 3281 1861 735 279 1356 3642 5253 4880 2541 1114 1763
304 1763 2963 4767 5728 5584 3843 2148 2111 4497 6043 6069 5223 4112 2846 2937 4401 6217 6642 5228
322 5228 3393 2646 3330 4906 5718 6354 5301 3277 2819 3618 5065 5858 5637 4750 3283 2659 3372 4733
340 4733 5829 5323 3674 2540 2395 3516 4548 5175 4378 2726 2014 2009 3250 4087 4269 3618 2129 1290
358 1290 1438 2553 3639 3661 2441 1382 1144 1038 2076 3074 3064 1843 344 -21 742 1797 2071 2039
376 2039 988 -312 -896 -36 1360 1505 1196 129 -709 -1213 -631 358 1238 660 -968 -1797 -1494 -584
394 -584 -188 128 -39 -1485 -2189 -2181 -1232 -464 -495 -1183 -2363 -2875 -2242 -1528 -954 -844 -2284 -2874 -3136 -2844
414 -2844 -2060 -1401 -1570 -2246 -2872 -3265 -2560 -1999 -1567 -1672 -2240 -3040 -3356 -2667 -1807 -1476 -1858 -2451 -2865 -2757
434 -2757 -2381 -1811 -1346 -1607 -2063 -2515 -2413 -1853 -1232 -1063 -1012 -1810 -2117 -1811 -1314 -890 -462 -997 -1393 -1514
454 -1514 -1063 -945 -277 -158 -279 -723 -863 -615 -159 196 580 244 -390 -504 -22 631 214 736 382 334
474 334 371 342 735 1142 1010 812 424 637 848 864 1131 884 1102 810 820 1372 1606 1279 1113 1183 1028 1084
496 1084 1389 1238 1479 1421 1086 1398 1016 1061 1341 1182 1113 741 1362 916 823 665 623 1228 756 794 1075 774
518 774 680 949 688 945 444 432 567 510 332 513 197 305 240 46 75 249 -17 -25 -45 -201 -325 -315 -102
541 -102 -156 -187 -302 -431 -334 -531 -805 -559 -335 -465 -861 -648 -603 -821 -702 -868 -743 -886 -1062 -901 -1065 -763
563 -763 -526 -1147 -871 -839 -1009 -1092 -240 -729 -847 -795 -780 -895 -848 -341 -514 -476 -1059 -1242 -581 -647 -248 -376 -350
586 -350 -477 -387 -540 -202 -70 -150 -271 -555 -661 -275 -172 115 2 -374 -127 -216 200 66 593 92 82 10
608 10 -128 195 215 435 337 -9 5 50 329 244 645 421 163 221 119 489 511 687 383 184 233 595 573 458
632 458 584 327 623 440 237 729 686 935 383 57 440 629 880 602 721 553 79 165 311 630 809
653 809 426 291 -43 42 641 794 541 507 289 236 309 515 475 265 223 54 -205 -86 299 360 197 95 -55
676 -55 -33 218 384 173 153 175 -182 -154 -133 174 289 4 -98 182 -119 -279 -163 19 331 25 -156 -187 -189
699 -189 -312 35 35 -103 -293 -118 -275 -294 -120 99 -120 -271 -337 -152 -300 -230 -100 -194 -328 11 -216 11
721 11 67 -95 -241 -58 -350 -302 -27 -460 -30 57 126 -341 30 145 -103 -44 202 -3 -199 -60 15 -272 257
744 257 -302 -70 -235 0 35 -291 167 -77 61 -125 45 -81 -29 90 -112 -96 254 144 90 172 -194 23
766 23 -99 -155 -139 96 -335 -16 -223 -91 -178 -167 -212 -146 -205 -414 -388 -82 -240 -571 -144 -124 -203 -101 -192 -465
790 -465 -474 -67 -256 -507 -518 -377 -458 -227 -160 -355 -206 -460 -245 -77 -277 -366 -555 -74 -308 -414 -284 -348 -157
813 -157 -174 -373 -294 23 -236 -137 -238 -324 -362 -422 -166 100 -38 -182 38 -209 -265 -273 157 306 110 178 -113 -173
837 -173 128 -40 29 154 18 335 321 138 91 2 88 257 -14 64 132 49 298 252 191 102 34 22 387 -65 223
862 223 471 135 365 274 515 545 442 344 151 222 267 326 473 260 253 448 471 533 543 467 260 169 27 508 558
887 558 181 290 71 324 350 50 488 125 19 252 349 176 299 268 41 532 244 -61 254 448 76
908 76 224 56 77 152 -135 111 92 -203 81 459 -42 41 288 163 -142 234 -95 60 114 -73 -254 294
930 294 248 -178 -43 -428 -198 -412 59 164 25 -36 -454 -309 -84 -388 -337 -51 -256 -220 -231 -171 -266 -71 -395
953 -395 -455 -124 73 -30 -165 29 -185 -262 -226 -272 -199 42 -86 -238 -478 -223 -223 -135 73 -110 -299 154 -110
976 -110 -341 -314 119 13 -54 -100 -3 -79 26 64 -86 -173 -352 33 182 -4 -82 -105 -108 -272 -31 216 99 -65
1000 -65 -38 -168 -64 -55 68 202 166 88 -107 181 109 21 -22 87 -88 -137 -215 130 -2 24 -16 199 -97 172
1024 172 -13 -82 -3 131 -86 -3 4 -77 -39 -149 593 160 -144 -251 -107 -159 148 -149 44 -334 6 104 50
1047 50 -135 98 72 -6 56 187 324 42 39 28 -81 -41 435 81 -227 -212 52 180 48 45 -162 294 26 54
1071 54 -60 -140 -24 -30 -21 144 60 92 -27 -179 -48 256 -59 15 -190 -152 160 194 -167 -139 -129 166 -282 109
1095 109 -55 -11 39 -209 -60 -430 110 98 116 95 136 128 42 -97 -64 272 -49 29 157 -203 123 235 191 47
1119 47 -93 -94 39 244 77 294 -68 -88 59 276 187 155 299 -346 39 -72 -176 75 160 154 23 -83 72
1142 72 174 -36 35 190 56 194 20 -48 -192 178 120 158 -193 29 122 -15 -179 175 215 94 -121 121
1164 121 164 -147 123 171 175 107 4 -49 144 17 136 -190 7 -217 -29 -44 -62 87 -132 67 -155 309 109
1187 109 -154 23 -133 84 -346 328 116 -198 -339 -112 -137 -309 -124 -15 -316 -211 286 96 -166 -87 -203
1208 -203 23 140 -278 -209 198 153 -33 -80 -244 -441 -128 -47 -26 302 110 -76 -400 -120 21 -22 182 -63
1230 -63 22 221 153 134 -224 187 -68 124 -21 -79 122 -9 -32 157 92 -15 45 -30 31 -22 316 145 155 -31
1254 -31 -7 -5 56 120 282 332 -165 138 0 64 287 21 104 -99 23 225 -112 -218 92 -151 180 -54 -6
1277 -6 152 -122 80 -98 215 -111 140 208 -164 245 141 -28 -175 26 -58 349 366 -191 316 295 57 224
1299 224 -73 26 111 161 10 225 309 43 -54 137 294 66 113 -104 97 167 55 -14 -133 55 -95 72 6
1322 6 143 61 48 7 -74 -168 -197 -137 -192 -153 96 -377 -12 82 67 56 71 -133 123 -4 0 59 6 -19 -2 -114 -93
1349 -93 54 66 217 -106 72 -135 42 63 88 382 -199 145 -239 -76 345 -69 -157 -12 -137 -22 -70 -145
1371 -145 244 -85 116 -61 -225 37 -133 45 -250 -39 90 2 -3 -128 107 203 -142 260 -284 127 -86
1392 -86 6 -203 29 79 73 213 -138 141 184 138 187 -194 90 -259 -196 91 -22 210 -61 6 -165 49 65 201
1416 201 -29 -100 -326 81 -253 99 -98 -105 247 88 117 -48 -174 -1 -312 -305 23 -36 -11 -100 -141 167 -85
1439 -85 -4 361 -229 76 125 0 122 -42 4 252 -100 15 -263 8 76 6 -257 169 -150 200 -29 -237
1461 -237 171 46 17 -246 -2 -189 141 44 35 -24 325 80 189 15 20 -1 223 -67 425 34 -174 -238 59
1484 59 -79 -185 -105 29 -27 227 -77 68 -23 -27 162 -5 263 -241 140 -15 -217 -65 178 -288 -37 60
1506 60 74 92 82 -139 185 -63 -59 12 -107 161 73 119 -65 56 -324 -105 47 -236 -140 95 71 246 248 97
1530 97 125 -153 95 204 75 -303 -60 99 50 11 -13 113 29 178 262 -23 -34 -51 -43 26 217 -66 -1 -5 8
1555 8 -53 -442 70 157 -242 305 -175 -95 252 -16 -68 227 59 -259 180 -31 -104 -158 -162 -133 -101 226 -261 -81
1579 -81 -57 -13 -130 132 118 -202 30 116 28 106 -126 -69 78 89 -53 -142 53 -107 -36 453 -134 -179 -93 86
1603 86 75 -277 290 -192 -7 62 233 7 -67 -295 81 -70 -76 -21 184 49 145 -137 -106 -55 -134 88 51 -168
1627 -168 195 -340 -272 -116 101 -135 -406 1 39 -243 -39 -229 4 -227 52 247 -22 122 302 -112 40
1648 40 317 222 352 -14 73 76 -197 212 -40 -28 -108 -47 -58 193 302 57 252 16 34 -102 -156 180 -7 20
1672 20 160 52 -71 268 -32 97 -147 -64 -86 -52 -28 -38 155 314 125 -37 5 -123 171 -37 80 167 -61
1695 -61 -33 131 7 235 15 74 -306 15 140 -132 -88 17 -2 47 -128 -38 -57 230 263 95 53 74 -74 -179
1719 -179 -22 291 -91 -115 -184 223 235 -185 256 96 26 29 -91 -73 94 185 -15 116 -184 9 18 -148 54
1742 54 140 94 109 -177 157 -57 47 19 13 -75 -43 -108 204 227 -91 39 192 80 39 63 -1 -312 83 -20 143
1767 143 -151 28 76 -74 -194 80 148 -153 330 250 266 -52 139 -66 -121 -272 290 -37 -47 -184 71 187
1789 187 -12 -255 262 -66 -154 85 -172 -138 -71 132 -22 72 26 -196 19 105 -153 -201 -174 238 -126 -50 50
1812 50 120 -83 139 4 -13 2 13 -319 120 118 273 172 28 -73 -230 109 -5 239 -25 95 -62 -163
1834 -163 -80 297 -287 -47 80 147 -73 -202 -2 -361 -206 94 -257 -224 -71 35 -505 12 206 279 -71
1855 -71 -191 -377 -115 -203 -102 36 -136 90 -268 -179 76 1 192 144 -32 308 168 -133 151 217 108 52
1877 52 140 -24 -8 51 -152 25 -45 5 -48 85 95 51 79 175 56 217 -15 3 -212 -107 -45 -90 238 -223 -76
1902 -76 -36 -214 49 -55 142 63 63 -159 2 -196 -91 -113 171 -14 -182 -2 -295 147 -251 -160 91 167 -15
1925 -15 -15 114 -232 285 163 116 -5 72 7 -277 99 168 106 -19 93 -87 189 147 97 59 -212 136 180 84
1949 84 173 -62 -4 160 139 -14 -288 12 116 125 -88 -51 22 207 42 110 135 98 -37 -60 158 90 155 -56 -111
1974 -111 -288 -11 -132 65 -113 -112 -251 328 8 11 122 -139 142 -258 68 -123 174 -134 96 -100 -93 82
1996 82 -187 -103 -6 -97 33 -198 -188 235 -37 8 38 -83 24 141 2 -38 -303 167 -66 71 -221 184 209
2019 209 27 -92 117 2 47 -306 162 267 -8 85 -286 -138 21 24 198 -143 122 215 -108 11 196 93
2041 93 -155 187 -34 -44 18 -133 -293 -84 -51 248 153 -125 84 -44 -166 -328 98 74 81 -3 126 15 -69
2064 -69 179 70 -17 201 11 50 -54 -22 -81 139 121 -84 13 -236 97 -64 13 -74 269 203 -61 -50 35 -366
2088 -366 137 3 232 58 115 -85 -135 -33 -93 78 256 134 127 -271 -33 -258 -35 -162 100 123 -458 -189
2110 -189 -2 16 131 -28 -55 -53 59 55 92 23 348 66 -57 45 215 327 -148 -1 23 193 -139 95 88 -189
2134 -189 -164 -12 107 213 -124 -5 15 -101 -445 165 -33 215 -187 11 43 33 23 200 105 -196 -153 169
2156 169 198 -146 20 86 -16 3 58 -365 362 35 128 32 -203 113 121 -35 61 -122 -179 74 -30 -108 193 -36
2180 -36 11 35 94 237 157 127 5 140 240 -20 54 -236 -253 95 116 -34 23 -134 130 182 88 -32 -69 157
2204 157 37 194 -131 19 56 58 213 -6 -19 132 1 -269 -72 43 -23 -35 -3 47 -237 -137 35 -81 -5
2227 -5 -25 -145 56 176 69 -70 184 -67 115 120 254 146 301 -50 148 -111 527 224 18 58 -155 52
2249 52 173 -110 62 72 -75 90 156 63 -148 30 -95 -239 134 117 94 32 387 5 -254 -203 -38 -194 -7
2272 -7 97 -43 239 -156 187 -92 -166 -169 -53 218 -82 -130 42 25 -18 16 -97 -281 86 -289 163 -193 124
2295 124 -172 -167 105 -137 419 -17 24 -82 152 195 -190 -61 41 -10 231 -197 -276 244 -33 -108 112 -80
2317 -80 -26 -35 93 77 35 71 -146 110 1 -59 224 -601 -36 142 -137 -193 101 103 -24 99 160 162 -168 70 -20
2342 -20 -118 113 103 64 16 16 67 181 -13 -69 24 21 -27 50 -373 -31 -129 109 86 48 29 -53 245 -258 44 276
2368 276 -43 11 142 157 100 133 98 170 -108 -19 131 232 -99 215 -107 36 220 -77 278 42 280 -149
2390 -149 -197 149 -59 -16 115 42 -184 93 155 16 146 -100 68 -82 134 55 108 18 82 -191 25 -139 161
2413 161 -206 -45 -203 9 -148 -98 95 -37 -5 140 -86 -225 -111 289 28 76 79 146 -24 30 62 114 318
2436 318 141 287 -107 239 -19 66 -35 232 97 50 -64 108 -33 -26 278 147 139 41 62 -280 305 -29 165
2459 165 -4 -103 6 32 -73 -69 147 28 -43 106 10 -144 15 150 -67 132 -50 128 -119 195 45 -96
2481 -96 154 -153 279 -233 -143 71 150 -83 213 -21 -104 188 183 114 -22 -198 -89 293 -162 134 -197 -95
2503 -95 -156 -201 -26 155 128 114 -439 -247 -140 166 143 -190 129 -226 127 -41 110 198 -71 -101 154 -47 133
2526 133 -100 -29 -331 54 13 1 -199 -109 171 -73 98 107 -121 103 -210 114 -7 -55 -216 267 222 -135 -4
2549 -4 65 75 212 9 -136 59 -165 -244 17 12 111 143 -81 -23 -91 -38 -213 427 -249 -194 -118 38 103 -175 238
2574 238 189 55 87 -23 138 35 60 -19 45 -90 167 348 9 152 146 -144 27 69 -79 -46 -367 -53 158
2597 158 -19 -53 35 355 -145 -47 59 -164 63 -119 -117 175 -232 -6 146 220 149 -232 -88 195 -42 215
2619 215 -53 -15 193 -43 -43 83 126 156 -55 342 90 -24 70 -191 51 64 -19 -37 -42 217 -98 70 165 -3
2643 -3 -135 -161 140 -16 123 78 -161 293 -259 -1 165 -54 150 128 129 -24 -124 40 -283 -16 -207 -90
2665 -90 52 100 -270 -85 -99 150 -60 -246 166 -25 127 68 -76 -132 31 42 137 66 30 -191 -68 121 -91
2688 -91 32 47 -10 -200 124 66 39 251 -30 149 113 6 -45 -22 217 -38 -203 -50 46 125 -55 67 121 186
2712 186 -210 -76 -62 75 46 -80 174 -103 -160 33 64 -5 -73 229 34 261 -10 -150 115 -457 295 -172
2734 -172 344 250 -362 125 27 40 -116 -208 338 -87 -14 -7 -75 89 -261 -163 -51 -70 -96 -94 37 -76 -305 84
2758 84 -66 -161 -192 -125 -41 210 52 190 44 -6 -132 -288 94 226 111 58 -33 0 122 175 -46 59 -39 -76
2782 -76 -266 -11 185 56 -191 226 313 316 128 -61 389 67 449 98 -86 -12 483 296 -85 -216 -63 -156
2804 -156 35 76 -239 -158 36 -138 -160 174 365 140 -49 -20 -98 70 148 197 -118 -12 133 -130 -108 41 99
2827 99 4 -248 136 48 -50 94 28 16 -38 -33 99 179 2 -375 -148 -9 8 -276 -115 21 281 -256 -88 -54
2851 -54 26 73 -10 -156 -153 240 -126 29 -50 114 -137 -74 106 87 -91 -48 -92 163 67 -102 -342 21 560 205
2875 205 -124 -287 128 -11 -93 202 157 -89 -93 -60 -179 -78 -61 -82 25 115 106 163 102 205 59 101 -197 -245 255
2900 255 -247 -10 48 -241 120 195 123 27 -34 -290 -25 39 -74 -200 37 -112 4 148 -16 59 40 -193 -80
2923 -80 212 113 174 182 223 -138 -60 -275 134 -42 128 -195 -3 249 -134 -94 26 395 -165 102 -117 205 -44
2946 -44 11 -18 84 131 8 -44 -87 -15 -192 -79 114 214 25 185 46 59 32 30 116 -30 29 114 119 19 107 2
2972 2 85 15 -86 27 307 -129 170 -134 -80 14 -71 96 -85 -135 180 -244 -161 -198 -46 65 68 321 -110 -47
2996 -47 39 88 300 -21 -136 131 66 -97 35 139 118 242 89 143 90 -53 -200 373 149 -186 263 116
3018 116 283 -161 187 211 -44 -6 87 -165 -47 61 115 12 -195 119 -158 -5 26 -112 -283 -200 -199 -81 199
3041 199 58 -106 -139 125 -97 -3 144 -155 15 264 -48 164 -121 -234 -119 -66 18 -202 263 31 -59 -25
3063 -25 68 87 -45 111 231 -57 226 -275 220 205 -196 -165 171 -69 40 -24 -106 -54 134 139 59 -245 135 -233
3087 -233 97 231 226 60 69 -20 -85 -70 -244 -163 -113 194 -129 -65 76 -50 -154 -74 -133 226 -133 -272 -263 148 -158
3112 -158 34 185 80 -185 -35 26 -17 206 70 204 123 38 -58 257 -117 -11 -213 184 136 247 66 -37
3134 -37 -252 -37 -85 191 8 76 127 172 322 -83 -161 -282 8 -1 19 85 -2 25 199 128 -195 -32 24 87 59
3159 59 -226 21 93 -165 -193 -55 -141 -6 -121 84 307 -79 162 -92 78 -146 5 58 76 -145 -5 31
3181 31 80 -68 -334 24 -271 11 44 -156 268 16 -135 -71 -169 -15 303 -128 -135 66 -164 111 140 68 -165
3204 -165 -69 -172 -55 -224 -147 -67 313 150 75 -58 231 211 -14 -96 -137 231 97 -189 -1 48 78 242 86
3227 86 206 -78 32 -65 159 -9 -191 -190 125 -67 -123 117 -95 340 -50 -187 249 39 -90 -28 257 -116
3249 -116 -135 224 61 -6 19 45 -225 -116 -116 65 -31 -97 -14 -237 96 -65 209 143 87 -90 233 152 138 -159
3273 -159 -23 158 89 87 30 -154 14 42 -54 -210 -176 -32 -4 -65 -59 -217 42 258 255 57 -86 203 41 38 177
3298 177 199 -247 172 -3 172 -50 102 -10 -123 -65 20 -132 -228 280 218 246 137 -36 141 6 43 146
3320 146 145 146 96 10 11 -181 3 -62 340 156 160 -113 -383 129 -28 0 75 53 133 198 15 -169 466 81 -248
3345 -248 -173 8 33 -232 129 81 77 -19 -164 238 7 -90 -208 454 42 -161 -155 10 15 -179 107 123 42 -91
3369 -91 -244 119 -402 -52 462 -166 92 -238 -127 -279 -90 13 148 -39 -33 152 -151 -51 -243 116 52
3390 52 237 38 -90 74 166 -88 1 78 -112 17 -106 -146 79 25 -112 -245 17 -187 242 128 -231 -11
3412 -11 -128 -12 -19 -98 -171 -18 -152 -96 -42 202 -79 -27 37 32 -82 -148 -27 129 -154 56 109 -136 -32 104
3436 104 -139 112 -227 447 140 -227 56 -160 127 33 -83 -195 199 -101 -63 -85 132 -6 -23 178 -52
3457 -52 6 -11 -286 -78 -236 -74 123 179 19 256 447 -270 49 130 66 34 35 16 180 307 -249 29 42 -38
3481 -38 -28 -18 -187 -42 233 -52 224 -90 107 -196 -35 24 257 -142 209 297 -160 -21 9 -187 -10 165
3503 165 -32 124 116 -21 263 1 20 265 9 -30 84 -1 -130 -44 -355 -210 62 79 -154 182 68 253
3525 253 242 -89 114 127 -217 119 -66 107 81 65 -48 27 -51 28 63 -118 177 70 -94 -187 -217 -122 45 103
3549 103 -23 317 -468 -81 16 136 -113 -68 286 -48 -216 -314 111 178 -123 -80 141 68 68 -51 -95 -96 -70 60
3573 60 142 52 26 -6 271 90 244 237 75 -220 -4 -20 45 -306 -108 12 -146 170 98 -31 133 168 -34 145
3597 145 154 -5 119 -218 70 348 -97 -152 -248 -31 -30 -121 194 42 8 211 -55 22 62 23 -54 109 42 170
3621 170 250 88 63 -171 64 -251 17 -99 64 108 34 331 -175 96 321 -64 153 320 186 43 -90
3642 -90 -80 -50 71 95 -60 -14 -11 139 209 65 233 94 -127 -21 -142 -101 -103 -61 70 -100 -321 -218 158 74
3666 74 117 -16 -2 -129 97 61 51 -236 73 -53 93 207 -97 -317 200 -186 74 20 417 120 218 365
3688 365 -229 -80 -180 61 -111 29 -307 -126 41 140 259 104 -86 187 -185 377 115 -133 204 19
3708 19 -49 131 30 -86 6 2 230 -164 181 33 -67 -147 193 166 318 12 18 -102 42 237 -360 61 2
3731 2 -44 -118 239 37 72 -69 68 266 260 -191 -173 68 -73 -203 255 -120 -49 -68 -38 -278 -59 -247 101 102
3755 102 -118 -114 84 -89 5 59 -71 -156 -374 -145 -108 -154 -18 -45 161 -97 -125 346 213 20 -126 -85 102
3778 102 -19 -144 127 -166 -346 63 156 -309 -234 287 62 46 -115 206 59 -53 5 -264 160 -59 -15 -12
3800 -12 21 -30 -34 -79 200 167 -139 -58 77 -96 -14 -202 -46 24 -328 114 -159 -28 -153 -9 -140 13 -3 -4
3824 -4 -176 -224 -78 -182 192 30 -184 124 169 81 196 16 -94 29 70 -193 154 38 92 245 139 -193
3846 -193 179 -217 -379 -6 -207 -102 143 -147 2 119 279 14 -33 14 45 -153 -25 71 220 171 -28 -60
3868 -60 -104 -24 -183 151 -64 26 -44 -112 32 110 317 226 87 14 154 293 -162 97 -1 -179 36 -58 -206 -12
3892 -12 121 31 104 -109 -198 -114 -77 268 41 164 -58 -47 29 79 -94 -4 23 156 0 -72 78 200 -31 -148
3916 -148 -63 9 -55 -129 -91 -195 -140 200 -87 -42 125 -51 -110 177 -194 12 -3 -33 -109 47 -31 -225 100 -8
3940 -8 318 -156 49 -172 6 200 -29 -114 -302 267 104 -129 180 -80 151 181 278 -50 -363 -44 -235 21
3962 21 78 -163 -215 247 222 -108 -54 -89 -37 155 -124 -125 -59 -65 -27 -208 29 -56 -59 -133 -112 -91 -21 -173 -75 -36 -43 -124
3990 -124 -351 140 5 69 88 -113 -43 205 -63 -32 10 206 41 204 61 -199 161 201 -332 87 66 1 113
4013 113 -217 -155 -74 -115 -93 25 82 -177 -144 -23 -242 372 94 73 -32 -68 -295 -167 -82 386 291 166 1
4036 1 -253 -12 -121 120 4 -147 146 283 216 -109 -81 392 150 -124 -106 -52 17 -100 -115 34 26 -61 -9 -250
4060 -250 -36 164 -194 73 -195 -165 46 10 -17 -68 -86 53 47 -34 192 141 -121 -257 284 -70 98 165 172 36
4084 36 -39 -140 15 -108 -150 -219 -142 17 -45 2 -254 -74 -208 210 12 -114 247 88 -194 -149 -204 339 52
4107 52 -206 -167 198 -25 149 -301 -9 -34 -132 46 -322 -40 77 2 -46 -41 36 113 -29 171 -285 120 -111
4130 -111 92 143 -209 110 -91 17 130 -237 -311 279 -208 400 113 94 329 3 85 -91 41 -90 -159 377
4152 377 -57 -334 28 -99 -70 -7 -259 -200 131 187 124 185 0 121 254 -79 -110 85 6 233 -1 -252 160
4175 160 -39 -89 119 -25 -3 -307 -121 -54 -56 401 53 70 321 169 75 -155 300 3 -178 10 -71 -244 -160
4198 -160 55 -37 6 -28 133 172 223 -175 62 -23 -220 -50 154 144 -56 -139 36 -97 94 -97 30 40 22
4221 22 173 -53 -22 85 34 -95 205 188 -108 25 -82 -257 214 -57 171 -140 -70 -164 -59 26 -169 23
4243 23 34 -87 160 168 102 92 -61 -54 -119 133 -27 -398 144 173 28 118 -82 258 -76 9 -351 222 7 -134
4267 -134 103 -136 35 126 48 27 13 -77 6 -121 61 51 150 307 -183 -5 30 365 -3 -13 -409 149 -148
4290 -148 32 248 245 -22 37 61 176 121 121 -8 -232 304 62 175 71 198 -218 -2 19 -69 99 176 30
4313 30 -38 -184 65 284 -116 -77 -26 -262 251 145 145 314 -38 166 105 -7 -236 247 207 -122 169 24 -96
4336 -96 114 -65 215 129 -199 -17 244 -155 -210 108 54 -1 245 -43 53 47 83 297 37 278 -54 -72 181
4359 181 -127 -87 -297 -168 105 70 65 -316 92 -78 -45 -40 85 -63 -46 -8 -38 239 217 -6 56 88 -415 -3
4383 -3 118 -59 -51 -16 8 -139 -228 -306 -101 -13 172 234 1 -168 -10 127 127 -104 150 163 -57 -61 67 154 -33
4408 -33 59 80 96 52 264 -51 -36 26 -95 -145 -87 112 17 195 -265 149 -54 16 -61 -247 -65 231 91 27
4432 27 -26 -273 -273 -140 -135 -48 317 -56 -67 -192 15 -55 -269 201 -258 25 134 113 129 -99 -216 -219 -192 -87 -20
4457 -20 -121 27 234 42 -47 -63 -62 -289 84 -176 -114 109 -243 276 -22 -24 143 -127 -90 133 5 -157 36
4480 36 -177 31 -330 -238 55 -151 -50 -81 -86 17 -160 -73 -102 -188 -59 197 316 -147 86 134 19 94 137 107
4504 107 64 -54 21 -40 -194 60 67 -48 157 378 100 180 309 -80 -116 106 180 -70 -6 80 30 -107 -15 -101
4528 -101 -27 34 3 27 -63 45 212 84 -27 238 -312 57 -18 17 -100 -109 141 237 65 -243 -25 -258 -89
4551 -89 80 -102 249 197 -187 86 165 43 37 192 -47 -310 213 -124 -120 -6 85 -37 -10 -156 114 32 -308
4574 -308 -172 -83 81 165 -230 -99 -358 -98 70 -56 58 15 137 -10 8 -109 33 51 -86 97 -16 162
4596 162 593 -47 124 -110 19 95 25 -72 195 -270 -94 74 141 -258 -397 -239 111 4 148 105 -252 -19
4618 -19 25 -184 -90 -75 -167 -200 -80 -2 59 246 -54 307 -80 24 -309 78 -156 81 193 -380 73 9 -18
4641 -18 135 54 15 -268 187 91 59 261 -38 5 -365 -182 175 -379 -38 -34 76 239 48 61 248 -140 -12
4664 -12 -60 -108 134 -205 151 220 130 238 6 240 -38 -116 -308 -165 72 -455 175 -74 18 -19 97 23 200
4687 200 -151 -117 160 215 -174 33 217 228 204 55 501 -183 -171 -14 -168 -123 -264 -177 -136 216 99 153 291
4710 291 174 -44 -89 -320 32 -63 -249 157 -317 -46 -60 93 66 106 -38 77 70 250 98 -32 196 315
4732 315 -44 -9 162 4 -136 56 -251 -29 141 -141 -56 219 -110 -72 -214 23 -85 -30 24 12 136 -88
4754 -88 6 76 -112 39 59 -314 132 -181 -53 305 134 -164 -160 61 372 197 -131 -243 219 -46 -118 235
4776 235 -36 -6 129 -379 34 -123 -5 51 -79 116 2 -15 148 -62 102 -157 -121 37 -108 -164 -32 162
4798 162 -145 113 228 316 -36 61 57 69 -231 -123 -50 31 61 -31 144 130 33 141 53 25 -188 17 -52 14 -1
4823 -1 176 -330 93 54 11 22 54 -76 -64 125 7 43 -222 -206 -245 -45 -74 60 198 101 -36 35 340 245 -381
4848 -381 -8 -74 135 -34 171 -134 18 -115 -143 -111 110 1 -125 323 -167 51 -20 218 195 19 -106 97
4870 97 -60 -236 -182 -43 73 -303 -101 92 -126 -20 262 -159 -118 -26 139 -128 302 38 18 -5 9 -21 172
4893 172 4 -93 40 63 -203 -84 8 35 -125 -148 -13 134 2 16 116 -16 86 -395 -72 202 126 -84
4915 -84 0 334 55 -33 38 325 66 -80 -79 -229 -221 -297 50 -12 139 -111 -7 -239 103 219 72 -160 100
4938 100 -199 -107 -18 -79 108 -81 -90 -60 116 -7 10 -279 112 -255 -246 102 -292 23 129 490 188 -231 222
4961 222 120 89 -14 245 -170 -62 -170 84 -24 183 0 -99 117 61 144 75 -301 -274 -146 -126 -87 21 50
4984 50 -104 -41 10 -76 197 35 -140 -1 7 -252 66 179 131 -9 -3 -107 -132 -207 180 131 -73 -84 121 222
5008 222 -34 -192 96 108 -151 -272 11 76 -49 -43 203 -145 256 -66 79 -28 -37 -153 356 233 -105 130
5030 130 -20 83 -15 105 8 262 -118 11 -78 121 152 -346 -44 -37 -201 86 -36 -34 -137 8 -79 -65 -340
5053 -340 157 3 -278 -6 -84 -210 -385 -9 -47 -345 -86 -260 8 52 42 139 109 -24 -77 -250 -183 127 9
5076 9 -34 343 8 101 199 22 -162 -115 -135 250 -81 -44 -117 -44 213 90 49 75 -115 257 -48 61 -107 105
5100 105 2 -48 100 188 230 91 200 -61 -181 -268 -208 104 -128 -187 -6 -101 -107 123 336 18 95 25 103 16
5124 16 185 126 294 387 -79 140 89 -134 111 135 -25 233 -192 -75 -25 -185 -201 102 -193 -71 -63 -52 13 205
5148 205 232 -102 -1 -41 25 282 92 26 -237 164 85 239 -100 111 -175 -62 212 109 116 328 193 -37
5170 -37 -153 -432 44 42 311 -75 200 44 -156 -47 -213 -244 227 -15 -48 96 -176 63 25 -111 -31 -126 85
5193 85 169 -189 22 68 -136 -114 -34 -49 4 18 119 70 -19 -60 -151 -276 -139 -146 359 42 56 61 78 -28 73 96
5219 96 -31 330 -121 -156 -96 104 43 -61 -234 41 12 -154 46 -448 -175 206 -7 67 145 -84 -32 28 18
5242 18 -135 -28 -217 2 81 211 80 82 -161 -22 215 110 32 52 -45 -88 -246 100 135 -248 -135 22 151
5265 151 -179 141 32 111 16 314 216 -63 148 256 140 -28 -113 -46 -69 185 50 -397 44 -217 -253 -209 -86
5288 -86 9 18 -319 -307 -502 31 282 55 -23 -68 -138 -60 282 -135 -175 10 113 -67 -199 -34 64 106 131 -3
5312 -3 89 89 59 -139 0 -20 -1 33 -68 -135 32 15 22 -136 70 251 -170 -211 -20 -15 116 79 -182 -151 -113 92
5338 92 -8 -194 81 215 -298 30 -248 -30 -228 64 30 -272 120 126 -74 -32 99 -349 -124 62 69 -31
5360 -31 -50 -58 15 -305 192 -118 -139 86 -188 -27 26 229 36 -189 18 -64 -56 141 341 -347 193 -245 34
5383 34 -109 -21 -164 -66 98 -108 187 39 -80 -74 -174 310 -153 168 31 -33 286 -83 -29 57 119 51 155
5406 155 -92 -180 -18 -82 -171 243 160 346 246 72 16 -163 -108 70 16 -142 9 63 75 169 -87 88 48 -35
5430 -35 -19 124 -245 239 -178 77 -9 -273 116 78 18 -47 -5 9 17 -416 -79 -24 -11 -147 -119 -9 -5 175 -197
5455 -197 -63 -91 89 -55 214 -189 -51 172 -220 255 88 -309 -34 -120 79 -41 63 -105 70 -201 172
5476 172 -283 -338 272 -25 82 107 -316 -4 56 -20 73 34 46 290 -151 56 -26 -359 -46 36 -146 -72 79
5499 79 155 -97 219 85 -60 -79 213 70 -32 -134 -54 -11 -279 -102 -230 -191 -177 43 -250 -155 132 170 -87
5522 -87 191 -77 -12 -43 -32 -70 -68 181 127 -91 -102 106 26 125 278 -193 -69 -144 -95 16 -85 401 93 -12
5546 -12 -112 -5 155 31 80 133 61 -34 114 -208 -118 -271 114 -3 117 -89 12 70 82 -158 -22 -48 -220
5569 -220 -206 130 116 75 -253 -82 97 178 -18 572 -130 -174 293 -55 251 -111 60 -254 -81 327 132 31
5591 31 268 239 83 -182 210 87 147 -254 -106 -17 -239 221 -72 143 -6 70 50 273 62 235 -32 -66
5613 -66 -73 43 -34 -29 86 -62 -5 -399 -255 120 158 -46 91 23 84 -125 144 -92 527 14 -40 -186 -20 28
5637 28 98 47 -148 52 -152 -7 -60 77 48 -175 -161 25 -17 123 34 48 39 -61 -80 -132 196 -218 128 -82
5661 -82 -95 284 -13 229 -65 -79 -302 -50 -54 -118 261 -73 205 -19 -24 -241 12 69 13 -25 5 168 -99 -76
5685 -76 -303 101 91 221 160 -190 -173 213 110 58 41 22 -108 125 29 -79 -332 24 212 54 -260 77 -175
5708 -175 -207 164 -273 -34 -163 -85 81 -90 -262 -27 86 166 41 6 151 -113 -52 94 27 174 98 -234
5730 -234 -36 48 -295 17 157 -155 -73 132 5 135 178 -64 20 -152 -52 -170 -7 190 153 -14 38 -191
5752 -191 -299 63 139 119 240 -162 0 298 -67 -142 -99 -156 2 118 -99 -112 -54 -225 -207 -84 186 146 44
5775 44 -214 -29 81 -330 -82 39 359 197 78 164 189 54 -205 54 26 -149 15 236 105 114 111 -271 -85
5798 -85 13 -125 201 95 -61 -15 274 -123 184 -107 -321 -155 -292 114 -44 267 76 -306 84 -111 100
5819 100 -10 9 231 75 9 52 54 31 -29 188 -237 -143 69 14 -3 -8 7 -210 -282 -113 59 -150 -82 -27 132
5844 132 -11 -31 146 -46 23 -38 -96 -326 118 63 89 9 44 9 91 -120 -123 -44 -172 98 -185 130 -179 0
5868 0 -219 355 12 19 155 273 -204 -82 -82 -24 120 -159 274 -78 -32 -99 -191 233 -56 141 8 91 49 51 104
5893 104 411 367 -357 -240 166 -209 -99 -271 43 -198 -19 -5 -299 79 -55 -98 -57 55 -229 112 -127
5914 -127 14 60 -186 -214 56 -168 -293 127 63 -218 -110 -210 -32 -62 87 -43 -74 -107 4 51 13 138 -157
5937 -157 265 -162 -77 73 104 -107 61 -100 -211 -127 -275 121 107 -241 -47 -79 162 -52 -20 103 -64 -31
5959 -31 45 -79 -58 270 89 119 -75 -203 213 7 -188 -253 156 459 -25 -15 -183 -13 208 140 -252 57
5981 57 124 14 151 -94 -251 59 320 137 -131 -219 72 15 6 -94 -24 257 276 244 35 -103 75 -169 -167 -100
6005 -100 130 72 -97 118 -127 -88 71 50 -59 80 313 299 146 -42 240 -35 -177 214 -12 -270 137
6026 137 78 43 -55 145 230 -6 45 -97 49 157 -39 -113 -116 -349 -235 64 -16 4 27 -92 139 -7 93 130
6050 130 -187 -73 70 35 -389 179 120 -54 54 -222 -136 -72 -83 111 320 201 -322 -65 3 69 196 -278
6072 -278 -169 -346 81 142 35 39 45 -36 -35 20 -9 45 164 5 -62 -209 5 -65 -71 -139 -23 -161 -161 180 -86 23
6098 23 -50 -165 -117 67 -126 224 90 72 104 -22 486 24 81 -86 -101 110 -35 -119 83 -56 296 -93 -39
6121 -39 218 -50 -48 -175 133 -98 10 -9 -229 16 98 -108 -55 -32 137 70 -121 -96 -52 -84 146 93 -112 148
6145 148 -80 -106 79 -27 21 -202 85 46 362 67 -252 -17 228 -23 166 11 -76 90 168 -364 0 116
6167 116 246 -279 -140 22 -155 -185 -61 2 85 -185 -18 168 -4 220 45 266 -117 -114 138 109 -41 164
6189 164 -78 19 -32 142 -62 -9 -67 68 -102 -258 25 -155 -141 237 238 108 109 163 204 68 356 75 83 271
6213 271 -51 -220 -147 -218 14 -225 43 -73 -33 -76 -121 54 49 -169 -64 3 239 -172 60 27 92 186 230 69
6237 69 -102 269 200 225 216 -171 75 -59 4 104 -6 95 59 -327 113 47 -210 -142 122 88 -124 96 16 82
6261 82 -241 169 104 165 -158 84 -126 210 190 -193 -216 318 127 -194 -167 391 -86 -111 64 -50 -71 -6 24
6284 24 -304 116 39 -332 -256 58 -81 -100 -30 -76 73 -65 -38 -73 24 229 45 75 45 -51 11 -78 163 117 -119
6309 -119 -127 28 -79 96 -187 151 -47 -187 -124 96 -171 -56 310 62 61 191 -9 -84 -49 -20 -20 223 130 -36
6333 -36 132 -274 -58 -84 -183 48 78 -120 -24 142 185 78 -21 223 -8 135 52 142 215 202 260 -126 -66 148
6357 148 -198 -74 -27 126 -90 25 -87 50 152 -1 90 4 -161 171 -155 -109 253 144 26 -52 49 180
6379 180 -65 -100 -4 47 232 74 -98 57 103 -122 148 -39 168 15 107 97 -142 283 28 172 -85 -1
6401 -1 -54 35 400 -8 179 167 -247 -114 -15 121 -238 258 -205 -236 -200 -119 24 -176 28 173 40 78 76 279
6425 279 291 170 -25 256 46 -222 216 30 -72 93 -31 -240 156 -148 411 118 -231 326 253 31 -116
6446 -116 -15 136 72 -282 16 23 70 -362 129 -102 175 -137 -202 54 -66 99 289 123 -83 -35 218 426
6468 426 60 -103 -313 76 -244 170 112 -198 223 89 -256 52 49 250 21 -165 -12 -186 -254 28 -367
6489 -367 -202 -17 -242 -49 239 311 -243 -35 148 82 31 77 -4 -65 -141 41 -13 -100 -128 -117 50 108 219 -248
6513 -248 59 -2 167 -11 -63 -142 -317 -101 44 -48 -115 -82 -166 307 -23 -124 348 72 117 -31 60 2 -48 -128
6537 -128 -218 -54 -63 43 -11 -76 -112 8 -208 -147 206 81 356 241 -89 -33 -62 279 66 129 85 -61 96 179
6561 179 -24 -14 32 148 236 69 -109 25 -111 -211 134 -111 -79 -28 308 242 345 -48 446 -56 253 116
6583 116 -69 -207 150 -149 105 182 187 -152 80 -2 -15 -72 -34 -95 114 -15 181 42 13 73 -48 -13 -218 -70
6607 -70 -45 -12 57 -83 75 157 -373 -111 372 -294 -170 316 80 -47 -50 0 -126 -227 267 68 130 2 -175
6630 -175 -46 140 -94 -85 -177 -234 311 357 4 125 88 -69 143 165 -158 -289 -224 -187 148 -116 -323 -14 -302
6653 -302 -44 -17 -115 5 53 -97 -211 -5 129 -107 151 194 -74 29 -286 200 170 -136 20 -286 -125 5
6675 5 -114 -25 -140 207 -76 264 359 6 -65 -75 -18 72 -119 107 -375 109 179 -123 90 83 -195 27 -44 -228
6699 -228 22 -13 199 176 60 104 -229 5 -23 30 64 170 239 186 183 296 -126 -353 -83 -254 20 135 -181
6722 -181 58 78 -54 -277 -100 27 82 210 117 97 -304 331 -182 177 153 28 65 9 -31 200 267 -119 -240
6745 -240 105 54 138 162 118 109 -227 -37 -127 -131 257 -121 -165 45 147 -98 -74 -90 66 235 -111 39 67 -73
6769 -73 103 184 -236 -63 75 72 -214 114 -21 66 129 63 -56 -237 -143 104 -31 -77 27 -33 -4 23 -49 97
6793 97 -8 219 70 -117 -131 4 176 -323 -248 -169 -180 -151 24 14 16 245 -50 -336 -79 86 -83 -158 44
6816 44 318 173 -106 1 -2 154 -72 -168 -139 35 -242 63 -126 50 40 -178 29 -46 81 -72 -162 -130 25
6839 25 148 259 33 -202 222 -38 241 42 -146 221 -16 442 -6 157 16 -173 -52 -131 82 -24 160
6860 160 29 -260 127 150 57 -17 -222 78 -93 -69 69 25 34 -218 -263 -167 20 -164 260 20 -159 54 189
6883 189 -165 133 98 -49 161 122 124 105 56 129 327 84 -122 -311 -96 37 140 -141 -37 92 163 155 7
6906 7 18 -178 132 -18 -65 -43 -166 7 -69 -58 -152 -122 350 2 56 -11 -4 69 -32 222 151 180 111 126 104 173 -303
6933 -303 -32 19 -28 217 20 -134 -179 74 -210 54 -143 -77 117 185 190 -180 -100 -95 -257 -207 160 -189 -152 247
6957 247 78 -201 241 -296 -110 -68 123 -7 -15 100 27 -179 -68 298 -92 55 171 -148 -61 -130 -257 -95
6979 -95 87 -163 -216 73 -40 -263 192 -75 150 -17 -68 -295 157 260 53 117 243 221 -70 149 -39 239
7001 239 130 -19 -175 47 -176 -9 -50 -77 -19 -89 223 294 134 -155 190 -52 -17 -197 -74 312 -100 94
7023 94 -124 199 57 -112 249 -43 -36 5 65 -138 -255 191 -119 -208 -229 125 31 -264 16 155 -61 73 -199
7046 -199 -18 -182 184 -117 -12 22 209 209 7 -37 88 116 -287 -62 304 220 -204 -37 -257 -47 -125 36
7068 36 65 83 135 57 -109 -115 130 -127 103 -96 -53 178 11 237 170 -13 9 76 161 11 -92 25 3 -158
7092 -158 -147 45 141 46 -88 -27 308 109 16 -175 221 121 -74 -32 16 -220 -176 99 -70 24 83 -143 344
7115 344 -77 -310 -36 -154 234 -196 92 -183 10 105 62 -227 -159 -164 -198 -67 16 -1 124 -89 -45 -105 65
7138 65 46 103 -175 43 202 -15 271 36 40 -71 243 46 -46 26 -58 -43 289 223 42 29 -80 76 -84 193
7162 193 -69 31 106 -103 36 -281 169 9 -9 201 104 135 79 295 74 9 119 -13 -155 -305 -211 27
7184 27 109 162 -4 -47 25 -22 -128 167 -204 21 -12 59 -54 5 83 -138 -133 -109 12 280 31 -94 107 31 -141
7209 -141 94 -131 33 -71 -69 60 256 31 95 16 -218 -116 171 163 -11 2 -12 -52 -22 -64 25 129 -148 -198
7233 -198 -45 -138 -188 30 10 -227 -17 -55 140 15 -105 -141 -248 -64 -64 144 -318 50 58 8 91 -216 -199 27
7257 27 95 43 206 -71 -126 250 -136 -117 -251 30 -41 200 -77 5 -156 26 73 123 4 62 -255 -177 147 -51
7281 -51 101 -98 134 149 -30 -129 27 -59 31 255 -229 -68 386 -218 251 182 80 287 -42 5 25 -99 -5
7304 -5 327 -187 -120 -42 139 -201 44 -144 63 340 -24 -112 -153 -141 251 196 -9 33 -137 194 38 -69 -389
7327 -389 70 -157 -1 261 -172 373 67 -95 -15 177 108 34 -192 -199 428 -80 124 -39 170 -341 132 195
7349 195 181 115 -273 72 -266 -37 -75 -66 -8 179 -36 118 5 14 313 284 -150 56 366 149 64 27 -51 -44 -315
7374 -315 16 -299 56 -99 -48 146 -132 -164 39 -37 -35 -94 -171 -60 142 45 60 -227 -146 -1 -13 62 -150 -8
7398 -8 -312 -21 -39 280 40 -229 -131 289 106 -183 -106 -275 -64 141 72 -132 -234 -376 -102 127 78 -33
7420 -33 -32 21 226 -18 -220 135 99 61 -19 -111 32 -57 -161 -162 81 288 121 269 129 -4 -124 -233 84 -76
7444 -76 -7 50 142 2 -7 -85 -98 -202 -23 2 -113 76 183 302 -64 -341 232 -53 -376 -173 342 -95 -45
7467 -45 428 -192 170 -44 -156 122 -89 -32 -52 122 -128 -84 194 423 158 104 134 -31 -64 -54 23 47 60 -82
7491 -82 -117 -377 -168 -118 18 -79 110 -35 191 -37 -133 241 3 -6 -50 129 220 18 80 14 -22 198 -188 -47
7515 -47 149 -85 -65 -21 -6 -227 -175 -165 33 -86 149 -93 109 134 153 -254 -169 -8 -206 -218 -32 -16 191 2
7539 2 -161 -61 -101 210 -214 14 -44 -145 32 -68 398 138 -107 -138 112 295 -21 75 -154 -141 -124 89 159
7562 159 204 198 208 -102 -197 112 -259 157 162 -169 -234 67 4 93 65 327 -42 87 -83 -176 23 66 40 -257 44
7587 44 -208 111 -14 -45 -448 -169 -5 106 -228 -45 -66 195 -117 130 59 -271 -191 322 -235 -25 -282 -175
7609 -175 -147 -246 51 -117 -215 172 45 130 61 -170 -75 -92 77 222 14 12 -109 77 -10 197 26 234 -9
7632 -9 -10 -82 -100 65 18 -194 14 142 -80 -60 298 142 43 -64 122 25 91 -305 -67 -50 111 -45 -233 -120
7656 -120 -248 269 12 123 -109 217 -421 -151 -13 212 -28 -229 60 -12 36 -67 -75 -31 -102 -129 -114 188 98
7679 98 58 287 -116 187 42 65 77 101 -112 -146 43 -265 -290 -7 -61 117 100 68 -156 -65 75 -61 -143 304
7703 304 -60 -441 60 -25 -147 -116 -232 -62 -94 -144 -27 -168 -11 -12 -24 -51 10 -43 -96 317 -107 150 51 103
7727 103 231 -104 130 -209 -12 26 25 224 -107 -91 -185 -235 -259 268 -113 212 56 -45 34 -87 21 -200 -71
7750 -71 -606 203 -87 282 87 40 -82 43 158 -65 -38 76 -128 120 -40 -14 93 -51 -64 163 -95 -334
7772 -334 -40 -109 -169 -222 -76 166 45 232 1 -366 -57 -127 -30 144 123 -170 69 188 -158 100 90 230
7794 230 23 -38 -132 165 93 -61 -102 34 -44 -32 -176 146 28 119 -37 242 20 42 -5 -42 113 -67 -341
7817 -341 138 82 -60 122 -52 171 -46 124 45 -121 -240 -241 108 -378 75 148 53 104 107 162 -118 -97 50 -25
7841 -25 -178 9 0 -142 -281 41 16 13 241 75 -59 57 28 31 97 141 231 -145 -252 3 -7 -47 -138 104 1
7866 1 -19 -60 98 -97 11 -314 273 49 57 0 54 14 -84 66 -299 4 55 -22 189 115 35 -27 179 -100 227
7891 227 -48 -67 271 -50 44 -14 147 158 -96 -28 9 16 38 -79 -131 -76 4 139 56 -247 -387 -120 144 -26
7915 -26 123 83 347 87 -313 -59 65 135 172 -85 -63 15 -165 -303 142 -78 -206 42 -17 -135 63 117 184
7938 184 223 -101 204 -139 -119 101 64 -116 8 53 99 -9 -18 4 -5 49 48 29 -273 74 -283 176 168 102 22 -204
7964 -204 88 -225 133 -66 61 22 406 214 -89 51 20 135 143 -138 -43 167 3 -54 13 195 -4 146
7986 146 -115 -263 89 -45 -23 21 -375 45 223 -139 -59 88 31 246 23 -58 100 -51 135 -17 -388 368
8008 368 139 153 3 -213 -28 62 172 -103 243 63 -319 18 50 -181 -142 -102 139 100 -199 256 50 -10
8030 -10 -86 74 -215 78 55 201 -303 -97 -282 116 292 62 -294 116 245 -22 33 36 124 118 61 243 23
8053 23 -218 285 108 -241 -64 76 90 68 36 207 38 183 103 129 59 -300 -147 -32 17 -155 -190 5 -17
8076 -17 -19 76 -163 1 -82 80 -87 -262 -136 -200 3 -90 55 -118 186 13 211 180 -245 -5 -280 192 304
8099 304 360 26 15 -107 1 -9 -217 -54 213 -199 -89 -93 153 66 190 180 280 372 190 112 -356 147 -85
8122 -85 132 -184 115 -251 24 136 30 -87 -305 255 163 -54 263 63 86 12 72 -62 165 -6 -81 283
8144 283 67 -29 25 250 169 -250 159 -75 101 209 291 228 261 -116 -45 -137 -53 217 -18 26 43 -92 8 237
8168 237 -60 -195 199 -4 4 -162 137 155 81 46 172 71 139 53 -72 -26 174 19 -100 -151 219 309 31
8191C1
$$ Imaginary data points
##PAGE= N=2
##DATA TABLE= (X++(I..I)), XYDATA
0 0 0 0 0 0 0 0 8 -8 8 -16 16 -16 24 -32 40 -46 56 -64 76 -88 104 -120 140 -160 185 -212 243 -276 311
29 311 -351 397 -446 500 -559 625 -696 772 -859 954 -1057 1169 -1296 1434 -1588 1759 -1952
46 -1952 2170 -2417 2700 -3032 3420 -3888 4462 -5185 6132 -7429 9328 -12387 18149 -32921
60 -32921 152489 288087 69635 7850 7173 117418 201358 265819 236054 162795 72857 58370
72 58370 96582 164913 197853 195449 147578 97430 68453 88004 122546 147285 137357 109727 76713
85 76713 63478 71930 94997 106115 97294 72975 52479 45493 55920 69852 74435 62504 43609
98 43609 29947 30297 40835 52597 51848 38578 21749 14122 18228 29316 37338 34792 20980 6430
112 6430 2446 9933 20770 25365 21567 10479 -850 -3614 4332 15373 17455 9433 -824 -6821
126 -6821 -7465 -1724 7158 9560 1312 -9874 -14795 -11932 -6160 -1852 -1257 -7261 -16880 -22101 -18824
141 -18824 -11581 -8972 -12365 -18309 -24423 -27271 -24227 -18766 -15836 -20229 -27241 -31560 -31483 -28169 -25134
156 -25134 -23660 -26695 -32576 -36329 -35494 -30660 -27285 -28184 -32174 -36762 -38649 -36306 -32170 -28726 -29585 -34234
172 -34234 -38903 -39160 -34997 -30445 -28158 -29618 -33340 -36726 -36526 -31691 -26320 -24750 -26977 -29746 -31537
187 -31537 -30561 -26269 -21448 -19650 -22074 -24810 -25960 -23411 -19566 -15881 -14608 -16499 -19182 -19636 -16429
202 -16429 -12582 -10738 -10188 -11559 -13673 -13722 -11240 -7756 -5773 -7084 -9049 -9662 -8550 -6662 -4014 -2464
218 -2464 -3594 -6088 -6595 -4494 -1725 -791 -1061 -1680 -2829 -2936 -1122 1725 2653 1519 -248 -707 -258
235 -258 2168 3980 4441 3614 1977 1128 2194 4462 6214 5804 4455 3481 2700 4336 6528 7778 7497
252 7497 5263 3918 4296 5578 7523 8530 7769 5800 4309 5159 7329 8892 8786 7204 5991 5000
268 5000 5541 7623 9660 8804 7073 5426 5484 6488 8123 9301 8563 6921 5103 5442 7230 8924 9080
285 9080 7945 6567 4970 4965 6824 8658 8925 7222 4930 4391 5196 6239 7542 7714 6340 3637 3077
302 3077 4376 6168 7061 6585 4914 3159 2211 3429 5113 6033 4618 3147 1646 1279 2003 3486 4653
319 4653 3797 1483 146 69 1310 2510 2960 2467 664 -577 -893 588 1907 1900 733 -891 -1600 -1539
337 -1539 -57 972 1211 -316 -2156 -2418 -1823 -222 243 -265 -1313 -2800 -2882 -2134 -901 -501 -1326 -2407
355 -2407 -3122 -3288 -2588 -1225 -716 -1816 -3090 -3720 -3759 -2604 -2109 -1456 -2090 -3497 -4390 -3851 -2758 -1712
373 -1712 -1804 -2702 -3690 -4287 -3939 -2635 -1541 -1891 -2754 -4037 -4141 -3676 -2615 -1735 -1785 -2969 -3967 -4244 -3147
392 -3147 -2276 -1986 -2047 -2697 -3564 -3477 -2708 -1664 -1417 -1403 -2723 -3076 -2738 -2460 -1391 -771 -1342 -2353 -2798 -2566
412 -2566 -1280 -618 -325 -901 -1358 -2176 -1750 -367 130 -112 -510 -1164 -1125 -557 300 997 817 277 -323 -536
432 -536 295 886 1461 1294 732 298 151 857 1685 1639 1611 1246 780 699 1197 1706 2112 2100 1242 844 1353 1359
454 1359 2014 2399 1805 1598 1138 1530 1992 2231 1960 2214 1531 1290 1278 1722 2018 2000 1763 1403 1295 1267 1473
475 1473 1805 1754 1446 1005 901 1111 1140 1058 1169 1248 921 300 496 684 783 524 515 288 598 379 249 473
497 473 474 -167 -260 64 -405 -285 333 59 54 -222 -568 -219 -337 -471 -406 -319 -569 -582 -814 -633 -262 -755 -802
520 -802 -850 -1191 -878 -1176 -866 -944 -957 -1011 -1114 -970 -1038 -956 -878 -792 -1039 -1038 -1152 -878 -921 -957 -512 -930 -875 -927 -1111
545 -1111 -909 -491 -438 -822 -598 -478 -521 -499 -500 -588 -309 -463 -449 -590 -243 -277 -121 -14 -119 -276 -242 20 201
568 201 300 341 31 -162 36 416 45 600 144 325 250 422 370 697 897 433 368 656 349 692 707 787 412
591 412 492 477 471 685 775 797 348 250 366 685 599 901 758 301 399 553 622 916 670 501 470 13 441 647
615 647 476 782 359 437 433 100 410 749 422 197 327 -212 11 220 412 344 245 39 174 -14 85 121 310
638 310 113 -69 -334 118 332 287 29 40 26 -349 -113 70 -169 -116 -447 -384 -300 -487 20 -169 30 -427
660 -427 -191 -234 -377 -369 -73 -58 -498 -666 -532 -351 -104 -378 -342 -232 -547 -526 -486 -243 -53 -451 -464 -615 -434
683 -434 -274 -152 -106 -206 -479 -280 -316 -110 -112 -501 91 -443 -290 -434 -411 -118 -225 -172 -584 -221 -214 108 190
706 190 -51 -168 -69 -354 -236 -290 -40 -81 2 -73 -158 -111 -24 381 307 -291 99 -37 -153 89 192 123 -247 -74
730 -74 -88 -107 -79 -27 -7 -193 -12 -103 2 -51 171 104 -188 -186 -237 55 -257 -126 -122 41 64 125 -165 -251 -50 -355
756 -355 -95 -6 -299 78 -267 -336 -77 -159 -97 -216 -382 -51 -159 -120 -278 -191 -144 -182 -236 33 -235 -313 -284 -5
780 -5 -33 -7 -18 -93 -144 12 135 -106 149 -10 -40 -39 -274 -117 208 -50 169 -73 127 163 226 326 320 287 258 212
806 212 357 155 136 198 359 109 -89 204 58 464 562 125 382 142 -117 507 289 573 319 504 344
827 344 704 401 298 356 231 401 142 223 281 172 279 474 288 270 343 456 295 449 352 434 238 256 682
850 682 506 614 459 328 581 500 294 159 495 184 372 136 100 612 368 390 438 133 192 15 -51 342
872 342 -104 318 35 3 158 202 -68 -192 87 -260 54 47 124 347 -138 -201 -251 -391 -293 123 -247 -346 -298 -315
896 -315 -43 -249 -205 -99 -42 -393 -295 -408 -183 86 -230 -291 -297 -410 -258 -194 -174 -203 -273 -237 -338 -57 -80 -265
920 -265 13 -320 -362 -116 -239 -193 -500 -240 -408 -232 134 -241 -436 -111 -211 -33 -179 -290 -156 -488 -444
941 -444 -246 -116 -584 -229 -315 -124 44 -76 -112 -210 -266 -155 188 -89 -151 33 86 -214 -235 187 -83 7 56
964 56 -23 98 133 111 -134 39 -5 51 206 439 -177 -98 270 26 145 30 -92 130 15 47 107 181 -10 -22
988 -22 287 -72 45 2 -231 -70 -159 72 50 -112 105 162 135 102 -73 72 -80 187 -22 167 13 200 -8
1011 -8 150 -159 -99 -220 -41 197 250 -160 -78 34 141 61 101 74 271 -128 150 178 -7 76 102 202 21 -7
1035 -7 -69 47 55 50 56 71 -226 -140 11 -190 207 125 47 56 10 -3 38 122 21 42 -137 -31 -130 -97 93 -273 -321 -46
1063 -46 110 68 153 49 -355 126 6 0 -23 -247 -127 39 -97 35 -11 322 22 -78 32 100 -261 166 23
1086 23 7 69 126 83 3 88 -56 176 261 -353 -95 159 266 -26 163 108 -318 186 173 5 -187 174 346
1109 346 97 43 201 -209 -191 -9 24 55 -38 -77 -126 -131 216 -212 -66 55 -125 -104 -208 335 5 0 90 204
1133 204 -330 214 -168 -97 -87 -111 -40 -85 -95 -292 -116 -94 -153 -143 -161 163 -21 8 -111 100 -54 -31 -193 82
1157 82 258 105 -279 114 -59 -133 -4 -191 -87 -125 -281 -116 182 20 147 -123 -140 22 -198 -270 -133 -202
1179 -202 -107 -87 57 -249 -70 -178 -72 54 -322 16 28 -107 -141 -119 81 -167 -213 11 -160 -51 69 117
1201 117 -194 -279 -63 118 91 165 79 -202 126 186 -177 419 -71 -85 -205 294 -104 -59 287 -70 442 -266
1223 -266 -71 66 14 -44 19 350 127 -117 352 76 86 102 40 110 6 188 309 -29 -102 280 253 -322 -127
1246 -127 -210 -76 3 -209 136 -37 -347 -178 170 33 -252 -103 161 61 49 498 248 63 -167 -232 -231 22
1268 22 -17 66 319 -151 -123 -101 -192 -114 -280 6 16 153 -11 -54 102 -277 11 -50 -220 -98 -223 -157 -75 9
1292 9 -165 -143 352 89 93 -37 57 -144 -78 -56 -98 60 105 -251 -119 -277 -65 97 115 -182 213 81 -79 119
1316 119 -123 249 -43 -67 108 -60 -13 -86 -25 -136 10 213 -150 37 -29 261 59 -99 88 61 -186 -141
1338 -141 258 -69 -70 64 17 93 51 103 -7 -31 -256 156 31 -186 -74 -213 205 162 -236 -83 57 114 -160
1361 -160 -151 46 266 34 17 -27 -287 221 152 66 158 342 -160 -180 6 102 -4 -75 -108 -53 -156 54 108 112 -18
1386 -18 172 126 215 142 -135 -41 183 -170 -241 69 328 -114 -464 101 128 163 -169 -215 -345 -342 150 -89 -156 -213
1410 -213 -180 28 160 -79 -183 31 -20 23 52 -76 -108 115 -186 163 31 255 99 -11 -164 -168 -16 -221
1432 -221 -114 106 241 -144 0 124 -197 64 -139 -11 200 -204 313 -256 -54 40 193 -143 63 111 148
1453 148 94 -21 -68 43 99 47 334 -105 150 77 -99 -93 129 51 -17 6 -48 -31 330 -3 76 -41 -54 -355 -69
1478 -69 63 211 155 -155 -168 -38 -196 412 -298 -255 243 230 107 -122 -132 -120 -2 -10 77 262 57 26 26 179
1502 179 9 275 -21 161 -53 -74 -16 265 171 -26 46 -113 -27 52 13 -53 115 -252 93 -13 48 -42 147
1525 147 -284 -115 -50 -382 -128 -17 -71 -77 -55 20 -123 110 64 18 -13 88 170 263 -9 -61 -103 47 13 17 -61 -63
1551 -63 7 156 -41 -167 84 -6 77 140 146 -234 -201 -122 -112 -39 124 -234 -194 -286 -33 54 50 -43 -135 -16 137 -382
1577 -382 -199 -123 -249 21 -12 -14 -17 35 -3 -118 -84 214 -88 -79 118 196 119 189 -151 179 199 -181 114 -29 279
1602 279 178 -156 -19 -83 -124 77 180 -212 -294 -347 269 118 18 -13 182 301 -20 20 -101 4 -80 -230
1624 -230 -81 -65 -132 -286 152 189 118 65 185 -6 13 -226 -188 151 -8 224 -133 97 -62 208 126 -25 27
1647 27 -34 4 -136 -112 -67 169 -110 109 -57 51 90 -256 -148 -310 215 3 -369 -82 -106 -265 -116 125
1669 125 -63 38 92 295 -223 -57 211 43 27 339 -181 -445 222 319 25 353 17 -100 51 308 294
1690 294 51 -79 120 44 -203 18 -209 -42 -20 50 156 -202 -13 183 -222 -220 27 -102 74 54 -132 171
1712 171 -108 -82 69 393 40 -260 0 52 288 -185 -353 22 -45 -154 -59 51 -103 131 -137 -19 -160
1733 -160 105 11 -258 -225 408 27 -183 -153 75 106 -98 -110 -291 282 -167 137 77 -260 126 165 69 -60 113
1756 113 -79 176 -95 232 -10 98 -11 -39 -6 -91 126 -41 239 160 179 -104 -157 100 226 120 -103 132
1778 132 -71 -86 49 134 128 112 226 10 -329 195 239 244 219 15 52 -126 247 -22 -17 -195 150 119 -108 -174 -34
1803 -34 57 -148 84 143 -18 123 64 275 -33 -7 -167 -232 59 16 102 -121 200 230 -12 -140 -42 -154 35
1826 35 83 239 -14 -189 -7 -23 -205 68 -160 1 -70 -75 -89 -135 45 57 -39 137 -139 -87 -33 198 104 -44
1850 -44 -237 -205 100 105 259 252 -143 -29 73 166 -118 45 -173 57 108 226 -142 38 -49 -55 -47 -39 -206 -16 247
1875 247 -315 279 -236 -175 66 -19 -43 -18 80 -176 -284 -17 -64 37 25 -173 -62 -173 -228 -40 188 168 56
1898 56 262 -52 375 -140 -17 119 -165 -33 65 9 -89 -251 153 -64 113 98 -169 -116 399 -353 -277 -30
1920 -30 17 -29 41 -178 -39 100 -181 -66 156 -28 397 163 102 -233 -169 68 -83 -83 47 52 121 180 264 255 303
1945 303 -111 64 -234 -66 148 -8 227 -4 54 -260 -130 -90 -167 -21 71 -138 46 63 60 104 235 127 -49
1968 -49 5 0 -70 62 -4 70 100 0 176 -61 109 349 87 -73 114 123 -43 310 20 45 -199 177 133 171
1992 171 -81 107 136 160 29 -188 84 152 103 -120 57 -213 73 -68 -83 -24 105 -184 74 166 -55 180
2014 180 -83 -264 -33 31 82 -327 -178 144 131 -15 -109 -46 274 -92 210 57 86 58 172 -9 168 -70
2036 -70 -15 40 -154 29 98 -194 235 224 -15 6 86 313 193 14 35 -52 123 70 -203 129 -53 -117 77 21
2060 21 161 247 16 277 19 -392 -179 299 84 232 3 46 94 -46 -127 121 -216 -189 63 164 49 -381
2082 -381 39 -77 -266 -101 -121 -162 2 -53 -269 26 74 21 -73 -169 65 -26 -123 -72 111 -424 57 13 -63 31
2106 31 -93 372 -64 135 -98 279 98 52 -53 -179 304 -106 -290 114 66 65 -97 122 18 -85 -250 -67
2128 -67 1 -281 85 66 94 -42 -59 -66 106 -73 -221 50 -200 -30 -146 298 -33 -331 377 -48 12 -387 197
2151 197 -170 28 -38 141 -194 -56 58 85 -70 -197 108 -53 7 -107 77 -49 -199 -213 101 70 305 -243
2173 -243 120 44 41 106 -61 291 -125 202 -249 -116 -267 -335 -88 123 203 -17 -64 120 -125 -209 96 -175 47
2196 47 -194 -146 -11 297 -183 -175 -57 -208 284 -303 -283 21 31 -255 -269 -32 11 -7 95 -73 -22 219 86
2219 86 55 175 -95 -51 89 -4 40 -58 -134 197 -34 -146 300 101 84 153 26 -198 248 -17 371 68 -47
2242 -47 -144 -356 143 121 1 -186 129 3 47 225 -43 84 0 -18 139 -210 -53 -131 16 117 -115 88
2264 88 120 -45 58 -110 -13 -78 -63 -28 283 51 144 -108 -180 317 2 -212 -79 -36 21 -121 56 -81 -75 -32
2288 -32 210 199 110 148 -261 -61 226 -342 91 81 18 64 71 19 159 14 -243 286 -210 47 -129 -146 -229 41
2312 41 -216 7 -204 -113 36 -119 -241 212 151 -101 -86 12 22 63 -58 225 -241 -181 304 116 16 222 -57
2335 -57 89 14 -207 -133 283 169 -91 7 -275 139 13 192 225 426 -43 -31 -99 -19 -86 -72 136 -282 -31
2358 -31 9 41 55 -131 117 189 -13 -90 -174 311 185 -9 208 69 399 0 20 -109 -382 154 322 -82 -87
2381 -87 -113 -146 84 120 -21 44 80 38 159 -18 9 37 -93 -40 -131 -26 117 -61 -14 -12 150 -37 98 -68 -120
2406 -120 44 -106 -111 -153 162 204 109 -205 54 -230 -308 180 130 7 -46 -50 -51 25 -22 229 44 113 -231 -72 -200
2431 -200 -278 -106 -1 70 231 7 26 14 -32 178 -98 -134 77 111 23 145 6 -45 -14 171 2 -2 3 98 316
2456 316 110 -73 -32 172 74 -91 -203 177 -96 -67 172 -79 -105 -38 50 -53 165 -83 -48 -268 115 -269
2478 -269 -33 144 -22 -246 48 -17 -90 -123 -51 37 -84 132 -4 97 -1 -14 -94 -238 -43 63 -71 51 -20
2501 -20 -69 -64 361 444 -174 -74 59 285 -9 128 -9 -111 -154 156 9 7 11 67 -62 78 162 -289 274 60
2525 60 -68 32 -75 -186 -266 43 -196 82 16 51 331 -76 182 103 -124 -220 -72 -19 133 107 -210 -81 -167
2548 -167 -60 2 -160 180 116 39 273 81 21 5 -159 -101 138 99 -39 152 308 -47 -62 5 -33 -128 -73 387
2572 387 123 54 -50 240 313 74 -21 -162 127 -124 168 -8 -128 -111 -44 -47 -35 -38 84 -80 15 13 177 -107
2596 -107 113 -196 136 -65 -10 72 412 25 -124 -278 -22 -77 -239 29 -177 42 -20 107 -197 196 -121
2617 -121 -89 -164 -134 25 -151 213 231 245 -175 -127 -249 -51 61 279 -94 145 63 73 43 -76 159 250 156 -235
2641 -235 49 -61 109 20 243 -413 117 333 -146 42 -17 257 0 -174 137 -20 51 -135 284 132 -34
2662 -34 109 203 21 -19 78 -106 70 94 46 -175 -66 -113 91 160 105 -234 -219 -41 -277 -129 -240 -26 126
2685 126 75 -108 -108 -259 -168 194 -250 115 -71 -121 -118 -108 125 53 -201 100 183 -70 -259 -66 109 14 180 184
2709 184 -283 -192 -137 18 -32 -6 -48 3 -2 14 7 196 -211 -72 -125 47 -151 44 -106 -173 -70 7 83 -336 90
2734 90 188 32 194 64 268 -74 130 60 -110 300 113 221 -157 154 140 15 36 268 71 132 31 26 -32
2757 -32 52 101 -300 7 -94 5 -161 44 148 -33 -199 -134 -58 48 367 133 -526 -32 -250 60 -119 158
2779 158 -246 -83 -114 117 -5 -133 -195 -71 -87 3 138 -209 120 -203 248 -115 164 -114 306 273 -34 -134
2801 -134 184 -151 118 -230 -84 -163 -239 -82 -32 24 -39 -45 -95 124 -124 46 88 -229 302 -76 -144 231 -26
2824 -26 200 -178 72 -141 190 -112 -134 318 92 209 -10 1 -30 -39 131 -116 -65 -151 -170 -24 -27 183 58 -68
2848 -68 141 -29 -137 -32 31 223 -57 236 -208 -43 -149 402 -25 153 173 -19 -151 -25 47 30 -76 -28
2870 -28 -202 37 190 70 42 89 9 -108 -120 -67 158 58 -140 -83 -138 -70 -67 -6 63 173 -74 -20 155 -121 88
2895 88 -111 46 52 -22 -164 313 52 -73 -140 146 83 -75 106 -94 89 -36 -86 -139 -109 -33 128 -6 14 -203
2919 -203 15 -14 -36 16 -69 -127 42 -164 112 -27 -83 212 47 184 -75 -120 -249 -368 5 -152 -32 -265
2941 -265 105 46 208 83 -9 -46 99 115 -210 -324 -293 194 -85 228 -74 292 -171 -47 -22 -35 -130 -191 -69
2964 -69 -60 39 -44 -29 -120 275 -60 27 51 -13 -44 -29 -122 -148 -62 -261 -172 318 -54 215 86 -67 4 -4 -341 97
2990 97 193 -207 160 -24 -301 -66 -7 55 191 38 21 226 -106 157 -270 100 304 -52 -233 30 -214 -271
3012 -271 253 -58 -35 -89 -160 -151 -85 164 -95 52 222 -157 37 107 100 -177 -235 -109 -140 -111 208 -106 -29 -66 -27
3037 -27 66 -192 30 164 -71 -155 -11 225 -30 -112 -275 56 17 80 94 138 99 55 265 128 111 12 -92 -264
3061 -264 -231 -13 36 43 76 -128 106 143 229 126 -263 5 -199 55 -57 196 -4 -16 -257 -27 5 78 173 55
3085 55 122 -284 48 -328 -286 -240 198 -36 61 -87 55 69 -193 -116 -84 192 30 69 6 -94 55 -322 -89
3108 -89 -1 88 279 45 -44 -5 -130 -171 132 105 193 -104 125 103 -285 -200 -283 -72 -75 17 81 149 -107 135 -30
3133 -30 -94 29 -218 131 -17 128 152 284 188 178 -235 -299 169 -388 107 34 50 79 143 -29 -3 -202 20 173
3157 173 115 106 -197 -115 41 129 74 242 79 87 -69 -102 35 -187 26 118 182 58 -131 12 179 -164 -20 94
3181 94 -38 337 46 -190 -130 63 -96 -144 -236 13 49 58 24 -116 -21 -8 35 237 180 -59 131 -59 -225 -112
3205 -112 -15 16 81 -68 -75 75 122 32 139 -77 -10 76 -94 -248 -214 38 -315 -293 -169 44 -10 -155 -325 397
3229 397 40 207 -23 50 29 -80 -134 -275 112 222 81 -115 -173 -15 -126 105 79 112 -44 -224 144 -109
3251 -109 -68 -191 65 -32 -8 30 -45 -47 263 -40 -57 36 198 -42 27 116 191 142 174 -147 91 217 -164 -35 231
3276 231 115 -23 3 -116 -92 -124 -202 221 251 -143 56 -89 -80 5 179 54 8 -153 75 21 -207 414 48
3299 48 -35 153 -104 -115 112 47 -197 -240 122 -214 84 -68 59 -97 -66 -296 60 22 -94 -126 -53 384 34
3322 34 -193 -142 -209 -145 -164 109 232 -241 -5 -380 -127 68 -29 -78 133 -40 -292 50 287 -41 41 -424 85
3345 85 30 215 93 -334 -147 -104 -281 -141 -69 -48 126 239 159 -256 74 75 122 397 -33 309 -291 -121 -299
3368 -299 -138 145 22 16 -42 -2 -20 165 16 7 75 117 124 -148 -161 10 -131 32 -134 -14 343 237 19 132
3392 132 37 -107 80 -67 224 -189 31 -86 79 -402 -6 333 -99 158 -48 96 -62 13 -48 -158 -102
3413 -102 252 100 -96 -49 4 182 -195 447 -99 -222 189 -88 -231 -30 -75 -79 -25 -83 -90 22 215 -104 -108 -3
3437 -3 15 -154 -265 11 -107 -84 171 8 265 -6 -42 109 -229 -302 -87 -42 82 103 153 -230 -158 71 -93
3460 -93 46 134 9 123 12 -7 -188 -17 -124 -200 156 -105 -143 97 77 -176 -164 -125 -44 81 163 86 114 10
3484 10 76 -128 -192 7 -105 -290 50 345 -60 -62 330 245 -76 -170 227 234 196 124 -28 -145 -163 119 -61 -85
3508 -85 -136 -317 -90 -76 -80 95 104 94 -168 35 25 -67 -345 -120 83 -85 -300 -12 39 162 19 165 -95 -61
3532 -61 221 144 245 6 -111 -314 182 -189 21 -65 -151 285 157 172 -154 -34 -93 140 68 -83 200 -101
3554 -101 161 -270 -248 6 187 -27 -134 63 -321 133 21 196 -130 124 -147 -120 -23 -212 14 -195 -197 -47
3576 -47 -141 -308 -246 -330 295 217 113 -26 406 263 16 28 -78 -44 253 57 117 57 210 51 -48 -180 -201 -7
3600 -7 -149 307 -60 145 -164 113 -90 -58 -264 -132 -194 -135 -108 -151 70 -314 142 78 129 230 -195 -299 -8
3623 -8 -25 -312 -50 -81 -165 37 102 -4 -1 75 -49 -191 64 -172 -14 -129 -243 35 -105 38 253 -147 45
3646 45 175 -144 53 174 -73 223 -67 6 -49 -11 233 -189 5 143 275 -124 -160 138 -112 -164 -86 97
3668 97 -231 -284 12 -115 -155 336 -216 38 -27 -214 -69 -98 203 -243 123 57 -399 94 -76 -17 67 -177 34
3691 34 123 169 -148 -156 -64 16 47 -41 3 132 -69 -220 -212 -123 -89 -91 -323 -5 51 -135 211 -199 -177 15 -111 -58
3717 -58 -345 -190 -9 11 131 -1 -71 30 -67 140 75 204 75 -66 -49 15 35 -4 127 318 -117 7 -3
3740 -3 -59 155 -132 -80 -244 128 377 69 101 324 -100 -118 184 -21 -16 8 -72 55 -315 33 87 -38 -70 -9
3764 -9 -116 -88 42 250 115 -70 -42 28 28 211 -47 -54 232 -143 -410 126 132 83 241 -219 -162 19 166 -150
3788 -150 -42 78 217 68 27 -156 -44 -149 95 -18 105 -31 -68 -88 110 -70 -192 143 74 -189 -77
3809 -77 12 -86 -415 -161 5 -363 226 86 294 35 -62 199 338 26 -18 10 -313 -383 -24 67 125 95 -24
3832 -24 173 13 5 48 134 -162 115 -44 -210 69 -199 -322 249 73 248 112 329 -106 -258 -98 49 61
3854 61 -42 179 74 -259 -110 58 -342 127 -59 -64 10 -209 207 -101 118 -145 -18 136 42 -5 171 262
3876 262 165 -113 -397 379 3 -50 218 302 -82 -30 25 74 -412 -21 97 -10 297 -76 -45 6 42 61 22 -13
3900 -13 -239 149 -7 6 -55 -5 440 -63 -10 186 150 -53 12 150 -50 197 -20 18 10 8 112 -207 84 85 92
3925 92 -88 -219 321 148 -113 -74 -9 208 -45 -5 -34 -97 144 249 94 -78 -3 -77 -274 30 -53 45 29 -215
3949 -215 -231 -156 363 -37 213 91 -55 214 -163 4 -254 32 -202 -57 144 -134 -145 144 -32 -228 39
3970 39 29 -101 -68 -91 118 129 -256 -22 -37 8 -88 -53 293 100 308 331 -435 190 169 79 1 215 -100 325
3994 325 128 67 68 -161 81 49 -182 354 -82 38 110 -173 13 34 274 94 199 57 83 -85 -258 42
4016 42 -212 39 -55 99 -89 -230 48 -37 195 48 20 35 51 -58 180 -66 82 -100 126 -101 -168 96
4038 96 -83 -157 41 163 122 113 177 -96 126 -96 12 116 -220 20 -444 -24 -97 11 -58 -21 5 -34 -292 -351
4062 -351 30 -109 -7 -122 29 126 -153 46 47 -126 -300 60 90 -26 401 -66 -88 9 5 -108 -31 -63 31 140
4086 140 32 110 177 -374 84 20 114 -109 87 117 103 133 121 240 -312 54 -29 195 -242 -188 84 -172 32
4109 32 -32 97 -27 -42 -156 67 119 103 -131 209 76 -58 157 3 -10 10 71 198 60 -201 133 -123 -42
4132 -42 203 -366 132 178 -278 105 -206 217 -2 -177 -118 -18 36 -127 -99 -263 74 166 -242 280 -174 -39
4154 -39 -7 -83 -39 -281 -63 -24 136 -43 -39 123 355 -234 72 -152 32 73 11 -95 107 -96 -242 -31 60
4177 60 -126 -245 -101 -92 -248 -1 259 145 -43 -293 -49 79 -7 31 166 150 -95 140 -118 174 112 -38
4199 -38 -166 -76 188 -20 -89 89 -111 -46 171 68 -35 -149 3 28 208 35 -100 184 -188 196 -186 32
4221 32 414 -181 32 10 43 201 0 -10 -83 -84 -114 -29 -195 460 -240 33 168 -136 292 -108 19 -77 132
4244 132 141 40 157 -148 128 121 304 -166 -91 54 222 139 -105 182 -2 -136 -236 -17 233 -256 14 -271
4266 -271 167 -102 22 117 6 -56 134 -189 33 17 -98 219 -135 223 -131 -173 36 207 81 -5 0 -15 139
4289 139 -101 -114 -18 92 -49 -75 -178 -179 -72 360 58 133 37 -34 -64 -54 314 65 29 31 -59 -110 173 -12 44
4314 44 90 -30 -98 -62 -110 -179 -98 104 35 307 128 -174 -359 48 -224 -74 99 -220 -170 96 73 203 62
4337 62 146 225 362 185 -173 -23 -25 364 216 4 84 -221 -100 155 75 130 128 -37 -184 73 -118 52 93 -173
4361 -173 -171 -249 -281 -324 93 -40 -308 -225 -136 -112 -195 149 -86 -261 -40 -102 -129 -55 -409 -62 -226 77 93 -27
4385 -27 34 9 81 -71 85 -328 131 -125 11 31 32 -306 -276 42 246 68 -44 125 102 -133 44 35 -28 -66
4409 -66 171 39 52 250 -241 90 65 -127 -139 -164 -24 -130 328 -204 41 178 -108 116 88 78 44 -134 -49
4432 -49 -309 228 -152 -96 12 -118 80 -185 139 -65 -114 6 83 -9 -19 -149 -61 -141 -83 -117 -403 99 -164
4455 -164 132 -9 -5 215 180 -204 -73 53 -159 -74 90 87 32 258 -253 123 17 93 -75 -72 -7 -52 284 139
4479 139 54 -45 313 178 -129 22 54 -299 -120 -49 5 -4 -61 -164 -143 73 78 -127 -95 -12 -213 134 -119 108
4503 108 191 152 241 -73 84 -137 82 -149 18 -20 -85 13 -37 -87 -33 117 -197 30 -115 -122 -199 -396 -146 136
4527 136 -102 6 -173 -205 68 -36 -214 -112 3 -7 -122 220 -61 -152 221 -160 89 87 346 138 -161 -90
4549 -90 -130 75 -12 17 25 -92 214 -38 123 -170 -54 40 -142 -147 50 -136 -176 -189 47 -48 -101 -39 402 -74 -29
4574 -29 -221 31 -8 -48 -131 -63 -140 -314 341 -24 275 239 20 45 20 -127 -8 139 -140 35 494 -114 166
4597 166 -194 69 1 -249 -49 381 152 -136 32 96 -41 -231 -139 259 86 4 -40 -200 -172 -130 96 -63
4619 -63 -24 -161 55 1 238 -71 44 21 57 -81 -23 13 -51 228 -128 344 -114 214 23 -200 333 -120 38
4642 38 154 94 84 326 -153 -139 103 -206 -116 -156 53 260 4 -96 -6 -22 97 155 110 47 -181 -4 -97 135
4666 135 65 -75 195 244 -217 66 -110 135 -143 128 -47 -63 97 -208 -44 -163 -297 -202 -279 147 -139 -172
4688 -172 -248 221 15 -354 104 4 -28 -150 73 386 159 93 19 71 132 -183 175 -62 -83 -375 123 -196
4710 -196 45 29 254 26 113 -270 -188 154 -245 -97 -116 42 39 -176 118 16 213 131 122 -64 122 91 114 27
4734 27 54 316 -116 -138 -101 107 99 136 275 -142 -122 -46 -75 267 162 -18 50 -49 -29 200 -176 -301 -530 19
4758 19 80 123 -112 -129 -96 88 275 -61 156 224 127 -198 -240 -29 -74 -112 -69 -146 -161 31 42 -244 -102 -67 91
4783 91 28 -141 465 57 -129 -240 -138 -105 225 23 -23 154 -329 -94 -203 268 -160 -173 -29 -24 -12 55 155
4806 155 -278 6 98 301 103 5 -114 -176 12 222 -145 47 36 89 -144 92 -17 124 -198 -178 -55 49
4828 49 85 -60 113 324 66 145 21 195 34 -120 92 -189 37 -228 -135 -223 -16 -164 -84 -143 43 173
4850 173 -36 238 195 -210 -106 40 -87 386 -32 -164 -109 96 17 173 37 -33 31 -145 68 75 -162 -179 226
4873 226 2 -217 -48 -251 100 -121 36 -11 -156 119 76 201 205 -41 37 54 -11 -34 -2 73 218 132 106 433
4897 433 -71 14 172 392 -103 -307 -74 75 -74 -27 -56 153 -35 -60 82 -42 89 -51 -218 0 90 22
4919 22 34 -81 7 63 29 203 -215 37 -34 -23 -5 -6 107 131 -247 67 -226 -139 265 -59 151 -120 134 -9
4943 -9 37 -16 267 -128 228 -16 211 165 431 89 -63 -22 -119 81 -17 180 -157 27 127 -247 39 -141 146
4966 146 -32 -17 -102 -20 119 -107 125 58 -155 219 10 412 196 154 -156 154 24 174 -178 -82 210 -116
4988 -116 123 -1 -177 -14 1 -26 228 60 47 39 -88 -15 -87 70 -99 -173 -47 136 -178 284 -37 -255 40
5011 40 -22 54 -72 241 226 325 -74 44 -20 195 247 -115 213 177 -58 39 -20 -343 -25 -128 18 -13 -36 -153
5035 -153 19 -79 108 58 32 -131 -100 -41 -48 44 103 162 32 26 -104 244 13 -13 197 62 89 270 415 205 112
5060 112 -116 -2 279 38 -138 129 224 -7 138 -250 -138 112 -259 198 -17 -79 -87 107 -223 10 123
5081 123 411 84 88 -50 -131 -160 -113 140 38 -216 56 -185 26 -16 -77 -157 173 180 -231 182 189 0 -33 -104 -287
5106 -287 -101 -170 168 -160 -280 -16 -222 339 -111 70 230 102 191 -3 -137 -72 -94 -207 53 -214 -140 244
5128 244 400 31 98 219 47 350 241 -62 -6 -148 -78 -14 -85 -69 115 -4 93 -11 -243 -4 -251 -167 55
5151 55 8 -235 57 156 16 74 117 52 312 -3 94 -152 -117 224 174 -115 196 520 96 -42 24 235 -276
5174 -276 8 -248 -108 -243 -123 0 -115 -154 22 -219 -127 -274 185 42 69 -48 -362 114 89 -101 152
5195 152 101 -381 179 -1 55 3 48 -188 59 103 -268 104 275 211 -170 -237 81 92 -48 264 164 -261 198
5218 198 -67 -40 -38 -232 -116 -422 -37 -19 -302 164 -39 172 -93 260 218 -235 143 47 36 198 18 -186
5240 -186 -184 -51 -274 -90 -41 125 -45 -43 89 94 -72 167 -165 19 -18 24 -56 -192 9 -125 42 -282 -266 180
5264 180 -68 -25 -119 -176 -137 -168 18 117 -306 96 35 -113 -90 194 44 155 -187 -18 118 -11 160 71 -5
5287 -5 8 40 214 -13 -221 210 161 29 21 128 -289 150 156 77 -44 -276 55 198 -232 41 118 50 14 39 167
5312 167 157 -105 -296 8 161 -62 -141 185 11 189 -46 -2 56 325 -61 16 -41 -219 193 -194 162 -14
5334 -14 225 -86 118 -12 -111 -316 125 -148 175 -72 321 111 252 186 -125 226 -247 308 -257 157 -35
5355 -35 -373 -23 278 138 115 -461 -194 -91 -63 0 29 -115 -48 220 150 -75 -9 124 -297 168 290 232 -251
5378 -251 -21 -95 -119 157 -240 163 -319 -117 -8 -54 0 -64 104 -138 -97 -301 -103 -33 -98 123 -278 -99 102
5401 102 -46 177 58 -162 -11 305 -127 -162 138 -156 -83 -143 -15 -11 132 -49 -18 198 -78 267 105 -348
5423 -348 6 121 -92 15 -119 -125 82 220 213 78 143 142 45 -49 201 196 -174 271 102 125 164 -49 -34 18 173
5448 173 -106 -39 -46 -251 187 -2 -161 -111 200 195 -148 -78 108 -45 -123 -86 22 -124 7 -18 39 -46 506 235
5472 235 -52 -18 174 228 129 -80 -68 -31 107 -147 182 -27 354 67 -5 155 -168 -224 63 -60 139 -168
5494 -168 104 195 -29 40 75 107 28 -142 -70 -154 21 -275 -310 -15 -52 -111 -126 -46 80 -118 -20 -161 -102 -23 -206
5519 -206 163 152 19 132 39 -250 -30 -220 7 121 76 -173 -255 13 196 -13 -10 51 40 -22 -101 16 -140
5542 -140 182 23 31 -96 -7 -145 -53 229 -81 -160 219 -62 50 -112 -92 -6 236 85 126 211 -110 -324 151
5565 151 -229 -75 -368 -190 -53 64 144 -13 -36 -262 128 -17 -174 201 180 -14 25 135 71 -56 340 83
5587 83 36 -148 -120 94 89 249 -62 -108 -116 11 -174 -236 -113 -232 61 253 142 -105 93 191 73 -63 -83 -87
5611 -87 23 -88 -113 -82 -171 -171 68 -17 29 -116 65 -41 -77 -90 114 -81 13 -23 -87 -93 20 129 101 -221 -80
5636 -80 67 75 226 150 -2 30 -40 -93 189 167 67 48 82 27 -69 -140 -184 8 196 272 -9 -324 -57 -121 -41 -13
5662 -13 -55 185 70 -10 94 -112 -279 -50 8 201 25 156 -205 33 -182 4 -8 -127 -141 55 -136 37
5684 37 73 -86 -135 6 124 41 -300 192 236 194 381 74 -302 -57 15 213 -157 41 398 -94 -151 -97 -4
5707 -4 200 -4 164 -30 74 37 128 287 -174 213 -263 30 -23 304 -66 164 -15 -118 156 -89 -14 -3
5729 -3 128 -218 186 55 -94 4 -89 31 36 -54 -122 -112 -127 -32 31 119 -149 -22 151 185 -33 -2 -230 -126 -172
5754 -172 -20 62 206 -37 143 -99 206 105 26 9 179 -51 -14 -83 -48 81 -201 41 55 -155 204 221 -188
5777 -188 -15 76 300 -142 137 14 -65 127 125 -11 18 -28 227 -48 -150 -40 -274 177 125 -56 -120 -73 99
5800 99 88 229 -131 -417 -56 99 -117 135 -38 198 66 -260 86 -3 0 -158 12 344 116 174 197 31
5822 31 272 -218 4 92 126 -182 -39 -188 118 108 -68 131 94 30 -226 -335 -92 -135 -180 204 37 282 68
5845 68 19 138 -36 1 -11 -209 -113 -147 112 -40 191 271 -29 11 -270 65 -49 0 -254 -72 -45 25 214 175
5869 175 -54 75 144 -74 33 234 5 -207 67 -76 -14 37 -1 -262 -270 118 -155 171 11 -48 -120 -28 -302
5892 -302 72 -55 -147 -66 -61 -93 -372 150 -191 -162 80 187 -112 -182 -325 -167 -188 75 -198 168 235 -355 89
5915 89 2 -358 -246 91 94 140 -130 -105 192 174 -62 -136 -179 -123 134 301 -41 212 -31 6 -156 -69 34 -118
5939 -118 56 109 56 -254 -243 67 22 -51 116 -170 -129 2 -125 161 -47 -86 -161 167 -75 -368 -310 -107 -318
5962 -318 99 -280 173 51 -211 308 -49 66 20 -230 32 49 -51 160 186 59 -50 -216 -101 -168 -71 239
5984 239 178 -140 183 522 98 -19 148 -107 78 -42 -138 258 -233 -430 113 -96 151 -133 -78 -20 -36 -46
6006 -46 167 314 275 14 -5 141 41 -57 198 83 10 31 58 -58 21 -55 17 -40 88 291 22 -125 -33 108
6030 108 -154 -127 -88 195 97 189 -92 84 -9 -61 23 -11 -228 -105 -100 49 -58 39 -185 -78 -176 80 199 105
6054 105 19 4 -188 -178 14 -169 192 264 -255 36 68 -339 -181 -122 158 45 5 -190 -196 -191 134 16 -83 193
6078 193 -27 37 70 -58 -55 -180 -107 145 184 -19 -14 160 -62 -116 144 -25 53 -233 -153 116 143 49 171 -53
6102 -53 243 -166 169 144 -153 125 -22 19 -188 -253 -126 -38 -564 3 -207 105 75 63 -92 -137 -236 -62 143
6125 143 100 230 -62 -39 -17 -53 -26 13 31 -18 -83 170 -69 -184 81 -464 -19 -292 80 269 -66 85 -288
6148 -288 -101 -298 -4 -104 59 -306 -259 133 -32 113 -26 -443 -167 133 -94 4 -163 226 -220 -155 -308
6169 -308 4 -241 -75 120 109 137 25 -28 8 -13 -235 178 -81 107 125 -110 -94 -146 -1 55 307 -136 -16
6192 -16 111 11 162 -105 183 -67 -96 -29 -23 16 -35 -137 73 74 -87 -146 -56 -87 90 445 -21 206 -24 -162
6216 -162 -101 66 248 -235 90 -146 -25 -25 -101 -103 -135 -109 -201 -111 246 86 -27 -82 153 -141 -29 -55 126 69
6240 69 64 84 46 -23 -135 373 -114 106 152 -23 208 84 277 -183 -114 -7 43 2 5 -85 -53 141 -38 87 245
6265 245 49 118 233 80 -220 88 107 177 85 318 -18 110 210 108 105 58 -513 -252 -1 -102 -226 58
6287 58 62 253 -144 -10 -55 -218 -31 35 -414 -253 3 24 -20 76 86 -171 54 -190 -1 166 203 -1 113
6310 113 84 -125 42 51 -82 78 -129 -223 -86 109 -115 110 -20 4 -13 204 -119 -79 -167 91 34 353 -192
6333 -192 109 144 61 -73 -220 -50 -125 69 -26 -271 -21 -156 -140 -183 -155 -153 -72 27 9 220 -81 53 -94 -17
6357 -17 -114 8 -44 -97 16 74 -330 241 -134 -221 399 -10 341 1 -29 -331 163 22 -272 231 31 96 -303
6380 -303 194 -28 -87 205 196 101 128 -31 155 -222 -357 18 167 164 390 -326 -40 61 36 134 327 57 152
6403 152 259 -78 -99 -29 -150 -168 31 -36 -107 -35 -84 49 131 10 49 1 83 26 -93 -91 -5 129 150 -49 -29 325
6429 325 -195 39 106 -118 47 -43 121 122 -65 -265 -183 -34 197 -100 -161 -146 12 70 -50 -167 118 18 -57
6452 -57 103 -376 35 92 197 104 -6 212 138 320 -111 -264 -164 21 -269 -239 234 231 130 -49 -32 133 140
6475 140 -286 -410 21 -210 -59 -109 279 41 -78 107 160 -47 -172 144 -39 47 -140 -137 -233 53 89 -113
6497 -113 491 -160 -155 108 76 -192 111 -147 10 -54 -256 60 -78 -122 -116 219 99 73 109 -224 -395 -18 -273
6520 -273 318 149 48 180 -8 17 -285 60 35 6 -44 143 -39 -118 -13 -310 -399 92 206 100 -9 75
6542 75 6 -14 -70 -76 144 -177 91 -50 -116 -94 150 -40 69 15 28 255 -152 -101 163 186 -17 -7 -70 -51 -53 115
6568 115 68 103 20 123 261 -157 240 -152 -334 19 16 81 -76 -128 338 -16 -61 65 -14 29 147 -61 251
6591 251 124 -55 295 -154 286 -134 -29 2 -209 356 1 122 -120 -57 221 -87 16 286 -186 118 -88
6612 -88 166 46 -203 -61 -18 -83 -72 -242 -109 35 -329 -83 292 96 -238 281 61 102 -207 74 189 -44
6634 -44 -7 -59 -23 225 87 -134 -65 -234 -137 277 -118 -37 171 -100 54 237 55 14 -13 -101 200 -211 35
6657 35 41 175 285 161 6 282 31 141 -143 -80 30 -258 195 94 194 -8 13 111 -63 298 86 -36
6679 -36 10 -148 -281 -104 -32 182 10 -52 152 -38 192 191 -49 -223 -213 -126 171 -95 -23 -92 -249 -72 -138 -240
6703 -240 206 75 -76 238 -59 105 47 110 216 84 -257 -97 -91 -59 -52 107 63 -314 59 226 -36 29 194
6726 194 -67 58 -203 61 -127 337 -23 -98 -86 61 19 171 -113 -7 60 190 -10 63 77 8 85 -158 -79
6749 -79 119 54 -82 311 45 175 -124 -143 -175 -103 -88 -98 32 -74 -88 -93 -7 34 -366 85 -45 128 69 -280
6773 -280 -251 47 -143 -33 186 -111 126 60 227 186 308 -9 30 -141 -135 173 -14 33 -138 280 44 -186
6795 -186 -222 -25 113 119 17 73 -136 -200 -74 217 104 14 84 -160 38 322 79 201 -91 137 28 148
6817 148 -144 -125 50 143 -100 57 94 155 -121 -241 85 -33 33 -68 43 177 44 -253 263 17 -40 -273
6839 -273 82 214 -25 -370 -273 182 37 234 -23 73 -202 227 15 -146 159 -128 -95 20 244 -16 -84
6860 -84 -171 -94 -94 111 -160 178 -99 0 134 2 -312 -52 -34 146 25 -172 99 -102 -238 75 -137 164
6882 164 59 -186 -123 -86 233 77 -53 -7 63 272 18 -323 -267 229 312 253 -167 -305 -107 -31 87 69 -54
6905 -54 -121 70 224 181 11 216 150 20 220 55 -150 -163 -46 -11 60 107 36 109 94 74 -162 13 -53 -211
6929 -211 1 20 244 -81 -101 -146 44 -31 47 -310 -1 0 214 -383 125 171 19 -82 64 116 -89 -232 -250
6952 -250 -39 106 312 -57 140 -143 197 49 -194 -157 -368 94 211 241 152 65 -145 6 -111 81 121 -23
6974 -23 92 -82 -199 -78 -25 53 166 166 183 194 -112 -24 -9 7 370 324 -63 116 -110 -119 -171 -68 23 -233 70
6999 70 56 -81 150 115 111 254 -82 -113 28 40 -209 21 118 -54 -91 -19 277 98 -293 -87 -15 -288 123 -241
7023 -241 21 -190 -9 -28 30 -38 265 -62 -182 -202 -294 -296 -324 -97 69 -114 -170 -52 -112 -11 -50 7 -304 -107
7047 -107 -36 -201 -71 -163 72 -162 228 -65 -276 308 18 -52 -74 -70 -27 -11 -139 -226 307 109 76 -214 -25
7070 -25 3 -178 111 129 267 -24 128 103 101 60 -183 272 -130 208 -56 145 63 51 -114 40 -107 3 -172
7093 -172 90 267 -170 166 40 50 -109 156 18 160 -122 -176 60 102 -320 46 -260 68 193 -194 46
7114 46 168 63 -55 30 -14 -126 134 280 176 205 90 -145 -36 296 61 84 249 -115 289 0 -85 -191
7136 -191 64 103 -24 256 173 196 165 190 215 129 -42 104 -179 267 161 128 137 334 63 -23 -233 -63 51 -44
7160 -44 -21 -57 131 15 65 40 41 79 31 12 49 15 -120 -150 29 88 -48 -83 -131 447 180 -168 -33 -208 40
7185 40 171 -364 299 57 63 80 105 -46 -69 100 113 136 84 70 7 361 -157 -129 -260 3 94 187 70 262 128
7210 128 -78 62 132 -85 196 249 60 94 -125 -82 98 10 18 -57 2 151 -53 -185 12 -207 -3 66 -69
7233 -69 -48 -92 113 28 19 69 103 74 -92 -11 -13 -100 162 -152 117 116 -2 -169 52 292 -78 38 53 -174 -34
7258 -34 148 207 243 -289 166 143 -161 -100 232 -425 -518 121 -14 -213 -146 94 27 47 -103 -53 66 84 -133 -2
7282 -2 -94 -110 -5 94 -40 -26 -151 64 35 18 -10 40 23 94 123 -118 -5 -17 -58 -57 373 -255 64 100 98 67 380
7309 380 -31 -248 -130 51 -378 48 65 -158 160 89 -146 -16 193 -252 139 -5 109 -44 35 127 126 -329
7331 -329 282 -168 248 93 -110 35 205 76 4 -110 -80 -73 67 -36 -96 -70 1 -275 139 -1 27 54 118
7354 118 96 -213 54 -16 208 -285 112 -225 277 -16 7 23 -66 -72 116 44 -53 -70 30 194 -155 -12 -61 50
7378 50 -228 -12 -52 10 8 -193 -260 169 -77 -23 173 69 -160 -214 18 108 90 -43 117 -22 82 -79 229
7401 229 -112 29 -36 -151 115 42 107 91 314 -171 7 -49 -72 86 319 -37 -19 154 88 -185 -110 -51 -289
7424 -289 -11 88 94 -94 -141 -116 218 -155 87 55 71 -126 76 253 191 135 -173 -3 -18 144 -135 239 -32
7447 -32 -238 38 3 196 184 -104 -179 164 -203 -32 -72 234 191 219 54 275 -150 -204 -353 194 221 -181 -191
7470 -191 43 -192 -41 24 -241 -33 -85 -125 88 151 -80 233 -168 142 303 -86 2 -101 132 -8 104 218
7492 218 73 168 30 124 36 286 154 -180 -106 -173 104 -359 241 65 62 -93 -261 -68 -32 -94 48 91 -188
7515 -188 203 46 -248 -124 -60 116 -38 -28 -20 83 43 326 -218 24 279 -202 107 90 -123 95 216 183
7537 183 237 234 19 -203 30 130 215 6 38 -238 -229 -38 -235 40 -262 -11 129 -132 -102 -55 -41 44 107 77
7561 77 -44 -41 27 -255 10 -33 -220 30 254 68 295 -277 -48 41 -321 49 -486 -43 -22 249 250 64 78
7584 78 32 7 -77 68 -129 90 97 30 -223 54 328 54 -78 145 72 -130 242 -168 -25 -240 243 150 -25
7607 -25 103 -186 -89 -179 69 206 -297 -70 -53 -58 44 58 -100 141 -127 -35 -309 -17 -102 -119 -43 -119 75 79 -256
7632 -256 -39 227 -166 13 -126 -10 -144 63 -31 -109 52 59 49 30 -207 82 68 67 58 16 -55 252 223 213 36
7657 36 201 -4 20 183 -120 -138 37 79 102 -37 2 226 118 -167 162 157 217 -2 146 53 -103 241 -67
7680 -67 -115 -200 -248 -73 -102 -298 -108 146 86 150 58 95 185 -279 -129 261 -102 -115 -165 0 -97 -14 -80 -233 447
7705 447 167 -53 94 63 -107 -172 131 38 -191 -65 -16 -184 -195 89 -28 123 80 49 284 -94 -23 151 145
7728 145 228 -113 101 -98 127 -100 432 -158 -58 156 111 189 -374 33 82 121 -272 -17 -256 -169 -98 186
7750 186 -57 -58 140 96 -350 72 56 15 -258 59 126 -7 -119 -101 -13 143 -282 -470 -322 -125 -107 -314 -5
7773 -5 225 16 -143 -138 -157 229 287 -173 -141 -44 178 62 65 -48 -14 -16 -19 65 21 -148 -174 13 -45 -53 151 35 51
7800 51 -168 53 -185 -60 98 1 -6 119 183 -1 331 48 -278 266 307 -95 -84 -170 5 -31 -58 8 -105 68
7824 68 -99 -371 -172 29 -101 66 -131 -100 -8 124 57 72 -181 -121 255 171 380 239 54 71 -24 -268 -18
7847 -18 44 -248 -10 -166 -230 334 -218 125 -106 -112 21 127 78 92 -74 1 34 -311 -85 -197 70 -115 114
7870 114 317 -36 -248 -106 -2 34 184 -252 -181 113 -113 -63 115 30 8 -247 -66 38 -86 -216 215 102
7892 102 -3 -74 160 247 -27 -174 -75 252 117 -206 2 -19 456 157 -258 -172 136 267 -208 33 -145 93
7914 93 20 109 47 371 -144 126 -68 -130 74 -54 22 -85 277 139 91 -8 -194 126 -11 -343 -89 -2 -19
7937 -19 -69 19 53 116 -129 -32 -19 -160 -87 -110 60 143 410 140 -62 -62 -478 -264 93 108 -76 186 239 -154 -57
7962 -57 -314 39 -185 141 171 -261 116 0 101 -70 60 270 16 32 -130 178 189 199 -6 64 234 26
7984 26 290 242 32 -122 211 -288 -88 171 116 207 -218 -212 -230 -159 44 89 -27 187 -216 19 30 -24 46 140
8008 140 266 153 141 7 11 -201 1 -11 -74 297 42 -5 199 -124 259 -55 -95 -39 -53 -8 104 131 -73 158
8032 158 282 80 -127 74 165 -136 -110 -24 -222 -122 6 -9 81 226 -68 200 -139 -126 268 -105 177 -79
8054 -79 40 67 -19 -60 299 120 172 131 197 -88 414 74 227 108 111 -112 240 227 -180 -56 102 -44 -270
8077 -270 -67 83 226 96 213 219 -78 -82 60 55 -159 -1 107 88 93 -179 26 -3 176 117 284 20 -144 -101
8101 -101 -61 77 -367 56 -255 -206 -158 -404 65 72 86 110 78 13 152 -43 -50 -305 146 -123 153 68 -136 41
8125 41 -67 195 136 284 226 -52 -216 58 -187 -188 -75 112 176 -132 81 -140 -211 168 -15 -219 59 226
8147 226 179 79 173 108 -5 -29 47 -276 144 -192 189 228 113 113 98 112 -13 149 -171 19 215 56 206
8170 206 -17 79 -45 -303 14 -118 224 164 14 196 218 115 135 -60 8 -227 -33 -16 31 -450 74
8191G4
##END NTUPLES=NMR FID
##END=
