##TITLE=1H_LR-698-R3-ETPH5
 CDCl3, 8 sc, 
 27.1.2020
##JCAMPDX= 6.0         $$ Bruker NMR JCAMP-DX V2.0
##DATA TYPE= NMR FID
##DATA CLASS= NTUPLES
##ORIGIN= UXNMR, Bruker Analytische Messtechnik GmbH
##OWNER= root
$$ XWIN-NMR		Version 3.5
$$ Mon Jan 27 14:43:48 2020 Russian Standard Time (UT+4h)  she@DPX200
##.OBSERVE FREQUENCY= 200.1315
##.OBSERVE NUCLEUS= ^1H
##.DELAY= (6, 6)
##.ACQUISITION MODE= SIMULTANEOUS
##.ACQUISITION SCHEME= undefined
##.AVERAGES= 8
##.DIGITISER RES= 18
##SPECTROMETER/DATA SYSTEM= spect
##.PULSE SEQUENCE= zg30
##.SOLVENT NAME= CDCl3
##.SHIFT REFERENCE= (INTERNAL, CDCl3, 0, 15.7039)
##AUDIT TRAIL= $$ (NUMBER, WHEN, WHO, WHERE, WHAT)
$$ ##TITLE= Audit trail, XWIN-NMR		Version 3.5
$$ ##JCAMPDX= 5.01
$$ ##ORIGIN= Bruker BioSpin GmbH
$$ ##OWNER= she
$$ F:/spectra/data/she/nmr/H-F/1/audita.txt
$$ ##AUDIT TRAIL=  $$ (NUMBER, WHEN, WHO, WHERE, WHAT)
(   1,<2020-01-27 14:42:33.56 +0400>,<she>,<DPX200>,
      <created by zg, POWCHK disabled, PULCHK disabled
       configuration hash MD5:
       00 E9 B6 7A A2 85 ED C7 34 08 36 98 17 FE 4E 26
       data hash MD5: 16K
       9A AD E4 F6 55 22 5D 42 B4 66 81 D6 0C 62 1A 10>)
$$ ##END=
$$ 
$$ hash MD5
$$ 38 5B 92 78 A9 23 2A 06 5D 1F C4 DD 4C E9 C0 CE
##$RELAX= 
##$RELAX= 
##$RELAX= 
##$RELAX= 
##$RELAX= 
##$RELAX= 
$$ Bruker specific parameters
$$ --------------------------
##$DU= <F:/spectra>
##$EXPNO= 1
##$NAME= <H-F>
##$PROCNO= 1
##$TYPE= <nmr>
##$USER= <she>
##$AMP= (0..31)
100 100 100 100 100 100 100 100 100 100 100 100 100 100 100 100 100 100 
100 100 100 100 100 100 100 100 100 100 100 100 100 100 
##$AQSEQ= 0
##$AQ_mod= 1
##$AUNM= <au_zg>
##$AUTOPOS= <>
##$BF1= 200.13
##$BF2= 200.13
##$BF3= 200.13
##$BF4= 200.13
##$BF5= 200.13
##$BF6= 200.13
##$BF7= 200.13
##$BF8= 200.13
##$BYTORDA= 1
##$CFDGTYP= 0
##$CFRGTYP= 5
##$CHEMSTR= <none>
##$CNST= (0..31)
1 1 145 1 1 1 1 1 1 1 1 1 1 1 1 1 1 1 1 1 1 1 1 1 1 1 1 1 1 1 1 1 
##$CPDPRG= <>
##$CPDPRG1= <>
##$CPDPRG2= <>
##$CPDPRG3= <>
##$CPDPRG4= <mlev>
##$CPDPRG5= <mlev>
##$CPDPRG6= <mlev>
##$CPDPRG7= <mlev>
##$CPDPRG8= <mlev>
##$CPDPRGB= <>
##$CPDPRGT= <>
##$D= (0..31)
0 1.2 0 0 0 0 0 0 0 0.06 0 0.03 0 0 0 0 0.0002 0 0 0 0 0 0 0 0 0 0 0 0 
0 0 0 
##$DATE= 1580121753
##$DBL= (0..7)
120 120 120 120 120 120 120 120 
##$DBP= (0..7)
150 150 150 150 150 150 150 150 
##$DBP07= 0
##$DBPNAM0= <>
##$DBPNAM1= <>
##$DBPNAM2= <>
##$DBPNAM3= <>
##$DBPNAM4= <>
##$DBPNAM5= <>
##$DBPNAM6= <>
##$DBPNAM7= <>
##$DBPOAL= (0..7)
0.5 0.5 0.5 0.5 0.5 0.5 0.5 0.5 
##$DBPOFFS= (0..7)
0 0 0 0 0 0 0 0 
##$DE= 6
##$DECBNUC= <off>
##$DECIM= 24
##$DECNUC= <off>
##$DECSTAT= 4
##$DIGMOD= 1
##$DIGTYP= 9
##$DL= (0..7)
0 120 120 120 120 120 120 120 
##$DP= (0..7)
150 150 150 150 150 150 150 150 
##$DP07= 0
##$DPNAME0= <>
##$DPNAME1= <>
##$DPNAME2= <>
##$DPNAME3= <>
##$DPNAME4= <>
##$DPNAME5= <>
##$DPNAME6= <>
##$DPNAME7= <>
##$DPOAL= (0..7)
0.5 0.5 0.5 0.5 0.5 0.5 0.5 0.5 
##$DPOFFS= (0..7)
0 0 0 0 0 0 0 0 
##$DQDMODE= 0
##$DR= 18
##$DS= 0
##$DSLIST= <SSSSSSSSSSSSSSS>
$$ [...]
##$SUBNAM2= <"">
##$SUBNAM3= <"">
##$SUBNAM4= <"">
##$SUBNAM5= <"">
##$SUBNAM6= <"">
##$SUBNAM7= <"">
##$SUBNAM8= <"">
##$SUBNAM9= <"">
##$SW= 24.9337058887773
##$SWIBOX= (0..15)
0 0 2 0 0 0 0 0 0 0 0 0 0 0 0 0 
##$SW_h= 4990.01996007984
##$TD= 16384
##$TD0= 1
##$TE= 0
##$TE2= 300
##$TE3= 300
##$TEG= 300
##$TL= (0..7)
0 120 120 120 120 120 120 120 
##$TP= (0..7)
150 150 150 150 150 150 150 150 
##$TP07= 0
##$TPNAME0= <>
##$TPNAME1= <>
##$TPNAME2= <>
##$TPNAME3= <>
##$TPNAME4= <>
##$TPNAME5= <>
##$TPNAME6= <>
##$TPNAME7= <>
##$TPOAL= (0..7)
0.5 0.5 0.5 0.5 0.5 0.5 0.5 0.5 
##$TPOFFS= (0..7)
0 0 0 0 0 0 0 0 
##$TUNHIN= 0
##$TUNHOUT= 0
##$TUNXOUT= 0
##$USERA1= <user>
##$USERA2= <user>
##$USERA3= <user>
##$USERA4= <user>
##$USERA5= <user>
##$V9= 5
##$VALIST= <valist>
##$VCLIST= <CCCCCCCCCCCCCCC>
##$VD= 0
##$VDLIST= <DDDDDDDDDDDDDDD>
##$VPLIST= <PPPPPPPPPPPPPPP>
##$VTLIST= <TTTTTTTTTTTTTTT>
##$WBST= 1024
##$WBSW= 4
##$XGAIN= (0..3)
0 0 0 0 
##$XL= 0
##$YL= 0
##$YMAX_a= 402492
##$YMIN_a= -223767
##$ZGOPTNS= <>
##$ZL1= 120
##$ZL2= 120
##$ZL3= 120
##$ZL4= 120
##$ABSF1= 10
##$ABSF2= 0
##$ABSG= 5
##$ABSL= 3
##$ALPHA= 0
##$AQORDER= 0
##$ASSFAC= 0
##$ASSFACI= 0
##$ASSFACX= 0
##$ASSWID= 0
##$AUNMP= <proc_1d>
##$AZFE= 0.1
##$AZFW= 0.1
##$BCFW= 1
##$BC_mod= 2
##$BYTORDP= 1
##$COROFFS= 0
##$CY= 11.3945322036743
##$DATMOD= 1
##$DC= 2
##$DFILT= <>
##$DTYPP= 0
##$F1P= 16.9975609425685
##$F2P= -3.02152046262296
##$FCOR= 0.5
##$FTSIZE= 0
##$FT_mod= 4
##$GAMMA= 1
##$GB= 0.15
##$INTBC= 1
##$INTSCL= 1
##$ISEN= 128
##$LB= 0.24
##$LEV0= 0
##$LPBIN= 0
##$MAXI= 10000
##$MC2= 0
##$MEAN= 0
##$ME_mod= 0
##$MI= 1.114404
##$NCOEF= 0
##$NC_proc= 0
##$NLEV= 6
##$NOISF1= 3.799351
##$NOISF2= 2.8
##$NSP= 1
##$NTH_PI= 0
##$NZP= 0
##$OFFSET= 15.70392
##$PC= 1
##$PHC0= -9786.832
##$PHC1= 16.8008
##$PH_mod= 1
##$PKNL= yes
##$PPARMOD= 0
##$PSCAL= 0
##$PSIGN= 0
##$REVERSE= no
##$SF= 200.130013532006
##$SI= 16384
##$SIGF1= 3
##$SIGF2= 2
##$SINO= 400
##$SIOLD= 16384
##$SREGLST= <1H.CDCl3>
##$SSB= 0
##$STSI= 0
##$STSR= 0
##$SW_p= 3612.71676300578
##$SYMM= 0
##$S_DEV= 0
##$TDeff= 0
##$TDoff= 0
##$TI= <>
##$TILT= no
##$TM1= 0
##$TM2= 0
##$TOPLEV= 0
##$USERP1= <user>
##$USERP2= <user>
##$USERP3= <user>
##$USERP4= <user>
##$USERP5= <user>
##$WDW= 1
##$XDIM= 8192
##$YMAX_p= 0
##$YMIN_p= 0
$$ End of Bruker specific parameters
$$ ---------------------------------
##NTUPLES= NMR FID
##VAR_NAME=  TIME,          FID/REAL,        FID/IMAG
##SYMBOL=    X,             R,               I
##VAR_TYPE=  INDEPENDENT,   DEPENDENT,       DEPENDENT
##VAR_FORM=  AFFN,          ASDF,            ASDF
##VAR_DIM=   8192,          8192,            8192
##UNITS=     SECONDS,       ARBITRARY UNITS, ARBITRARY UNITS
##FACTOR=    0.0002004,     1,               1
##FIRST=     0,             0,               0
##LAST=      1.6414764,     0,               0
##MIN=       0,             -223767,         0
##MAX=       1.6414764,     402492,          0
$$ Real data points
##PAGE= N=1
##DATA TABLE= (X++(R..R)), XYDATA
$$ [...]
$$ plain form
2462 1764 -1948 -2930 205 4197 6113 4377 -284 -3660 -2558 1284 4834 5203 2069 -2148 -3767
2477 -3767 -1573 2501 5189 3742 67 -3671 -4138 -723 3367 4802 2284 -2410 -4651 -3393 566
2492 566 3663 3858 487 -3766 -5248 -2621 1781 3886 2071 -2142 -5264 -5018 -1229 2349 3319 684
2508 684 -3788 -5841 -4225 -4 2998 2527 -1440 -5197 -5278 -2531 1539 3044 1186 -2923 -5626 -4774
2524 -4774 -1050 1968 2694 -518 -4409 -5473 -3682 525 3050 1885 -1925 -4830 -5016 -1946 1803
2539 1803 3083 788 -3172 -5119 -3788 -19 2944 2691 -606 -3611 -4678 -2117 1702 3413 2187
2554 2187 -1306 -4236 -3581 -172 2790 3700 1154 -2294 -3783 -2257 1377 3667 2900 46 -2787 -3490
2570 -3490 -632 2876 4061 2301 -831 -3262 -2125 824 3594 3588 1012 -1533 -2531 -460 2739 4140
$$ packed form
2462A764l712r82L135L992J916j736m661l376J102L842L550L69l134m217j619
2477c767K194M074K688j447l675l738m67L415M090J435k518m694k241J258L959
2492E66L097J95l371m253j482K627M402K105j815m213l122K46L789L578R70k635
2508F84m472k053J616M221L002m71l967l757q1K747M070J505j858m109k703Q52
2524d774L724L018P26l212l891j064J791M207K525j165l810k905j86L070L749
2539A803J280k295l960j947J331L769K963k53l297l005j067K561L819J711j226
2554B187l493k930O55L409K962R10k546l448j489J526L634K290p67k854k833p03
2570c490K858L508J185j760l132k431J137K949K770ok576k545r98K071L199J401
$$ plain form
2586 4140 3113 181 -2237 -1594 728 3280 3875 2203 -768 -1962 -655 2035 3848 3578 972 -1302
2602 -1302 -1669 321 3032 3937 2415 -54 -1438 -823 1392 3338 3456 1384 -924 -1151 302 2443
2618 2443 3365 2498 650 -1197 -891 896 2988 2773 1499 -406 -1119 -163 1897 2879 2027 560 -734
2635 -734 -1139 603 2459 2552 1350 -384 -961 -243 1033 2242 1961 256 -979 -1039 77 1314 1780
2652 1780 930 -476 -1428 -717 882 1577 1366 34 -1133 -1783 -578 1017 1399 348 -1160 -1587 -960
2669 -960 272 1108 1060 -424 -1794 -1815 -790 897 1077 -25 -1516 -2289 -1504 73 982 307 -931 -1953
2687 -1953 -2526 -760 371 689 -387 -1690 -2496 -1547 -312 767 471 -1017 -2358 -2821 -1260 -116
2703 -116 697 -113 -2094 -2711 -2454 -722 625 280 -1570 -2865 -3122 -1728 -61 878 -362 -2152 -3296
$$ packed form
2586D140j027k932k418O43K322K552N95j672k971j194J307K690J813k70k606k274
2602a302l67J990K711R05j522k469j384O15K215J946J18k072k308k27J453K141
2618B443R22q67j848j847L06J787K092k15j274j905p13R56K060R82q52j467j294
2635g34m05J742J856R3j202j734n77P18J276J209k81j705j235o0J116J237M66
2652A780q50j406r52P11J599O95k11j332j167o50J205J595L82j051j508m27O27
2669i60J232Q36m8j484j370k1J025J687J80j102j491p73P85J577R09o75j238j022
2687a953n73J766J131L18j076j303q06R49J235J079k96j488j341m63J561J144
2703a16Q13q10j981o17K57J732J347l45j850j295k57J394J667R39j240j790j144
$$ plain form
2720 -3296 -2514 -1252 382 544 -625 -2662 -3420 -2100 -170 823 -126 -1842 -3429 -3059 -1039 483
2736 483 862 -749 -2949 -3508 -2412 -703 1205 451 -1591 -3224 -3307 -1772 746 1335 67 -2195 -3552
2753 -3552 -2912 -397 1348 1410 -692 -2850 -3350 -1921 640 2110 1262 -1607 -3196 -3038 -427 1811
2769 1811 2022 429 -1875 -3116 -2153 697 2641 2251 -310 -2525 -2595 -672 1818 3021 1703 -645
2785 -645 -2870 -1642 545 2861 3357 983 -1803 -2627 -835 1744 3547 3010 332 -2129 -1856 337
2801 337 2900 3943 2197 -657 -2317 -1270 1205 3915 3484 1365 -1713 -1956 -267 2737 4340 3404
2817 3404 316 -1966 -1403 949 4071 4323 2381 -759 -1935 -644 2076 4316 3479 844 -1810 -1998
2833 -1998 200 3391 4631 3039 -140 -1893 -1481 1167 3896 4244 1581 -1227 -2242 -722 2368
$$ packed form
2720c296P82J262J634J62j169k037p58J320J930R93r49j716j587L70K020J522
2736D83L79j611k200n59J096J709J908p54k042j633q3J535K518N89j268k262j357
2753c552O40K515J745O2k102k158n00J429K561J470q48k869j589J58K611K238
2769A811K11j593k304j241R63K850J944l90k561k215p0J923K490J203j318k348
2785f45k225J228K187K316M96k374k786q24J792K579J803n37k678k461K73K193
2801C37K563J043j746k854j660J047K475K710m31k119l078k43J689L004J603r36
2817C404l088k282N63K352L122K52j942l140j176J291K720K240q37k635k654j88
2833a998K198L191J240j592l179j753M12K648K729L48k663k808j015J520L090
$$ plain form
2848 2368 3834 3538 646 -2053 -2002 424 3289 3977 2319 -746 -2701 -1476 1151 3646 3426 1118
2864 1118 -1732 -2452 -571 2304 3610 2559 -325 -2417 -2057 211 2780 3134 1487 -1534 -2695 -1721
2880 -1721 1105 2912 2799 335 -2150 -2547 -839 2101 3089 1743 -899 -2402 -2050 385 2785 2801
2896 2801 957 -1986 -2416 -1411 1322 2702 2141 34 -2110 -2582 -45 1934 2690 1249 -1424 -2349
2912 -2349 -1506 621 2252 2244 335 -1858 -2059 -1113 1265 2589 1656 -432 -2158 -2126 -162 1838 1943
2929 1943 530 -1229 -2467 -1745 827 2011 1477 -306 -1953 -2286 -824 1056 1893 736 -1062 -2434
2945 -2434 -1593 -300 1127 1214 -24 -2023 -2090 -1236 260 1341 1021 -947 -2358 -2022 -699 585 981
2962 981 -75 -1514 -2320 -1799 -577 540 447 -944 -2146 -2156 -1492 -83 530 -377 -1631 -2117 -1866 -863
$$ packed form
2848B368J466k96k892k699N1K426K865O88j658l065j955J225K627K495k20k308
2864A118k850p20J881K875J306j051k884k092L60K268K569L54j647l021j161R74
2880a721K826J807j13k464k485l97J708K940R88j346k642j503L52K435K400J6
2896B801j844k943m30J005K733J380n61k107k144m72K537J979P56j441k673r25
2912b349Q43K127J631qj909k193k01R46K378J324r33k088j726L2J964K000J05
2929A943j413j759j238P22K572J184n34j783j647l33J462J880Q37j157j798j372
2945b434Q41J293J427Q7j238j999o7Q54J496J081l20j968j411L36J323J284L96
2962I81j056j439q06N21J222J117r3j391j202j0O64J409O13r07j254m86K51J003
$$ plain form
2980 -863 254 -216 -1050 -2014 -2114 -1274 -379 -15 -301 -1474 -2092 -1780 -1099 -423 -56 -947 -1735 -1732 -1675 -674
3000 -674 -468 -355 -1041 -1829 -1808 -1058 -32 -339 -941 -1501 -1415 -1065 -481 62 -267 -1185 -1409 -1479 -429 -68
3020 -68 211 -482 -1179 -1219 -501 28 206 -11 -664 -774 -521 124 606 559 158 -492 -437 95 743 1011 570
3041 570 11 -523 33 899 1693 1360 579 -61 470 992 1395 1998 1104 679 -108 471 1491 2399 1923 1079
3061 1079 275 240 1077 2361 2626 2098 1046 393 891 1909 2851 2856 1638 574 492 1279 2534 3152 2461
3080 2461 835 406 713 1825 2931 2889 1780 681 77 719 2077 2944 2664 1049 -188 251 1212
3097 1212 2753 2906 1712 585 -513 220 1822 2582 2609 1247 -383 -562 184 1704 2453 1937 178
3114 178 -828 -809 464 2203 1698 853 -991 -1707 -608 905 1807 1623 -65 -1781 -1909 -762 1034
$$ packed form
2980h63J117m70q34r64j00Q40Q95L64k86j173o18L12O81O76L67q91p88LN7J001
3000f74K06J13o86p88K1P50J026l07o02n60Q6L50N84N43l29r18k24p0J050L61
3020f8K79o93o97m0P18N29J78k17o53j10K53O45M82m7m01o50N5N32O48K68m41
3041E70n59n34N56Q66P94l33p81o40N31N22M03O03q94m25p87N79J020R08m76q44
3061A079q04l5Q37J284K65n28j052o53M98J018R42Nj218j064q2P87J255O18o91
3080B461j626m29L07J112J106m2j109j099o04O42J358Q67k80j615j237M39R61
3097A212J541J53j194j127j098P33J602P60K7j362j630j79P46J520P49n16j759
3114A78j006J9J273J739n05q45j844p16J099J513R02j84j688j716j28J147J796
$$ plain form
3131 1034 1783 405 -1197 -2353 -2179 -273 1428 1337 -340 -2250 -2778 -1851 66 1293 601 -1240 -2746
3148 -2746 -2835 -1430 558 1106 76 -2108 -3163 -2531 -786 655 952 -1052 -3016 -3621 -2027 -102
3164 -102 873 26 -1440 -3246 -3200 -1570 304 860 -1012 -2464 -3718 -3064 -576 461 393 -1221 -3131
3181 -3131 -3304 -2104 -254 746 -79 -2313 -3799 -3364 -1243 274 855 -646 -2480 -3470 -2414 -736
3197 -736 1016 771 -1332 -2942 -2979 -1594 415 1365 -229 -1769 -3453 -2953 -865 944 852 -669 -2105
3214 -2105 -3186 -1989 228 1327 1046 -861 -2757 -2614 -1126 930 1799 487 -1247 -2640 -1820 113
3230 113 1581 1697 37 -1908 -2484 -729 867 2002 1372 -635 -1801 -1889 -577 1567 2003 621 -653
3247 -653 -1647 -1020 714 2004 1887 852 -1291 -1409 -306 1708 2577 1395 18 -956 -688 696 1911
$$ packed form
3131A034P49j378j602j156J74J906J701r1j677j910n28R27J917J227o92j841j506
3148b746q9J405J988N48j030k184j055O32J745J441K97k004j964o05J594J925
3164a02R75q47j466j806M6J630J874N56j872j452j254O54K488J037o8j614j910
3181c131j73J200J850J000q25k234j486M35K121J517N81j501j834r90J056J678
3197g36J752k45k103j610l7J385K009R50j594j540j684N00K088J809r2j521j436
3214b105j081J197K217J099k81j907j896J43J488K056Q69j312j734j393Q20J933
3230A13J468J16j660j945n76J755J596J135o30k007j166q8J312K144M36j382j274
3247f53r94O27J734J290j17j035k143j18J103K014Q69j182j377r74K68J384J215
$$ plain form
3264 1911 2555 1296 -125 -935 -73 1275 2259 2278 1024 -622 -487 285 1903 2468 2010 534 -321 -30
3282 -30 1374 2430 2702 1600 444 -187 523 1834 2753 2256 1143 -102 162 940 2212 2894 2277 537
3300 537 51 452 1703 2379 2633 1603 699 122 644 1747 2465 2090 905 260 276 910 1867 2399 1633
3319 1633 795 139 311 1414 2006 2017 1297 606 161 655 1413 1538 1229 161 231 11 646 1108 1004 538
3339 538 21 -59 -223 596 900 540 34 -269 -499 28 246 283 94 -702 -631 -256 7 -424 -112 -222 -958
3360 -958 -799 -731 -523 -385 -618 -786 -1218 -835 -791 -481 -753 -1044 -1043 -1114 -1015 -824 -871 -1315 -1404 -1366 -833 -939 -869
3383 -869 -1323 -1327 -1221 -1047 -1083 -630 -1247 -1419 -1466 -1391 -998 -651 -1110 -1077 -1634 -1422 -1037 -968 -485 -695 -1521 -1407
3405 -1407 -1120 -668 -320 -521 -801 -1699 -1185 -477 -275 113 -276 -1099 -1239 -766 -410 424 542 -478 -866
$$ packed form
3264A911O44j259j421q10Q62J348R84J9j254j646J35P72J618N65m58j476q55K91
3282c0J404J056K72j102j156o31P10J311R19m97j113j245K64P78J272O82o17j740
3300E37m86M01J251O76K54j030r04n77N22J103P18l75j185o45J6O34R57N32p66
3319A633q38o56J72J103N92J1p20o91m45M94P58J25l09j068P0k20O35M62j04m66
3339E38n17q0j64Q19L04l60n06l03k30N27K18L7j89p96P1L75K63m31L12j10p36
3360i58J59O8K08J38k33j68m32L83M4L10k72k91Jp1R9J91m7m44q9L8N33j06P0
3383h69m54mJ06J74l6M53o17j72m7P5L93L47m59L3n57K12L85O9M83k10q26J14
3405a407K87M52L48k01k80q98N14P08K02L88l89q23j40M73L56Q34J18j020l88
$$ plain form
3424 -866 -744 -97 698 626 332 -370 -1131 -969 332 1544 1088 279 -209 -639 46 1072 1520 968 310
3443 310 -625 -357 450 1303 1997 1239 406 -566 36 964 2067 1550 889 138 -191 648 1995 2110 1704
3462 1704 756 -332 95 925 2139 2455 1811 213 -40 409 1523 2637 2001 751 -24 -543 730
3479 730 1865 2171 1697 355 -327 -159 854 2046 2104 1158 -494 -1003 58 1247 2372 1850 347
3496 347 -896 -501 233 1551 1795 1118 -203 -906 -978 633 1603 1449 545 -958 -1405 -484 1761 779
3514 779 595 21 -1301 -1825 -488 980 1138 554 -1206 -2067 -1207 -207 1026 1058 -282 -1709 -2137 -1391
3532 -1391 395 996 654 -833 -2155 -2403 -575 -74 23 81 -1088 -2692 -1708 -17 662 899 -720 -2106
3550 -2106 -2834 -1798 129 799 15 -1228 -2065 -2188 -1005 365 776 -149 -1617 -2082 -1995 -476 503 592
$$ packed form
3424h66J22O47P95p2k94p02p61J62J301J212m56q09m88m30O85J026M48n52o58
3443C10r35K68Q07Q53O94p58q33r72O02R28J103n17o61p51l29Q39J347J15m06
3462A704r48j088M27Q30J214L16o44j598k53M49J114J114o36j250p75n19J273
3479G30J135L06m74j342o82J68J013J192N8r46j652n09J061J189J125n22j503
3496C47j243L95P34J318K44o77j321p03p2J611R70j54r04j503m47R21K245r82
3514G79j84n74j322n24J337J468J58n84j760q61Q60J000J233L2j340j427m28P46
3532a391J786O01l42j487j322k48J828N01R7N8j169j604R84J691O79K37j619j386
3550b106p28J036J927O70p84j243q37j23J183J370M11r25j468m65Q7J519R79Q9
$$ plain form
3568 592 -624 -1946 -2490 -1546 108 425 316 -1344 -1993 -1625 -480 569 758 -43 -1921 -2419 -1425 -260
3586 -260 697 232 -646 -1706 -2165 -839 101 1032 370 -954 -1982 -1566 -553 697 757 -168 -1153 -1830
3604 -1830 -1266 364 892 648 -539 -2063 -1463 -382 419 931 385 -967 -1744 -1425 -380 595 891 185
3622 185 -841 -1358 -1263 521 765 538 -443 -1246 -1182 -599 73 739 385 -874 -1325 -1165 -413 920 716
3641 716 -30 -839 -1505 -906 257 884 731 -123 -715 -1008 -101 597 1396 532 -389 -740 -606 98 1001 1150
3661 1150 378 -385 -565 231 638 1119 873 249 -175 -77 339 823 1033 955 423 -66 98 589 1127 1314
3681 1314 638 332 542 605 913 1402 981 875 331 422 621 1454 1415 1169 828 422 428 991 1183 1533 1082
3702 1082 739 679 566 1047 1408 1267 1097 825 765 1046 1281 1150 1223 795 802 583 884 907 862 784 896 743
$$ packed form
3568E92j216j322n44R44J654L17j09j660o49L68J145J049J89q01j878m98R94J165
3586b60R57m65q78j060m59J326R40R31o62j324j028M16J013J250O0r25r85o77
3604a830N64J630N28k44j187j524O00J081Q01N12n46j352p77L19J045R75K96p06
3622A85j026n17R5J784K44k27r81q03O4N83O72O66l54j259m51J60P52J333k04
3641G16p46q09o66N99J163O27j53q54n92k93R07O98P99q64r21l51J34P04R03J49
3661A150p72p63j80P96M07M81k46o24m24R8M16M84K10p8n32m89J64M91N38J87
3681A314o76l06K10O3L08M89m21j06n44R1J99Q33l9k46l41m06ON63J92L50m51
3702A082l43o0j13M81L61j41j70k72o0K81K35j31P3m28Pk19L01K3m5p8J12j53
$$ plain form
3724 743 886 612 711 805 771 668 205 205 322 477 449 415 586 202 454 13 169 300 463 521 5 -189 -255
3747 -255 -35 294 230 183 -118 -712 -330 -25 1 219 -74 -698 -693 -381 -105 -67 -88 -501 -759 -926 -745 -43
3769 -43 -328 -370 -712 -1128 -910 -615 -226 -550 -515 -1228 -1602 -1138 -588 -380 -283 -661 -1229 -1477 -912 -344 -495
3790 -495 -487 -1022 -1472 -1506 -774 -364 -296 -535 -1593 -1658 -1331 -94 102 -32 -871 -1557 -1393 -966 97 247 -272
3811 -272 -718 -1362 -1357 -346 260 124 38 -1028 -1115 -725 73 912 427 -353 -1166 -1177 -177 646 1025 516 -531
3832 -531 -1154 -968 344 1122 1073 405 -702 -582 -254 764 1433 1081 198 -584 -869 342 1219 1499 1208
3851 1208 52 -821 -535 576 1648 1636 699 -185 -811 26 949 1445 1444 290 -531 -348 349 1474 1604
3870 1604 1143 34 -578 -376 788 1572 1538 678 -66 -425 -23 1175 1671 1518 421 -381 -448 155 1536
$$ packed form
3724G43J43k74R9R4l4j03m63%J17J55k8l4J71l84K52m41J56J31J63N8n16j94o6
3747b55K20L29o4m7l01n94L82L05K6K18k93o24NL12K76L8k1m13k58j67J81P02
3769d3k85m2l42m16K18K95L89l24L5p13l74M64N50K08R7l78n68k48N65N68j51
3790d95Qn35m50l4P32M10O8k39j058o5L27J237J96j34q39o86J64M27J063J50n19
3811b72m46o44NJ011O06j36q6j066q7L90P98Q39m85p80q13j1J000Q23L79n09j047
3832e31o23J86J312P78m9o68j107J20L28J018O69l52q83p82k85J211Q77K80k91
3851A208j156q73K86J111J072j2r37q84o26Q37R23M96jj154q21J83O97J125J30
3870A604m61j109o12K02J164P84l4q60p44l59M02J198M96j53j097q02o7O03J381
$$ plain form
3889 1536 2017 1129 -339 -377 -250 789 1531 1312 654 -317 -838 -352 898 1577 1422 336 -916 -705
3907 -705 183 1004 1830 661 -326 -808 -606 470 1244 1588 251 -950 -1225 -304 758 1311 971 -224
3925 -224 -981 -793 -121 1054 1261 667 -497 -1083 -914 474 1300 656 129 -673 -1013 -288 481 1220 806
3944 806 -377 -1386 -1133 -363 685 1084 399 -853 -1270 -666 30 1059 764 -350 -1052 -971 -671 110
3962 110 877 246 -306 -1011 -1312 -549 672 747 14 -546 -1043 -901 -165 480 329 -345 -1218 -1463 -666 -55
3982 -55 214 273 -585 -1131 -885 -752 343 536 -175 -912 -1402 -802 -472 64 188 -551 -879 -1252 -778 -340
4002 -340 601 -52 -396 -1036 -600 -1649 -339 544 253 -1489 -2078 -1285 -1204 188 -31 -344 -1217 -1299 -879
4021 -879 -327 -50 -122 -524 -933 -1025 -624 -145 99 1 -717 -926 -1010 -768 -218 -116 91 -669 -920 -777 -200
$$ packed form
3889A536M81q88j468l8J27J039P42k19o58r71n21M86J250O79j55j086j252K11
3907g05Q88Q21Q26j169r87m82K02J076P74L44j337j201k75R21J062N53l40j195
3925b24p57J88O72J175K07n94j164n86J69J388Q26o44n27q02l40P25P69P39m14
3944H06j183j009K53P70J048L99o85j252m17O04O96J029k95j114p02Q1L00P81
3962A10P67o31n52p05l01P63J221P5p33n60m97J42P36O45j51o74q73k45P97O11
3982e5K69N9q58n46K46J33J095J93p11p37m90O00L30N36J24p39l28l73M74M38
4002c40R41o53l44o40M36j049J310Q83k91j742n89P93Q1J392k19l13q73q2M20
4021h79N52K77p2m02m09r2M01M79K44r8p18k09q4K42N50J02K07p60k51J43N77
$$ plain form
4042 -200 8 -68 -228 -510 -732 -457 -133 116 -105 62 -471 -598 12 219 339 142 -213 -448 -242 83
4062 83 450 325 155 -20 -369 -402 -32 374 504 194 66 -116 -74 374 392 604 244 360 -106 202 500
4083 500 466 746 493 398 -84 380 1048 561 715 832 441 470 444 861 870 746 428 460 543 254 766 895 550
4106 550 731 -5 173 853 1105 983 734 514 367 488 607 1075 718 433 577 493 234 671 862 981
4126 981 404 264 0 263 602 671 808 254 228 -72 415 608 778 335 81 -53 -33 206 396 792 425
4147 425 -318 -267 -82 569 952 288 5 -150 -725 -196 521 447 548 -421 -623 -631 94 519 484 -165 -715 -645
4169 -645 -346 249 363 332 -120 -804 -1000 -7 274 417 67 -342 -943 -842 -351 289 678 -222 -786 -645
4189 -645 -831 338 607 324 -199 -982 -858 -284 351 622 -198 -597 -1141 -809 -66 330 297 -136 -424 -1164
$$ packed form
4042b00K08p6j60k82k22K75L24K49k21J67n33j27O10K07J20j97l55k35K06L25
4062H3L67j25j70j75l49l3L70M06J30l10j28j82M2M48J8K12l60J16m66L08K98
4083E00l4K80k53r5m82M64O68m87J54J17l91K9k6M17Rj24l18L2Q3k89N12J29l45
4106E50J81p36J78O80K52j22k49k20j47J21J19M68l57k85J44q4k59M37J91J19
4126I81n77j40k64K63L39O9J37n54k6l00M87J93J70m43k54j34K0K39J90L96l67
4147D25p43N1J85O51L83o64k83j55n75N29P17p4J01r69k02qP25M25l5o49n50P0
4169f45K99N95J14l1m52o84j96R93K81J43l50m09o01J01M91O40L89r00n64J41
4189f45j86J169K69k83n23p83J24N74O35K71q20l99n44L32P43L96l3m33k88p40
$$ plain form
4209 -1164 -756 240 643 382 -371 -1022 -716 -574 524 664 375 -431 -1020 -857 -130 767 631 166 -969
4228 -969 -914 -705 181 808 642 -14 -807 -802 -65 138 814 392 -813 -1198 -1000 -124 670 356 198 -653 -1028
4249 -1028 -756 214 641 305 -589 -940 -1268 -731 493 774 176 -559 -1245 -1011 -449 254 335 -20 -829 -1257
4269 -1257 -574 -46 335 321 -599 -1104 -1300 -850 379 717 183 -759 -1096 -868 -146 142 331 -238 -575 -979
4289 -979 -892 -189 517 275 -393 -1100 -1251 -482 307 400 -35 -310 -1148 -1023 163 361 420 208 -781 -916 -846
4310 -846 186 588 522 100 -661 -642 -532 375 824 325 -407 -381 -353 -334 543 693 459 -83 -599 -294 211
4331 211 955 751 202 -249 -618 101 425 1006 838 182 -210 -103 158 1018 886 758 13 -265 -17 466
4351 466 1198 1084 782 -36 -189 308 791 1059 766 365 207 41 213 949 1087 1027 388 -40 488 682
$$ packed form
4209a164M08R96M03k61p53o51L06J42J098J40k89q06n89J63P27Q97j36m65j135
4228i69N5K09Q86O27j66o56p93NP37K03O76m22j205l85J98Q76P94l14j58q51l75
4249a028K72R70M27l36q94l51l28N37J224K81n98p35o86K34N62P03Q1l55q09m28
4269a257O83N28L81j4r20n05j96M50J229L38n34r42l37K28P22K88J89n69l37m04
4289i79Q7P03P06k42o68p07j51P69P89R3m35k75q38J25J186J98N9k12r89j35P0
4310h46J032M02o6m22p61J9J10R07M49m99p32K6K8J9Q77J50k34n42n16L05N05
4331B11P44k04n49m51l69P19L24N81j68o56l92J07K61Q60j32j28p45k78K48M83
4351D66P32j14l02q18j53M97M83K68k93m01j58j66J72P36J38o0o39m28N28J94
$$ plain form
4371 682 851 844 961 -44 -116 274 846 1080 923 447 232 -174 247 857 899 482 375 -18 25 316 619
4392 619 879 515 130 -325 -8 565 326 525 286 -34 -338 -3 346 686 435 250 18 -108 151 249
4412 249 313 56 119 -516 -67 15 160 249 139 -214 -244 -308 -321 199 48 -82 -490 -611 -501 -106 -71 -6 9
4435 9 -577 -467 -267 36 300 239 -473 -554 -480 -208 64 90 -169 -563 -518 -397 -378 238 -94 -86 -610 -469 -625
4458 -625 119 140 -17 -162 -494 -632 -351 92 16 -83 -317 -336 -633 -451 -111 72 -121 -131 -530 -622 -432 -18
4480 -18 82 17 -446 -580 -54 -8 3 206 -39 -325 -465 -336 114 523 113 -152 -514 -492 -267 77 466 32
4502 32 -292 -553 -702 -143 271 383 -7 -354 -549 -400 62 229 413 39 -319 -736 -396 93 418 295
4522 295 -178 -595 -555 -169 227 491 109 -338 -462 -609 -107 419 419 22 -236 -612 -658 166 451 176 -159
$$ packed form
4371F82J69pJ17j005p2L90N72K34j57m76k15m06M21O10M2m17j07l93M3K91L03
4392F19K60l64l85m55L17N73k39J99k39l20l04L35L49L40k51j85k32j26K59R8
4412B49O4k57O3o35M49Q2J45Q9j10l53l0o4j3N20j51j30m08j21J10L95L5O5J5
4435In86J10K00L03K64o1p12q1P4K72K72K6k59l94M5J21J9O16l32Qn24J41j56
4458f25P44K1j57j45l32j38K81M43p6r9k34j9k97J82L40J83j93j0l99r2J90M14
4480a8J00o5m63j34N26M6J1K03k45k86j40J29M50M09m10k65l62K2K25L44L89m34
4502C2l24k61j49N59M14J12l90l47j95J49M62J67J84l74l58m17L40M89L25j23
4522B95m73m17M0L86L96K64l82m47j24j47N02N26%l97k58l76m6Q24K85k75l35
$$ plain form
4543 -159 -710 -486 -109 163 595 -41 -221 -685 -621 2 368 548 170 -570 -835 -649 170 399 406 -63 -465
4564 -465 -603 -229 292 754 251 -6 -665 -883 -45 517 458 232 -937 -841 -397 512 461 615 -176 -649 -795
4585 -795 81 437 874 720 -195 -418 -488 117 864 629 361 -156 -345 -250 256 647 525 115 -450 -362 -92
4606 -92 596 982 530 -112 -430 -344 -17 593 846 585 -519 -316 -231 99 713 470 145 -364 -497 151 710
4627 710 773 494 13 -458 -732 112 792 623 -37 -45 -669 -278 176 743 792 383 -343 -327 -491 112 794 718
4649 718 -143 -542 -420 2 682 561 407 -364 -490 -492 38 549 392 223 -380 -837 -345 163 588 246 -273
4670 -273 -798 -456 47 641 281 340 -151 -595 -277 399 561 594 -99 -695 -839 -99 137 440 239 -168 -389
4691 -389 -235 -449 295 540 409 -125 -287 -441 -108 374 763 555 -129 -361 -319 462 517 414 157 -230 -544
$$ packed form
4543a59n51K24L77K72M32o36j80m64O4O23L66J80l78p40k65J86Q19K29Pm69m02
4564d65j38L74N21M62n03k57o59k18Q38N62n9k26j169R6M44R09n1J54p91m73j46
4585g95Q76L56M37j54r15k23p0O05P47k35k68n17j89R5N06L91j22m10n65Q8K70
4606i2O88L86m52o42l18Q6L27O10K53k61j104K03Q5L30O14k43l25n09j33O48N59
4627G10O3k79m81m71k74Q44O80j69o60qo24L91M54N67M9m09p26J6j64O03O82p6
4649G18q61l99J22M22O80j21j54p71j26kN30N11j57j69o03m57M92N08M25l42n19
4670b73n25L42N03N94l60N9m91m44L18O76J62L3o93n96j44P40K36L03k01m07k21
4691c89J54k14P44K45j31n34j62j54L33M82L89k08o84k32M2P81N5j03k57l87l14
$$ plain form
4712 -544 53 587 667 416 22 -31 -218 200 833 654 720 41 -25 -69 25 492 711 145 8 257 140 727
4734 727 437 647 99 13 -166 227 839 855 684 61 -183 -247 300 513 648 328 -134 -165 -81 276 799 624
4756 624 155 89 -119 104 297 672 618 334 -312 77 217 413 506 364 193 -458 -308 335 338 384 126 -100
4778 -100 -442 -652 141 40 132 -332 -462 -553 -295 314 71 2 -50 -716 -217 -41 144 3 -487 -319 -710
4799 -710 -455 -411 25 67 -139 -606 -931 -234 -127 -83 -117 -107 -699 -816 -396 -174 -147 -154 -481 -525 -978 -630 -466
4822 -466 -291 -203 -517 -521 -516 -530 -135 201 -313 -612 -676 -511 -427 -108 18 -341 -620 -958 -667 -387 -16 -37 -195
4845 -195 -817 -344 -302 -142 -25 -257 -282 -684 -471 -218 273 189 114 -237 -629 -210 197 480 203 -119 -472
4866 -472 -528 78 97 483 280 -135 -515 -163 -50 216 492 350 7 -247 -10 438 449 496 133 -80 -230
$$ packed form
4712e44N97N34Q0k51l94n3j87M18O33j79O6o79o6m4R4M67K19n66j37K49j17N87
4734G27k90K10n48q6j79L93O12J6j71o23k44o4N47K13J35l20m62l1Q4L57N23j75
4756F24m69o6k08K23J93L75n4k84o46L89J40J96R3j42j71o51J50O43LM6k58k26
4778a00l42k10P93j01R2m64j30r1K58O09k43o9n2o66M99J76J85j41m90J68l91
4799g10K55M4M36M2k06m67l25O97J07M4l4J0n92j17M20K22K7pl27m4m53L48J64
4822d66J75Q8l14mNj4L95L36n14k99o4J65Q4L19J26l59k79l38K91K80L71k1j58
4845a95o22M73M2J60J17k32k5m02K13K53M91q4p5l51l92M19M07K83k77l22l53
4866d72n6O06J9L86k03m15l80L52J13K66K76j42l43k54K37M48J1M7l63k13j50
$$ plain form
4887 -230 -264 648 853 647 162 7 -224 86 605 832 784 446 -286 10 478 447 622 486 -48 -450 247
4908 247 482 583 484 117 -296 -168 138 727 667 184 360 -146 14 228 720 770 398 -158 -267 127 399
4929 399 774 519 80 -569 -221 150 591 512 494 -135 -531 -76 85 547 715 565 -242 -423 -349 394 503
4950 503 346 423 -596 -397 -158 71 722 438 -150 -532 -405 -250 324 425 -183 -179 -350 -501 52 118 412
4971 412 166 -451 -673 -219 266 199 464 -92 -500 -566 -277 251 684 119 -434 -491 -289 -52 449 389 13
4992 13 -375 -394 -432 67 447 106 -160 -536 -775 -500 147 854 327 -15 -573 -434 -313 -116 261 -166 -229
5013 -229 -952 -500 -43 -16 -71 -235 -494 -672 -502 4 273 274 -406 -499 -922 -177 62 368 6 -482 -619 -766
5035 -766 -138 -25 312 -323 -390 -674 -484 20 99 -48 -441 -923 -701 -303 124 203 -79 -327 -911 -523 -307
$$ packed form
4887b30l4R12K05k06m85j55k31L10N19K27m8l38p32K96M68l1J75j36n34m02O97
4908B47K35J01r9l67m13J28L06N89o0m83J76n06J60K14M92N0l72n56j09L94K72
4929C99L75k55m39o49L48L71M41p9j8o29l96M55J61M62J68j50q07j81P4P43J09
4950E03j57P7j019J99K39K29O51k84n88l82J27J55N74J01o08Mj71j51N53O6K94
4971D12k46o17k22M54M85o7K65n56m08o6K89N28M33n65n53n7K02K37N01o0l76
4992A3l88j9l8M99L80l41k66l76k39K75O47P07n27l42n58J39J21J97L77m27o3
5013b29p23M52M57K7n5j64k59j78J70N06K69Jo80r3m23P45K39L06l62m88j37j47
5035g66O28J13L37o35o7k84J90N04P9j47l93m82K22L98M27P9k82k48n84L88K16
$$ plain form
5056 -307 6 -137 -202 -415 -731 -367 -404 259 233 -450 -661 -811 -493 -74 150 226 -383 -622 -337 -592 -165
5077 -165 119 -76 -289 -830 -354 -170 400 271 -395 -251 -718 -285 390 576 -17 -262 -538 -287 163 185
5097 185 445 309 51 -422 -239 389 338 630 250 -43 56 83 325 346 733 297 31 -78 334 717 569
5118 569 426 405 -23 73 440 671 926 606 295 -81 155 562 904 998 634 131 37 15 691 736 586 240
5140 240 330 183 623 825 1078 1000 305 126 67 746 424 804 609 515 339 456 311 691 479 449 427 -73
5162 -73 189 276 618 814 105 -55 120 61 636 1092 338 -40 -66 -342 432 349 690 323 -170 -382 56 66
5184 66 336 266 -146 -28 -144 -408 216 117 -10 -199 -411 -559 -116 226 280 176 -369 -324 -531 -98 248 107
5206 107 139 -256 -538 -243 -100 211 162 -50 -302 -529 -156 -76 100 302 -357 -459 -647 -231 60 235 46
$$ packed form
5056c07L13j43o5k13l16L64l7O63k6o83k11j50L18M19K24P6o09k39K85k55M27
5077a65K84j95k13n41M76J84N70j29o66J44m67M33O75J86n93k45k76K51M50K2
5097A85K60j36k58m73J83O28n1K92l80k93R9K7K42K1L87m36k66j09M12L83j48
5118E69j43k1m28R6L67K31K55l20l11l76K36M07L42R4l64n03r4k2O76M5j50l46
5140B40R0j47M40K02K53p8o95j79n9O79l22L80j95r4j76J17j45L80k12l0k2n00
5162g3K62Q7L42J96p09j60J75n9N75M56p54l78k6k76P74q3L41l67m93k12M38J0
5184F6K70p0m12J18j16k64O24r9j27j89k12j48M43L42N4j04n45M5k07M33L46j41
5206A07L2l95k82K95J43L11m9k12k52k27L73Q0J76K02o59j02j88M16K91J75j89
$$ plain form
5227 46 -453 -443 -446 -127 68 -88 -46 -396 -277 -539 87 65 -35 -367 -622 -561 -253 96 197 -22 -156 -389
5249 -389 -398 -276 310 224 -40 -353 -493 -180 51 505 119 36 -276 -260 -367 -14 402 277 -109 -557 -324 69
5271 69 208 593 411 -489 -510 -198 172 248 561 -108 -151 -418 -236 248 126 218 -143 -451 -220 96 359 512
5293 512 163 -435 -421 -325 269 530 630 134 -452 -442 -93 219 237 73 41 -318 -365 14 385 528 431 -423
5315 -423 -663 -369 267 275 359 271 -227 -406 -426 190 442 232 136 -241 -158 -156 368 239 506 -162 -147 -272 123
5338 123 390 224 222 -223 -681 -196 34 307 351 148 -298 -512 -103 234 611 126 21 -185 -348 13 511
5359 511 473 24 -161 -252 -16 375 649 412 186 -340 -114 146 348 566 609 -23 -464 -209 151 117 489
5380 489 361 -27 -235 -307 -66 731 280 96 -170 -61 -59 229 511 273 -84 -214 -486 -173 25 249 109
$$ packed form
5227D6m99J0lL19J95j56M2l50J19k62O26k2j00l32k55O1L08L49J01k19j34k33
5249c89rJ22N86q6k64l13j40L13K31M54l86q3l12J6j07L53M16j25l86m48K33L93
5271F9J39L85j82r00k1L12L70P6L13o69m3k67J82M84j22R2l61l08K31L16K63J53
5293E12l49n98J4R6N94K61J00m96n86J0L49L12J8j64l2l59m7L79L71J43r7q54
5315d23k40K94O36QQ4q8m98j79k0O16K52k10r6l77Q3KN24j29K67o68J5j25L95
5338A23K67j66km45m58M85K30K73M4k03m46k14M09L37L77m85j05k06j63L61M98
5359E11l8m49j85r1K36L91K74k37k26n26K26K60K02K18M3o32m41K55L60l4L72
5380D89j28l88k08p2K41P97m51j84k66J09KK88K82k38l57j30k72L13J98K24j40
$$ plain form
5401 109 -90 -476 -327 51 207 462 94 -381 -271 -155 55 524 278 215 -509 -568 -67 -239 141 13 -361
5422 -361 -506 -512 -130 -210 290 43 -381 -572 -626 -157 129 346 -31 -683 -667 -173 -112 -101 -162 -614 -474 -394 -509
5445 -509 -137 -252 0 -305 -568 -454 -211 138 128 -126 -292 -660 -568 98 223 -53 -216 -394 -398 -146 158
5466 158 247 -7 -369 -721 -434 -14 181 202 -81 -379 -410 -426 283 220 199 -26 -421 -400 -221 -295 168 240 438
5489 438 -325 -441 219 395 368 217 -141 -61 -253 246 502 603 94 125 -224 175 361 572 576 75 -39 -270
5511 -270 82 789 699 401 116 146 32 137 379 634 707 159 143 190 106 250 582 783 106 2 127 316
5533 316 465 721 320 31 289 330 295 752 392 209 114 133 307 693 729 233 -99 -163 46 209 619 745
5555 745 412 -194 -84 -108 16 497 575 -112 -241 -257 -37 -4 348 236 -165 -300 -45 24 333 49 -11 90
$$ packed form
5401A09j99l86J49L78J56K55l68m75J10J16K10M69k46o3p24n9N01j72L80j28l74
5422c61j45oL82q0N00k47m24j91n4M69K86K17l77o52J6M94O1J1o1m52J40Q0j15
5445e09L72j15K52l05k63J14K43L49j0k54j66l68R2O66J25k76j63j78mK52L04
5466A58Q9k54l62l52K87M20J95K1k83k98l1j6P09o3k1k25l95K1J79p4M63P2J98
5489D38p63j16O60J76k7j51l58Q0j92M99K56J01n09L1l49L99J86K11Mn01j14k31
5511b70L52P07r0k98k85L0j14J05K42K55P3n48j6M7q4J44L32K01o77j04J25J89
5533C16J49K56m01k89K58M1l5M57l60j83r5J9J74L86L6m96l32o4K09J63M10J26
5555G45l33o06J10k4J24M81P8o87j29j6K20L3L52j12m01j35K55O9L09k84o0J01
$$ plain form
5577 90 -502 -161 -209 360 277 -276 -167 -350 -223 -222 272 -122 -379 -773 -372 -70 214 135 -64 -417 -319 -180
5599 -180 10 85 -85 -180 -122 -576 -389 -196 16 169 -208 -537 -492 304 -419 301 -152 268 -787 -725 205
5620 205 452 342 45 -754 -472 376 -580 -408 -247 -76 -364 -785 -194 -95 129 -39 120 -241 -375 -269
5640 -269 233 80 201 89 -381 -452 -116 107 229 81 -163 -363 -248 -2 263 -73 -99 -222 -295 325 192
5661 192 445 -50 -152 -157 -239 -93 85 404 274 -138 -270 -92 297 511 438 14 -262 -488 -280 121 205 402
5683 402 -95 -125 -178 41 359 513 175 -35 -300 -274 285 405 747 10 -63 -452 11 255 374 202 -31
5704 -31 -296 -114 -105 448 725 367 9 -156 -203 147 497 296 -63 -122 -354 141 -142 328 307 126 -136 -7
5726 -7 111 490 575 102 -130 -298 280 166 181 396 235 -245 -10 -34 31 629 624 133 -505 145 98 101 504 258
$$ packed form
5577I0n92L41m8N69q3n53J09j83J27JM94l94k57l94M01L02K84p9j99l53R8J39
5599a80J90P5j70r5N8m54J87J93K12J53l77l29M5P96p23P20m53M20j055O2R30
5620B05K47j10k97p99K82Q48r56J72J61J71k88m21N91R9K24j68J59l61j34J06
5640b69N02j53J21j12m70p1L36K23J22j48k44k00J15K46K65l36k6j23p3O20j33
5661A92K53m95j02nq2J46J78L19j30m12j32J78L89K14p3m24k76k26K08M01Q4J97
5683D02m97l0n3K19L18J54l38k10k65K6N59J20L42p37p3l89M63K44J19j72k33
5704c1k65J82RN53K77l58l58j65m7L50L50k01l59n9k32M95k83M70k1j81k62J29
5726gJ18L79Q5m73k32j68N78j14J5K15j61m80K35k4O5N98nm91o38O50m7LM03k46
$$ plain form
5750 258 207 -78 -19 121 548 247 381 -113 -266 -92 482 435 624 32 -166 -326 133 204 276 270 -201 -186 -213
5773 -213 40 238 418 368 -190 -108 116 61 476 353 432 -95 -414 -138 38 638 433 -123 -230 -294 -8 -69
5795 -69 319 303 -390 -371 -455 126 240 31 -4 -142 -444 -455 92 -44 451 -47 -245 -509 -571 -66 -229 -123
5817 -123 76 124 -300 -408 59 59 -9 -578 -842 -423 -327 -99 -127 -552 -488 -490 -338 -826 -80 -183 -920 -1082 -446
5840 -446 -199 -62 84 -167 -120 -626 -711 -658 98 -139 -107 -289 -730 -275 -112 -76 44 -442 -425 -346 -316 -113 42
5863 42 -259 -11 -491 -593 -139 183 -40 -308 52 -296 -356 -199 152 320 25 -291 -376 -27 214 -157 353
5884 353 114 -132 -393 -117 32 159 247 -113 -120 -130 -125 200 269 329 -288 -120 37 281 479 444 318 158 -88
5907 -88 -67 220 618 562 192 -70 3 52 356 384 433 47 84 197 486 495 356 321 246 36 -186 568 401 621
$$ packed form
5750B58n1k85N9J40M27l01J34m94j53J74N74m7J89n92j98j60M59P1P2om71J5k7
5773b13K53J98J80n0n58Q2K24n5M15j23P9n27l19K76J76O00k05n56j07o4K86o1
5795f9L88j6o93J9q4N81J14k09l5j38l02j1N47j36M95m98j98k64o2N05j63J06
5817a23J99M8m24j08M67%o8n69k64M19R6K28k8m25O4kJ52m88P46j03p37j62O36
5840d46K47J37J46k51M7n06q5N3P56k37L2j82m41M55J63L6J20m86J7P9L0K03J55
5863D2l01K48m80j02M54L22k23k68L60l48o0J57L51J68k95l16q5L49K41l71N10
5884C53k39k46k61K76J49J27Q8l60pj0NL25O9O0o17J68J57K44J98l5j26j60k46
5907h8K1K87L98n6l70k62P3M9L04K8M9l86L7J13K89Rj39l5p5k10k22P54j67K20
$$ plain form
5931 621 447 -45 14 158 397 562 387 198 36 -192 -131 723 356 183 104 -2 48 466 169 259 146 -236
5953 -236 -257 175 184 353 194 -129 -22 -231 63 251 433 -39 -164 -262 -207 80 315 430 -88 -99 -196 -10
5975 -10 29 547 284 100 -228 -220 -213 172 227 192 -184 -226 -233 -239 232 389 -70 21 -188 -476 65 368 402 -274 -402
6000 -402 -606 -304 99 276 445 119 -242 -297 -259 263 -64 11 -134 -292 -299 -197 51 92 360 -92 -311 -508
6022 -508 -28 -10 237 -366 -562 -459 371 85 126 784 -128 195 -1047 -1497 472 564 -229 -703 -599 -30
6042 -30 -67 28 111 -181 -361 -545 -403 -32 95 95 61 -317 -337 -17 -263 189 24 -197 -679 -1187 -241 51 -48
6065 -48 82 -226 -521 -262 334 198 -386 103 -685 -347 -241 40 163 53 -54 -395 -284 -233 299 -123 248
6086 248 -165 -513 -453 285 370 8 -310 -518 41 -407 -8 191 -126 15 -273 -180 -156 81 142 -28 -20 -205
$$ packed form
5931F21j74m92N9J44K39J65j75j89j62k28O1Q54l67j73p9j06N0M18k97R0j13l82
5953b36k1M32RJ69j59l23J07k09K94J88J82m72j25r8N5K87K35J15n18j1r7J86
5975a0L9N18k63j84l28QPL85N5l5l76m2poM71J57m59R1k09k88N41L03L4o76j28
6000d02k04L02M03J77J69l26l61n5L8N22l27P5j45j58pJ02K48M1K68m52k19j97
6022e08M80J8K47o03j96J03Q30k86M1O58r12L23j242m50J969R2p93m74J04N69
6042c0l7R5Q3k92j80j84J42L71J27%l4l78k0L20k46M52j65k21m82n08R46K92r9
6065d8J30l08k95K59N96j36n84M89p88L38J06K81J23j10j07l41J11N1N32m22L71
6086B48m13l48O0P38Q5l62l18k08N59m48L99J99l17J41k88R3K4K37O1j70Qj85
$$ plain form
6108 -205 -460 315 106 102 43 -218 -126 -245 242 310 -51 17 -232 -203 -69 231 455 254 45 -213 -369 234
6130 234 277 230 177 -334 -297 -265 -16 468 296 335 -193 -394 -154 8 226 7 -178 -204 -77 152 223 344 167
6153 167 -1 -246 -137 312 325 321 105 -77 110 -188 76 634 345 195 -212 55 -105 -16 510 33 42 114
6175 114 -56 246 301 312 456 103 -196 74 180 265 200 39 246 36 -44 502 312 172 266 -124 -347 183
6197 183 133 270 222 -222 -186 -178 106 588 366 81 -88 -182 99 55 381 134 -170 -337 -147 -118 24 -44 -367
6220 -367 -142 -317 -479 -114 -203 -18 -44 -32 -344 -235 63 172 -283 -19 -326 -256 -73 38 161 91 -75 -320
6242 -320 -298 51 62 102 54 -163 -225 -245 -84 89 212 -270 -266 -300 -484 -77 6 105 -5 -420 -401 -38 78 209
6266 209 363 -94 -426 -272 -129 116 -112 162 -303 -262 -235 90 11 108 -207 -31 -225 -141 109 241 179 184 -77
$$ packed form
6108b05k55P75k09mn9k61R2j19M87O8l61O8k49K9J34L00K24k01k09k58j56O03
6130B34M3m7n3n11L7L2K49M84j72L9n28k01K40J62K18k19j85k6J27K29P1J21j77
6153A67j68k45J09M49J3mk16j82J87k98K64N58k89j50m07K67j60Q9N26m77RP2
6175A14j70L02N5J1J44l53k99K70J06Q5o5j61K07k10q0N46j90j40R4l90k23N30
6197A83n0J37m8m44L6QK84M82k22k85j69r4K81m4L26k47l04j67J90K9J42o8l23
6220c67K25j75j62L65q9J85k6J2l12J09K98J09m55K64l07P0J83J11J23p0j66k45
6242c20K2L49J1M0m8k17o2k0J61J73J23m82Ml4j84M07Q3R9j10m15J9L63J16J31
6266B09J54m57l32J54J43K45k28K74m65M1K7L25p9R7l15J76j94Q4K50J32o2Nk61
$$ plain form
6289 -77 -365 -112 46 233 -87 -194 -251 224 175 93 274 308 62 -93 -202 95 242 351 -281 122 -369 75
6311 75 247 325 190 182 -32 -295 -188 73 233 305 28 -96 -109 31 175 53 39 -292 -241 14 39 23 177
6334 177 -80 -20 -119 73 166 131 204 -441 -263 13 -8 354 312 151 -375 -349 -178 -160 -11 198 73 -412 -311
6357 -311 -305 236 123 127 -90 -449 -16 -112 5 320 62 -161 -147 -242 -65 127 -40 -95 98 -354 -283 205 293
6380 293 4 79 -338 -34 67 279 36 102 -438 -278 -36 24 209 -187 -75 -366 -144 -263 133 193 242 -233
6402 -233 89 -398 -28 174 213 293 122 -485 7 176 163 343 68 130 -180 -122 15 230 69 244 -185 5
6424 5 12 231 58 330 -41 -288 432 -20 168 678 472 177 -123 -226 196 157 129 -77 -29 -132 -116 201 177
6447 177 294 262 -356 -88 122 442 445 142 -13 -81 -84 -44 417 372 439 -23 47 -356 25 241 -55 207 -194
$$ packed form
6289g7k88K53J58J87l20j07n7M75m9q2J81L4k46j55j09K97J47J09o32M03m91M44
6311G5J72P8j35qk14k63J07K61J60P2k77j24j3J40J44j22j4l31N1K55K5j6J54
6334A77k57O0r9J92R3l5P3o45J78K76k1L62m2j61n26K6J71J8J49K09j25m85J01
6357c11ON41j13Mk17l59M33r6J17L15k58k23J4r5J77J92j67n5J93m52P1M88Q8
6380B93k89P5m17L04J01K12k43O6n40J60K42O0J85l96J12k91K22j19L96O0M9m75
6402b33L22m87L70K02L9Q0j71o07M92J69j3J80k75O2l10N8J37K15j61J75m29J90
6424EPK19j73K72l71k47P20m52J88N10k06k95l00j03M22l9k8k06M8j03J6L17k4
6447A77J17l2o18K68K10L20Ll03j55o8lM0M61m5O7m62P0m03L81K16k96K62m01
$$ plain form
6470 -194 -199 -104 7 408 137 -177 -457 -283 -56 67 240 -37 13 98 -342 20 170 87 112 -22 -330 -205
6492 -205 -109 160 -85 -57 -366 -294 -144 -164 151 -33 -14 -239 -135 -23 308 130 -76 -230 -44 178 138 183
6514 183 -5 -11 15 -133 -297 -29 19 82 -333 142 -272 -128 399 286 -53 72 -154 -292 151 203 75 174
6536 174 -209 -201 -65 105 420 214 -53 -189 -244 -68 -36 61 207 -33 -191 -40 -69 -247 37 139 -215 -237
6558 -237 -133 149 122 247 33 79 -175 77 522 558 247 -76 -173 -140 204 61 250 252 -83 -128 -96 249 221
6581 221 195 -35 37 -189 -380 160 305 134 73 -224 -473 -367 52 220 80 -162 -283 -452 -69 -16 -5 -80
6603 -80 -188 -311 -260 -147 -146 329 -194 -290 -370 -195 -70 492 9 -234 -592 -170 -320 8 -69 -75 -323 -416 -533
6626 -533 -199 290 279 -62 -396 -57 -42 -37 61 -1 -51 -41 -337 -163 -272 392 38 -181 -367 -162 -290 12 175
$$ packed form
6470a94nR5J11M01k71l14k80J74K27J23J73k77N0Q5m40L62J50q3K5j34l08J25
6492b05R6K69k45K8l09P2J50k0L15j84J9k25J04J12L31j78k06j54J86K22m0M5
6514A83j88oK6j48j64K68M8O3m15M75m14J44N27j13l39J25k26j38M43N2j28R9
6536A74l83QJ36J70L15k06k67j36n5J76L2R7J46k40j58J51k9j78K84J02l54k2
6558b37J04K82k7J25k14M6k54K52M45L6l11l23r7L3L44j43J89Kl35m5L2L45k8
6581B21k6k30P2k26j91N40J45j71o1k97k49J06M19J68j40k42j21j69L83N3J1p5
6603h0j08j23N1J13JM75n23r6q0J75J25N62m83k43l58M22j50L28p7ok48r3j17
6626e33L34M89j1l41l34L39J5NR8o2n0J0k96J74j09O64l54k19j86K05j28L02J63
$$ plain form
6649 175 47 -532 -254 -165 15 111 368 43 -652 -13 -408 -60 196 292 87 -280 -216 -40 29 -14 -36 -57 -165
6672 -165 -54 -193 115 48 20 -219 -53 -143 195 273 140 3 234 -155 73 -101 117 272 -328 428 -238
6693 -238 -78 -66 375 195 75 627 -139 309 -254 -146 346 -168 -42 -55 408 361 263 -175 -61 -263 -4
6714 -4 197 -21 19 -185 -154 -77 14 161 244 150 -298 -102 -115 -116 297 45 247 -124 -244 -189 -48 -245 188 55
6738 55 -296 -513 106 180 127 -18 -121 -186 155 284 225 -177 -339 -272 -230 -39 100 212 193 -35 -82 -147 124
6761 124 32 103 63 -40 -114 41 23 214 295 -12 -296 -91 -227 -9 214 26 -77 -50 -171 -328 290 152
6783 152 376 -57 -145 -39 211 339 97 108 168 239 -120 -136 241 76 317 -187 -173 -24 321 41 192 270
6805 270 193 149 -149 239 452 364 45 -427 -6 281 280 238 260 -98 -272 359 246 466 234 -28 -165 -262 52
$$ packed form
6649A75j28n79K78Q9J80R6K57l25o95O39l95L48K56R6k05l67O4J76O9m3k2k1j08
6672a65J11j39L08o7k8k39J66r0L38P8j33j37K31l89K28j74K18J55o00P56o66
6693b38J60J2M41j80j20N52p66M48n63J08M92n14J26j3M63m7r8m38J14k02K59
6714dK01k18M0k04L1P7R1J47Q3r4m48J96j3jM13k52K02l71j20N5J41j97M33j33
6738E5l51k17O19P4n3j45j03o5L41J29n9m02j62O7M2J91J39J12j9k28m7o5K71
6761A24r2P1m0j03p4J55j8J91Q1l07k84K05j36K18K23j88j03K7j21j57O18j38
6783A52K24m33q8J06K50J28k42J1O0P1l59j6L77j65K41n04J4J49L45k80J51P8
6805B70p7m4k98L88K13q8l19m72M21K87jm2K2l58j74O31j13K20k32k62j37r7L14
$$ plain form
6828 52 508 504 -2 2 -91 -60 -127 317 244 197 -198 20 54 -30 29 -3 -49 -218 -407 36 109 38 -74 -166 -261 -111
6854 -111 -53 98 262 -301 -341 -386 -20 17 141 27 -37 -213 -185 -136 -13 -39 128 14 -347 -503 -138 -149 192
6877 192 168 -94 208 -376 -85 108 324 -125 -100 -264 -230 -113 135 177 -66 -26 -288 -184 -56 113 -288 12
6899 12 -113 -331 -126 -101 206 120 -136 -208 -385 -212 94 -87 9 3 -238 -281 62 155 -107 320 46 -202 -16
6922 -16 147 26 298 3 -343 251 -40 272 181 -37 -124 -19 -70 70 -133 283 40 -146 123 -156 148
6943 148 24 -84 -59 -130 369 301 242 269 103 140 -214 -53 99 419 139 -25 -28 -108 19 17 261 269 28 -147
6967 -147 -70 158 270 -104 -34 -64 139 -64 229 357 360 176 15 -311 56 -135 151 118 -136 -122 -144 -117 158
6990 158 -33 42 105 -209 113 -114 -99 70 -51 165 -114 -223 -52 -25 -21 30 -317 -36 -125 210 151 -61 -84
$$ packed form
6828E2M56mn06Mr3L1o7M44p3m7l95K18L4q4N9l2m6j69j89M43P3p1j12r2r5J50
6854a11N8J51J64n63m0m5L66L7J24j14o4j76K8M9J23k6J67j14l61j56L65j1L41
6877A92k4k62L02n84K91J93K16m49K5j64L4J17K48M2k43M0k62J04J28J69m01L00
6899A2j25k18K05K5L07q6k56p2j77J73L06j81R6ok41m3L43R3k62M27k74k48J86
6922a6J63j21K72k95l46N94k91L12r1k18q7J05n1J40k03M16k43j86K69k79L04
6943A48j24j08K5p1M99o8n9K7j66L7l54J61J52L20k80j64lq0J27kK44Qk41j75
6967a47P7K28J12l74P0l0K03k03K93J28Lj84j61l26L67j91K86l3k54J4k2K7K75
6990A58j91P5O3l14L22k27J5J69j21K16k79j09J71K7MN1l47K81q9L35n9k12k3
$$ plain form
7013 -84 -482 -219 -210 170 255 200 -69 -142 -220 -29 145 332 -303 -124 -89 -226 -11 -155 -222 -193 -262 -226 -221 294 142
7038 142 -23 94 -196 -207 -34 280 228 241 -96 -251 38 18 171 272 164 71 192 81 84 221 180 314 137
7061 137 81 -21 87 212 172 -106 -184 -69 58 422 156 260 -47 -162 -95 -49 253 -69 -84 -118 -57 -72 -39
7084 -39 162 274 -107 -184 22 -109 502 157 139 -161 -105 64 174 202 264 53 -63 -219 -168 125 247 368
7106 368 -120 -52 -255 -262 149 39 -16 -376 -255 -79 -94 118 231 176 -332 59 -256 16 356 266 -145 -464
7128 -464 -260 -1 -432 -28 -131 -182 -281 -401 313 52 52 38 -373 -476 -190 24 229 -88 78 -259 -405 7
7150 7 340 278 53 -21 -134 -209 -328 98 -27 -166 -83 -378 -422 32 193 151 -137 -99 -219 -111 -63 -47 187 -131
7174 -131 -56 144 12 158 240 283 -152 -9 -88 -127 204 89 144 -217 -412 -80 41 144 56 -112 -275 154
$$ packed form
7013h4l98K63RL80Q5n5k69p3p8J91J74J87o35J79L5j37K15j44o7K9o9L6NN15j52
7038A42j65J17k90j1J73L14n2J3l37j55K89k0J53J01j08r3J21j11LJ37m1J34j77
7061A37n6j02J08J25m0k78p8J15J27L64k66J04l07j15O7M6L02l22j5l4O1j5L3
7084c9K01J12l81p7K06j31O11l45j8l00N6J69J10K8O2k11j16j56N1K93J22J21
7106C68m88O8k03pM11j10n5l60J21J76j5K12J13n5n08L91l15K72L40r0m11l19
7128d64K04K59m31M04j03n1r9j20P14k61%j4m11j03K86K14K05l17J66l37j46M12
7150GL33o2k25p4j13p5j19M26j25j39Q3k95m4M54J61m2k88L8j20J08M8J6K34l18
7174a31P5K00j32J46Q2M3m35J43p9l9L31j15N5l61j95L32J21J03q8j68j63M29
$$ plain form
7196 154 53 -208 33 246 -263 0 4 260 93 -24 89 -54 -103 40 18 351 350 207 -42 -280 -111 89
7218 89 354 -69 46 -150 18 -370 58 112 26 25 -459 -141 282 127 276 178 -36 -186 61 -103 146 133
7240 133 137 -99 -85 224 -49 65 240 -32 -173 -309 -190 189 42 232 11 -227 -23 -45 -19 -127 175 -2
7262 -2 44 -273 -166 117 26 -73 -264 244 -127 106 79 -152 -170 -231 -287 -179 -64 396 -70 -260 -347 -213 -107
7285 -107 220 173 95 43 77 -82 72 -253 183 -89 -291 -475 107 245 182 133 187 -135 -97 24 122 270 -288
7308 -288 70 -83 -507 -25 172 246 109 52 11 254 71 -197 -94 -174 -246 31 52 380 416 32 51 37 139
7331 139 -82 172 100 69 177 -106 -187 419 -60 189 -171 -226 62 99 15 -30 79 -236 65 157 -30 -6 -86
7354 -86 261 218 -352 -1 -84 -315 135 -139 98 58 -45 -44 301 17 106 -499 93 76 -222 31 -254 -28 -86
$$ packed form
7196A54j01k61K41K13n09K63MK56j67j17J13j43m9J43k2L33jj43k49k38J69K00
7218H9K65m23J15j96J68l88M28N4q6jm84L18M23j55J49r8k14j50K47j64K49j3
7240A33Mk36J4L09k73J14J75k72j41j36J19L79j47J90k21k38K04k2K6j08L02j77
7262bM6l17J07K83r1r9j91N08l71K33k7k31j8o1n6J08J15M60m66j90q7J34J06
7285a07L27m7p8n2L4j59J54l25M36k72k02j84N82J38o3m9N4l22L8J21R8J48n58
7308b88L58j53m24M82J97P4j37n7m1K43j83k68J03q0p2K77K1L28L6l84J9j4J02
7331A39k21K54p2l1J08k83q1O06m79K49l60n5K88L7q4m5J09l15L01R2j87K4q0
7354h6L47m3n70L51q3k31M50k74K37m0j03JL45k84Q9o05N92j7k98K53k85K26n8
$$ plain form
7377 -86 -97 -16 6 188 -209 -171 -139 -311 -135 145 -148 -148 -329 -84 -227 262 -77 391 98 -355 -30 135 -50
7400 -50 127 -41 -48 -41 -33 -33 3 98 -78 -393 -268 -112 -225 29 -142 146 -396 -63 -272 -197 90 21 -128 -301
7424 -301 -66 10 -14 187 -115 147 9 -137 -45 -1 -67 49 -212 48 -196 33 -156 269 35 -230 -9 -37
7446 -37 242 223 -33 -185 -403 4 109 38 46 265 168 -38 327 70 179 166 -114 108 40 12 160 61 136 -174
7470 -174 -286 30 168 229 -34 177 -36 -370 67 6 179 -40 97 -247 147 120 279 156 51 155 -101
7491 -101 -321 75 82 -92 214 -290 141 122 -192 137 81 -207 -11 -161 129 193 333 -47 97 -212 20 101
7513 101 286 371 104 98 -134 -71 134 26 -52 33 -442 -304 -183 341 303 202 -61 -74 -87 -57 255 164 249 55
7537 55 -165 76 40 121 500 170 -83 6 -97 -133 124 36 161 -188 -382 -369 -278 2 100 -84 -67 -168 108
$$ packed form
7377h6j1Q1K2J82l97L8L2j72J76K80k93%j81K45j43M89l39M68k93m53L25J65j85
7400e0J77j68pPQ%L6R5j76l15J25J56j13K54j71K88n42L33k09P5K87o9j49j73
7424c01K35P6k4K01l02K62j38j46R2M4o6J16k61K60k44K29j89M25k34k65K21k8
7446c7K79j9k56j52k18M07J05p1QK19r7k06L65k57J09j3k80K22o8k8J48r9P5l10
7470a74j12L16J38O1k63K11k13l34M37o1J73k19J37l44L94k7J59j23j05J04k56
7491a01k20L96Pj74L06n04M31j9l14L29n6k88J96j50K90O4J40l80J44l09K32Q1
7513A01J85Q5k67ok32O3K05j08p8Q5m75J38J21N24l8j01k63j3j3L0L12r1Q5j94
7537E5k20K41l6Q1L79l30k53Q9j03l6K57q8J25l49j94J3R1K80R8j84J7j01K76
$$ plain form
7560 108 275 96 -85 -35 -86 -399 -135 274 -21 310 59 3 -87 96 307 139 -82 -181 -361 84 35 237
7582 237 -54 -507 -506 -135 166 178 133 -245 120 -12 88 280 79 -65 33 74 -242 81 -63 457 384 -24
7604 -24 134 -312 165 113 147 227 36 -26 24 -103 182 37 221 -16 6 92 10 155 47 136 -48 -12 -133 176
7628 176 127 93 -108 -125 -233 -172 106 351 29 104 -266 -85 -50 -121 94 28 -413 -377 -120 62 427 -50 109
7651 109 -77 -49 -337 8 189 126 -87 -178 39 -25 -49 -107 117 -126 -169 -227 21 26 16 1 18 -142 17 145
7675 145 397 289 273 -209 223 -173 -80 -169 7 -245 -255 -259 286 65 301 -19 55 -343 -25 283 177 152 101
7698 101 314 11 -186 -56 393 295 -10 -18 -126 -234 -30 48 -48 -100 -266 -265 112 266 142 23 69 74 -331 154
7722 154 25 169 47 222 -142 -265 257 150 -55 -87 16 216 267 -111 8 -109 -94 -339 -42 22 0 191
$$ packed form
7560A08J67j79j81N0n1l13K64M09k95L31k51n6r0J83K11j68k21r9j80M45m9K02
7582B37k91m53JL71L01J2m5l78L65j32J00J92k01j44R8M1l16L23j44N20p3m08
7604b4J58m46M77n2L4Q0j91o2N0j27K85j45J84k37K2Q6q2J45j08Q9j84L6j21L09
7628A76m9l4k01j7j08O1K78K45l22P5l70J81L5p1K15o6m41L6K57J82L65m77J59
7651A09j86K8k88L45J81o3k13r1K17o4k4n8K24k43m3n8K48Nj0j5J7j60J59J28
7675A45K52j08j6m82M32l96R3q9J76k52j0mN45k21K36l20P4l98L18L08j06k5n1
7698A01K13l03j97J30M49r8l05qj08j08K04P8r6n2j66JL77J54j24j19M6Nm05M85
7722A54j29J44j22J75l64j23N22j07k05l2J03K00N1l78J19j17J5k45K97O4k2J91
$$ plain form
7744 191 -144 -221 11 41 84 1 -251 -22 -18 -272 4 146 -21 -38 84 -127 -236 71 109 50 339 -372 -349
7767 -349 -59 -160 52 -85 -287 -66 -136 5 -141 92 -182 232 -120 -65 -143 30 -70 -233 -203 40 8 27
7789 27 -96 16 50 -157 -153 -233 -78 64 72 -96 -40 72 96 -64 252 -70 108 -219 -172 -246 295 270 167 91
7813 91 156 44 103 -170 -39 -43 -262 45 34 -74 156 150 90 -231 103 -182 -24 298 -41 -95 -109 -101 101 157 176
7838 176 -73 -159 -82 -170 -16 231 -63 -406 32 119 16 371 -261 204 6 -70 221 37 23 231 -72 -67 -109
7861 -109 160 28 175 321 73 -192 -61 251 -97 106 29 -93 138 134 66 72 451 -130 -255 -61 -92 94
7883 94 -114 313 117 -289 -159 38 20 263 -18 -125 -92 -186 164 59 -7 -76 7 -274 -278 -133 417 144 -124
7906 -124 13 -7 -213 -76 208 30 -34 -285 -27 178 -128 138 64 -108 -287 -238 81 273 -229 -21 94
$$ packed form
7744A91l35p7K32L0M3q3k52K29Mk54K76J42j67j7J22k11j09L07L8n9K89p11K3
7767c49K90j01K12j37k02K21p0J41j46K33k74M14l52N5p8J73j00j63L0K43l2J9
7789B7j23J12L4k07Mq0J55J42Qj68N6J12K4j60L16l22J78l27M7p4N41k5j03p6
7813I1O5j12N9k73J31mk19L07j1j08K30oo0l21L34k85J58L22l39n4j4QK02N6J9
7838A76k49q6P7q8J54K47k94l43M38Q7j03L55o32M65j98p6K91j84j4K08l03Nm2
7861a09K69j32J47J46k48k65J31L12l48K03p7j22K31mo8OL79n81j25J94l1J86
7883I4k08M27j96m06J30J97j8K43k81j07L3r4L50j05o6o9Q3k81mJ45N50k73k68
7906a24J37k0k06J37K84j78o4k51K58K05l06K66p4j72j79M9L19J92n02K08J15
$$ plain form
7927 94 -93 -247 -354 -202 -151 121 -33 -33 -135 192 41 -14 -371 -214 -45 35 30 66 -1 318 -44 -103 -371 46
7951 46 -127 141 46 11 -71 237 319 36 -17 -122 57 66 202 115 173 -66 18 31 98 104 4 -251 35 -186 151
7976 151 235 184 190 163 -114 14 -87 -115 217 72 -124 -130 -62 201 137 291 -144 -225 -131 -152 69 333 92 3 40
8001 40 -91 150 59 421 174 24 -176 102 8 247 286 80 -100 4 -313 -15 211 261 144 142 -56 -177
8023 -177 144 79 52 -88 22 -92 178 83 50 -300 -157 -257 -85 -203 -32 266 119 -81 -54 -51 5 -37 73
8046 73 -128 -156 200 17 149 -318 54 -222 -276 -120 7 -7 -65 1 31 -132 -68 -250 31 -65 74 -116 -190
8069 -190 1 -97 -114 251 196 -298 -65 -169 71 -232 358 9 256 83 -25 319 -4 66 -207 -14 99
8090 99 245 47 146 139 90 69 45 181 -193 189 63 -284 -208 -19 -52 258 113 -149 72 112 27 190 33 -99
$$ packed form
7927I4j87j54j07J52N1K72j54%j02L27j51n5l57J57J69Q0nL6o7L19l62n9k68M17
7951D6j73K68r5l5q2L08Q2k83n3j05J79RJ36q7N8k39Q4J3O7Oj00k55K86k21L37
7976A51Q4n1Ok7k77J28j01k8L32j45j96oO8K63o4J54m35q1R4k1K21K64k41q9L7
8001D0j31K41r1L62k47j50k00K78r4K39L9k06j80J04l17K98K26N0j17kj98j21
8023a77L21o5k7j40J10j14K70r5l3l50J43j00J72j18J71K98j47k00K7LN6m2J10
8046G3k01k8L56j83J32m67L72k76n4J56J27j4n8O6L0j63O4j82K81r6J39j90p4
8069a90J91r8j7L65n5m94K33j04K40l03N90l49K47j73j08L44l23P0k73J93J13
8090I9J46j98R9pm9k1k4J36l74L82j26l47P6J89l3L10j45k62K21M0q5J63j57j32
$$ plain form
8114 -99 -138 -344 -193 176 233 55 -428 47 -371 130 100 290 42 -106 -66 -226 138 70 256 -281 -264 -112
8136 -112 -4 110 278 -166 -326 -214 -273 -347 -79 98 28 -47 104 73 -8 240 186 184 97 -301 -164 -6 52 11
8160 11 -3 -113 64 -72 124 -86 -79 -224 58 -163 -162 23 -227 -27 -268 -364 -28 -23 328 -131 141 23 -27
8183 -27 -47 92 -5 -198 134 -148 150 76
$$ packed form
8114i9l9k06J51L69N7j78m83M75m18N01l0J90k48j48M0j60L64o8J86n37J7J52
8136a12J08J14J68m44j60J12n9p4K68J77p0p5J51l1q1K48n4kq7l98J37J58N8m1
8160A1j4j10J77j36J96k10Pj45K82k21JJ85k50K00k41r6L36NL51m59K72j18n0
8183b7k0J39r7j93L32k82K98p4
8191G6
$$ Imaginary data points
##PAGE= N=2
##DATA TABLE= (X++(I..I)), XYDATA
$$ plain form
0 0 0 0 0 0 0 0 8 -8 8 -16 16 -16 25 -32 40 -48 56 -64 80 -91 108 -124 145 -167 195 -219 253 -285 323
29 323 -365 413 -462 520 -580 647 -722 802 -890 991 -1094 1214 -1344 1487 -1647 1825 -2022
46 -2022 2249 -2508 2802 -3146 3552 -4039 4640 -5396 6393 -7760 9768 -13031 19236 -35391
60 -35391 168540 391839 201780 114166 85480 204235 322432 402492 338173 206885 97598
71 97598 131412 254474 380752 398395 309947 167765 101986 161532 303027 392122 367971
82 367971 247166 130256 101815 193153 323792 381902 311889 180365 90833 109954 215203
93 215203 320972 333176 237896 112280 60379 114004 223773 295704 269149 156741 48684
104 48684 33504 116403 216804 246923 182503 71411 -3153 17135 110846 190769 182654 92151
$$ packed form
0@%%%%%%Qj6J6k4L2l2M1n7P2q8J04j20J44j71J99k32K69l12L62m14M72n38O08
29C23o88P78q75R82j100J227j369J524j692J881k085K308k558K831l134L472l847
46b022M271m757N310n948O698p591Q679j0036J1789j4153J7528k2799L2267n4627
60c5391K03931K23299j90059q7614k8686J18755J18197Q0060o4319j31288j09287
71I7598L3814J23062J26278J7643q8448j42182o5779N9546J41495Q9095k4151
82C67971j20805j16910k8441R1338J30639N8110p0013j31524q9532J9121J05249
93B15203J05769J2204r5280j25616n1901N3625J09769P1931k6555j12408j08057
104D8684j5180Q2899J00401L0119o4420j11092p4564K0288R3711P9923q115r0503
$$ plain form
116 92151 -7728 -43803 6162 96031 145023 103924 3471 -75177 -72998 -1018 74857 87446
128 87446 19952 -75560 -122645 -88723 -9605 42795 20569 -61363 -138577 -150387 -92846 -20221
140 -20221 2522 -46214 -129073 -180439 -160314 -90376 -35010 -42917 -109712 -181461 -201301 -154891
152 -154891 -84940 -53930 -89753 -162594 -212560 -201224 -140509 -82923 -79198 -133466 -200096 -223767
164 -223767 -186155 -120432 -83413 -105785 -169189 -219761 -214910 -159238 -100632 -87863 -130743 -192326
176 -192326 -220033 -189212 -125298 -82108 -94306 -150123 -199965 -201175 -151776 -90626 -67564 -101184
188 -101184 -160298 -191346 -166675 -105397 -56917 -58118 -106523 -159053 -167608 -121542 -58095 -28812
200 -28812 -54136 -108749 -144420 -128968 -70740 -15206 -8555 -51846 -104845 -119116 -81318 -19887
$$ packed form
116I2151r9879l6075M9965Q9869M8992m1099j00453p8648K179P1980P5875J2589
128H7446o7494r5512m7085L3922P9118N2400k2226q1932p7214j1810N7541P2625
140b0221K2743m8736q2859n1366K0125O9938N5366p907o6795p1749j9840M6410
152a54891O9951L1010l5823p2841m9966J1336O0715N7586L725n4268o6630k3671
164b23767L7612O5723L7019k2372o3404n0572M851N5672N8606J2769m2880o1583
176a92326k7707L0821O3914M3190j2198n5817m9842j210M9399O1150K3062l3620
188a01184n9114l1048K4671O1278M8480j201m8405n2530q555M6066O3447K9283
200b8812k5324n4613l5671J5452N8228N5534O651m3291n2999j4271L7798O1431
$$ plain form
212 -19887 17908 2748 -50424 -92284 -83738 -29567 26649 41964 6658 -46852 -70279 -40924
224 -40924 20354 62929 54824 6393 -38596 -39369 6754 64578 87550 58448 5457 -24061 -3128
237 -3128 52260 98698 98983 55684 7019 -3079 35978 92282 119978 98823 48124 11598 21774
250 21774 73046 122409 128479 88934 39154 21102 50223 104496 138879 124309 73439 31219
262 31219 33955 78754 127779 141948 108281 54963 27776 50280 103127 140390 131798 83836
274 83836 36935 29286 68154 119867 140519 111148 56507 22285 36188 85282 127959 127010 81736
287 81736 29337 13708 45870 97612 124538 102062 47943 5907 10794 56898 103086 109168
299 109168 68586 13906 -11066 13836 65431 97995 83011 30795 -15786 -19934 20013 68900
$$ packed form
212a9887L7795j5160n3172m1860Q546N4171N6216J5315l5306n3510k3427K9355
224d0924O1278M2575q105m8431m4989p73M6123N7824K2972k9102n2991k9518K0933
237c128N5388M6438K85m3299m8665j0098L9057N6304K7696k1155n0699l6526J0176
250B1774N1272M9363O070l9545m9780j8052K9121N4273L4383j4570n0870m2220
262C1219K736M4799M9025J4169l3667n3318k7187K2504N2847L7263q592m7962
274H3836m6901p649L8868N1713K0652k9371n4641l4222J3903M9094M2677r49m5274
287H1736n2399j5629L2162N1742K6926k2476n4119m2036M887M6104M6188O082
299A09168m0582n4680k4972K4902N1595L2564j4984n2216m6581m148L9947M8887
$$ plain form
311 68900 83721 49477 -6421 -38650 -21651 27634 66271 59591 11469 -39588 -52355 -17747
323 -17747 32927 55743 28795 -26258 -65079 -56859 -10214 33889 36990 -5728 -60065 -81187
335 -81187 -52944 -897 29394 12057 -40770 -85776 -86872 -44127 6154 18353 -17786 -73462
347 -73462 -102709 -82645 -30358 8998 933 -48383 -98734 -108433 -69492 -16769 6006 -21366
359 -21366 -76628 -113782 -102068 -51395 -4866 -2534 -45822 -99253 -117758 -86023 -30334 1463
371 1463 -16519 -69360 -112311 -109250 -63064 -11395 1828 -33724 -87876 -114328 -90825 -36788
383 -36788 3479 -3262 -51464 -99052 -105067 -64617 -10703 11878 -13793 -66448 -99984 -85572
395 -85572 -33963 11698 14465 -26621 -75471 -90643 -58447 -3945 27272 10894 -38285 -77477
$$ packed form
311F8900J4821l4244n5898l2229J6999M9285L8637o680m8122n1057j2767L4608
323a7747N0674K2816k6948n5053l8821Q220M6645M4103L101m2718n4337k1122
335h1187K8243N2047L0291j7337n2827m5006j096M2745N0281J2199l6139n5676
347g3462k9247K0064N2287L9356q065m9316n0351r699L8941N2723K2775k7372
359b1366n5262l7154J1714N0673M6529K332m3288n3431j8505L1735N5689L1797
371A463j7982n2841m2951L061M6186N1669J3223l5552n4152k6452K3503N4037
383c6788M0267o741m8202m7588o015M0450N3914K2581k5671n2655l3536J4412
395h5572N1609M5661K767m1086m8850j5172L2196N4502L1217j6378m9179l9192
$$ plain form
407 -77477 -72071 -25980 23239 36059 2815 -46875 -70260 -45911 6243 44612 37620 -6836
419 -6836 -50621 -54415 -14901 36348 57909 32607 -16336 -46917 -32132 17313 60141 62211 23022
432 23022 -22837 -36153 -4610 46327 75174 58646 11890 -24699 -19109 24533 70104 81013
444 81013 48319 1442 -19893 2856 51581 85278 77158 34780 -5574 -9497 26644 72886
456 72886 90543 65653 20063 -8154 5391 48769 85898 85957 48979 7272 -4866 22597 66978
469 66978 90305 73624 30582 -2140 2784 39905 77663 84878 55139 12584 -6809 12648
481 12648 53481 80975 71351 32929 -2462 -6407 24110 62518 76051 51578 11047 -13625
493 -13625 -2027 34579 64904 62281 28390 -9199 -19191 5206 42093 60120 42707 3969
$$ packed form
407g7477N406M6091M9219J2820l3244m9690k3385K4349N2154L8369o992m4456
419f836m3785l794L9514N1249K1561k5302m8943l0581J4785M9445M2828K070l9189
432B3022m5859j3316L1543N0937K8847j6528m6756l6589N590M3642M5571J0909
444H1013l2694m6877k1335K2749M8725L3697q120m2378m0354l923L6141M6242
456G2886J7657k4890m5590k8217J3545M3378L7129N9l6978m1707j2138K7463M4381
469F6978K3327j6681m3042l2722M924L7121L7758P215k9739m2555j9393J9457
481A2648M0833K7494r624l8422l5391l945L0517L8408J3533k4473m0531k4672
493a3625J1598L6606L0325k623l3891l7589r992K4397L6887J8027j7413l8738
$$ plain form
505 3969 -24787 -19711 12834 44982 48077 18958 -19057 -34383 -16038 19812 41285 29949 -5595
518 -5595 -36453 -37741 -9544 22723 31809 8191 -28814 -48300 -35348 -2168 22157 16760 -14913
531 -14913 -46465 -52507 -28891 3523 16836 -1425 -35701 -57899 -50252 -19894 6580 6214 -20545
544 -20545 -52332 -62082 -42723 -11326 4795 -7283 -38307 -62526 -59620 -31888 -4047 -33 -22308
557 -22308 -52462 -65456 -50347 -20343 -427 -7917 -36530 -61319 -61846 -37601 -8914 -100 -18198
570 -18198 -47410 -63363 -51495 -21957 24 -3263 -28472 -54241 -58420 -36584 -7074 5496
582 5496 -8759 -37344 -55338 -47036 -18670 6151 6794 -15944 -43066 -49945 -30831 -766 15045
595 15045 4498 -23190 -43600 -38606 -11616 14970 19568 -495 -28006 -38790 -22785 7100
$$ packed form
505C969k8756N076L2545L2148L095k9119l8015j5326J8345L5850K1473j1336l5544
518e595l0858j288K8197L2267R086k3618l7005j9486J2952L3180K4325n397l1673
531a4913l1552o042K3616L2414J3313j8261l4276k2198P647L0358K6474l66k6759
544b0545l1787r750J9359L1397J6121j2078l1024k4219K906K7732K7841M014k2275
557b2308l0154j2994J5109L0004J9916p490k8613k4789n27K4245K8687Q814j8098
570a8198k9212j5953J1868K9538K1981l287k5209k5769m179K1836K9510J2570
582E496j4255k8585j7994Q302K8366K4821O43k2738k7122o879J9114L0065J5811
595A5045j0547k7688k0410M994K6990K6586M598k0063k7511j0784J6005K9885
$$ plain form
607 7100 26333 19745 -6535 -28752 -28238 -4167 24063 33352 16373 -11776 -25966 -13709 15243
620 15243 37195 34255 10069 -14871 -18156 2952 32145 44976 30740 3254 -14192 -6270 20813
633 20813 45276 46713 24618 -2308 -10276 7786 37176 53069 43400 15770 -5746 -2426 22658
646 22658 49761 55360 35162 6631 -5943 8012 37400 57577 51533 23706 -1005 -3037 20206
659 20206 49009 59149 42024 11862 -6244 3733 32910 56214 54873 28688 419 -7306 12729
672 12729 43229 57825 43881 13513 -8628 -4262 22495 49883 53094 29572 -1516 -13890
684 -13890 1656 31706 50900 42829 12928 -13955 -15323 9587 38512 46585 27258 -4312 -22550
697 -22550 -12235 17615 40603 37213 9381 -19586 -26701 -6149 23810 37771 22974 -8647
$$ packed form
607G100J9233o588k6280k2217N14K4071K8230R289j6979k8149j4190J2257K8952
620A5243K1952k940k4186k4940l285K1108K9193J2831j4236k7486j7446P922K7083
633B0813K4463J437k2095k6926p968J8062K9390J5893r669k7630k1516L320K5084
646B2658K7103N599k0198k8531j2574J3955K9388K0177o044k7827k4711k032K3243
659B0206K8803J0140j7125l0162j8106R977K9177K3304j341k6185k8269p725K0035
672A2729L0500J4596j3944l0368k2141M366K6757K7388L211k3522l1088j2374
684a3890J5546L0050J9194q071k9901k6883j368K4910K8925Q073j9327l1570j8238
697b2550J0315K9850K2988l390k7832k8967p115K0552K9959J3961j4797l1621
$$ plain form
709 -8647 -31255 -26029 1156 27789 30001 5728 -25367 -37895 -22063 8504 27537 18049 -12083
722 -12083 -38629 -39419 -14613 14723 22900 2660 -29154 -47139 -35801 -5388 17468 14288 -13739
735 -13739 -43062 -49483 -27828 2866 16316 1770 -29818 -52209 -46469 -17442 9420 11757 -12368
748 -12368 -42922 -54873 -37787 -6616 12830 3630 -26463 -51736 -51262 -25717 3363 12058 -6987
761 -6987 -38162 -54921 -42633 -12460 10907 7705 -18262 -45747 -51465 -29820 836 14899 902
774 902 -28903 -48781 -42690 -15081 11311 14833 -7728 -36068 -46099 -29436 78 18265 10808
787 10808 -16432 -39292 -38565 -13902 13182 21595 4591 -23067 -38116 -26890 1610 23244 20889
800 20889 -2993 -27489 -32315 -12236 15788 29060 16396 -10186 -28310 -22052 3154 27158
$$ packed form
709h647k2608N226K7185K6633K212k4273l1095j2528J5832L0567J9033r488l0132
722a2083k6546p90K4806K9336Q177k0240l1814j7985J1338L0413K2856l180k8027
735a3739k9323o421K1655L0694J3450j4546l1588k2391N740K9027K6862K337k4125
748a2368l0554j1951J7086L1171J9446r200l0093k5273M74K5545K9080Q695j9045
761f987l1175j6759J2288L0173K3367l202k5967k7485n718K1645L0656J4063j3997
774I02k9805j9878O091K7609K6392L522k2561k8340j0031J6663K9514J8187p457
787A0808k7240k2860P27K4663K7084Q413j7004k7658j5049J1226K8500K1634k355
800B0889k3882k4496m826K0079K8024J3272j2664k6582j8124O258K5206K4004
$$ plain form
812 27158 29787 9566 -16391 -25367 -9197 17668 34148 26513 1400 -18760 -17782 4324 29212
825 29212 35788 19286 -6217 -18626 -7754 17339 36270 32912 10539 -11471 -14762 3199 28013
838 28013 38280 25713 1996 -14158 -8281 14320 34750 35669 16585 -6062 -13217 776 23774
851 23774 36663 28872 6529 -10938 -9807 9889 30340 34272 19095 -2813 -13230 -3297 17831
864 17831 32436 28028 8025 -10128 -12288 3703 23737 30861 18779 -2465 -14418 -8342 10921
877 10921 26868 25492 8406 -11245 -15715 -2615 16769 26173 17233 -2478 -16784 -13596 4109
890 4109 21094 22266 7283 -11880 -18980 -8430 10726 21654 15421 -3238 -18325 -17897 -1797
903 -1797 15451 19282 6384 -12205 -21348 -13006 5460 17661 14123 -2969 -18546 -20299 -6441
$$ packed form
812B7158K629k0221k5957q976J6170K6865J6480p635k5113k0160R78K2106K4888
825B9212O576j6502k5503j2409J0872K5093J8931l358k2373k2010l291J7961K4814
838B8013J0267j2567k3717j6154N877K2601K0430R19j9084k2647p155J3993K2998
851B3774J2889p791k2343j7467J131J9696K0451L932j5177k1908j0417R933K1128
864A7831J4605m408k0003j8153k160J5991K0034P124j2082k1244j1953O076J9263
877A0921J5947j376j7086j9651m470J3100J9384R404q940j9711j4306L188J7705
890D109J6985J172j4983j9163p100J0550J9156J0928o233j8659j5087M28J6100
903a797J7248L831j2898j8589r143Q342J8466J2201l538j7092j5577j753J3858
$$ plain form
916 -6441 11312 17476 6641 -11357 -21813 -15758 1312 15226 14090 -1347 -17499 -20817 -8992
929 -8992 8293 16340 8319 -8698 -21014 -17018 -1005 13866 14705 1176 -15138 -21094 -10395
942 -10395 6554 16521 10576 -5866 -19450 -17585 -2557 13139 16088 4381 -12461 -20195 -11849
955 -11849 5340 17083 13373 -2376 -17233 -17754 -4082 12754 18330 7677 -9515 -19413 -12687
968 -12687 4276 17724 16017 660 -15208 -18301 -5739 11603 19672 10748 -6639 -18659 -14703
981 -14703 2031 17413 18079 4103 -13463 -19528 -8980 9373 19928 13472 -4118 -18420 -17046
994 -17046 -1429 15405 19294 6668 -11658 -20618 -12177 5933 18803 15552 -1426 -17761 -19823
1007 -19823 -5704 12400 19145 9156 -9610 -21114 -16168 1531 16880 16478 945 -17051 -21988
$$ packed form
916f441J7753O164j0835j7998j0456O055J7070J3914j136j5437j6152l318J1825
929h992J7285Q047q021j7017j2316L996J6013J4871Q39j3529j6314n956J0699
942a0395J6949R967n945j6442j3584J865J5028J5696K949j1707j6842p734Q346
955a1849J7189J1743l710j5749j4857n21J3672J6836N576j0653j7192r898O726
968a2687J6963J3448j707j5357j5868l093J2562J7342Q069q924j7387j2020L956
981a4703J6734J5382O66j3976j7566o065J0548J8353J0555o456j7590j4302J374
994a7046J5617J6834L889j2626j8326q960Q441J8110J2870l251j6978j6335k062
1007a9823J4119J8104O745r989j8766j1504M946J7699J5349m02j5533j7996m937
$$ plain form
1020 -21988 -10293 8292 18284 11186 -7490 -21738 -19945 -2961 13847 17351 3900 -15614 -24278
1033 -24278 -14847 4340 17044 13303 -4745 -21499 -23174 -7790 11017 17553 6787 -13501 -25325
1046 -25325 -19148 143 15828 15101 -1574 -20435 -25357 -12338 7568 18121 9939 -9971 -25028
1059 -25028 -22194 -4235 14175 17022 2465 -17515 -26094 -15881 4292 18183 13175 -5909 -22733
1072 -22733 -23618 -7745 11917 18876 7022 -13091 -25415 -18405 1109 17079 16367 -508 -19354
1085 -19354 -24342 -10675 9448 19882 11888 -8314 -22847 -19791 -1707 16302 19661 5197 -14844
1098 -14844 -22953 -13006 7058 20520 16318 -2336 -19370 -19943 -4621 14928 21715 10290 -9618
1111 -9618 -20994 -14568 4712 20645 19950 3445 -14891 -19562 -6626 13463 23187 15231 -4214
$$ packed form
1020b1988J1695J8585R992p098j8676j4248J793J6984J6808L504j3451j9514q664
1033b4278R431J9187J2704l741j8048j6754j675J5384J8807O536j0766k0288j1824
1046b5325O177J9291J5685p27j6675j8861m922J3019J9906J0553q182j9910j5057
1059b5028K834J7959J8410K847j4557j9980q579J0213K0173J3891n008j9084j6824
1072b2733q85J5873J9662O959j1854k0113j2324P010J9514J5970p12j6875j8846
1085a9354m988J3667K0123J0434p994k0202j4533L056J8084J8009L359j4464k0041
1098a4844q109R947K0064J3462m202j8654j7034n73J5322J9549O787j1425j9908
1111i618j1376O426J9280J5933o95j6505j8336m671J2936K0089R724p956j9445
$$ plain form
1124 -4214 -18065 -15099 2503 19952 22794 8586 -10309 -18097 -8087 11209 23748 19588 1845
1137 1845 -14300 -15236 211 18574 24659 13797 -5061 -15745 -9197 8811 23507 22493 7072
1150 7072 -9780 -14060 -2012 16412 25437 17940 350 -12638 -9963 6159 21712 24311 11532
1163 11532 -5849 -12835 -3619 13514 24743 20671 4738 -9519 -10099 3172 19220 24776 14774
1176 14774 -2083 -11529 -5680 9647 22454 21645 7966 -7219 -10524 216 15999 23366 16259
1189 16259 773 -10355 -7773 6291 19514 21250 9671 -5489 -11238 -3448 11588 20911 16652
1202 16652 2202 -9933 -9973 2071 15466 19112 9888 -5103 -12420 -7248 6631 17084 14902
1215 14902 1918 -10787 -13247 -3117 10363 15607 8181 -5514 -14407 -11259 999 11849 11839
$$ packed form
1124d214j3851K966J7602J7449K842j4208j8895p788J0010J9296J2539m160j7743
1137A845j6145r36J5447J8363O085j0862j8858j0684O548J8008J4696j014j5421
1150G072j6852m280J2048J8424R025p497j7590j2988K675J6122J5553K599j2779
1163A1532j7381o986R216J7133J1229m072j5933j4257n80J3271J6048N556j0002
1176A4774j6857r446N849J5327J2807q09j3679j5185l305J0740J5783P367p107
1189A6259j5486j1128K582J4064J3223J736j1579j5160n749P790J5036R323m259
1202A6652j4450j2135m0J2044J3395L646r224j4991p317N172J3879J0453k182
1215A4902j2984j2705k460J0130J3480N244p426j3695q893L148J2258J0850j0
$$ plain form
1228 11839 446 -12035 -15929 -8066 4772 11477 6321 -6772 -16684 -15482 -4151 6471 8193
1241 8193 -912 -12945 -18821 -12947 -543 6467 3574 -8067 -18277 -19020 -9449 1874 4741 -2734
1255 -2734 -15047 -21417 -16609 -5869 2758 1110 -9487 -20041 -21641 -13077 -1912 2461 -3836 -15512
1269 -15512 -22760 -19251 -8791 351 109 -9210 -19962 -23153 -15261 -3756 1662 -3397 -14330 -22531
1283 -22531 -20161 -9626 -89 1336 -7145 -18418 -22242 -15436 -3597 2615 -493 -11771 -20110 -19304
1297 -19304 -8842 1575 4329 -3604 -14776 -19273 -13566 -2431 5612 3997 -6714 -16084 -16076 -6629
1311 -6629 4500 8559 1933 -8694 -15325 -10655 528 9869 9134 -225 -10114 -12014 -3563 8205
1325 8205 13782 8441 -2397 -10190 -7020 3843 14480 15231 6489 -4430 -7804 -605 11369 18593
$$ packed form
1228A1839j1393j2481l894P863J2838O705n156j3093r912J202J1331J0622J722
1241H193r105j2033n876N874J2404P010k893j1641j0210p43R571J1323K867p475
1255b734j2313o370M808J0740Q627j648j0597j0554j600Q564J1165M373o297j1676
1269a5512p248L509J0460R142k42r319j0752l191P892J1505N418n059j0933q201
1283b2531K370J0535R537J425q481j1273l824O806J1839O212l108j1278q339Q06
1297a9304J0462J0417K754p933j1172m497N707J1135Q043j615j0711r370QR447
1311f629J1129M059o626j0627o631M670J1183R341p35r359r889j900Q451J1768
1325H205N577n341j0838p793L170J0863J0637P51q742j0919l374P199J1974P224
$$ plain form
1339 18593 14944 4120 -5326 -4079 6483 18065 20948 12776 1215 -4170 1329 13832 22671
1352 22671 20411 9358 -1416 -2191 7620 19733 24584 17712 5224 -2512 1432 13621 24111
1365 24111 23893 13055 1064 -2144 6283 18958 25937 20544 7773 -1925 -311 10937 23217
1378 23217 24945 15303 2251 -3366 2651 15822 24552 21142 8535 -2642 -3697 6101 19030
1391 19030 23342 15521 1509 -6492 -2751 9532 20539 19768 8257 -5241 -8715 -138 12781
1404 12781 19528 13995 614 -10206 -8952 2636 14587 16413 6410 -7075 -13643 -7521 5529
1417 5529 14804 11487 -1568 -13657 -14784 -4910 8145 12658 4943 -9266 -17859 -14058 -1385 9459
1431 9459 9197 -2455 -15812 -19926 -11551 2115 9261 3622 -10180 -20631 -19293 -7533 4756
$$ packed form
1339A8593l649j0824r446J247J0562J1582K883q172j1561n385N499J2503Q839
1352B2671k260j1053j0774p75R811J2113M851o872j2488p736L944J2189J0490
1365B4111k18j0838j1991l208Q427J2675O979n393j2771r698J614J1248J2280
1378B3217J728r642j3052n617O017J3171Q730l410j2607j1177j055R798J2929
1391A9030M312p821j4012q001L741J2283J1007p71j1511j3498l474Q577J2919
1404A2781O747n533j3381j0820J254J1588J1951J826j0003j3485o568O122J3050
1417E529R275l317j3055j2089j127R874J3055M513p715j4209q593L801J2673J0844
1431I459k62j1652j3357m114Q375J3666P146n639j3802j0451J338J1760J2289
$$ plain form
1444 4756 7167 -2962 -16470 -22771 -16477 -3140 6386 3536 -9351 -21427 -22527 -12426 1092
1457 1092 5609 -1616 -14699 -23221 -19733 -7253 4068 3727 -6760 -19695 -23295 -15007 -1798 5710
1471 5710 853 -11714 -21774 -20192 -9356 3122 6115 -2818 -15812 -21618 -15608 -2448 6471
1484 6471 4476 -6741 -17735 -19148 -9193 3047 8352 1845 -10570 -18210 -14491 -2905 7619
1497 7619 8458 -1281 -13257 -16375 -8514 3606 10580 6807 -4684 -13851 -12812 -2001 9310 11699
1511 11699 3844 -7605 -12760 -7321 4774 12749 11005 630 -8772 -9541 -841 10698 14497 8810
1525 8810 -2214 -9082 -5382 5578 14455 14533 5605 -4563 -7062 -210 10691 16730 12639 2346
1539 2346 -5097 -3743 5517 14973 16657 9564 -427 -4637 588 10577 17369 15121 5866 -2181 -2617
$$ packed form
1444D756K411j0129j3508o301O294J3337R526k850j2887j2076j100J0101J3518
1457A092M517p225j3083q522L488J2480J1321l41j0487j2935l600Q288J3209P508
1471E710m857j2567j0060J582J0836J2478K993q933j2994n806O010J3160Q919
1484F471j995j1217j0994j413R955J2240N305o507j2415p640L719J1586J0524
1497G619Q39r739j1976l118P861J2120O974l773j1491r167J039J0811J1311K389
1511A1699p855j1449n155N439J2095P975j744j0375r402p69Q700J1539L799n687
1525H810j1024o868L700J0960Q877P8q928j0168k499O852J0901O039m091j0293
1539B346p443J354R260R456J684p093r991m210N225R989O792k248r255q047m36
$$ plain form
1554 -2617 5145 14303 17641 11695 2376 -2961 297 9448 16529 16053 7919 -221 -1889 4029 12899
1569 12899 17139 12627 3800 -2298 -701 7403 14854 15371 8380 298 -2685 1960 10366 15118 12073
1584 12073 3687 -2655 -2087 4476 12084 13855 7627 -734 -4575 -685 7552 12115 10016 2549 -4465
1599 -4465 -4800 1591 8802 10759 5762 -2606 -6759 -3836 3546 8965 7775 546 -6527 -7483 -2534
1614 -2534 4850 7598 3567 -4066 -9277 -6941 -282 5341 4880 -1484 -8104 -10375 -5917 1291 4412
1629 4412 985 -6068 -11159 -10159 -3653 2337 2552 -3220 -10276 -13016 -8993 -1699 2176 -19 -7605
1644 -7605 -13148 -12573 -6367 -76 1134 -3836 -11062 -14560 -11483 -4184 858 -1222 -7868 -14241 -14345
1659 -14345 -8747 -1348 782 -3591 -10928 -15220 -12621 -4985 572 -73 -6699 -13328 -14600 -9012 -1299
$$ packed form
1554b617P762R158L338n946r319n337L258R151P081m76q134q140j668N918Q870
1569A2899M240m512q827o098J597Q104P451N17o991q082k983M645Q406M752l045
1584A2073q386o342N68O563P608J771o228q361l841L890Q237M563k099p467p014
1599d465l35O391P211J957m997q368m153K923P382N419j190p229p073r56M949
1614b534P384K748m031p633n211K336O659N623m61o364o620k271M458P208L121
1629D412l427p053n091J000O506N990K15n772p056k740M023P294L875k195p586
1644g605n543N75O206O291J210m970p226l498L077P299N042k080o646o373j04
1659a4345N598P399K130m373p337m292K599P636N557o45o626o629j272N588P713
$$ plain form
1674 -1299 1662 -1713 -9083 -14406 -12827 -5159 1393 1862 -4032 -11709 -13544 -8757 -712 3801 941
1689 941 -6483 -12594 -11622 -4590 3114 4846 -303 -8581 -11551 -8174 105 6242 4621 -2278 -9531
1704 -9531 -9926 -3391 4933 7996 3691 -4543 -9162 -6634 1305 8309 8422 2042 -5882 -8079 -2769
1719 -2769 6308 10858 7922 -494 -6339 -5412 2148 10192 12072 6084 -2478 -6315 -2296 6686 12882
1734 12882 11550 3705 -4078 -4869 2213 10818 14528 9561 570 -5150 -2280 6577 13799 14225 6660
1749 6660 -2079 -4509 1193 10595 15394 12140 2675 -4449 -3424 4646 13084 15059 8129 -791 -5081
1764 -5081 -806 7987 14493 13146 4440 -3776 -5135 2095 10807 14383 9529 -166 -6138 -3960 4677
1779 4677 12479 12652 5018 -3918 -6990 -1767 7233 12645 9417 281 -6970 -6762 992 9304 11269
$$ packed form
1674a299K961l375p370n323J579P668O552M69n894p677j835M787Q045M513k860
1689I41p424o111R72P032P704J732n149q278k970L377Q279O137j621o899p253
1704i531l95O535Q324L063m305q234m619K528P939P004J13o380p924k197N310
1719b769R077M550k936q416n845R27P560Q044J880n988q562l837M019Q982O196
1734A2882j332p845p783p91P082Q605L710m967q991n720K870Q857P222M26p565
1749F660q739k430N702R402M799l254r465p124J025Q070Q438J975o930q920m290
1764e081M275Q793O506j347q706q216j359P230Q712L576m854r695n972K178Q637
1779D677P802J73p634q936l072N223R000N412l228r136p251K08P754Q312J965
$$ plain form
1794 11269 5007 -4432 -9137 -5314 3377 10113 8319 38 -8134 -9558 -3425 5451 9331 4682 -4549
1809 -4549 -10771 -8782 -733 6890 7358 340 -8786 -11974 -6994 1923 7107 4669 -4348 -11608 -11827
1824 -11827 -4467 3885 5944 309 -8604 -13240 -9925 -1242 5159 3987 -3625 -11499 -12957 -7129 1374
1839 1374 5255 954 -7281 -13073 -11493 -3673 3417 3961 -2026 -10481 -13450 -8777 -659 4823 2249
1854 2249 -5373 -12240 -11858 -5550 2331 4228 -277 -8332 -12258 -9093 -1718 4073 3660 -2870 -10020
1869 -10020 -11551 -5819 1510 5040 1837 -5483 -10309 -8808 -1987 4097 5055 -533 -7135 -9654 -5605
1884 -5605 1355 5874 3904 -2829 -8094 -7857 -2018 4709 6330 2226 -4398 -7534 -4834 1900 6836
1899 6836 6027 348 -5333 -6099 -1551 5015 7501 4547 -1561 -5317 -3384 2596 7437 7481 3246 -2454
$$ packed form
1794A1269o262r439m705L823Q691O736j794q281q172j424O133Q876L880m649r231
1809d549o222J989Q049P623M68p018r126l188M980Q917N184k438r017p260k19
1824a1827P360Q352K059n635q913m636L315Q683O401j172p612p874j458N828Q503
1839A374L881m301q235n792J580P820P090N44n987q455k969M673Q118N482k574
1854B249p622o867L82O308P881J897m505q055l926L165P375N791m13o530p150
1869a0020j531N732P329L530l203p320m826J501O821O084R58n588o602k519M049
1884e605O960M519j970o733n265K37N839O727J621m104o624l136K700O734M936
1899F836q09n679n681p66M548O566K486k954o108l756J933N980M841M4m235n700
$$ plain form
1915 -2454 -4304 -391 5730 8968 6694 1147 -2965 -2566 2571 7975 8930 5344 -271 -2690 394
1930 394 6012 9426 8112 3194 -816 -1314 3050 8085 9724 6668 2079 -947 1003 5786 9803
1945 9803 8869 4717 479 -54 3751 7935 10183 7549 2901 -19 1455 6051 9780 9422 5500 1603
1961 1603 303 3310 8284 10275 8028 3504 370 1154 5608 9274 9624 5751 1605 -77 2598
1976 2598 7448 9519 7775 3323 -386 421 4395 8018 8912 5583 703 -1016 1104 5910 8505
1991 8505 6925 2188 -1048 -912 2643 6755 7761 4394 -191 -2529 -997 4098 6923 6054 970
2006 970 -2980 -3214 57 4396 5859 2928 -1660 -4698 -2995 1366 4882 4021 -1 -4875 -5520 -2680
2022 -2680 1964 4030 1400 -3443 -6853 -6062 -1845 2539 2254 -1654 -6792 -8362 -5636 -926 2166
$$ packed form
1915b454j850L913O121L238k274n547m112L99N137N404R55l586n615k419L084
1930C94N618L414j314m918m010m98M364N035J639l056m589l026J950M783M017
1945I803r34m152m238n33L805M184K248k634m648k920J474M596L729l58l922l897
1961A603j300L007M974J991k247m524l134P84M454L666L50l873m146j682K675
1976B598M850K071j744m452l709Q07L974L623Q94l329m880j719K120M806K595
1991H505j580m737l236J36L555M112J006l367m585k338J532N095K825q69n084
2006I70l950k34L271M339J463k931m588l038J703M361L516q61m022m874o45K840
2022b680M644K066k630m843l410P91M217M384k85l908n138j570K726M710L092
$$ plain form
2037 2166 614 -4757 -8863 -8900 -4477 -195 899 -2342 -8155 -10979 -8817 -2917 575 -997 -5861
2052 -5861 -10929 -10930 -7362 -1725 230 -3230 -8662 -12165 -10536 -5278 -658 -919 -5730 -10946 -12343 -9164
2068 -9164 -3453 -198 -2590 -8153 -12329 -11874 -6496 -1466 -101 -4301 -10090 -12640 -9764 -3784 219
2083 219 -1000 -6671 -11420 -11720 -7135 -1282 697 -2089 -8037 -11666 -9905 -3998 1145 1474 -3589 -9200
2099 -9200 -10669 -6912 -673 3102 807 -5081 -9408 -9042 -3508 2364 3978 28 -6217 -8870 -6345
2114 -6345 -148 4989 4016 -1355 -6693 -7313 -2652 3576 6625 3410 -2505 -6799 -4784 1228 6441
2129 6441 6983 2284 -3507 -5372 -1838 4752 8730 6837 837 -4180 -3473 1694 7860 9606 5924
2144 5924 -559 -3962 -1062 5121 9783 9673 4014 -1663 -2517 1530 7999 10785 8307 2438 -2268
$$ packed form
2037B166j552n371m106l7M423M282J094l241n813k824K162N900L492j572m864
2052e861n068jL568N637J955l460n432l503J629N258M620k61m811n216j397L179
2068i164N711L255k392n563m176M55N378N030J365m200n789k550K876N980M003
2083B19j219n671m749l00M585N853J979k786n948l629J761N907N143L29n063n611
2099i200j469L757O239L775k295n888m327L66N534N872J614l950o245k653K525
2114f345O197N137r73n371n338o20M661O228L049l215n915m294K015O012N213
2129F441N42m699n791j865L534O590L978j893o000n017P07N167O166J746l682
2144E924o483l403K900O183M662j10n659n677q54M047O469K786k478n869m706
$$ plain form
2159 -2268 -1140 4685 10223 10873 6388 534 -2110 1274 7082 11293 9709 4151 -939 -1247 3639
2174 3639 9225 11175 8100 1954 -1772 -6 5581 10266 10162 5231 -395 -1818 1684 7718 10611
2189 10611 8244 2272 -1558 -1239 3685 8895 9657 5570 -70 -2337 128 5248 9184 8010 2815
2204 2815 -1807 -2401 1706 6633 8607 5560 116 -3425 -1656 2879 6959 7033 2594 -2110 -3552 -839
2220 -839 4506 6703 5080 -132 -4196 -3407 658 4869 5556 1993 -2475 -4733 -2563 2055 5403 3920
2236 3920 -463 -4342 -4598 -1897 2482 4193 1476 -2540 -5433 -4205 44 3146 2903 -685 -4863
2251 -4863 -5679 -2941 795 2466 1028 -2911 -5535 -5395 -2033 1307 2068 -1240 -4778 -6554 -4598 -768
2267 -768 1408 223 -3071 -5803 -6237 -3299 -143 893 -1575 -4802 -6736 -5486 -1781 355 -333 -3079
$$ packed form
2159b268J128N825N538O50m485n854k644L384N808M211j584n558n090l08M886
2174C639N586J950l075o146l726J766N587M685j04m931n626j423L502O034K893
2189A0611k367n972l830L19M924N210P62m087n640k267K465N120L936j174n195
2204B815m622n94M107M927J974l047n444l541J769M535M080P4m439m704j442K713
2220h39N345K197j623n212m064P89M065M211O87l563m468k258K170M618L348j483
2236C920m383l879k56K701M379J711k717m016k893J228M249L102k43l588m178
2251d863q16K738L736J671j438l939k624J40L362L340P61l308l538j776J956L830
2267g68K176j185l294k732m34K938L156J036k468l227j934J250L705K136o88k746
$$ plain form
2283 -3079 -6008 -6578 -3922 -1131 239 -1548 -4425 -6552 -5608 -2526 -102 -565 -3164 -5857 -6725 -3872
2299 -3872 -1324 -195 -1390 -4487 -5906 -5325 -2756 -260 -483 -2429 -5204 -5508 -3827 -1153 231 -847
2315 -847 -3453 -5285 -4917 -2298 -34 513 -1590 -4106 -4943 -3451 -723 837 -167 -2695 -4253 -3547
2331 -3547 -1439 1061 1300 -748 -3105 -3707 -2379 569 2320 1508 -1335 -3222 -2571 -387 2503 2716
2347 2716 937 -1492 -2649 -1421 1545 3177 3089 656 -2050 -1838 479 3311 4236 2386 165 -1684
2363 -1684 -511 2722 4733 4630 1832 -720 -1072 1213 4501 5687 4017 1146 -748 175 2947 5651
2379 5651 5687 2963 111 -819 1221 4714 6407 5101 2007 -555 54 3204 5926 6663 4186 523
2395 523 -699 1095 4372 6705 5758 2632 -588 -624 2142 5600 6893 4758 843 -1626 67 3184
$$ packed form
2283c079k929n70K656K791J370j787k877k127R44L082K424m63k599k693q68K853
2299c872K548J129j195l097j419N81K569K496k23j946k775l04J681K674J384j078
2315h47k606j832L68K619K264N47k103k516q37J492K728J560j004k528j558P06
2331c547K108K500K39k048k357o02J328K948J751q12k843j887O51K184K890K13
2347B716j779k429j157J228K966J632q8k433k706K12K317K832R25j850k221j849
2363a684J173L233K011j03k798k552l52K285L288J186j670k871j894R23K772K704
2379E651L6k724k852r30K040L493J693j306l094k562O09L150K722P37k477l663
2395E23j222J794L277K333r47l126l220l6K766L458J293k135l915k469J693L117
$$ plain form
2411 3184 6253 6269 2720 -617 -1713 948 4502 6628 4370 571 -2147 -2022 1906 5279 5901 2798
2427 2798 -1326 -2946 -1349 2563 5176 4264 706 -2900 -3368 -298 3542 4822 2496 -1577 -4322
2442 -4322 -3417 581 4029 3882 508 -3810 -4990 -2489 1724 3832 2343 -1547 -5435 -4780 -1386 2541
2458 2541 3479 316 -4136 -5971 -3971 -59 3150 1962 -1513 -5463 -6254 -2895 853 3030 843
2473 843 -3463 -6233 -5171 -1443 2121 2314 -821 -4863 -6291 -4382 74 2843 1289 -2370 -6120
2488 -6120 -6095 -2603 1562 3112 511 -3671 -6350 -4627 -287 3026 2577 -1122 -4977 -6087 -3462 1172
2504 1172 3387 2048 -2312 -5141 -4782 -950 2275 3748 610 -3548 -5195 -3446 1303 3779 3315
2519 3315 -862 -4023 -4399 -1252 2430 4632 2462 -1873 -4533 -3223 912 4023 4206 1109 -2545
$$ packed form
2411C184L069J6l549l337j096K661L554K126k258l799k718J25L928L373O22l103
2427B798m124j620J597L912K613r12l558l606m68L070L840J280k326m073k745
2442d322R05L998L448j47l374m318j180K501M213K108j489l890l888O55L394L927
2458B541R38l163m452j835K000L912L209j188l475l950p91L359L748K177k187
2473H43m306k770J062L728L564J93l135m042j428J909M456K769j554l659l750
2488f120K5L492M165J550k601m182k679J723M340L313m49l699l855j110K625M634
2504A172K215j339m360k829L59L832L225J473l138m158j647J749M749K476m64
2519C315m177l161l76L147L682K202k170m335k660J310M135L111J83l097l654
$$ plain form
2534 -2545 -3705 -1505 2746 4674 3735 217 -2960 -2867 222 3956 4773 2380 -1125 -3063 -1559 1761
2550 1761 4801 4579 1508 -1834 -2601 -291 3094 4939 3837 92 -2634 -2004 1358 4233 4817 2212
2566 2212 -1083 -2656 -510 2418 4854 3840 877 -2179 -2092 563 3632 4495 2470 -465 -2599 -1172
2582 -1172 1735 3680 3321 1168 -1751 -2378 -525 2304 3962 2725 -312 -2444 -2113 433 2849 3069
2598 3069 1181 -1549 -2732 -1391 1321 3008 2028 -36 -2303 -2797 -569 1833 2391 889 -1738 -2705
2614 -2705 -1703 133 2059 1569 -160 -2336 -2709 -1340 858 1668 587 -1234 -2860 -2290 -465 1361
2630 1361 902 -284 -2576 -2852 -1506 69 1408 452 -1397 -3083 -2283 -1004 531 1045 -400 -1997
2646 -1997 -2617 -2053 -496 531 -11 -1428 -2767 -2411 -1078 209 300 -484 -2018 -3017 -2158 -249 359
$$ packed form
2534b545j160K200M251J928r39l518l177R3L089L734Q17k393l505j938J504L320
2550A761L040k22l071l342p67K310L385J845j102l745k726O30L362K875N84k605
2566B212l295j573K146K928K436j014k963l056Q7K655L069Q63k025k935k134J427
2582a172K907J945l59k153k919o27J853K829J658j237l037k132L31K546K416K20
2598C069j888k730j183J341K712J687r80k064k267m94K228K402N58j502k627r67
2614b705J002J836J926m90j729k176l73J369K198Q10j081j821j626N70J825J826
2630A361m59j186k292k76J346J575J339r56j849j686Q00J279J535N14j445j597
2646a997o20N64J557J027n42j417j339L56J333J287R1p84j534r99Q59J909O08
$$ plain form
2663 359 327 -1334 -2350 -2304 -1194 16 210 -509 -2124 -3033 -1822 -106 205 44 -1389 -2521 -2358 -1206
2681 -1206 298 191 -675 -1813 -2624 -1859 -35 767 84 -1653 -2686 -2033 -956 303 835 -635 -1676
2698 -1676 -2356 -1711 -181 740 631 -482 -2284 -2177 -830 618 1358 -27 -1489 -2224 -1641 308 1653
2715 1653 1158 -429 -1945 -1716 -749 1251 1849 859 -983 -2088 -1149 499 1670 1619 283 -1575 -1785
2732 -1785 -568 1797 2602 1849 -192 -1653 -1301 451 2770 2983 1163 -743 -1792 -490 1840 3358
2748 3358 2291 383 -1327 -1402 636 2964 3618 2320 -143 -1595 -570 1726 3609 3320 1753 -935
2764 -935 -1553 247 2775 4131 2877 266 -1310 -1215 1517 3983 4021 2326 -621 -1413 -30 2589 4310
2781 4310 3643 1206 -954 -1069 685 3326 4596 2898 237 -1629 -959 1534 3908 3893 1728 -1038
$$ packed form
2663C59l2j661j016M6J110J210J94p19j615r09J211J716L11j61j433j132J63J152
2681a206J504j07q66j138q11P65J824Q02o83j737j033O53J077J259N32j470j041
2698a676o80O45J530R21j09j113j802J07J347J448P40j385j462p35N83J949J345
2715A653m95j587j516K29R67K000N98r90j842j105R39J648J171n1j336j858k10
2732a785J217K365Q05p53k041j461L52J752K319K13j820j906j049J302K330J518
2748C358j067j908j710p5K038K328O54j298k463j452J025K296J883k89j567k688
2764i35o18J800K528J356j254k611j576R5K732K466L8j695k947p92J383K619J721
2781D310o67k437k160j15J754K641J270j698k661j866O70K493K374j5k165k766
$$ plain form
2797 -1038 -1873 -18 2656 4244 3121 504 -1775 -1966 840 3379 3997 2040 -986 -2439 -1060 1735
2813 1735 3757 3280 888 -1863 -2311 -490 2619 3360 2481 -145 -2800 -2475 458 2922 3447 1177
2829 1177 -2059 -3404 -1628 1105 3172 2396 -139 -2727 -2948 -940 1806 2950 1351 -1441 -3508
2844 -3508 -2554 171 2760 2291 324 -2323 -3485 -1901 1096 2595 1671 -1084 -3072 -3114 -869 1872
2860 1872 2313 1048 -2144 -3634 -2558 -301 2426 2165 -711 -2873 -3574 -1840 795 2130 1196 -1293
2876 -1293 -3465 -3242 -762 1689 2094 272 -2600 -3445 -2500 -80 2236 1876 -560 -3103 -3166 -1470 1240
2893 1240 2243 1146 -1576 -3192 -2573 -604 1844 1969 92 -2446 -3419 -2028 905 1947 1256 -781
2909 -781 -2818 -3005 -772 1134 2171 519 -1750 -2850 -2354 124 1507 1506 -386 -2382 -3102 -1335 726
$$ packed form
2797a038q35J855K674J588j123k617k279j91K806K539O18j957l026j453J379K795
2813A735K022m77k392k751m48J821L109P41q79k626k655L25K933K464N25k270
2829A177l236j345J776K733K067p76k535k588k21K008K746J144j599k792k067
2844c508R54K725K589m69j967k647j162J584K997J499r24k755j988m2K245K741
2860A872M41j265l192j490J076K257K727k61k876k162p01J734K635J335r34k489
2876a293k172K23K480K451M05j822k872q45R45K420K316l60k436k543o3J696K710
2893A240J003j097k722j616O19J969K448J25j877k538r73J391K933J042o91k037
2909g81k037j87K233J906J037j652k269j100M96K478J383jj892j996p20J767K061
$$ plain form
2926 726 1628 827 -1206 -2827 -2579 -796 1245 1372 102 -1728 -2843 -1975 313 1441 945 -896 -2422
2943 -2422 -2491 -1338 747 1058 248 -1665 -2541 -1832 -661 958 1094 -283 -2053 -2170 -1187 238 1287
2960 1287 569 -1005 -1869 -1663 -594 584 1114 43 -1416 -2113 -1575 285 1062 611 -496 -1544 -1364
2977 -1364 -501 514 948 450 -581 -1674 -1110 -10 1011 1053 352 -465 -925 -305 770 1308 776 -130
2995 -130 -691 -169 533 1350 1171 439 334 -340 688 1521 1503 1153 636 17 593 1217 1788 1748 1078 171
3015 171 730 1203 1734 2194 1482 961 643 1000 1702 2236 1883 1441 1028 906 1680 2067 2107 1609 1006 678
3035 678 1149 1956 2273 1869 1247 753 905 1751 1956 2211 1667 674 474 805 1945 2239 1792 1107 421 398
3055 398 976 2143 1823 1394 342 -124 358 1389 1968 1583 672 -488 -73 593 1314 1690 765 -340
$$ packed form
2926G26R02q01k033j621K48J783K041J27j270j830j115Q68K288J128m96j841j526
2943b422o9J153K085L11q10j913q76P09J171J619J36j377j770j17R83J425J049
2960A287p18j574q64K06J069J178N30j071j459o97N38J860P77m51j107j048J80
2977a364Q63J015M34m98j031j093N64J100J021M2p01q17m60O20J075N38n32r06
2995a30n61N22P02Q17j79p32j05o74J028Q33j8l50n17o19N76O24N71m0o70r07
3015A71N59M73N31M60p12n21l18L57P02N34l53m42m13j22P74L87M0m98o03l28
3035F78M71Q07L17m04o22m94J52Q46K05K55n44r93k00L31J140K94m47o85o86k3
3055C98N78J167l20m29j052m66M82J031N79l85r11j160M15O66P21L76r25j105
$$ plain form
3073 -340 -992 -437 499 1209 1205 20 -1318 -1585 -605 658 1165 575 -1096 -1917 -1820 -364 847 652 -272
3092 -272 -2111 -2540 -1715 -425 535 178 -1337 -2324 -2373 -1329 -69 635 -852 -2305 -3188 -2622 -1099 127
3110 127 -37 -1324 -2902 -3373 -2298 -553 450 -467 -2090 -3631 -3276 -1367 8 7 -1340 -2924 -3673
3127 -3673 -2639 -749 45 -194 -1847 -3117 -3569 -2102 -139 459 -842 -2514 -3652 -3052 -1226 362
3143 362 399 -1011 -2652 -3417 -2479 -25 1185 313 -1418 -2834 -3007 -1212 698 1312 -141 -2058 -3211
3160 -3211 -2481 -528 1461 1162 -221 -2222 -2853 -1074 852 2023 1452 -782 -2295 -2200 -358 1524
3176 1524 2325 905 -1452 -2220 -1521 854 1903 2005 228 -1768 -2002 -712 1799 2542 1572 -610 -1727
3193 -1727 -1091 518 2205 2793 1038 -841 -1562 -486 1364 3105 2538 617 -1211 -1594 466 2230
$$ packed form
3073c40o52N55R36P10mj185j338k67R80J263N07n90j671q21R7J456J211j95r24
3092b72j839m29Q25J290R60l57j515r87m9J044J260P04j487j453q83N66J523J226
3110A27j64j287j578m71J075J745J003r17j623j541L55J909J375jj347j584p49
3127c673J034J890P94k39j653j270m52J467J963N98j301j672j138O00J826J588
3143C62L7j410j641p65R38K454J210q72j731j416j73J795J910O14j453j917j153
3160c211P30J953J989k99j383k001o31J779J926J171n71k234j513R5J842J882
3176A524Q01j420k357p68O99K375J049J02j777j996k34J290K511P43r70k182j117
3193a727O36J609J687N88j755j879p21J076J850J741n67j921j828l83K060J764
$$ plain form
3209 2230 3293 2089 -187 -1056 -530 1169 3066 3298 955 -348 -996 -16 1978 3296 2754 1023
3225 1023 -754 -816 515 2834 3395 2008 250 -1044 82 1663 2968 3430 1603 -375 -853 304
3241 304 2243 3074 2504 696 -636 -525 1125 2677 3125 2115 404 -668 -227 1693 2830 2970 1264
3258 1264 -357 -708 598 2433 3050 2135 710 -611 -439 1182 2522 2855 1534 -88 -741 -286 1571
3275 1571 2045 2122 472 -460 -719 303 1714 1918 1474 154 -906 -785 717 1796 1585 645 -710
3292 -710 -1107 -321 1046 1566 876 -46 -1242 -1061 -40 640 909 364 -633 -1394 -903 -373 783 299 -282
3311 -282 -1273 -1802 -921 -84 428 46 -825 -1437 -1513 -960 -220 253 -391 -1235 -2011 -1373 -927 -237 -196 -967 -1883
3332 -1883 -1883 -1549 -724 -405 -742 -1665 -1853 -1742 -1074 -561 -635 -1383 -1677 -1789 -1484 -1171 -793 -705 -1588 -1766 -1731
$$ packed form
3209B230J063j204k276q69N26J699J897K32k343j303o48R80J994J318n42j731
3225A023j777o2J331K319N61j387j758j294J126J581J305M62j827j978m78J157
3241C04J939Q31n70j808j332J11J650J552M48j010j711j072M41J920J137J40j706
3258A264j621l51J306J835O17r15j425j321J72J621J340L33j321j622o53M55J857
3275A571M74P7j650r32k59J022J411K04m44j320j060J21J502J079k11r40j355
3292g10l97P86J367N20o90r22j196J81J021O80K69n45r97p61M91N30J156m84n81
3311b82r91n29Q81Q37N12l82q71o12p6N53P40M73o44q44p76O38M46O90M1p71r16
3332a883%L34Q25L19l37r23j88J11O68N13p4p48k94j12L05L13L78Q8q83j78L5
$$ plain form
3353 -1731 -1471 -828 -938 -1123 -1253 -1602 -1465 -1184 -1011 -671 -1258 -1126 -1349 -834 -482 -849 -984 -1102 -935 -840
3373 -840 -626 -632 -923 -889 -888 -483 -336 -447 -405 -651 -564 -590 -49 104 -23 -89 -411 -132 -81 411 496 -30 -150 -16
3397 -16 437 740 802 468 -64 53 230 752 866 1237 886 474 261 279 1016 1519 1427 641 353 456 897
3418 897 1709 1404 1119 577 -26 748 1487 1931 1652 791 256 270 1200 1778 1920 1414 787 118 560 1152
3438 1152 1685 1787 1059 281 -419 448 1406 2179 1854 690 -347 -315 985 1709 1735 1076 11 -656 4
3457 4 764 1526 1498 214 -662 -1041 35 943 1367 723 -394 -1120 -894 -71 1138 1219 149 -1111 -1429
3476 -1429 -1368 -24 1118 778 -454 -1506 -1801 -1156 319 779 183 -1271 -2202 -1918 -721 275 627 -484
3494 -484 -1762 -2341 -1972 -378 522 118 -1219 -2575 -2554 -1280 375 484 -182 -1832 -2420 -2197 -462 163
$$ packed form
3353a731K60O43j10j85j30l49J37K81J73L40n87J32k23N15L52l67j35j18J67R5
3373h40K14ok91L4JM05J47j11M2k46Q7k6N41J53j27o6l22K79N1M92Q5n26j20J34
3397a6M53L03O2l34n32J17J77N22J14L71l51m12k13J8P37N03r2p86k88J03M41
3418H97Q12l05k85n42o03P74P39M44k79q61n35J4R30N78J42n06o27o69M42N92
3438A152N33J02p28p78p00Q67R58P73l25j164j037L2J300P24K6o59j065o67O60
3457DP60P62k8j284q76l79J076R08M24o44j117p26K26Q23J209Q1j070j260l18
3476a429O1J344J142l40j232j052k95O45J475M60n96j454r31K84J197R96L52j111
3494d84j278n79L69J594R00m04j337j356K1J274J655J09o66j650n88K23J735O25
$$ plain form
3512 163 1039 -1065 -3048 -2257 -1802 -389 436 -44 -1113 -2521 -2479 -1036 355 748 -418 -1778 -2635
3529 -2635 -2059 -392 672 835 -519 -1945 -2316 -1405 253 1549 -174 -839 -1065 -2378 -308 928
3545 928 822 252 -609 -2524 -1076 -227 976 1158 -339 -1347 -1921 -504 624 1324 1148 -623 -1438
3562 -1438 -1787 -164 1389 1572 180 -999 -1676 -953 331 1620 1441 296 -1217 -1098 -489 1146 1853
3579 1853 1188 -172 -1019 -839 -13 1420 1724 618 -493 -1480 -515 520 1475 1564 340 -646 -1299 -156
3597 -156 1219 1802 1205 -288 -1148 -730 500 1466 1821 902 -104 -968 -67 1276 1944 1346 366 -672
3615 -672 -652 -9 1369 1894 925 228 -823 -325 612 1454 1951 657 -124 -522 -7 1059 1770 1189 476
3634 476 -580 -381 278 1590 1662 1090 369 -296 -121 785 1825 1852 842 -115 -519 441 1504 1708 1265
$$ packed form
3512A63Q76k104j983P91M55J413Q25m80j069j408M2J443J391L93j166j360q57
3529b635N76J667J064J63j354j426l71R11J658J296j723o65k26j313K070J236
3545I28j06n70q61j915J448Q49J203J82j497j008n74J417J128P00j76j771q15
3562a438l49J623J553J83j392j179o77P23J284J289j79j145j513J19O09J635P07
3579A853o65j360q47J80Q26J433L04j106j111r87R65J035R55Q9j224r86o53J143
3597a56J375N83n97j493q60M18J230R66L55r19j006q64R01J343O68n98r80j038
3615f72K0O43J378N25r69o97j051M98R37Q42M97j294p81l98N15J066P11n81p13
3634D76j056J99O59J312P2n72p21o65J75R06J040K7j010r57m04R60J063K04m43
$$ plain form
3653 1265 435 2 8 267 1382 1678 1143 668 -75 274 806 1454 1614 1008 286 229 407 822 1409 1156
3673 1156 357 -28 7 624 1085 873 1204 198 -66 24 909 861 975 854 70 112 381 449 855 765 511
3694 511 49 -355 115 497 653 353 -71 -588 -414 -65 75 379 -19 -221 -181 -514 -138 82 -190 -251 -285
3715 -285 -540 -720 -421 -295 -361 -635 -711 -699 -606 -900 -724 -633 -708 -481 -990 -907 -665 -557 -698 -829 -885 -1136 -996
3738 -996 -1086 -1175 -946 -936 -1005 -1059 -1110 -1160 -619 -882 -534 -873 -1249 -1273 -1100 -732 -657 -800 -740 -897 -1230 -806 -295
3761 -295 -796 -498 -875 -1329 -1034 -690 -238 -413 -660 -822 -1306 -891 1 -33 -377 -940 -887 -1039 -384 52 422
3782 422 -1 -964 -983 -447 387 632 609 -58 -545 -632 -69 430 1052 497 -42 -784 -377 451 1007 1360 359
3803 359 -281 -303 182 1001 1401 1384 459 -55 -298 303 1097 1609 819 246 -100 -22 884 1616 1457 980 -21
$$ packed form
3653A265q30m33OK59J115K96n35m75p43L49N32O48J60o06p22n7J78M15N87k53
3673A156p99l85L5O17M61k12L31j006k64R0Q85m8J14j21p84M2K69O8M06r0k54
3694E11m62m04M70L82J56l00m24n17J74L49J40L04l98k02M0l33L76K20k72o1l4
3715b85k55j80K99J26o6k74p6J2R3k94J76R1p5K27n09Q3K42J08j41j31n6k51J40
3738i96r0q9K29J0o9n4n1n0N41k63L48l39l76k4J73L68P5j43O0j57l33M24N11
3761b95n01K98l77m54K95L44M52j75k47j62m84M15Q92l4l44n63N3j52O55M36L70
3782D22m23r63j9N36Q34K45k3o67m87q7N63M99O22n55n39p42M07Q28N56L53j001
3803C59o40k2M85Q19M00j7r25n14k43O01P94N12p90n73l46P8R06P32j59m77j001
$$ plain form
3824 -21 -350 -3 1014 1760 1341 659 -88 20 268 1251 1730 938 327 12 -20 1064 1655 1504 901 -248
3844 -248 -405 297 1443 1689 1300 628 -499 -409 389 1324 1658 884 205 -714 -209 607 1509 1265 545 -629
3864 -629 -975 -201 805 1275 797 -54 -1216 -899 -230 1230 1329 822 -482 -1025 -664 66 734 900 104
3883 104 -846 -1149 -494 450 1068 557 -362 -1215 -1149 -351 662 1270 97 -769 -1600 -1262 -331 767 837 -305
3903 -305 -1535 -1291 -918 528 960 667 -439 -1152 -1349 -657 583 901 29 -1038 -1657 -1251 -27 646
3921 646 819 -300 -822 -1523 -897 171 271 273 -1012 -1695 -1391 -626 322 752 -33 -1114 -1965 -1264 -351
3940 -351 471 531 -471 -1310 -1814 -851 84 694 242 -718 -1257 -1144 -281 590 822 7 -1037 -1336 -1085 -532
3960 -532 847 829 -94 -1022 -1385 -735 401 330 504 -438 -1285 -1444 -775 404 791 -16 -702 -1092 -764 112
$$ packed form
3824b1l29L47J017P46m19o82p47J08K48R83M79p92o11l15l2J084N91j51o03j149
3844b48j57P02J146K46l89o72j127R0P98R35L34p74o79r19N05Q16R02k44p20j174
3864f29l46P74J006M70m78q51j162L17O69J460R9n07j304n43L61P30O68J66p96
3883A04r50l03O55R44O18n11r19q53O6P98J013O08j173q66q31L38R31J098P0j142
3903c05j230K44L73J446M32k93j106p13j97O92J240L18q72j067o19M06J224O73
3921F46J73j119n22p01O26J068J00Kj285o83L04P65R48M30p85j081q51P01R13
3940c51Q22O0j002q39n04R63R35O10m52r60n39J13Q63Q71K32q15j044k99K51N53
3960e32J379j8r23r28l63O50J136p1J74r42q47j59O69J179L87q07o86l90L28Q76
$$ plain form
3980 112 574 471 -130 -1141 -1008 -717 381 725 413 -265 -703 -1109 -628 462 682 121 -290 -948 -390
3999 -390 146 605 628 207 -249 -62 -953 366 586 462 186 -978 -915 -1114 -26 867 994 -332 -372 -174
4019 -174 -34 762 864 387 -77 -355 149 425 539 774 520 -43 -170 199 715 901 983 414 -40 -144
4039 -144 537 687 594 621 405 -91 261 918 931 864 575 557 343 453 905 1131 733 737 407 290 532 836
4061 836 979 944 780 267 547 468 896 972 794 448 287 345 566 780 1195 891 423 318 330 736 790 669
4083 669 534 119 148 208 365 868 538 430 243 36 241 415 529 77 98 139 28 -44 356 249 541 191
4105 191 -191 -222 -357 284 551 17 -111 -368 -348 -430 177 81 -160 -287 -33 -316 158 -157 454 60 -608
4126 -608 -620 -458 -421 71 -169 -415 -639 -1092 -544 -321 169 -137 -448 -648 -901 -156 15 111 -261 -780 -900
$$ packed form
3980A12M62j03o01j011J33K91J098L44l12o78m38m06M81J090K20n61m11o58N58
3999c90N36M59K3m21m56J87q91J319K20j24k76j164O3j99J088Q93J27j326m0J98
4019a74J40P96J02m77m64k78N04K76J14K35k54n63j27L69N16J86Q2n69m54j04
4039a44O81J50r3K7k16m96L52O57J3o7k89j8k14J10M52K26l98Ml30j17K42L04
4061H36J43l5j64n13K80p9M28P6j78l46j61N8K21K14M15l04m68j05J2M06N4j21
4083F69j35m15K9O0J57N03l30j08j87k07K05J74J14m52K1M1j11p2M00j07K92l50
4105A91l82l1j35O41K67n34j28k57K0q2O07r6k41j27K54k83M74l15O11l94o68
4126f08j2J62L7M92k40k46k24m53N48K23M90l06l11k00k53P45J71R6l72n19j20
$$ plain form
4147 -900 -985 -482 87 -137 -602 -651 -852 -755 2 85 144 -472 -1280 -902 -589 6 97 -80 -707 -1226 -699 -294
4169 -294 78 374 -24 -788 -1258 -516 -168 415 44 -523 -994 -891 -300 227 540 68 -626 -1029 -657 -134
4189 -134 445 496 104 -743 -694 -931 192 704 184 -197 -715 -885 -201 144 633 312 -304 -979 -418 -46
4209 -46 586 482 160 -535 -810 -319 265 994 442 -264 -779 -659 -278 443 725 498 -287 -805 -837 -20 848
4230 848 698 -6 -512 -957 -484 272 856 486 -39 -636 -700 -287 615 1027 438 -196 -805 -848 -35 735 705
4251 705 82 -504 -1210 -747 263 780 863 -164 -813 -961 -21 539 763 467 -438 -587 -846 254 477
4270 477 642 154 -522 -997 -501 222 1005 1001 154 -395 -390 -283 514 1078 253 -127 -520 -212 352 1044 1071 368
4292 368 -145 -411 -62 694 1285 1093 406 -155 -189 216 700 1467 494 239 -63 -362 516 1172 1026 647
$$ packed form
4147i00q5N03N69k24m65m9k01R7P57Q3N9o16q08L78L13N95R1j77o27n19N27M05
4169b94L72K96l98p64m70P42L48N83l71n67m71J03N91N27L13m72o94m03L72N23
4189a34N79N1l92q47M9k37J123N12n20l81n18j70O84L45M89l21o16o75N61L72
4209d6O32j04l22o95k75M91N84P29n52p06n15J20L81P21K82k27p85n18l2Q17Q68
4230H48j50p04n06m45M73P56N84l70n25n97o4M13R02M12n89o34o09m3Q13P70l0
4251G05o23n86p06M63J010N17Q3j027o49j48R40N60K24k96r05j49k59J100K23
4270D77J65m88o76m75M96P23P83mq47n49NJ07P97N64q25l80l93L08N64O92K7p03
4292C68n13k66L49P56N91j92o87n61l4M05M84P67r73k55l02k99Q78O56j46l79
$$ plain form
4312 647 33 -327 -261 606 1221 1254 581 -135 -409 118 883 1696 1012 67 -135 -278 512 798 1401 874 233
4333 233 -60 462 607 1225 1345 655 -126 -257 191 893 815 851 572 -192 37 399 701 1024 224 -279 -208
4354 -208 -318 716 903 667 177 -498 -462 -130 573 566 534 -168 -481 -590 -137 518 366 323 -9 -601 -388
4375 -388 4 397 364 77 -659 -492 -482 -186 62 113 -209 -699 -699 -496 -145 78 -14 -403 -702 -1071 -475 -322
4397 -322 195 -372 -586 -782 -512 -421 -136 182 -507 -786 -894 -925 -544 -228 -30 -687 -372 -748 -427 -87 -71
4418 -71 -759 -375 -904 -807 -560 -169 -335 -611 -489 -811 -765 -498 -8 -314 -62 -723 -647 -559 -161 -13 23 -406
4440 -406 -671 -501 -197 -27 211 -5 -101 -555 -498 -235 70 72 100 -497 -280 -120 -287 -157 160 318 -184 -303
4462 -303 -111 61 -268 14 336 -183 -182 -245 322 430 324 145 -498 -249 -60 257 218 475 -125 -436 -349 -12
$$ packed form
4312F47o14l60O6Q67O15L3o73p16k74N27P65Q13o84r45k02j43P90K86O03n27o41
4333B33k93N22J45O18J20o90p81j31M48P02p8L6k79p64K29L62L02L23q00n03P1
4354b08j10J034J87k36m90o75L6L32P03pl2p02l13j09M53O55j52m3l32n92K13
4375c88L92L93l3k87p36J67J0K96K48N1l22m90%K03L51K23r2l89k99l69N96J53
4397c22N17n67k14j96K70R1K85L18o89k79j08l1L81L16J98o57L15l76L21L40J6
4418g1o88L84n29R7K47L91j66k76J22l22M6K67M90l06K52o61P6Q8L98J48L6m29
4440d06k65J70L04J70K38k16r6m54N7K63L05KK8n97K17J60j67J30L17J58n02j19
4462c03J92J72l29K82L22n19Jo3N67J08j06j79o43K49J89L17l9K57o00l11Q7L37
$$ plain form
4484 -12 410 306 -112 -83 -214 -327 128 288 308 31 -42 -340 -152 337 293 591 72 -343 -646 -38 68 336
4506 336 75 57 -519 -316 9 281 533 -32 -264 -439 -453 0 750 499 362 -384 -510 -223 445 410 280
4527 280 -10 -327 -322 -105 414 443 537 -118 -488 -417 -97 591 456 140 -287 -447 -579 159 710 453 129 -534
$$ packed form
4484a2M22j04m18K9j31j13M55J60K0k77p3k98J88M89m4K98n19m15l03O08J06K68
4506C36k61j8n76K03L25K72K52n65k32j75j4M53P50k51j37p46j26K87O68l5j30
4527B80k90l17NK17N19K9R4o55l70P1L20O88j35l16m27j60j32P38N51k57l24o63
$$ [...]
8191B01
##END NTUPLES=NMR FID
##END=
