##TITLE=1H_LR-698-R3-ETP7
 CDCl3, 8 sc, 
 27.1.2020
##JCAMPDX= 6.0         $$ Bruker NMR JCAMP-DX V2.0
##DATA TYPE= NMR FID
##DATA CLASS= NTUPLES
##ORIGIN= UXNMR, Bruker Analytische Messtechnik GmbH
##OWNER= root
$$ XWIN-NMR		Version 3.5
$$ Mon Jan 27 14:55:37 2020 Russian Standard Time (UT+4h)  she@DPX200
##.OBSERVE FREQUENCY= 200.1315
##.OBSERVE NUCLEUS= ^1H
##.DELAY= (6, 6)
##.ACQUISITION MODE= SIMULTANEOUS
##.ACQUISITION SCHEME= undefined
##.AVERAGES= 8
##.DIGITISER RES= 18
##SPECTROMETER/DATA SYSTEM= spect
##.PULSE SEQUENCE= zg30
##.SOLVENT NAME= CDCl3
##.SHIFT REFERENCE= (INTERNAL, CDCl3, 0, 15.7039)
##AUDIT TRAIL= $$ (NUMBER, WHEN, WHO, WHERE, WHAT)
$$ ##TITLE= Audit trail, XWIN-NMR		Version 3.5
$$ ##JCAMPDX= 5.01
$$ ##ORIGIN= Bruker BioSpin GmbH
$$ ##OWNER= she
$$ F:/spectra/data/she/nmr/H-F/1/audita.txt
$$ ##AUDIT TRAIL=  $$ (NUMBER, WHEN, WHO, WHERE, WHAT)
(   1,<2020-01-27 14:54:36.57 +0400>,<she>,<DPX200>,
      <created by zg, POWCHK disabled, PULCHK disabled
       configuration hash MD5:
       00 E9 B6 7A A2 85 ED C7 34 08 36 98 17 FE 4E 26
       data hash MD5: 16K
       F9 D2 8A 65 28 74 89 F7 B6 90 CA 97 1E DA 67 00>)
$$ ##END=
$$ 
$$ hash MD5
$$ FB B9 82 61 59 73 91 5D D9 0C 6F 46 75 14 F5 0B
##$RELAX= 
##$RELAX= 
##$RELAX= 
##$RELAX= 
##$RELAX= 
##$RELAX= 
$$ Bruker specific parameters
$$ --------------------------
##$DU= <F:/spectra>
##$EXPNO= 1
##$NAME= <H-F>
##$PROCNO= 1
##$TYPE= <nmr>
##$USER= <she>
##$AMP= (0..31)
100 100 100 100 100 100 100 100 100 100 100 100 100 100 100 100 100 100 
100 100 100 100 100 100 100 100 100 100 100 100 100 100 
##$AQSEQ= 0
##$AQ_mod= 1
##$AUNM= <au_zg>
##$AUTOPOS= <>
##$BF1= 200.13
##$BF2= 200.13
##$BF3= 200.13
##$BF4= 200.13
##$BF5= 200.13
##$BF6= 200.13
##$BF7= 200.13
##$BF8= 200.13
##$BYTORDA= 1
##$CFDGTYP= 0
##$CFRGTYP= 5
##$CHEMSTR= <none>
##$CNST= (0..31)
1 1 145 1 1 1 1 1 1 1 1 1 1 1 1 1 1 1 1 1 1 1 1 1 1 1 1 1 1 1 1 1 
##$CPDPRG= <>
##$CPDPRG1= <>
##$CPDPRG2= <>
##$CPDPRG3= <>
##$CPDPRG4= <mlev>
##$CPDPRG5= <mlev>
##$CPDPRG6= <mlev>
##$CPDPRG7= <mlev>
##$CPDPRG8= <mlev>
##$CPDPRGB= <>
##$CPDPRGT= <>
##$D= (0..31)
0 1.2 0 0 0 0 0 0 0 0.06 0 0.03 0 0 0 0 0.0002 0 0 0 0 0 0 0 0 0 0 0 0 
0 0 0 
##$DATE= 1580122475
##$DBL= (0..7)
120 120 120 120 120 120 120 120 
##$DBP= (0..7)
150 150 150 150 150 150 150 150 
##$DBP07= 0
##$DBPNAM0= <>
##$DBPNAM1= <>
##$DBPNAM2= <>
##$DBPNAM3= <>
##$DBPNAM4= <>
##$DBPNAM5= <>
##$DBPNAM6= <>
##$DBPNAM7= <>
##$DBPOAL= (0..7)
0.5 0.5 0.5 0.5 0.5 0.5 0.5 0.5 
##$DBPOFFS= (0..7)
0 0 0 0 0 0 0 0 
##$DE= 6
##$DECBNUC= <off>
##$DECIM= 24
##$DECNUC= <off>
##$DECSTAT= 4
##$DIGMOD= 1
##$DIGTYP= 9
##$DL= (0..7)
0 120 120 120 120 120 120 120 
##$DP= (0..7)
150 150 150 150 150 150 150 150 
##$DP07= 0
##$DPNAME0= <>
##$DPNAME1= <>
##$DPNAME2= <>
##$DPNAME3= <>
##$DPNAME4= <>
##$DPNAME5= <>
##$DPNAME6= <>
##$DPNAME7= <>
##$DPOAL= (0..7)
0.5 0.5 0.5 0.5 0.5 0.5 0.5 0.5 
##$DPOFFS= (0..7)
0 0 0 0 0 0 0 0 
##$DQDMODE= 0
##$DR= 18
##$DS= 0
##$DSLIST= <SSSSSSSSSSSSSSS>
$$ [...]
##$SUBNAM2= <"">
##$SUBNAM3= <"">
##$SUBNAM4= <"">
##$SUBNAM5= <"">
##$SUBNAM6= <"">
##$SUBNAM7= <"">
##$SUBNAM8= <"">
##$SUBNAM9= <"">
##$SW= 24.9337058887773
##$SWIBOX= (0..15)
0 0 2 0 0 0 0 0 0 0 0 0 0 0 0 0 
##$SW_h= 4990.01996007984
##$TD= 16384
##$TD0= 1
##$TE= 0
##$TE2= 300
##$TE3= 300
##$TEG= 300
##$TL= (0..7)
0 120 120 120 120 120 120 120 
##$TP= (0..7)
150 150 150 150 150 150 150 150 
##$TP07= 0
##$TPNAME0= <>
##$TPNAME1= <>
##$TPNAME2= <>
##$TPNAME3= <>
##$TPNAME4= <>
##$TPNAME5= <>
##$TPNAME6= <>
##$TPNAME7= <>
##$TPOAL= (0..7)
0.5 0.5 0.5 0.5 0.5 0.5 0.5 0.5 
##$TPOFFS= (0..7)
0 0 0 0 0 0 0 0 
##$TUNHIN= 0
##$TUNHOUT= 0
##$TUNXOUT= 0
##$USERA1= <user>
##$USERA2= <user>
##$USERA3= <user>
##$USERA4= <user>
##$USERA5= <user>
##$V9= 5
##$VALIST= <valist>
##$VCLIST= <CCCCCCCCCCCCCCC>
##$VD= 0
##$VDLIST= <DDDDDDDDDDDDDDD>
##$VPLIST= <PPPPPPPPPPPPPPP>
##$VTLIST= <TTTTTTTTTTTTTTT>
##$WBST= 1024
##$WBSW= 4
##$XGAIN= (0..3)
0 0 0 0 
##$XL= 0
##$YL= 0
##$YMAX_a= 71796
##$YMIN_a= -25554
##$ZGOPTNS= <>
##$ZL1= 120
##$ZL2= 120
##$ZL3= 120
##$ZL4= 120
##$ABSF1= 10
##$ABSF2= 0
##$ABSG= 5
##$ABSL= 3
##$ALPHA= 0
##$AQORDER= 0
##$ASSFAC= 0
##$ASSFACI= 0
##$ASSFACX= 0
##$ASSWID= 0
##$AUNMP= <proc_1d>
##$AZFE= 0.1
##$AZFW= 0.1
##$BCFW= 1
##$BC_mod= 2
##$BYTORDP= 1
##$COROFFS= 0
##$CY= 11.3945322036743
##$DATMOD= 1
##$DC= 2
##$DFILT= <>
##$DTYPP= 0
##$F1P= 16.9975609425685
##$F2P= -3.02152046262296
##$FCOR= 0.5
##$FTSIZE= 0
##$FT_mod= 4
##$GAMMA= 1
##$GB= 0.15
##$INTBC= 1
##$INTSCL= 1
##$ISEN= 128
##$LB= 0.24
##$LEV0= 0
##$LPBIN= 0
##$MAXI= 10000
##$MC2= 0
##$MEAN= 0
##$ME_mod= 0
##$MI= 1.114404
##$NCOEF= 0
##$NC_proc= 0
##$NLEV= 6
##$NOISF1= 3.799351
##$NOISF2= 2.8
##$NSP= 1
##$NTH_PI= 0
##$NZP= 0
##$OFFSET= 15.70392
##$PC= 1
##$PHC0= -9789.637
##$PHC1= 20.80081
##$PH_mod= 1
##$PKNL= yes
##$PPARMOD= 0
##$PSCAL= 0
##$PSIGN= 0
##$REVERSE= no
##$SF= 200.130013532006
##$SI= 16384
##$SIGF1= 3
##$SIGF2= 2
##$SINO= 400
##$SIOLD= 16384
##$SREGLST= <1H.CDCl3>
##$SSB= 0
##$STSI= 0
##$STSR= 0
##$SW_p= 3612.71676300578
##$SYMM= 0
##$S_DEV= 0
##$TDeff= 0
##$TDoff= 0
##$TI= <>
##$TILT= no
##$TM1= 0
##$TM2= 0
##$TOPLEV= 0
##$USERP1= <user>
##$USERP2= <user>
##$USERP3= <user>
##$USERP4= <user>
##$USERP5= <user>
##$WDW= 1
##$XDIM= 8192
##$YMAX_p= 0
##$YMIN_p= 0
$$ End of Bruker specific parameters
$$ ---------------------------------
##NTUPLES= NMR FID
##VAR_NAME=  TIME,          FID/REAL,        FID/IMAG
##SYMBOL=    X,             R,               I
##VAR_TYPE=  INDEPENDENT,   DEPENDENT,       DEPENDENT
##VAR_FORM=  AFFN,          ASDF,            ASDF
##VAR_DIM=   8192,          8192,            8192
##UNITS=     SECONDS,       ARBITRARY UNITS, ARBITRARY UNITS
##FACTOR=    0.0002004,     1,               1
##FIRST=     0,             0,               0
##LAST=      1.6414764,     0,               0
##MIN=       0,             -25554,          0
##MAX=       1.6414764,     71796,           0
$$ Real data points
##PAGE= N=1
##DATA TABLE= (X++(R..R)), XYDATA
$$ [...]
1975e53KM6n2j49J32R2L38k85k46N8L31J46k61J73n06N3K22J87k7r2J18k53k36
1998g62O84n26M52P0j95j25n6N70o4r8j97K40J09l29K71J08j5o7K0m6J20p5QQ8
2022A85q4k87M24J74j23J23l68k62N61J56l2l47K48j48K10l0K98J82l90k34K41
2043D97l1K79J19l2l99k12M62n5K1Q5n18L76j22k08L64J28l01k88L1K83l58M30
2065E51Nl48k86K01K36n5j28j23J09k24K57k25j9K62o22l8O7O09p3k74j60J12
2087a66J10l24L34K89o30j78J98O8m08K47N62o28j96O9n5L58J65m07L4j33L72
2108c19l70L54J56m39J94R8j21j10N0J15j72K03n7K13k44J74k83l1R7k89O59K1
2130a01l8m75q3K11O9L87j31M4j99J62k13J09j36L62j23J44j06OJ80J96j97j79
$$ y = [-553, -551, -505, -557, -706, -574, -482, -144, -429, -675, -617, -286, -140, -401, -228, -734, -681, -459, -272, -299, -391, -273, -526, -762, -78, -604, -152, -82, -277, -402, -458, 112, 48, -50, -247, -7, 102, -227, 44, 152, 137, 70, 90, 44, 164, 89, 97, 185, 101, -186, 238, 412, 289, 412, 44, -218, 343, 499, 467, 120, 368, 220, 430, 400, 698, 880, 490, 256, 497, 466, 745, 864, 832, 433, 221, 683, 628, 649, 734, 216, 592, 470, 262, 626, 754, 453, 165, 196, 479, 121, 551, 556, 208, -78, 123, 359, 304, 176, 53, 162, -62, 195, -30, -49, 213, -409, -447, -380, 229, 156, -118, -278, -166, -56, -380, -46, 243, -387, -565, -367, -299, -707, -460, 102, -526, -722, -653, -708, -350, -185, -592, -558, -691, -319, -689, -335, -179, -618, -424, -326, -447, -557, -507, -392, -564, -361, -418, -205, -449, -275, -558, -589, -492, -781, -122, -101, -139, -614, -697, -486, -417, -30, -161, -117, -316, -154, -367, -258, -394, -32, -155, -11, -117, -111, 69, 265, 68, -111]
2152a11J18J83m8K21k97p6j3K72j2j6L7j97J88j45n8M84l24nk50L12K12k07j7
2175B51M09l25k37J98N4l0j12J9L25l75O3J79R3k52l30J78K27r4L40j11q3l35
2197E2o6L42K9K0l25qO8M4R4K7j42l06j49M97ok07k4MJ45k8P9n8n5n0j41k6Q0
2224a10j56L67K5j67j49k08N62k88J33j85j3R7k22J34l6j15r9J03j13L29o7q7
2246b65J62l15K84k07J67o6m5M7Rj25J21K16l6j74n8j01J1M96j88j44P1J12k60
2269b88L43K52j08j69j04N7j93M91l4m4j65k4K32j43M3K20l27K57k10M98l65R3
2291C12R4j03j19L9K08k31L77l62k07k9K09L25l4j26k2k67J67j8L51j2j03m2j67
2314B40K6L85j49l85L0p1J34K1j18J87P0l08n2J5P4m9J44N4J06o01M14M33n32
$$ y = [-111, 7, 190, 142, 363, 66, -10, -23, 249, 237, 221, 258, 61, 249, 104, 46, 530, 206, 201, -49, 263, 475, 268, 251, 660, 335, 98, 296, 350, 320, 208, 227, 552, 177, 240, 419, 512, 260, -70, 108, 335, 241, 581, 470, 387, 52, -14, 328, 357, 377, 52, 44, 112, 156, 250, 277, 135, -171, -320, 177, 171, -36, -60, -56, 89, 61, 140, 82, 27, -23, -164, -190, -110, -266, 101, 126, -41, -190, -398, 164, -124, 9, -176, -189, -92, -314, -180, -216, -331, -430, -327, -440, -111, -178, -265, -103, -418, -134, -341, -174, -240, -285, -238, -229, -354, -233, -17, -53, -227, -285, -386, -375, 121, -67, -211, -140, -28, -288, 55, 307, 199, 30, -74, -17, -210, 281, 247, 203, 38, 14, 246, 103, 146, 366, 39, 296, 86, 584, 219, 312, 406, 303, 184, 223, 431, 200, 577, 215, 8, -21, 188, 513, 479, 353, 331, 64, 231, 213, 564, 552, 449, 407, 240, 266, 651, 502, 117, 147, 76, 210, 231, 113, 300, 370, 62, 10, 25, 99, 50, 194, 248, 354, -247, 167, 600, 68]
2337F8o8o8k34L09j05K55j68J08m75K82k8J29k50J9N5l6r3K82N8m40l2L86r5J3
2361a28j91N19l53n3j65J7M88m00J10J56j84Qj30J47K87n29M01l02J11j50O3J98
2383h0N9o1j58K84k04L16k53J88l50J00j7K26K24k92l4J52j20J6K72j65n1l3Q0
2406I9l01L94k45P0p4p6M41o5m9q0q4R8m3J48R6j96r5R1P2k9j73Q3O8K09P2k81
2432A50J99p2k68L09L5m18M29k95l2J03JO1q4j79K57k4J6m59K7M48p1l57N8j22
2456b88J56L70j61j16o4k64M53n4K20n32k71M28K20l39j44K17K0k46J62J66l77
2477d44M91k98p0R2m6l5K6K74p4o3j00j73M88j85k70K39l51j0N6J14m0o7m9J71
2501c24J49M48l28j17q8K61o3j35J73j54K80j98r9j1P3L37r7k0j88O4p2J19K84
$$ y = [68, 0, -68, -302, 7, -98, 157, -11, 97, -378, -96, -124, 5, -245, -226, -171, -207, -300, -18, 40, -400, -432, -46, -141, -128, -319, 200, -153, -206, -371, -354, 134, -266, -156, 0, -184, -176, -306, -159, 128, -401, 0, -302, -191, -341, -278, -80, -21, -82, -240, 44, -160, 156, -97, 91, -259, -159, -176, 50, 274, -18, -52, 100, -20, -4, 268, 103, 52, 19, 99, -202, 192, -53, 17, -57, -133, 308, 243, 194, 114, 30, 128, 85, 233, 329, 133, 38, 129, 201, 172, -1, 82, 150, 359, 431, 150, 349, 277, 9, 318, 353, -65, 364, 69, 37, 140, 141, 202, 118, -61, 196, 172, 188, -271, -244, 204, 133, -224, -166, -288, -132, 238, 77, -39, -103, -367, 86, 32, 252, -280, -551, -123, 97, -242, -386, -169, -149, -395, -233, -67, -444, 47, -251, -321, -229, -275, -310, -284, -10, -84, -147, -247, -420, 68, -117, -387, -148, -499, -509, -453, -339, -379, -446, -495, -324, -175, 273, -55, -172, -260, 1, -62, -197, -24, -178, 102, -96, -195, -206, -133, 204, 107, 87, -101, -37, -109, 10, 294]
2524B94rk88O7nj0%L12k30J67j28k5L87k21n9j18J5q1K60k5r4JO0r3L50l45N99
2550G81k47k17P5K31k52J07M7p5L3r3j63l2M9M57k82l38L16j03L77l97J39Ol81
2573C8K06K30N3j62j96K28l27K38p5N7j45Q3j02L48m82M29k37k17L2j84K97R7
2595B09J10k84J0j28L8j39%j66Km4J62l1k7J64j38K1j58K86j11J25m31m8K17K51
2619a10m57L74m25J83k13J94K92k77j24K18j82r3k7J30Q9J80r7k14J55l55N01
2640b58j08L7l49R4M50q3j37L79j79O9j03q9j16P6k06K40n1J41J10K31j93P8j5
2663A8J18m5N1K6m1L9k21M93n00J8j56kM01K9j86J06K25o15J76Q9L4J27K85q1
2687C88p0l24J32K56R1k53j36R8L04l91OJ77l02N5K11P4J34K11k67k92M3K62k95
$$ y = [294, 285, -3, 64, 59, 49, 49, 361, 131, 298, 170, 145, 532, 311, 252, 134, 149, 68, 328, 303, 209, 210, 270, 177, 527, 182, 781, 534, 317, 392, 623, 371, 478, 525, 450, 483, 390, 227, 195, 244, 701, 419, 81, 397, 294, 671, 274, 413, 419, 38, 244, 474, 527, 365, 169, 397, 70, 308, 233, 290, 145, 228, 126, 474, -8, 421, 184, -33, -1, -185, 112, 209, 319, 35, 45, -83, -45, -184, -184, -350, -348, -392, -230, -261, -288, -124, -262, -241, -399, -113, -224, -99, -530, -578, -361, -110, -567, -193, -618, -435, -648, -454, -162, -439, -563, -345, -527, -620, -647, -517, -428, -248, -345, -559, -404, -759, -258, -366, -329, -678, -584, -134, -217, -354, 25, -154, -85, -188, -277, -393, -317, -523, -283, -334, -193, -83, 148, -45, 33, 18, 136, 91, 142, 168, 127, 166, -55, 438, -62, -44, -200, -202, 199, 228, 42, 148, 373, -242, -66, 23, 57, 184, 469, 388, 318, -6, 126, 382, 473, 220, 84, 182, 486, 95, 101, 278, -24, 31, 242, 316, 450, 661, 394, 102, 145, 407, 112]
2710A12J63j69p7j9J12J0M4L9m1l48J75J36J12j20rq5j43J37l3J14N9k23k61P6
2734b39L3J2M31l7l52Lj74M30j55k03K3K54Pm04N84l65n9j62L73k08j28M8R7o3
2758b54j54J66o7J66k5m4nL41k91rJ43O7k08k97L18L9j00j33L31m0l05K63j45
2781b43n5M79Nj68q9j30L78n7k88O4N7Q8N7J49j96M5k52L26K06m57K08K98l93
2804C2J25J85j01O0k14m9L54j71j23K29Q5J12j70j05q1J03K38j83l72L26j69J3
2826A24L8J25J78p0J29o1n39L62n04P71k08k99K54k70k08N19L5k39J51l74J37
2847E1mJ55L36p82K35o1K82j42J32l96J91L0j33k69L64k20J39k75L49j14J37j78
2869a73o5K03k88k6K34p9j63m1K00P0j30J2l43N41k6j85J29j9k28R5J1j09j30
$$ y = [112, 275, 106, 29, 10, 122, 132, 176, 215, 174, -174, 1, 137, 249, 129, 120, 35, -108, 29, -4, 110, 169, -54, -315, -239, -206, -194, 237, 200, -152, -149, -323, 107, -48, -251, -228, 26, 33, -371, 213, -152, -211, -373, 0, -208, -336, -288, -191, -254, -408, -242, -309, -143, -168, -212, -217, 124, -167, -176, -33, 34, -174, -471, -153, -114, -214, -347, -16, -56, -361, -98, -243, -298, 181, 186, 18, -71, -201, 177, 120, -168, -104, -47, 41, 98, 247, 51, 96, -156, 170, 376, -81, 127, 425, 32, 157, 342, 241, 301, 87, 38, 392, 221, 98, 327, 412, 524, 354, 249, 168, 271, 509, 326, -46, 280, 111, 124, 162, 287, 465, 395, 524, 463, -76, 286, -218, 553, 345, 46, 300, 30, -178, 341, 376, 137, 288, -86, 51, 47, 202, 538, -244, -9, -70, 212, 70, 202, -194, -3, 27, -106, -375, -11, -231, -92, -367, -18, -132, 5, -173, -238, -35, -323, -349, -115, -194, -357, -398, -198, -128, -258, -246, -589, -48, -74, -259, -130, -149, -377, -282, -271, -380, -510]
2892e10K93K52o02M12J17k89J93p1j51R2K63l21L83n2k05j10k17N24j82o8J51
2913i8j76K34J40P8k00l27M19j07J75l42N23n2k46j54L15L5Kl38L50M9r3J02R
2936B98j09JM9Q2k48R7K8J44O7k56P7J42o3J4K0K6k48J66O2j75j2O3J61j53N2
2961B85J71l49K3J2j01J17J16L3j53K56l61p5J82J33j24M8l24K2J61j15k51L00
2983FK57n39L38M8j56L5J98k62J13k35K9q3k10J90J4Q2j6j83p1l5M36j57k44L02
3007a43l21L80j16q1l7j07N21n98J96O6L0k10K43j10J31k3j6J19j80K45k99KR2
3030b16K72l79j8R1K87p5m8o1%J28J11k51K6O5J57l55j75M51r5Q5Lj69K70N2l19
3055a63J73J01j15m6J59L15l80J9O5p6K4J6k1p5kK27J65J0p8K13k79L11j6l30
$$ y = [-510, -217, 35, -567, -155, -38, -327, -134, -205, -356, -264, -1, -322, 61, 9, -196, -306, -523, 1, -181, -249, -98, -274, -40, 100, 178, -22, -349, 70, -37, 138, -204, 319, 267, 21, -133, 182, 217, 219, -119, 231, 280, 187, 289, 298, 189, 190, 239, 321, 73, 170, 198, 342, 409, 153, 230, 372, 309, 323, 343, 369, 121, 287, 349, 174, 162, 225, 386, 233, 285, 456, 107, 130, 142, 41, 158, 274, 307, 154, 410, 49, -26, 156, 289, 165, 213, -111, -89, 72, -43, -294, 6, 263, -276, 62, 110, -46, -11, 187, -75, 38, -197, -168, -251, -461, -271, -257, -175, -191, -374, -445, -480, -44, -201, -445, -143, -464, -84, -200, -281, -318, -425, 96, -502, -306, -240, -210, -420, -177, -287, -156, -179, -195, -76, -256, -11, -310, -308, -216, 56, -323, -341, -250, 37, -38, -86, -147, -147, -19, 92, -159, -133, -68, 89, -266, -441, 10, -85, 0, 3, -166, 104, 156, -163, 10, 111, -4, -50, 109, 424, 44, 63, 128, 52, 76, 92, 71, -4, -6, 221, 386, 396, 318, 531, 252, 563, 547, 217]
3079B17K47l36k4J31j81L14p2j30K2Rj85K54j9Q9j71j88K00r9L57k33k10P0k75
3102b13N28r6j58K84j53l31K32j45jJ33lj06j61L81J73k52m07M52n24M59J37m26
3124a97L88l09P9O2k49L53k44K8K5p0O8m19O43m84J59K2N4K2J0o1j66J48k49Q3
3148c04O8J74O6l74J36j32L19q7M7p8L09j47l3J04l36K05J19N1m26j5M83j62j60
3171a73J87k92K93j08oL34j07j31L2K4J20k61M06n06L88k81N6K28o3J10k12J92
3193B30p4n8J54l8k61L46l08K48j41J31k95N25j68l87M8J93k52j29K26Q4J85l96
3215a37K8K46o0j93L72l47J38RR9p7o6L11m67K49R4l42K99j70K69m1j80J01j92
3238e7j27K20L6J78k81j9j1j13j25J75l3J23l96M33m12K52m6P8j12K52m9l09J71
$$ y = [217, 464, 128, 104, 235, 54, 368, 296, 166, 188, 197, 12, 266, 247, 336, 165, -23, 177, 78, 435, 202, -8, 62, -213, 315, 219, 61, 345, 192, -139, 93, -52, -53, 80, 77, -29, -190, 191, 364, 112, -295, 157, -367, 92, 229, -197, 191, -118, -39, 23, -226, 127, -117, -89, -64, -134, -66, -485, 158, -326, -167, -145, -91, -69, -59, -120, -286, -138, -387, -304, -236, -62, 4, -370, -234, -366, -47, -134, -87, -165, 144, -3, -36, 68, -268, -63, 56, 107, -319, -334, 149, -13, -173, 14, -278, 15, -93, -99, 235, 128, -3, 29, 53, 173, -88, 318, -188, 200, -81, -25, 203, 140, 250, 38, 230, 156, 98, 252, 214, -47, 299, -9, 239, 98, 229, -66, 459, 291, -96, -48, 145, -107, -236, -10, 74, 259, -137, -109, 137, 77, -116, 256, -91, 47, 56, 155, 78, 12, 323, -144, 105, 199, -143, 156, -14, 255, 214, 34, 135, -57, -184, 36, 72, 250, -31, -50, -61, -174, -299, -124, -157, -34, -430, 3, -409, -157, -203, -125, -237, 15, -34, -343, -172]
3261a72o8N51o36J38k08k2P8L5m4L15k02k21K27J06j86l7k32K55NJ54j87j0K24
3284a37o3q7o5m0K34J26k08K41j52R0m9P7J71j56J4L22l99K67r4j01K25j98R8
3307A16j86m8K25j31L40l38J50pn7Q7J90j96J6r1j6K39j52j67K40j55N7J83j67
3330A32M22m23n2j0L1L40k89L85r2j86j66L19j88K71m8l79L74l90n0J32K66j75
3352B24J13p5P6l14R1J37m49M55J39k35j00k67K60K2J71k58k87K99J85j72J59
3373A74k79K7k42L07m2Q7K64k63j74j14J96N2k27J24k32J12J34j28j43n8K23J17
3395h5j50p3j9K49qrK32k08j20J8j51K16m4L07l68M4j28J86n9J98o62M71J26k9
3419f6M8j31j53J2K91j81Q6j26K28p2l0Q9J22o4j48J54l65j7K92J25k85J55K18
$$ y = [-172, -240, 311, -325, -187, -395, -417, -339, -304, -348, -33, -235, -456, -229, -123, -309, -346, -578, -323, -318, -164, -351, -361, -137, -200, -287, -352, -392, -158, -32, -240, 1, -151, -61, -110, -33, 138, -18, -4, 318, -81, 186, 92, -9, 216, 18, 116, -70, -118, 107, -24, 316, -22, 128, 121, 64, 151, 341, 145, 161, 70, 54, 293, 141, -26, 214, 59, 116, 299, 132, 554, 131, 79, 69, 100, 440, 151, 536, 444, 258, 92, 411, 223, 494, 446, 67, 441, 51, 1, 133, 399, 224, 337, 262, 338, 24, 115, 252, -197, 258, 397, 162, 62, -205, 55, 77, 248, -10, -297, 2, 187, 15, 174, -105, -78, -320, -13, -55, 32, 296, 33, -141, -255, -59, -7, -234, -110, -342, -230, -96, -224, -367, -425, -202, -85, -235, -308, -327, -78, -86, -95, 137, -71, -191, -173, -324, -108, -152, 155, -213, -169, -297, -111, -170, 28, -634, -163, -37, -66, -18, -149, -302, -290, 1, -180, -94, -220, 8, -64, -94, -5, 117, 53, -95, 59, -306, -323, -31, 94, -191, -36, 182]
3442A82j00k07O4r5J98j89O4J75K1J7l38K84K17k46K43n07L01j7j12J15K23k66
3464B7j11K53J95k08M4K43l59m11L44M6J87j47J58l88L79j18k05J82j53K69r4
3485A33j36J6QK25k48Q1J91j63r6J55k1k68j79L04L1n8p2k8qJ6K34o05M50p3K09
3510I8p3j23k85M01j61n5j9J3K38j29j4n4p2J33j48J57J47j56o9k64L00q5J66
3533e4k0j33K92k31K1k0r8R8j05J66q1Mj3L1J27J5l66K56Q5o2o2m01P11k69L66
3558B57k23O6k20q6K11l0lj16J51L34k56j10J09R9l71k1L13k48K74M6m1M4R3k15
3582E7j70K70j10j24k10J76J43j42J11J77m7k17K75j34r7J91K52j16p0m78M13
3603A50m0K0n7nkj03n4r7K74l8J62n8R2k38NK34j65ok73K0K63l22M92k08M8Qj39
$$ y = [182, 82, -125, -61, -156, 42, -147, -83, 92, 113, 130, -208, 76, 293, 47, 290, -217, 84, 67, -45, 70, 293, 27, -84, 169, 364, 156, 200, 443, 84, -327, 17, 63, 250, 103, 261, -127, 252, 134, -71, 111, -42, 227, 133, -3, 13, 21, 246, -2, 79, 270, 107, 11, 166, 145, -123, -302, 2, 33, -25, -97, -125, -133, -117, 117, -488, -38, -111, 98, 25, -98, -383, 18, -143, -198, -217, -204, 34, -95, -109, -163, -235, -102, -250, -93, 54, -102, -171, -435, -135, -220, -54, -74, -207, 85, -146, -125, -145, -243, -145, -250, -84, -165, -161, -174, -143, -16, -1, -367, -111, -26, -88, -150, -551, 160, -109, 257, 34, 100, -120, -206, 5, -25, -28, -144, 7, 341, 85, -25, 84, 183, -188, -209, 104, -144, 130, 176, 135, 179, 272, 57, -113, 157, 47, -77, -287, -111, 32, -110, 1, 178, 131, -86, 189, 55, -42, 149, 401, 285, 215, -263, 150, 110, 130, 73, 68, 66, -37, -91, -188, 86, 48, 210, 152, 244, 6, 11, 245, 80, 74, -199, -179, 84, -238, 254, 46, 94, 102, -37]
3630c7Q2l23n0K27pj17J66N2kj17K43k45m1kP4j78K77J11m7J44k79j81K07K18
3654A75l57%K46j59R7k6K2l57Q8O0Qq4J71k24M30l03J24o3K41j96k9k89K13J2
3678b00j24K39J80j76JK95m70J57K31n8r0j41M3n7K15K30m99J36o0N41k28o1l0
3701G4o4J70l06L34l36q3L67j58l6m0J22J86k06J92j3R1l03M00j52j28k17L31
3723B25n9m4M5j11j50M11R7m88K58K42n77L97K7k92K6J33j81J2k02K3K97j14j84
3746b09L12P9J34m29J06j7j49L08j68K82j97K2k84O3J21K28l97M74k94j58K55
3767H2m41K66k40J58k7J36K20j80pq6N5L8N0l26K62j16o8K81j61j46P0o9l6M4
3791b41K08k27K29n0o1k03LL05n9K18L0k54p4J27j01j03K27k62L00k88M1L27M5
$$ y = [-37, 45, -278, -328, -101, -108, -225, -59, -7, -9, -126, 117, -128, -169, -171, -97, -275, 2, 113, 66, 210, -69, -250, -43, 175, -182, -182, 64, -95, 2, -24, -2, -359, -271, -211, -203, -287, -116, -340, 90, -213, -89, -152, 89, -107, -136, -425, -212, -200, -324, -85, 95, -81, -80, 215, -255, -98, 133, 75, -15, -156, -113, -170, 45, 275, -224, -88, -148, 393, 165, 104, 74, 10, 180, -126, 208, -128, -211, 156, -2, -38, -78, 44, 230, 24, 216, 203, 294, -9, 391, 239, 111, -106, 225, 166, 122, 167, 56, -94, 317, 414, -74, 184, 426, -151, 246, 273, -19, 7, 140, -41, -29, -231, -208, 89, -25, -209, 103, 182, 316, -113, -7, -24, -173, 135, -33, 249, 52, 74, -210, -147, -26, 202, -195, 279, -15, -173, 82, -359, -93, -333, -175, -202, -66, 154, -26, -33, -119, -64, -26, 24, -302, -40, -156, -224, 57, -104, -250, -180, -249, -285, -241, -33, -260, -31, -81, -142, -345, -342, -37, -96, 122, 152, -102, -176, -49, -150, -253, -26, -288, 12, -276, -235, 92, 137]
3814A37p1j56K34k3P4M5k90K27j4j1j93J06r1J25l05L69j90L52k26M16m54L65
3836D26j87l78M01l70L51j37K08R3k88n4R3J7o8J14R7l75P5K61Po4O1k53L20k60
3860I0K31j27j72L18k24rL19l85K65l37J50n0m9k70L25KN7l23K62J26MJ06l43
3883c4j7l05L92j35J78O7l19J36J21j26n7r0L24J9q0j4k61PQ0n0KQ6m1M2l22J71
3909b26L7k14N7J87J29L1k69L12j76J4Q1J24m90J25J26n4J50k12L6R4r6J61k8
3932a01k31QM81l55RL58k49K22n29M68n7l0J51p5k06O4K16q9j37Q7J54k55N4P
3956c5k01R6j99O99r2j57Rk57J69J2J99n0m65K28J39mJ43J14k73J61j73J54q2
3979A35Nm5j21K79n2J96k49K2k19J88j06n6K51l26L39n4j42J7R0P9P2j8j33r2
$$ y = [137, 66, -90, 144, 121, 195, 240, -50, 177, 163, 152, -41, 65, -26, 99, -206, 163, -27, 325, 99, 515, 61, 426, 239, -139, 262, -108, 243, 106, 314, 407, 119, 65, 158, 175, 107, 221, 318, -57, 18, 279, 286, 222, 283, 30, 350, 90, 321, 194, 22, 340, 116, 107, 426, 41, 306, -31, 119, 69, 20, -250, 75, 77, 134, -189, 73, 199, 203, 309, -34, -51, -356, 36, -99, 79, 146, -173, -37, 84, -42, -99, -189, 135, 154, 74, 60, -201, -194, -114, -164, -162, -76, -117, -75, -397, -226, -189, -403, -346, -159, -30, 1, -268, 44, -132, -118, -37, 87, -403, -278, -152, -206, -56, -268, -232, -138, -234, -73, -101, -332, -324, 157, -198, -189, 169, -80, 142, -387, 81, 24, -6, 145, 70, -136, -72, 144, 55, -82, 5, 159, -96, -42, -35, -236, -140, -339, 360, 268, 111, 120, -137, 32, 44, 243, 193, -272, -44, 95, 91, 234, 348, 75, 236, 63, 217, 135, 140, 95, -26, 253, 201, 397, 148, 170, -49, 139, 33, -23, 228, -98, 241, 187, 45, 62, 152, 231, 303, 285, 152, 60]
4003F0k63K85L01k60L47l92J05j26k19L91Kl04q0K51k08J45K61k43M4J51l13J31
4025F6P8J31o59K68k6j51n9K96j41l5J46Q1j88K77j33j95J34J80r8k34K73k31
4047b20J2j60L10l0R3m08J44K67J9j95L32l50o6K63o6q7J22j60N4R0j45K48O6
4070A33q9j73M5n3K73J88l33lJ18n5j03K30l14J1KK28j27J17R9j10m2J62L1O4
4094B99k49m1OK20K1j40k05R8K81j13k74L56j09l44L38l4P0n9q1L50n24L54j4
4117B06l37K35j83M83k75M6J20l55j02L30j96K52k73J28J73l0m3l79K25J20qk12
4139g5Q7k35K28J35j62k11L31k42J81j03q2L15q1l56K89k18J66N2p0l07N42k29
4161d5j73L77k66k74J02K33J86k62o4j13m2M64k01O5j94R4j41K78J1j04j76L56
$$ y = [60, -203, 82, 383, 123, 470, 78, 183, 57, -162, 229, 231, -73, -153, 98, -110, 35, 296, 53, 97, 248, -65, 66, 144, 275, -384, -116, -142, -293, -352, -56, -197, -232, -86, -5, -193, 84, -49, -244, -110, 70, -28, -262, 11, -220, -208, -368, -58, -88, 5, -403, -259, 8, 27, -168, 164, -186, -252, 11, -55, -142, -20, -180, -126, -36, -181, 67, 133, 44, -129, -84, -137, 136, 324, -9, -12, 106, 51, -52, 178, -136, -125, -123, 105, -22, 95, 194, 84, 42, 204, 235, 299, 50, 9, 15, 235, 256, 116, -89, 9, 290, 177, -97, 259, 150, -194, 144, 110, 180, 121, 40, 390, -134, 220, 206, -131, 104, -79, 404, 129, 175, 295, -60, -162, 168, -28, 224, -49, 79, 252, 222, 179, -200, 25, 145, 137, -75, 12, -223, 5, 140, -22, -233, 98, -144, 37, -66, -148, 167, 86, -270, 19, -199, -33, 19, -51, -358, 184, -45, -218, 159, -107, -381, -279, -46, 140, -122, -186, -299, -341, 123, -78, -13, -207, -113, -254, 24, 35, -69, -245, 111]
4183A11l87N7oj24K19q5R1J52j58j76K76J08n18L71k4j16J25P0k10J45K3j17K99
4206A26k95J74J33j93j18J91r3J56j77l0M1j18J23J28J20k23j2r7L21j98L50k85
4228B4L2J41M2p8j32n8K37l49J79J43L5L0m9j60J72j45K0q4m1k5q2R6K93l35J02
4253HK07J81k26j74J12J37o63N00j67L08l26K57R1j92Q3j99K34pN0j64L3m9jj53
4277a20L63n69M97j18k09O6J58k6K35m16J20N7o7J5L9J65j79j0k29j89L13oJ66
4300E6k85M08k30j8m8k0j31J30K6k40N94O4j53j02j49k17P8N55n50j54J03L18
4322C5n8%K43k61j59K83j6n08M90k19K18J2j50J07K97k22j51J48lk15K16r2j9
4345b4L3o6j4J67P9Pq7m4j76M43j96n3M7K64j53j93J54k23K25k22K18j03Q1K30
$$ y = [111, -276, -219, -225, -349, -130, -215, -124, 28, -130, -306, -30, 78, -440, -69, -93, -209, -84, -14, -224, -79, -56, -173, 126, -169, 5, 138, -55, -173, 18, -75, 81, -96, -126, -85, -203, -80, 48, 168, -55, -67, -164, 157, -41, 309, 24, 56, 197, 239, 161, 29, -29, 208, -141, 38, 181, 216, 246, 197, 37, 209, 64, 84, 0, -41, -66, -148, -52, 241, -94, 8, 215, 396, 170, -4, 108, 245, -418, 82, -85, 223, -103, 154, 245, 53, 136, -63, 171, 164, 214, 50, 83, 34, 33, -120, 243, -326, 171, 53, -156, -90, 68, 42, 277, -139, -19, 38, -29, -14, 25, 190, 11, 1, -228, -417, -104, -110, 56, -229, 179, -51, -69, -117, -137, -268, -138, -112, -352, 242, 306, 153, 51, -98, -315, -237, 318, -232, -386, -283, 35, -23, -23, 220, -41, -200, 83, 67, -441, 49, -170, 48, 60, -90, 17, 314, 92, -59, 89, 86, -129, 87, -5, -24, 9, -57, -71, 96, 175, 182, 95, 51, -125, 318, 122, 69, 116, 380, 227, 34, 188, -35, 190, -32, 186, 83, 164, 394]
4369C94m71J44l97M42O4k54M03m00K83k17K61k93M8LK66l25r6J93J38m8k13K06
4391A31j10P5Ok36N1J80J08k65NK26j58j28N0J78j42Q6Jp2p7l10M57j96L68n67
4415c39J32K91k22j9k44M18j04n1K8L97m72L24m52J97j11j24L90j31l2r2J4k9
4437b31J84j57O5j62K49J46k08K43l30Q4j69l7J55J22k37k12M54m76N87j06O0
4458B4j93K46K2k98L07j30pJ15j8j9J29m38J87r1J45j57K81O2k8m6Pl1Q7l41J15
4483g0J30L2J98q0k16J79k50l5K39J02l0o9p1J93j87K26k72q2J69j88K16j40j22
4506a28L03j35M2O3k22K11k55M28q4j41J24p9j4k63L82k08j46M71l93K23j64O2
4528G7n9M7q8j80K05J31j54M7R4k43M10k70J31n0k43o3j13L09j50n2L52j42J93
$$ y = [394, -77, 67, -330, 112, 176, -78, 325, -75, 208, -9, 252, -41, 7, 10, 276, -49, -145, 48, 186, 138, -75, 131, 21, 96, 102, -134, -83, 97, 205, -60, -55, 171, 13, -115, -65, 113, -29, 57, 58, -14, -91, -401, 56, -140, 228, -339, -207, 84, -138, -157, -401, 17, -87, -138, -110, 287, -185, 139, -313, -116, -227, -351, 39, -92, -124, -216, -202, -231, -47, -204, -139, -301, -52, 94, -114, 129, -201, -117, -286, -323, -168, -46, -283, -495, -41, -517, 70, -36, 24, -169, 77, 99, -199, 108, -22, -29, 86, 68, 49, 178, -260, -73, -164, -19, -176, 105, 167, 139, 93, 100, 69, 156, -185, -70, 60, 92, 290, 210, -6, 173, -77, -112, 127, 229, 199, 130, 59, 252, 65, 291, 19, -63, 106, -82, 134, -6, -128, 175, 40, 82, 145, -77, 134, -121, 307, 223, 82, 206, 127, 113, -150, 232, 24, -122, 349, -44, 179, 15, 77, 18, 65, -23, -203, 2, 133, -21, 26, 120, -123, 287, 17, 148, 98, -145, -208, -321, -12, -162, -214, 138, -4, 189]
4551A89k6m44J58k76M20K21o4j42j45J66p1r0L6J43j67j45o6l2J21K07K7j88K26
4574E8N6j87k12J56Q1N9l67L12m4J2l1K45N5j45n7L7M9K6j03l06K50no4J49J09
4599A33N3k87K28l78L66m1k23J56P7j68p6K79K1k25K97j36k2K20k04J21K5l79
4621a63J11K95k02mJ91j61jK02k07K06j18j27K40L5J47l00J34Qk11J56l69Q0N18
4644D60k47j32J23k60oQ6k10K47j13J60n1j15k7J48l09J60j91K90L5j37J85r9
4666cM8nk36J96k53J26q0L12j14r2P1k13O2k02L63l03J88J35o7K68j29l24J3k08
4690d47K35M11k83J90m36J94ol12M09j56j48j32M79q0j21N0M12k06O5o0l82K07
4712a17K59m59J38J9K09K00m60M06k97l8K40M4j85J34l37J59n7J94O8J90k01k44
$$ y = [189, 163, -281, -123, -399, 21, 242, 178, 36, -109, 57, -14, -104, -68, 75, -92, -237, -303, -335, -214, -7, 20, -168, 58, 114, -73, -285, -129, -48, 11, -356, -44, -88, -76, -107, 138, 193, 48, -9, 28, 77, 103, 0, -306, -56, -61, -125, 24, 133, 186, -101, 127, -251, 115, 74, -149, 7, 84, -84, -160, 119, 140, -85, 212, 76, 54, 274, 70, 191, 216, -163, -52, 243, 41, 37, 228, 67, 66, 268, 61, 267, 149, 22, 262, 297, 444, 144, 278, 286, 75, 231, -138, -58, 460, 213, 81, 204, -56, -62, 24, -186, 61, -52, 108, 57, -58, -85, 63, -246, -86, -277, 13, 48, -89, 96, -3, 45, 40, -196, 0, -253, -127, -207, 105, -9, -101, -30, -243, -181, -383, -20, -323, -135, 0, -67, 201, 72, -252, -239, -447, -212, 199, -84, 106, -330, -136, -142, -454, -45, -201, -349, -481, -2, -82, -203, -153, 259, 53, 118, 58, -324, -117, 142, -317, -179, -160, 49, 249, -211, 195, -102, -140, 100, 144, -41, 93, -244, -85, -142, 52, 120, 310, 109, -135]
4734a35L72j07mj2J96j76P4l60J96J12r8J88l45L17j36j6K38k3J00k02k51K30
4756A58o4l8j48K34o7Q6J5K2J06m63K65P1R6j20l6k59M32m12K25Q2j43ll5J19
4780A23L3p6l4J9j23J41j32p7N6J52k18J47p7O2K19n53M02j81m8r4j41L19R9j66
4804a48N9M1j95K29O4k73J29l3l0j7J59oj92K02l2R0J13m24L74k06L45k55l58
4827c64m8L10M0K02j47j85m0P4Q7J27j21k38L42k07K35k71n7N0K30J5k21J21L31
4850B65k93R8n3j7P1l67J02J46P3J46l24n8L58k6k38l91O55M3j99l08L60L43l43
4873D3l0L52l37q9n0K40P1J5ln8j68j48J45K74k44l9K47m26L59L3l38M17l34O6
4897bJ81k5j70J04j25J69k39L37P2m23J07j13J50k04R1%N3K6q8M20j85L4k93J77
$$ y = [-135, 237, 130, 126, 114, 310, 134, 208, -152, 44, 156, 58, 246, -99, 218, 82, 66, 304, 281, 381, 179, -72, 158, 94, 56, -92, 142, 75, 161, 176, 198, 304, -159, 106, 177, 273, 153, 117, -142, 290, -122, 103, 185, 42, 39, 4, 123, 156, 80, 46, 65, -58, 83, -49, -126, -70, 82, -136, 11, -66, -4, 215, -338, 64, -117, -165, -259, -400, -81, 18, -148, -89, -48, -243, -14, 50, -223, -94, -127, -157, -174, -15, -21, -213, -11, -43, 47, 160, -264, 110, -96, 249, -6, -364, -412, -102, -62, 140, -7, -192, -232, -158, -71, 56, -65, -303, 39, -168, 67, -204, -261, -211, 19, 34, -187, -66, 265, -28, 70, 17, 0, 71, -296, -194, -48, 25, 171, -153, -211, 147, 121, -117, -508, 147, 190, -9, -317, 43, 386, 43, 13, 365, 28, -61, -111, 129, 200, 215, 212, 154, -14, -162, -17, 257, 13, -26, 221, -205, 154, 187, -151, 266, -68, -2, 179, 154, -16, 88, -37, 132, -107, 230, 302, -121, -14, -127, 23, -181, -90, -90, -37, -11, -99, 321, 136, 170, -123, 54]
4921E4m5J30r7j62K20l49J66j23J92n9L4k65K04K77k35j43R8J18K01q01O93j3
4943I5j11J20q2j31m8q1kJ85Q6n1J3l7k62L35J64m3k54K7j42K33P4k33K67k10
4967h8J05L4P4Nj11j97J73l06L07j30J49J15j72j11J89k23O8M10l46K90k48K9
4989A6k56Q9L28k10J42k32J45j8j0J69l8o0k33J16J75M3o2j57M29l21j36K23J47
5012B89j91K30J12o2k58j83L01l75K35j78J67k29M06k00k7K02j7j23L6r0q4K26
5034A87j51M5l5n1K02J6m34J45O6L2j18K31N9l40P9J66k70k2K99j42n9K4J92k88
5058a67j45K47J77om52L44J43p4k19N6K19m30J85J28J05j19j51n5MQ3p0J5P8l1
5082a35j82J92k06K82k03J71m8J00J10j9j4k96J20l4j03K98m60L13j19K68J35
$$ y = [54, 9, 139, 42, -120, 100, -249, -83, -206, -14, -73, -39, -304, -100, 177, -58, -201, -103, 15, 216, -585, 108, 95, -16, 104, 22, -109, -157, -238, -240, -55, 31, -20, -7, -44, -306, 29, 193, 150, -104, -77, -219, 14, 88, -145, 122, -88, 17, 51, 125, 130, 19, -178, -5, -311, -4, -134, 15, 130, -42, -153, 36, -187, -119, 291, -55, 235, -13, 16, -240, -151, 177, -33, 109, -123, 22, 4, -6, 163, 125, 65, -168, -52, 123, 166, 104, -53, 376, 55, -81, 142, 289, 98, 328, 440, 378, 120, -63, 238, -137, 98, -80, 87, -142, 264, 64, 37, 239, 222, 99, 135, 45, -39, 187, 36, 81, 46, -5, 197, 213, -221, -76, -10, 22, -96, 135, 194, -146, -67, 99, -171, -193, 106, -36, -95, -71, 121, -167, -312, -65, 112, 106, -346, -2, 141, 67, -152, -96, 123, -307, -122, 6, 111, -8, -159, -214, -210, -127, -197, -182, -104, -135, -317, -125, -331, -49, -252, -81, -129, -29, 81, 62, 48, -248, -128, -162, -265, 33, -427, -114, -233, 35, 170]
5103A70n99L88k19L64j34k78K21n7K54l36M6M5J10J06K1n06M16P0M0Q1j51j36
5125h4K51k04L4m4J70nJ6k10l46M73R7m2l11J10OK69k7k95K44K06l75n0L32J05
5149C20k01K08k67k74K32J63j33j87L54l98j94J63L77k59J18J27m9P9j17j11j28
5170a77M09k46K33k29K88k84J9o2K14l67K46R2j12n7m5k08M68j84k38OL52j58
5192d0K12q3J69m47J92j15J94m1k57K07J60k30N3o1O5ok09J74j57L19l73N7j25
5215c42Q11n24J86k37O3Lj14J3Q1j7J90k22O4j0P6l73L35J22l98J42j6J49M8L4
5239F4P9m11M08m74M28k29P0J44J92l7p7n5J17K56m54Q4l00m7K1L79k5k89N5N35
5263D34k53Ok71J05Q4pk88L25q1J72n9J6j04k2K26l01m1M00l16p1J78oJ29k26
$$ y = [170, -429, -41, -260, 104, -30, -308, -87, -144, 110, -226, -180, -135, -25, 81, 102, -404, 12, 82, 122, 203, 52, -84, 167, -37, -3, -47, 123, 118, 134, -76, -422, 51, 148, 106, -205, -95, -89, 180, 153, -142, 102, 308, -67, -117, 215, 320, 119, 327, 60, -214, 18, 181, 48, -139, 215, -183, -377, -214, 163, -96, 22, 149, 100, 179, 62, -49, -177, 232, -14, 219, -10, 278, -6, 13, -49, 165, -202, 44, 136, 24, -33, -78, -286, 182, -2, -240, -234, 118, -40, 172, 89, 258, -189, 3, -112, 82, 41, -216, -9, 151, -79, -26, -87, -22, -28, -237, -63, -220, 99, -274, -217, -342, 469, -55, 131, -106, -43, -40, -154, -141, -60, -77, 113, -109, -45, -55, 21, -352, -17, 105, -293, -151, -167, -18, 30, 64, 143, -268, 140, -334, 94, -135, -65, 79, 271, 234, 157, 102, 219, 475, 21, 105, -195, -242, -221, 158, 133, -156, -101, 434, 181, 187, -84, 21, 105, 98, -190, 135, 54, 226, 167, 183, 79, 57, 283, -18, -59, 341, 25, -46, 132, 126, 255, 29]
5287B9J70j82m2qR6j18N3N2j79L00k08P8M2j54N35k96Kj30j45J41j85j26J97Q5
5311Gp6j32O3K83l31k17M12j96J18J21k34J82l38R6Qk4q0J22K57L8n3m01L2J22
5335b21K25j42J77J36n08K48J47j2j00Q0j3j25J31N0m41M12l69J30O1j37J92K9
5357e0J62j94K86k57j26J19J00j75m4n5J15l2J24J47j01O4j99L54j99m0Q3l16
5379b34J22L0K95j85j49K47n4j25M10l60K3J94j4p5qJ54k52J29r0r3K93O4l11
5402A1k77K75K18k15Q6Q2l1k62J95J36l5j73L10l87P7R5o3K4K5j92M88p9k67J39
5426A80k66L95l08k2jN7o4J45o9J22k24J96O5j43K56l33j52K49j39j2q6Q7Jj69
5450b35Q0J88J39j16p2j31M46n51o6K33j80O0K8Q7J72k54p0J73j00K29k48k4M58
$$ y = [29, 199, 17, -25, -33, 63, -55, -2, 50, -129, 171, -37, 41, 83, -71, 464, 168, 170, 40, -105, 36, -149, -275, -78, 7, -69, -201, -138, 145, -186, -403, 9, -187, -69, 52, -182, 0, -338, -242, -234, -258, -338, -216, 41, 79, 26, -375, -343, -221, 4, -138, 39, 175, -333, -85, 62, 50, -50, 30, 17, -108, 23, 73, -368, 44, -325, -195, -134, -271, -79, -50, 112, -82, 204, -53, -179, -60, 40, -135, -179, -234, -119, -151, -27, 120, 19, 83, -116, 238, 39, -1, 82, -234, -112, -82, 213, 28, -121, 126, 72, -53, 357, -3, 20, 214, 200, 125, 117, 271, 19, 148, 58, -35, 258, 322, 11, -266, 9, 227, 12, 98, 180, 149, -113, 82, 218, 183, 10, 320, -67, 10, 105, 42, 66, 91, -101, 387, 308, 41, 180, -86, 309, 1, -21, -22, 35, -29, 116, 47, 169, -55, 141, 206, 63, 319, -14, -166, 83, -56, -68, -154, -67, -66, -235, -155, 33, 172, 56, -16, -147, 299, -252, -318, -85, -265, -205, -177, -90, 82, -172, -242, -69, -169, 60, -188, -212, 246]
5473B46l53N0p0J81o16R28l34m5qK0m2L6kn9K98j80k54L49j27q9l7k47N82j72
5497E5r1J59l05K31J95j09j71L4j8J85k42n9M06r8j47l55O64l88P9P2P5k68J02
5520FN1J24K5ql15J38j88NO2L34r5r1Oo6K27l14K23l32K54Q9j34J0K65j55M6j65
5546BJ14n6J54l14L34k36J03j22J49j70n6J11q9Q3o8L7j91%J22K88m34M20l1j42
5570Hp8K89l41j45J78Ok59J28J18%r8r6N47K5k64N8k97K00P2j12k79K68P1j25
5594a26L04k47J63j74Q4k28J53p3P4J06k30K78m7%k5p0J03o8k5M7J4J45j83K2
5618cm3j31L1L12j07n5K5J05k07Q7J3J9M0K09k41J45k9k91R7j01L25l93K11j01
5642h3J3K74k21j72L58K18j37j20k84J81r4L3j09K32k0R7m17K78K6k1J76l46M00
$$ y = [246, -107, -57, -127, 54, -562, 366, 32, -13, -21, -1, -43, -7, -9, -68, 230, 50, -204, 145, 18, -71, -108, -355, 227, 55, -36, 123, -182, 49, 244, 135, -36, -2, -20, 165, -77, -136, 270, 172, 25, -330, 334, -54, 25, 97, 172, -96, 6, 57, 181, 206, 198, -117, 21, -167, -162, -100, 234, 139, 48, 54, -12, 215, -99, 124, -208, 46, 135, 1, 11, 276, 121, 167, 2, 116, 60, 214, -100, 234, -2, 101, -21, 128, -42, -98, 13, -76, 7, -61, -24, -215, -215, -93, 195, -239, 181, 150, 8, -70, 219, -122, -267, -89, -83, -342, -214, -96, -96, -194, -290, 257, 282, 18, 76, -221, -21, 51, -61, -340, -72, -1, -126, 178, -69, 94, -80, 4, -224, -71, -144, -70, 36, -194, 84, 37, 37, 12, -58, 45, -23, -48, -1, 13, 158, -25, -3, -46, -177, -146, 166, 59, 4, 29, 134, -73, 14, 27, 46, 86, 295, 54, 199, 170, -121, -24, -125, 200, -193, 18, -83, -70, 204, -17, -189, 169, 387, 250, 130, -154, 27, -67, -34, -143, 89, 69, 166, -251, 27, 53, 32, 208, -138, 262]
5665B62k84J10j19R7L01k82l19K08L40J20m03k81M98k23j90J75j13M35l15K4o
5686C5l3J73M0J0l93J25L8M7k9o5K07k17j12L13k24R7PL1j60L28k57k45K77O7
5710F0k07J45J78l23M76l50l55L59ql5P8j90j38K56n0M9M6l0J3J81l14K45l87
5733c01J79K1j3K30Q5m19J09K6K48J54m79KRM6K03l68L88j45J61k67K24J6j58
5756d9q1J99j06OJ87l52q4K81K96p6m32M12J38k88N4J91m09O7K25m9J85l00k0
5779eL50l92km7L97l89k57L74k2KJ00RJ86j45k62M53k06j33J67l89R9L78o15L53
5803DJ18k90L16j0j45J71p2L04m99K4n8M27l5n08J63J96j86L09o29M53o8j87L49
5826A47r3q2k34j9J80O8j65K35o1K56j30q3j15q9j19L85k18m8L47k94n7j16J65
$$ y = [262, -22, 88, -31, 66, 367, 85, -234, -26, 314, 434, 31, -250, 248, 25, -165, 10, -103, 332, 17, 41, 35, 2, 175, 215, 225, -168, -43, -5, 42, 13, -52, 155, -62, -174, 139, -85, 12, 19, 50, -110, 218, -39, -284, -7, 60, -147, -2, 176, -147, 329, -21, -376, -17, -25, -60, 18, -172, -310, -54, -104, -55, -9, -39, -26, 155, -159, 86, -301, -122, -101, -114, 116, 201, -218, -109, -83, 165, 319, -160, -158, -149, -103, 100, -268, 120, -25, 136, -131, 93, 109, -49, -130, 69, -37, -31, 156, -196, -280, 1, 297, 221, -211, 201, 339, 51, 105, 296, -113, -46, 179, 130, 315, 15, -5, 345, -47, -49, -96, 301, -88, -345, 29, 7, 9, 109, 118, 304, 159, -103, 350, 144, 11, 178, -211, -112, 266, -349, 4, 122, -168, 148, 138, -7, 164, 92, 396, -103, -79, -137, 290, 255, -253, -90, 106, -80, 229, -400, 53, -15, -202, 147, 54, -28, -262, -281, -101, -33, -198, 37, -24, 232, 102, 19, -96, -185, -304, 81, -137, -185, 162, -132, -189, -305, -140]
5849a40n3k97M61j9J13K42l27K8N6P0j53m5q9k22K66K6K10j94j31J02J87j68o8
5872a45L49l82M28j61l39J13J72R8Rj68k02L20k19L0L99j28j41k30J1Q2m4J21
5894b7m1J37J10k80J59n9J38K4k8m01M72n6j61j66L41j82J8J99j82J43j08K42
5916B92k59j1J6l6J89j80K21j34k85N33l66L9L4n0j70j07M94j45LK1J8n9J83j61
5940H0j06R4j45J77Q7M7l04J47o8J94j39j03M0R1N3l04K77j52J6j4J80j15j02
5963f9%J49j73j05K42Q1k45k13J36J24r7L5K34M8j12q0j07J64R1l52J41l29M50
5986A3k46j1q9K61p2L4q0R9o7N6j14J04K10k05j00J22k94M89k61K12q3K65k2l31
6010a10M29o19L29k38L1L4K61m8k54K83k44K41k3k29L46j98j52K70k37O1M9L73
$$ y = [-140, -193, -490, -29, -48, 65, 307, -20, 8, 64, 134, -19, -64, -153, -375, -109, -83, 127, -67, -198, -96, 91, -77, -145, 204, -178, 250, 89, -250, -137, 35, 133, 142, -26, -228, 92, -127, -97, 302, 174, 33, -197, -186, -104, -148, -27, -68, 69, 179, -101, 58, -1, 137, 161, 133, -268, 204, 148, -13, -179, 162, -20, -2, 197, 15, 158, 50, 292, 33, 22, 38, 2, 191, 11, 232, 98, -187, 346, -20, 19, 53, 3, -167, -274, 220, 75, 78, 99, 117, 58, 241, 80, -26, 68, -77, 100, 187, 234, -70, 77, 9, 203, 64, -39, 1, 92, 145, -159, 118, -34, -18, -32, 148, 33, -69, -69, 80, -93, -198, 44, 125, -120, -333, -197, -73, -170, -135, 99, 147, 35, -45, -152, 12, 103, -249, -108, -437, 13, -233, -244, -333, -72, -144, -110, -190, -91, -158, -102, -216, -112, 98, -107, -207, -85, -379, 110, -151, 61, -22, 243, 221, -110, 319, -300, 29, -209, -178, -144, 117, 69, -185, 98, -146, 95, 72, -157, 189, -9, -161, 109, -128, -67, -18, 355]
6032C55m68l5K49j00l5J55l27k51O55j7k51J61k46O4K43j85j78K34K94l09J29
6053A37K1k6p0R2k12K18L9j55R1N5j21j00J25j01L89l10R3k2K07l92Q4l62L86
6076F6k16j19K71j65p8J54P6m7N73m41o0K8Q6J0j43N3n2rq1J8J15k59K53l08L10
6101C5j18K2J68m71K98j01M92m32K13J2k63l1J6K99l48L34j74r8K74j89j75m1
6123b78P7K39n5l82J87J07p9l0K75k01m4N3K9N4L67k02k4l73L41r8L0k12R0K65
6147A36j68j41L85P9o12K39r9L75m6j8k0K68m89N3l7J69J21j72l08J18M44l61
6169h4J59Q5P0j17L57n16k17L82r7K4R8j1j8J33m93N3L35k6l66J59R7J24k73K86
6193A44j77R1L6J46k31J74o1j35J51K58l71k26L40k53J14J16r6l55L64J68j79
$$ y = [355, -113, -148, 101, 1, -34, 121, -206, -457, 198, 181, -70, 91, -155, -91, 152, -33, -211, 23, 317, 8, 137, 158, 132, 62, 154, -58, 160, 199, 44, 135, 190, 69, -31, 94, -7, 382, 72, 165, 143, 350, -42, 42, -320, 66, -150, -269, 2, -163, -241, -87, -11, -58, 515, 74, 14, 42, 128, 138, -5, 48, -4, -13, -94, -76, 39, -220, 33, -275, 35, -83, -61, 107, -364, -66, -167, 325, -107, 106, 118, -145, -176, -160, 139, -209, 125, -49, -147, 127, -62, -237, -278, -201, 38, -17, -399, -212, -105, -184, -214, 61, -140, -184, -131, -102, -48, 319, 117, 93, -280, 61, -37, -7, -219, -129, 136, -32, -173, 212, 291, -321, -82, -181, 194, 148, 130, 110, 378, -111, -58, -95, 74, 195, 23, -285, -167, 277, -84, 75, 160, 230, 113, 470, -46, -263, 119, 22, 46, 144, 133, 115, 248, -245, -192, 143, 117, -249, -90, 7, 131, -142, 144, -33, 58, 94, 240, 9, 183, 122, -13, 138, 396, 25, -201, 139, -114, 0, 116, 20, -335, 29, 197, 18]
6214A8o8N8j70L03k71L03j47n3qn1l1l5R6k1o6n0J08J33j70Q4j35K49j41m2K30
6239A23k63P7k56K73j30K98l00L31l64R3oL25l29K09k24J59j09j8n0K5M7N6L2
6262aK1j26N9j24J26nJ81p3m4P5k67J04R4j5k12M03j65J5p6Kj16l6K85l5j5J06
6288A61L0J03l23J69j97j23J48J25n0n6j76L1M8l2K71r8l9j37J67k13J0L38qk8
6312A21J50m99M76j30r0J38p8J02k48K02n87O81j83j16J17J0j96J15P6j26J39
6333G4r3j43Q6M1l43K40P4N1m5lM1l3N3k7L1Q3m75K40K39j22Q9k78K9L21l89J40
6359a19K64R2k47K81j47k37J89k7j37L32l15n2K0J25J9k36K70j17j76K69L1j50
6381f8p4J43Q1o8Kl8k64K10r6L63k75j84J30J24J17j10J3k29M05l92K77Mk02K56
$$ y = [18, -50, 8, -162, 141, -130, 173, 26, -27, -35, -86, -117, -152, -56, -77, -143, -193, -85, 48, -122, -38, -173, 76, -65, -107, 123, -140, -63, -319, -46, -176, 122, -178, 153, -211, -118, -124, 201, -128, 81, -143, 16, -93, -111, -161, -136, -89, -33, -1, 20, -106, -47, -171, -45, -50, 131, 58, 14, 89, -178, -74, 20, 5, -207, 196, 31, 46, -30, -28, -144, -180, 105, 70, 55, 161, 191, 294, -29, 140, -57, -180, -32, 93, 43, -13, -189, -158, -110, -142, 129, 31, -8, -145, 22, -191, -181, 157, 149, 121, 271, -228, 248, 118, 28, 166, 88, 190, -58, 144, -443, 238, 55, -61, 56, 66, -130, -15, 61, -65, 74, -19, -162, -76, -35, -378, -138, -64, -13, -58, -61, -20, -53, 0, -27, 4, 87, -388, -148, 91, -31, 58, -220, -191, 130, -259, -119, 145, 237, -10, 271, 124, -113, 76, 49, -88, 244, -71, -123, -103, 22, 41, -195, 75, -42, -218, 51, 82, -68, -142, 1, 82, 14, 16, -22, -286, -76, -172, 191, -84, -268, -138, -14, 103, -7, 6, -223, 182, -210, 67, 71, -131, 125]
6405A25l05J04k15N8K85K22m31J12M1K07k13J5O8Ro2jj72K73M9j17j52j7N7K94
6429B34q6j91K27j06J75k19j87j54M78k54p9L62%k09J03l55J07o4J98J82J23l75
6451i0j27J42Q8J99l41K23k02K5L43m57K23L4NP0n10K53j6L3k8K8J13k1J3k27
6475b27J75J69l34M53q2j62p7L13j77r3K21k38p4J95J45N1m80K01j2P6K80k15
6497A08k17o0J34J49J14l92n9P5M31n98L82j05j44L29q9J50l94M42m32P6J43K02
6519B45k84L90m51K1J25k68M6M3j07J70PJ56J02k16J1J3J4J68k41K4ML09M8l75
6543d6K49j93N5J13j75P8o4L08n11L43o0Q5m16L36k6k27o5L66K30m93K26N9k99
6566a27K65k28J56J57j80J6o0J67jj27p9J05O3pQ1K61o70Q3QR3J19Ql34rK59N
$$ y = [125, -180, -76, -291, -233, 52, 274, -157, -45, -4, 203, -10, 5, 73, 82, 20, 19, -153, 120, 169, 52, -100, -117, -60, 234, 148, -43, 184, 78, 253, 34, -153, -307, 171, -83, -162, 200, 200, -9, 94, -261, -154, -218, -20, 162, 285, -90, -217, -75, 13, 212, -129, 94, -108, -83, 260, -197, 26, 60, 65, 135, -375, -122, -138, -105, -133, -105, 8, -13, 0, -227, -52, 117, -217, 236, 154, -8, -85, 228, 51, -42, 179, -59, -133, 62, 207, 258, -222, -21, -33, 43, 323, 108, -109, -169, -35, 114, 228, -164, -223, -148, 283, -315, 67, -38, -182, 147, 58, 208, -186, 256, -176, -100, 43, 245, -39, 351, -100, -79, 46, -222, -176, -133, -240, -70, -63, 93, 195, -21, -10, 3, 17, 185, -56, -32, -28, 281, 329, -46, 203, 10, 65, 178, 3, 81, 17, 325, -186, 157, 97, 182, -234, 102, 76, -151, -216, 150, 380, -113, 113, 172, -127, 138, -90, 66, 223, 43, 59, -1, 166, 165, 38, -41, 64, 127, 120, 201, 462, -208, -125, -117, -24, 95, 103, -231, -240, 19, 24]
6592B4J13q8m4J3j02J45K59k43j08LJ59n4k15K71l53J37J75N6k46qL25l2j41L0
6616G6J19k86J64j28N4k25K80j08J76j47j95J69k61L62k82j63K72R8J53j21l22
6637c15J47L31m25M72n35J97l5K2O4N8J88m91K34m7K39P2j19K88j36l43J65J58
6659A89Rn0o23N78m1k3o6M9m3N9M1J56m42J15J26n6k01J32J13n6J17j64L37l49
6683i3J56k28J95j62j7K03j59L32j03j17KO5J57p6k02M3J97j15j66K65j02j51
6705g6Q0K70o7j55k1j74J07l25N22l01j25K45R9J53j29p8pJ00m5k2O1k82J43k2
6729d9J18J3J32J9j21k20K4M4j34M2K85k31J75J55k66m1p5Q7j19L8M1L6N2N5m5
6754A5J32l14J10l04K19J62r4N03p06N4L4J67Q4k26L9K87j49kJ05m7j3J88n45
$$ y = [24, 137, 49, 5, 18, -84, 61, 320, 77, -31, -28, 131, 77, -138, 133, -220, -83, 92, 148, -98, -106, 219, 187, 46, 76, 195, -91, 73, -55, -1, -226, 54, -54, 122, -25, -220, -51, -312, 50, -232, -395, -123, -25, 128, 7, -315, -168, 163, -262, 210, -325, -128, -163, -141, -77, -19, 169, -322, -88, -135, 104, 176, 57, 345, 209, -134, 31, 189, 198, 148, -475, 103, 62, 39, -27, 22, -21, 38, 79, 235, -207, -92, 34, -22, -223, -91, 22, -34, 83, -81, 256, -93, 63, -165, 30, -132, -149, 54, -105, 227, 124, 7, 9, 74, 231, 155, -47, -4, 193, 78, -88, 177, 75, -76, 4, 274, 207, 52, 31, -143, -36, -361, 161, -140, -265, -20, 79, 232, 103, 25, 18, 118, 73, 51, 112, -170, -27, -49, 69, 82, 214, 233, 112, -108, -84, -40, -174, -132, 153, -78, 97, 252, -14, -55, -130, -43, -162, -124, -83, -47, 5, 60, 15, 147, -167, -57, -361, -142, 20, -74, 429, -277, -223, -189, -22, 62, -164, -125, 162, 13, 11, 116, 69, 56, 244, -301]
6777c01L14k03j37K62J57l65K34M1p9R3j28M63l97QJ01pk90K91k61J03j39P2l3
6800b01M84k33Pk61J75P1r2J91j17l0K95j15j22J10%p8p2j83J42K26j76O5k26
6823a40L17k78n0q0L79j48l0L53k72L6n6m7j76J44L98k56n8M4Q9m75K35K23l59
6846b07J60M9Nqk36N5K41kL81m52L0R9j97Ll3N9L46k54M9M1n8J13k49J91k4jk96
6873a95K58K96n62J61J91k73k14N0K66r6J73k00K53J22l45j39J35J21n2j93J83
6894f0K10l00R0m7L3p1K50J31k11k46J75L20m45j24K88M3o5J09k08N3q5J46O3
6917D9p9M4J4j06R3j47L00k3j88J98j98k24L97j38J1j07l1K78k6j85L98k71l1
6940B8K24k70O8J46k20L10q9k94J72J07k52J62k36L89m09j45M72k13M54l38L40
$$ y = [-301, 13, -190, -327, -65, 92, -273, -39, 2, -77, 16, -112, 351, -46, -38, 63, 56, -234, 57, -204, -101, -240, -168, -201, 283, 50, 57, -204, -29, 42, -50, 141, 24, -6, 289, 174, 52, 162, 162, 84, 12, -171, -29, 197, 21, 86, -140, 177, -101, -151, -231, 148, 0, -30, 323, 51, 87, 31, -16, -192, -48, 350, 94, 36, 80, 169, -306, -71, 152, -207, -47, 2, 7, -1, -237, -182, 59, 57, 438, -14, 16, 115, -82, -79, -112, -53, 293, 39, 88, 129, 71, 184, -65, 126, 102, 101, -195, 63, 359, -203, -42, 149, -124, -338, -288, -22, -118, 55, -145, 108, 230, -115, -254, -119, 2, -50, -243, -60, 150, -150, -60, -107, -74, -145, 105, 236, 25, -221, -46, 274, -171, -295, -7, 36, -29, 80, -128, -75, -160, -14, 49, -30, 14, 28, -78, 15, -132, 168, 145, -43, 155, -43, -267, 130, -8, 3, -104, -135, 143, 117, -68, 330, 59, 28, 252, -18, 50, 196, -24, 286, 197, -97, 75, 182, -70, 92, -144, 245, -164, -309, 163, -50, 404, 66, 406]
6961D06m22K54k55l0J62r8K72j55j99J70k92J52J32L12k42j59K38l70L18Mk86
6982h8j41J39J2rk87M44P0m31L82p0p2N5j08QJ80m92K68r7J60l4J42o8K54k13
7006DK0K57j33j93k4J57j92K06l07N9M8M7j96R6L23j28j09J88k38K29l14J11m1
7029a30K30K1r3k30K48K91l28o1J69j43k50M44j07j6K22k75K6j77L64k97J08l56
7051c40L49K7j03Q9jN5p8j82M75k09J2l83M40O0n85L63j01K96L2P9k53j20R0q5
7075g3K51l47K46j95NL07N4l96J83R7l35L75j42O9M2k30L34j10j16l2k66M00j72
7098e1M90k52l6j10q6N3j69L02l4k46M6L03j94j21J61j25J17Q1J19k65P7O3m8
7121G5j91K70k92K1K05P1n3j00J34k06R1j34K39m68Q8N3L55k09m8lL40k33j39
$$ y = [406, -16, 238, -17, -47, 115, 17, 289, 134, -65, 105, -187, -35, 97, 409, 167, 8, 246, -124, 194, 198, -88, -229, -90, -78, -87, -374, 70, 140, -291, 91, 21, -51, 4, -104, -96, 84, -408, -140, -237, -77, -111, 31, -37, 217, 4, 24, 281, 148, -45, -69, 88, -104, 102, -205, -146, -98, -51, -247, -151, 172, 44, -65, 123, -115, 114, -200, -89, -130, 100, 121, 28, -202, 46, 337, 9, -52, 117, -26, -276, 168, 61, 45, 267, -8, 18, -159, 205, -92, 16, -340, 9, 36, -67, 22, 21, 76, -2, -184, 291, 82, 94, -289, 151, 211, -374, -11, -112, 184, 216, 295, 42, -78, 12, -73, 178, -169, 77, -118, -113, 194, 248, -148, 35, 132, -203, 172, 30, 99, 141, -89, 245, 135, 19, -13, -279, 121, -51, 439, 187, 151, 41, -45, 8, -161, 141, 107, -139, -93, 210, 16, -105, 56, -69, 48, 129, 248, -17, 60, 123, 75, -116, 154, -138, -117, 88, 159, 106, 6, 140, -66, 25, -109, 130, -338, -250, -197, 158, -51, -99, -102, 238, 5, -134]
7144a34q8J42J03R2Q4q6j73j33MK9J07K23q8o5k07L59k31j12n0J46J26j51L30
7167B27m52K09J35j05K3j69R5Q0J8j16j36o9M00p8J62r3j35k53J84J50k18j54
7189b95L92j87J81l48K54Q8j76R3k7r5K14m3R6P1j44J26k43J32L9k54J28j5j03
7212a16M10Lk10j30K92L6l70J38J67j1k44P1N7j90K63o7L9j70L92n47N36m53n4
7235a58K09J1j09J37J9j1N5M6j23J73l05J83k15K4O1Q3k11J42q6K68k47R7P5j01
7259A7r7Q8K7l8QN9k50J68K1j61J81j8j55K85m7m05M53k24j5r9l86N26k0l4J6
7284a00j84J69n2K73j70m27P62l88r5L04l07J05m3K54m33M36j35j33J17N9r5J83
7306A00l47J37K36j62R8j08M8N1l92L18j7K56k60J04j69Q6J18r9Q2J15j91j3J00
$$ y = [-134, -222, -80, 23, 115, 199, 113, -60, -193, -189, -160, -53, 170, 82, 17, -190, 169, -62, -174, -224, -78, 48, -103, 227, -225, -16, 119, 14, 37, -132, -37, 43, 61, -55, -191, -260, 140, 62, 224, 131, -4, -257, -73, 77, -141, -295, 97, -90, 91, -257, -3, 85, -91, 2, -25, -120, 94, 51, 147, 218, 74, 200, -43, 89, 128, -126, 2, -13, -116, 294, 297, 87, -43, 249, 285, -85, 53, 220, 209, -35, 36, 93, -97, 166, 99, 138, -32, 360, -187, 349, -104, -158, 51, 62, -47, 90, 109, 98, 153, 199, 76, 249, -56, 127, -88, -64, -3, 80, -131, 11, -75, 193, -54, 43, 118, 17, -80, 8, 35, -3, 5, 64, -186, -18, 3, -158, 23, 5, -150, 135, 88, -317, 136, -88, -103, -202, -588, -62, -82, -116, -100, -284, -115, -167, 106, -64, -491, 271, -117, -212, 92, -215, -110, -153, 101, -332, 104, -31, -164, -47, 12, -83, 100, -247, -110, 126, -36, 62, -46, 2, 53, -339, -21, -38, 218, -42, 62, -107, -21, 97, -2, 80, 195, 4, -9, 91]
7329I1L9o0L01m61J00K19k12J03K01l46J14Q8l78K99k20J43P6K8j80J59r9n0P7
7352C2j87K57kJ7k12k7L76r9j01k7k38L89J01p0j98k31l9K90n7j33K58J23k43
7375b1M3K60l34j6N5r3k17L31J76j96J6Jj91j5K12j3j46K35L58o85L11m3R6J74
7399B98o15K90J0j14K59o17M38p7K47L2j68J51l47NL6j4K53k40L3K87j92ok06
7422b57N1J82J69k40J54q8J85k48r0J40Q4l00K79l8J23R7p8m2j63J10P7K21l64
7445c6j47K25J73k01l29P2j5L37J44j74L8Rl69L59j75J22j3j05M25k05J52l30
7467d3J31K65l54o5P1L0K0k04J95j54J03J21j9j87K76J69m53J14K8j52L89m37
7489a56o1M77k67P8j91J84J41n05O19l03K30k40J46j44j63J07m8K9N0J25j60R8
$$ y = [91, 130, 70, 371, -90, 10, 229, 17, 120, 321, -25, 89, 177, -201, 98, -122, 21, 97, 125, -55, 104, 5, -45, 32, -155, 102, 100, 117, -95, -122, 254, 155, 54, 27, -211, 178, 279, 209, 11, -220, -259, 31, -26, -159, 99, 222, -21, 22, 282, -52, -68, -13, -106, -323, 8, 184, -12, 4, 5, -186, -201, 11, -2, -148, 87, 445, -240, 71, 28, 124, 298, -317, -27, -17, -131, 128, -489, -51, -128, 119, 151, -17, 134, -213, -208, -172, -186, 67, -173, -140, 147, -45, -51, -257, -206, -24, 145, -95, 59, -29, 156, -92, -182, -42, 42, -258, 21, -17, 106, 203, 125, 83, -80, 30, 107, 328, -36, -183, 42, 215, 14, -315, -243, -258, 79, 223, 49, 87, 96, -273, 86, -89, 33, 20, -85, 340, 135, 287, -43, 88, 353, -1, -66, 5, 35, 55, -149, 46, -108, -5, 116, 97, -90, 186, 355, -98, 16, 44, -108, 281, -156, -217, 260, -7, 71, -120, 64, 205, -300, 319, 16, 246, 6, 152, 8, -155, -48, -96, -67, -17, 108, -52, 46]
7511D6J87k70R9j42j36K79j43r3q0K40L0j39J55Ml40j07J80L54j67J01k82L73
7533A49J59k14j54J11j41qo4K58j1n3j42K89l70N0J34p5l3n3k72kP00k78o6o1
7557a47K79l08L71k30r5Q2n5k44L16j0K1J42q5k15K50J37k52L56rk92l3R1m5L90
7581D15o33M15ln9k6k91K87Lj69M3J30Rj5n5m3L23o30L77K61m09L00m59J74j48
7605b03J90L5q0K34k02Q5J68j01n1Q1m07K00m5J88j91l6K4j46K48K15k68K82k01
7628A9j52K20j84J93k67J40j30L07r6J28j20J61j05k25%Q9J77l1j89k15M20o0
7650H0n9p5K45j91J03m40L70n3q5j7K57k48k6j73M53o6Q9l4m58M87Kk16k04M26
7674A67k55J17j54j66K04L0J54m26O44k88K35l04K97m2n3nj1k52K39j33j77J99
$$ y = [46, 233, -37, 62, -80, -216, 63, -80, -173, -253, -13, 17, -122, 33, 37, -303, -410, -230, 124, -43, 58, -224, 149, 308, 94, -60, 51, -90, -98, -162, 96, 85, 32, -110, 179, -191, -141, -7, -82, -115, -168, -440, -442, 258, -20, -86, -147, 132, -176, 195, -35, -130, -48, -103, -347, -31, -41, -20, 122, 37, -178, 72, 209, -43, 313, 304, 12, -21, 70, 25, 415, -218, 197, 194, 135, 109, -182, 105, 108, -61, -18, 112, 121, 106, 51, 8, 331, -299, 78, 339, -70, 230, -229, -55, -203, -13, 22, -58, 176, -26, 59, 227, 126, 75, 156, -251, -51, -96, 92, -99, -135, -111, -257, -9, 206, -62, 220, 19, -133, 87, -97, 96, -171, -31, -161, 146, 50, 178, 58, 219, 114, -111, -111, -22, 155, 124, -65, -280, 140, 80, 21, -54, 191, 0, 103, -337, 33, -20, -105, -122, 135, -113, -139, -312, 141, 75, 164, 130, -328, 159, 161, -55, -259, 167, -88, 29, -125, -291, -87, -57, 97, -329, 315, 27, 262, -42, 255, 213, 160, 155, 144, -108, 131, -2, -179, 20]
7696B0j8M93m10j91J69O6j44k6J32r0K23M5j18q7j68J67N2J48l28M97p44M13l9
7719F2J25j71j52J18J33k31K32Jo7J92l58K03q8j65K91k77J03p6M17k24L8k1l2
7742E3m18M50P2j54O6k7l9j85K24P6Kl39K04lQ8J4K09j83j58k69M03j73J41j30
7766g6L8o6J65j26J32o3l8k25K8M80m42L5O1J42j26K72k83K6O4o9J25j87J64p0
7790c9k75M37r7j31O6q0J74j11Q0j0K33q3l02N8M1L24r4K8k86j28rK18r3M3J53
7815A17k14K28pl45K95k25J76J16k89P7J49l8K6j17k12N22l79q5J84l22L77P2
7837A06m2Q8m2j63K1p9J79j06J61j11pk7j75J50J16j66o8M6L43l31J54j46J02
7860Cj48p8M74j81q4j05K87m6O5k81J98l63K78o6q7K68k21n6J76j48L02j32k80
$$ y = [20, 2, 495, 85, -106, 63, 129, -15, -41, 91, 1, 224, 269, 151, 64, -104, 63, 115, 263, -65, 432, -312, 101, 62, 187, 16, -136, -18, 115, -116, 116, 117, 50, 242, -116, 87, -1, -166, 125, -152, -49, -125, 292, 68, 106, 85, 53, -365, 85, 157, 3, 69, 42, 3, -182, 42, 118, 120, -219, -15, -18, 70, 84, 293, 110, -48, -317, 86, -87, 54, -76, -38, -104, 61, -65, 67, 4, -34, -259, -231, 249, -193, -158, -97, 45, -81, 191, -92, -66, -2, -71, 54, -133, 31, -39, -314, 123, 26, -105, -39, -119, 55, -56, 24, 14, 247, 164, -138, -80, -39, 285, 191, 219, -67, -195, -204, 14, -79, -36, 117, -97, 131, 124, -221, 74, -151, 25, 141, -148, -71, 78, 40, 66, -51, -263, 259, -120, -205, -21, -343, 34, 106, 64, 152, 110, -53, -32, -111, 68, -38, 123, 12, 5, -22, -197, -47, 69, -97, -165, -119, 224, -107, 47, -99, 3, -145, -223, 251, 70, -14, -119, 168, 122, 187, -94, 104, -259, 19, -47, -134, 134, -87, -143, 33, -115, 187, 55, -225]
7883b25J52J93l09J70K63j64Q5j87L0J03j80j17J99j62P9K37J25l97K70k10J30
7904H5p0J90m31Q6J52k57R3L97l75Q5l8qP7j69Q6n7j1L79l8j94m1J50j29R0k5
7929B7j9K8kj62J19m3m6k72O35k11l3m50M59j52p0R7k99N87l6m28N03k20j21o2
7953a71K23j17K10k87K74j26j10K50r0R0m46K17M1K0j41K32k33K87N8j02j95K82
7975A66j01k37K09j46J87l9j7J35j23r1j24L61j45k82L7L77j86L7q2mm6J19J20
7998A25J21m21L24n6P1l09K69O1l16K2r2K57JP3M2K08l18k15L4Q3j03K26m13O53
8022C27l42j06Ln8L15j93J59l4j10l6k2L0K89J8j73k54L45m0p6k32q4L93j18j98
8046a97Q4J07L8l2j20j08N9K91k41K10j04k8J08j8J08j8j0k25m08M10k0p1J02
$$ y = [-225, -73, 120, -189, -19, 244, 80, 165, -22, 8, 111, -69, -186, 13, -149, -70, 167, 292, -105, 165, -45, 85, 15, 205, -226, -140, 12, -245, -152, 245, -130, -45, -83, -91, -14, -183, -97, -154, -165, 214, 176, -18, -59, 91, -38, 52, 27, 8, 36, 34, -128, -9, -52, -98, -370, 265, 54, 21, -429, 30, -122, -192, -95, -394, 193, 157, -271, 232, 12, -109, -171, 52, -65, 145, -142, 132, 6, -104, 146, 56, 146, -300, -83, -42, -22, -163, 69, -164, 123, 181, 79, -116, 166, 65, -172, 37, -109, 78, 39, 22, 157, 34, -57, -181, 180, 35, -247, -210, 167, -19, 18, -64, -68, -114, 5, 125, 246, -175, 149, 93, 164, -145, 124, 185, -131, -109, -201, 56, 57, 130, 172, 380, 62, -153, -119, -36, -139, 87, -326, 327, -15, -121, -118, -176, 139, -54, 105, 71, -39, -75, -97, -67, 222, 240, 67, -187, 158, 118, 42, -190, -274, 119, 1, -197, -113, -6, 32, 0, -120, -228, -169, 122, -119, 91, -13, -41, 67, 49, 157, 139, 129, -96, -504, -94, -114, -185, -83]
8069h3J89j54j5Q8k38K62K18m38L36K0k43J06L1l28K87j92K49R1l4L9j14j78r0
8092a91J18J35k29K4J69J44o1l60K51P9k18j11M69j10j84K36j79P9k9j10KJ47
8114G1j87K60k71K9j70R7J61J49K48m25K8K23p5k3r4m4L9Pj12K23j85K55j43K4
8138H5j13K9N4J05K17l77j2N7%k74L49k6j81P3J31j03P3j40J86M8n9K11k04k88
8162a59K04j79j21J96j13L02j11k13K52J15jk05j25K88j26Q5j64p9J97J48k40
8183d9L8j9j81K07R1j40j01J74
$$ y = [-83, 106, -48, -63, 25, -213, 49, 267, -171, 165, 185, -58, 48, 79, -249, 38, -154, 95, 186, 152, 191, 77, -101, -191, -73, 62, -167, -143, 26, 170, 109, -251, 0, 79, -139, -250, 219, 109, -75, 161, -18, 61, 32, -78, -76, 71, -116, 144, -127, -98, -268, -171, -10, 139, 387, -38, -10, 213, 138, 115, 21, -23, 16, 23, -89, 134, -51, 204, 61, 85, -28, 1, 55, 160, 377, 0, -12, 45, 45, -229, 120, 94, -87, -14, 117, 14, 87, -53, 133, 181, 122, 333, 129, -159, 45, -134, -255, -59, -172, 130, 19, -194, 58, 173, 172, -33, -158, 130, 4, 89, -75, -154, 43, 191, -49, -11, -30, -211, -4, 87, -53, -154, 20]
8191B0
$$ Imaginary data points
##PAGE= N=2
##DATA TABLE= (X++(I..I)), XYDATA
0@%%%%%%%%%%%mJ2j6J6j6J7k5L2l2M0m8N5o4P3q4R4j07J22j39J58j77J98k22K49
35A32k78L08l42L78m19M65n13N70o33P01p78Q63r60J072j201J351j530J748k019
54a085K368k841L517m566O445j0865M0371L8452l6453j0708k886P701j589O711
68C4572o70q583j1418P664J6717J1596k961o294j0140q002r81J0782N864n606
82C2540j2118l555M565Q829O807J699p513j1935n449M817Q056K604n234q156n183
97A0774J092O584O347N19q485j0492k802O146P533J251n112p408n407M57N235
112F232N797j542p677p751r81N601O173J451l914p495n926J007O363L967l371
127b066o378m762K6M475N645L104l819q433n008K889O130K539k963n180l431L9
$$ y = [0, 0, 0, 0, 0, 0, 0, 0, 0, 0, 0, 0, -4, 8, -8, 8, -8, 9, -16, 16, -16, 24, -24, 31, -33, 40, -44, 50, -57, 65, -74, 84, -93, 105, -117, 132, -146, 162, -180, 198, -221, 244, -269, 301, -332, 369, -409, 454, -506, 566, -635, 716, -814, 934, -1085, 1283, -1558, 1959, -2607, 3838, -7027, 33344, 71796, 35343, 24635, 21749, 29450, 27861, 34572, 33902, 25319, 13901, 21565, 38282, 49878, 46917, 40623, 30483, 22481, 21500, 32282, 38146, 32540, 20422, 16867, 21432, 30261, 37068, 38767, 31254, 19319, 13870, 18687, 26743, 29347, 24113, 15957, 10774, 11866, 18450, 24797, 25316, 16831, 6339, 3537, 9683, 17216, 18467, 13355, 5947, 540, 997, 6232, 12029, 10487, 2810, -4941, -5922, -321, 5852, 7303, 3389, -4106, -10032, -9025, -2662, 1305, -2066, -8444, -13206, -13180, -8705, -3060, 44, -3775, -12208, -17216, -14327, -8197, -5658, -8621, -13801, -17232, -17193]
143a7193M767O770J677n316o920k623M337M391J376j318m072m123M07N982O121
158e737L5n301n525J88L316L427K488j182n257l747L159O394L746j737l377k398
174a1508k046K513O211L539l642o393j565M671M842J805L84l154m861j009N632
189d581O409O21m852l714o00K235M116M901m89o283m703K199O309M231j24l072
205B603m558k474K765O451L924l139n651l230J642N051M301J336m143o052k402
220c576M484O572K130k946n465l228J097N304M767M81n166o346j323M421N518
235F724K209l062n397m045Q93N843N011m24n552o191l83M109M724K064k321n847
251a645m284J412O075M774j327n675m832o20L580N051K788l031o667l419K558
$$ y = [-17193, -12426, -5656, -3979, -9295, -16215, -18838, -14501, -10110, -8734, -10052, -14124, -18247, -17840, -11858, -5737, -5702, -11003, -16528, -16340, -13024, -9597, -7109, -8291, -13548, -17295, -14136, -7742, -3996, -5733, -9110, -11508, -13554, -11041, -4830, -1291, -4933, -11326, -12891, -8220, -3378, -1573, -1189, -4343, -9204, -10213, -4581, 1828, 2449, -2403, -6117, -6717, -4482, -366, 4535, 4046, -2237, -6940, -4741, 1568, 5799, 5675, 2603, -1955, -4429, -1664, 4787, 8711, 5572, -79, -3309, -1667, 3384, 7685, 9021, 4878, -1174, -3576, 908, 7480, 9610, 6664, 1199, -2029, -932, 4372, 9139, 9620, 4454, -1892, -3215, 1206, 6724, 8933, 5871, 474, -3571, -2678, 3165, 8176, 7752, 2200, -3991, -4374, -265, 4459, 6523, 4202, -1645, -5929, -4517, 1558, 6332, 5005, -670, -5502, -6122, -2542, 2509, 5297, 2266, -4401, -7820, -5262]
266e262O176K727j291m320m375j149L478O423K178m120o240k446L385M385L001
281B550j53m507n036l30N040N251O92l731l995j996J246M526M418n34n564m532
297f655J445M768L532P69k263m026l399K184O037L293k139m819k261Q63L160L432
313C921J684k512n126j600L007M576J697j756k829k567J83L137L634P68l627l613
329a023n44K735K773J722r24l473k446J23L935L268r20l266k772p5K002L011J702
346E828j921l551k262J003M131J864j254k656k555k90K103K818J674k645l857
361a570j592K759K818J056r93k527k855j85L144L218J91l141l247m80J724K585
377I05J651r08l418l000O54L731K585r29k657k614m59J268L498J932j995l683
$$ y = [-5262, 914, 3641, 2350, -1970, -6345, -7494, -4016, 2407, 4585, 465, -5775, -8221, -4836, -451, 2550, 2397, -2110, -7146, -7476, -2436, 2815, 3507, -224, -4219, -6215, -4969, -443, 3975, 3441, -2123, -6655, -5210, -442, 3090, 3859, 1596, -2430, -5829, -3645, 2392, 5685, 3546, -1273, -3534, -2671, 489, 3921, 5605, 3093, -2033, -3633, -626, 3950, 5647, 3891, 1062, -1505, -1322, 1815, 5449, 6217, 2590, -1023, -1567, 1168, 3941, 5663, 4739, 1266, -1180, -1057, 2878, 6146, 5226, 1960, -812, -887, 1115, 4126, 5828, 3907, 356, -1906, -903, 3228, 5092, 3838, 1182, -1373, -1663, 440, 3258, 4932, 2287, -1570, -3162, -403, 2415, 3471, 2478, -49, -2904, -3089, 55, 3273, 3464, 323, -2924, -3404, -1680, 905, 2556, 1648, -1770, -4770, -4116, -385, 2200, 1271, -1386, -4000, -4459, -3191, 307, 2239, 244, -3439]
393c439k067J932K831J909o06k161l106j082K878L887J135k917l217j066J577
408c512K384K385J38l166l751N12L475L316J16k240k707j718J003L398L282m12
424B503m404l069Q77L660K516Q05k278l040k622K442M083K482j498l835k120M47
440c051L127K851J033k152m541j360L011L991J521j568l192k391K64K960L655
455D158P85l673l732n93K568L139J660j068l412k808O23L800L180q13l017k958
471b161m09J833K356K760j292l773k619J434L496J848o18j823l253r10J967M009
487B845R74k174l034j508J484K008J740N44k439l028r28K687L156L61j783k512
503a607j048L91K393K287j1k847k549K36K464K361L23j661k301j505P63L330J762
$$ y = [-3439, -5506, -3574, -743, 1166, 560, -1601, -4707, -5789, -2911, 976, 2111, -806, -4023, -5089, -3512, -1128, 1257, 1395, -1771, -5522, -5010, -1535, 1781, 1897, -343, -3050, -4768, -3765, -367, 2915, 2503, -1901, -4970, -4093, -433, 2083, 2888, 610, -2430, -5052, -2610, 1473, 3955, 2457, -1378, -3498, -3051, 76, 2927, 3960, 1808, -2733, -4093, -1082, 2909, 4430, 2862, -330, -2721, -2457, 503, 4158, 4943, 1270, -2462, -3055, -487, 2652, 4312, 3244, -168, -2976, -2353, 1447, 4627, 3814, 797, -2161, -2570, -737, 1619, 4379, 3087, -686, -3305, -1871, 1625, 3473, 2855, 1032, -2221, -3131, -1164, 2845, 3819, 1645, -1389, -2897, -1413, 595, 2335, 2879, 440, -2588, -3516, -829, 2327, 2688, 905, -1607, -2655, -2264, 129, 2416, 2405, -442, -2991, -2755, -291, 2070, 2393, 732, -1569, -3074, -2311, 1019, 2781]
520B781q68k824j790O40K088J728O00j348k376j419J681K530J634j139k284j510
536a876k37K143K390M91j781k734m59J868K337O78q94j867j230L04K104J878P3
553C188k100k205J74J704J723N67p76j981j337M97K787J617p69j908j534K14J100
570I61J767J143j336k562q88J165K462N86r73j027j688p50J835K656O15k862k071
587i67j24J280J367J034L6k585k149K03K675J993o84k011j584o54M30K476J855
604B591j529l014j424Q71J923J402J18j419k637j472J655L007P37j691k077j696
620d655R70J447J960j82j859k828o3K203J852M31j059k118j603R58J895J875m72
637a248k171k053l4J781K132N62j076j982j171N48K540J773q03j715j666r5J720
$$ y = [2781, 1913, -911, -2701, -2061, 27, 1755, 2355, 1007, -1369, -2788, -1107, 1423, 3057, 1918, -366, -1876, -2113, 30, 2420, 2911, 1130, -1604, -2063, -195, 2142, 2820, 1926, 59, -1171, -867, 1237, 3115, 3188, 1088, -1117, -943, 761, 2484, 3051, 2275, 294, -1043, -546, 2241, 3858, 3089, 1181, -353, -139, 961, 2728, 3871, 2535, -27, -915, 250, 2712, 3298, 2325, 1298, -390, -1140, 695, 3351, 3966, 1104, -967, -1091, 189, 1556, 2590, 2626, 41, -2108, -1905, 770, 2763, 2079, 68, -1516, -2170, -1740, 736, 2591, 1062, -1952, -3376, -2505, -582, 820, 938, -481, -3118, -4590, -2935, 72, 809, -882, -2959, -4655, -3685, -2238, -278, -460, -2319, -5147, -5210, -3007, -1155, -724, -1783, -3901, -5504, -4546, -2651, -776, -1248, -3419, -5472, -5506, -3725, -1593, -1031, -2107, -4089, -5260, -4712, -2172, -399, -1202, -2917, -4583, -4678, -2958]
654b958K438M97j190k222j183J135K764J558j009j775j364J71J651K286N78j274
670A03k208p21J405K134J340m49j295j800k37K211K649K63k019j661L3J231J496
687B475J204N3j475k099K15K749J366l42j139j315m22Q97J812J719j251k098p61
704A588Q41J513P79K71r06k019p56J630K210L81j428j182l77N1P88J852j54j753
722C329j726J46J577R73J85o73j365r85K52J653R75o28j831r03o2J382R74L94
740C667j000j919q17J266J238J93p51j135j157P0J295J097p8j544j267q42Q54
757h30J700O56j260j508q74K54J152J323j52j405j595m40Q27J483P19o93j606
774b249j509L89J280J661r8k189j000k31J443J238M02n10j873q97M37J642J205
$$ y = [-2958, -520, -23, -1213, -3435, -4618, -3483, -719, 839, -170, -1945, -3309, -3138, -1487, 799, 1377, 103, -2105, -2826, -1421, 713, 2053, 1604, 309, -1491, -1728, 483, 3132, 3395, 1376, -285, -252, 979, 2475, 3679, 3732, 2257, 158, 373, 3122, 4488, 4146, 3007, 1692, 1270, 2167, 3979, 5698, 4447, 2349, 1588, 2429, 3942, 4721, 4992, 4086, 2067, 1311, 2941, 5151, 5532, 4104, 2922, 2545, 2596, 3384, 5236, 5082, 3329, 1603, 1749, 3326, 4299, 4484, 3811, 2446, 1461, 1713, 3366, 4341, 3713, 1882, 979, 917, 2299, 3273, 3667, 2667, 748, -69, 1197, 2435, 2628, 1877, 742, -415, -345, 950, 2047, 1969, 425, -842, -1684, -830, 870, 1526, 266, -1242, -2116, -1862, -710, 613, 461, -944, -2539, -2979, -2152, -669, 50, -643, -2249, -3758, -3369, -2089, -428, -526, -2715, -3715, -3946, -2503, -1265, -863, -1373, -3246, -4143, -3706, -2064, -859]
791h59p36q52j246l57R21J777P31j381j827m07Q60J547Q59K21q78j867j59J419
809b234K291J31j303j312r5K87J392J469J25k119j707J002J620J336J94j052j054
826a029r58O92K058J713j315j544n63Q0J103J106J207j110k115m77J471J668M61
843B448o60q09r66m00J320J703O28j377j711j60J171R91O78k18j492j211K89J565
861A789J048m18j068j186L39J05J299O08o38j114j033K00J062J062o1j123j228
878c57j9R18Q87M39q69j286p62Q31R54O67l79j102n75j04L96J182K5q41j349j70
898a514O25R07L99m71n73j278J86J348R48l64j226m55l84M51R27Q19n08j262o85
917b110O79R86K34M0m76o16q28O27J205P55j085j059r0M31O79M96M18q39j215
$$ y = [-859, -1595, -2447, -3693, -4050, -3129, -1352, -621, -2002, -3829, -4236, -3376, -1829, -970, -749, -1627, -3494, -3653, -2234, 57, 188, -1115, -2427, -2522, -2235, -843, 626, 751, -1368, -3075, -2073, -453, 883, 1077, 25, -1029, -1987, -1295, 763, 2476, 1161, -383, -946, -866, 237, 1343, 2550, 1440, -675, -1152, 319, 1987, 2448, 1788, 979, 13, -387, 933, 2636, 3264, 1887, 176, 16, 1187, 2178, 2856, 2638, 1146, -65, 224, 1789, 2837, 2419, 1351, 165, 504, 609, 1908, 2516, 1878, 764, -269, -69, 993, 2055, 1994, 871, -357, -376, 542, 1429, 1868, 999, -287, -1049, -218, 736, 1403, 1024, -78, -653, -757, -361, 821, 846, 5, -1344, -1514, -889, 18, 417, -54, -627, -1905, -1719, -371, 577, 213, -1013, -1468, -1852, -1401, -474, 345, -163, -1425, -2110, -1431, -445, -211, -171, -647, -1263, -2091, -1464, -259, 496, -589, -1648, -1738, -1307, -628, -132, 286, -553, -1768]
936a768j80J590P84kr62o08n56M14J029J556n01j305r72P56Q73L15O13m88j009
955d21r58Q72J297O52p43q68m21N97L60O04P51j142j030k37R33Q29O23n35o95
974D68q44o9J185Q29P18j620j044j21N89J451O07m73j238r46M7J342J003j7j190
993F77j036k58R69O42J284o33j067j431J75J428Q42J07j114j233o6M23R37O83
1011A329k50q99j206J47J132P58J70p05j441j56K37J443Q73r92j103m58L25N32
1029b64M59L26o09j176n30R56J201J47p61m05m95k49R49J415l46j319r75L06P38
1048f32O52L93k69j034p20J63J186Q18l90r47p21K29M89R17M96o21j092k80O20
1067g43J075J33l34q0r23m52J437P10l4j048l50j62N79M31M22P6r87l75j30J221
$$ y = [-1768, -1948, -358, 426, 424, -538, -1146, -1702, -1288, -259, 1297, 796, -509, -1481, -725, 148, 463, 1076, 588, -421, -1379, -507, 790, 1442, 699, -169, -590, 7, 367, 971, 1722, 580, -450, -687, 246, 1075, 1698, 1163, 468, -376, -445, 740, 1569, 2287, 667, -377, -498, 91, 1542, 2149, 1676, 438, -508, -461, 881, 1884, 1867, 677, -359, -617, 352, 994, 2278, 1645, 578, -853, -678, 750, 1592, 1699, 585, -648, -714, -291, 646, 1329, 1079, 180, -1026, -879, 253, 1011, 1181, 476, -965, -1121, -884, 559, 1432, 440, -663, -1121, -796, -264, 195, 521, -88, -1264, -1794, -838, 363, 510, -251, -656, -1151, -1400, -451, 964, 618, -701, -1676, -1370, -632, 20, 413, 144, -890, -1610, -1447, -261, 557, 167, -780, -1501, -1272, -783, 134, 630, 9, -1083, -1363, -743, 332, 465, 131, 51, -872, -1324, 113, 823, 789, -259, -609, -771, -192, 239, 661, 737, -250, -625, -755, 466]
1087D66K32l58Mp14J73R4O42P34n16q65k84P62N14J74O7p96k24J4J35R73L60j338
1109B49l93j32M39P77J22k45m83l17m07R97M45k69n82m23j55L87L34L42k06m18
1129F2p63O43M71L53j71o02m96j74L41Q16M08p67n07l94J23O79L57J56p30p29
1149i24l33P05J028O3n68p22n79M93L40J207m02p13j040R8Q36P40M4k43j079l60
1169a409Q5J309P94o00r31n18M21O17L70M61p45n48o40M88R80O55k92o06o72n7
1189h38O89N59O28p85n53q73P01J258L93j90o78q23o5P64J397r8o27q92l41L86
1209A2Q25L62J72r10n34j54R52R83k98l58n03n92P3J051P38l25p53q09L40P16
1229I88M71j65rr48n37L31R72M71o27m02n77k19J049K36M66m22q43o21O21O20
$$ y = [466, 698, 340, 344, -370, -197, -103, 539, 1273, 757, -108, -392, 370, 884, 1058, 1125, 329, 105, 119, 254, 1227, 1587, 249, -144, -276, 163, 940, 1062, 817, 334, 17, -390, 607, 1052, 783, 201, -222, -377, 10, 344, 686, 480, 62, -701, -58, 413, 766, 595, -7, -503, -677, -336, 480, 888, 121, -386, -780, -657, 22, 379, 535, -195, -924, -1257, -552, 476, 539, -29, -751, -1330, -837, -497, 710, 308, -405, -1445, -1347, -511, 229, 273, 30, -1049, -1409, -1324, -15, 779, 179, -752, -1270, -849, -232, 138, 599, -146, -694, -1334, -846, 134, 789, 497, -109, -781, -838, -149, 410, 1038, 253, -300, -1173, -472, 786, 1179, 989, 311, -512, -577, 187, 1584, 1486, 859, -33, -374, 12, 837, 1199, 1371, 461, -73, -227, 725, 1708, 1410, 1052, 549, -43, 30, 1081, 1819, 1494, 741, -68, 272, 988, 1459, 1294, 1285, 337, -200, 131, 1103, 1574, 947, 545, -32, -251, 798, 1034, 1500, 1078, 235, -386, 235, 855]
1249H55K33j57q14l89r4M62O11r5m56p55jL60j2N81k03o25m87J48L75N31j7n76
1271e25j1n75M83K41K61l75l81J3j24L39O7k7k73m07j36M85K91J99m21j71l64
1292a411L0N44q4K40m36m86k30P52O50m71m13j27k53O24J12L7l3k36o42M17O47
1313g69K75j40m45n4j85L11M88M29k31p83mN44M11j53Q4l34j62NN99O09k08n92
1335c05j05P6N62J73M22l73k99n03M79N94K65K8q70K09j26M8Q89K84n29r78J28
1356F9P51Q2J74M46n71m35j14N10M23J15jm45n81Q1N99P26j60n40p93k64Q31O06
1378A509L50n86m41q80O40L61O84j84n66j089L02L46P52M61n20j006k82M54L74
1397F79N21j03o89n85j62M08N24L13l84p78k49P0M83R10n34k81n82j77l7Q21O94
$$ y = [855, 1088, 931, 117, -272, -366, 96, 707, 612, 156, -599, -600, -240, -252, 329, 126, -499, -986, -838, -463, 68, 51, -525, -536, -1111, -628, -387, -126, -501, -882, -869, -993, -654, -587, -614, -887, -1294, -1430, -945, -654, -455, -876, -1047, -1411, -1381, -837, -921, -681, -1117, -1603, -1833, -1081, -431, -902, -1315, -1442, -1695, -1071, -959, -922, -955, -1191, -1833, -1416, -769, -494, -634, -1079, -1133, -1318, -1007, -519, -90, -321, -1104, -1108, -564, -153, -306, -222, -556, -718, -713, -114, 495, 287, -305, -410, -334, 228, 401, 823, 450, 151, -352, 127, 721, 986, 1014, 144, 353, 227, 275, 1164, 1448, 919, -59, 69, 820, 902, 1076, 1522, 951, 516, 402, 912, 1335, 1450, 1449, 1004, 423, 504, 1103, 1829, 1669, 1129, 336, 72, 903, 1509, 1859, 1273, 832, -48, 592, 953, 1637, 1453, 887, -202, 100, 446, 1198, 1659, 1139, 133, -149, 305, 679, 1200, 1097, 408, -177, -339, 69, 593, 906, 522, -256, -505, -435, 48, 958, 424, 143, -439, -616, -653, 168, 862]
1418H62q14p87j74K74L12K72J91l66r32j96M95P77O7j43o34n24J5N25Q23k93m16
1439f66n35K81K71K13J96l44j67o34K32P00K18p4p13q1K74j00L96N07k75o76J50
1460h27JQ94o3k01k12O3k32o7N64M60n10p62M56J29M15P7J63j79q61M02L45L74
1482D29l01J64l74L14N3Q1L41l22k39k67L88M0K43j3r9k40k16L13M39l00j92r9
1504A43JP1K49N9J55o16P4J19Q5L85l96j36j23J46K62J87k40j25N4o01q8P21L9
1527D25k9n13Q9j19K98K10K37j35j052kM90N33j33j13n97l12K12K11O65l17k62
1548b14n80L82k28M26M15k66l57m47l0Q06L12n15n7k51p7Q1N78K23k66o04k52
1569i21J92O25J34l2k51j67n94N31M59L24k17n69j5K03J79M30R2l79k76m84P43
$$ y = [862, 48, -739, -913, -639, -327, -55, 136, -230, -1162, -1358, -863, -86, -19, -162, -796, -1320, -1305, -780, 43, -250, -666, -1201, -920, -649, -436, -240, -584, -751, -1385, -1153, -453, -235, -309, -1022, -1103, -829, -929, -533, -26, -301, -977, -827, -826, 68, 5, -196, -408, -345, -577, -644, -80, 380, -130, -892, -436, -307, 108, 185, 348, 169, -692, -290, 55, 429, 128, 292, -82, 232, 285, 366, 707, 385, 146, -121, 267, 307, 550, 537, 438, 198, -18, 295, 734, 434, 242, 143, 144, 215, 464, 523, 678, 62, 136, 255, 340, 725, 329, 193, 70, 216, 478, 665, 425, 300, 354, -247, -335, 386, 425, 396, -117, -28, -147, 151, 361, 598, 463, -589, -591, -101, 432, 299, 186, -411, -723, -511, -300, 365, 48, -214, -794, -412, -640, -214, 201, -65, -422, -869, -899, -93, 219, -296, -353, -604, -681, -600, -22, 201, -65, -669, -921, -729, -104, 30, -2, -253, -420, -1014, -483, -24, 300, 83, -486, -501, -298, -119, 311, 403, 24, -252, -736, 7]
1590GK05K75J24n43m65k24O05Q76j82m81k93j08K50L06L12j08m36o00L34M90K20
1611E64K0P9l44l88K57P83j42j4n60K78j98L54j08L03m39j59JJ80K58N4l9k25
1633E15m41l01O00L17j09N0k85m55J84K97P15n86n43J54k80L49K72j49K02l43
1653A63m99M93Q4p9j30l08j8O0K80J19K7k33k53n2L05j86J51L1j39n02N6O61j15
1676h4m9j99j06j26J73n5M36j23n54K03J44N3M3O4Q7n32N9L56r3J13r2k51K13
1699c20q9R9J45K81m18m15M78QM76n04j43K84l2J26j3M80m62j96R5l9K86M0q2
1722H5P6m59M59K1m0L4M3l32K85l3J52L06k83k89K00P6J24M59l21j08l07j10M4
1745H2M34K58l80nm14K37L21m3M4l90l23P5L19N15j86j36l98l22N39M05l6j89
$$ y = [7, 212, 487, 611, 68, -397, -621, -16, 860, 678, 197, -96, -204, 46, 352, 664, 556, 120, -480, -146, 344, 564, 584, 663, 319, -69, 188, 971, 829, 815, 255, 533, 335, 689, 581, 884, 445, 286, 287, 467, 725, 779, 740, 515, 74, -227, 373, 690, 581, 631, 346, -109, 75, 372, 1087, 501, -42, 112, -168, 181, 453, 304, 506, 163, -336, 157, 241, 162, 32, -276, -294, -234, 46, 165, 192, -41, -294, -346, -41, -227, -76, -45, -184, -686, -630, 31, -84, -133, -332, -438, -564, -391, -446, -10, -133, -687, -484, -340, -287, -244, -180, -93, -625, -566, -210, -303, -190, -282, -533, -320, -409, -310, -165, 116, -302, -717, -239, -231, 245, -259, -402, -118, -150, -24, -37, 443, -19, -215, -120, -159, 127, 167, 85, 161, -298, 161, 182, 142, 176, 219, -113, 172, 139, 291, 597, 314, 25, 225, 301, 425, 884, 563, 455, 148, 38, 82, 516, 774, 394, 389, -25, 212, 533, 490, 534, 144, -179, -104, 215, 730, 544, 408, 10, -312, 227, 632, 596, 407]
1767D07o0k23N7M1O1Q0m47k05j3M57K4j1L3k63l71ln7O86J42k69n20j09m7M03
1791b07L05k27k88j87J58j82K46K00m0n10N2O2M31o1l3l53m70M29J83L00L54m30
1813b68n82L9L33K45l19P9k4m62K25k5K69K55j98k27J07r8M13r9q2p1j9J5j6K87
1837b23P4J09p0j74q3P46j84m22L9p5K11K4L42K2j50o4J9q7M74P2j26n46J73P3
1861A74K91k8N7J86k21o6k61L64L27j98j43l3m28O06J08J10m94K05j26L48J21
1882H99l53Q5j92K15M1M5k23J44k73J1J8Q6R3p7j92J28r4n9L24q6p1m06j42l6
1906a15J11K04mj9j26p7J98n7J28k28k36j64m6J97L78l61l08JO0J18j06K29J29
1929i4j63jn61L81N4L9j51j64k0o0M26j19L74o66J26o3K47Qj28M5l59K78k1L21
$$ y = [407, 347, 124, 181, 222, 283, 363, -84, -289, -302, 155, 179, 168, 201, -62, -433, -436, -493, 193, 335, 66, -454, -563, -610, -207, 98, -129, -417, -604, -446, -628, -382, -182, -222, -732, -680, -618, -187, -248, -281, -634, -1104, -675, -492, -192, 162, -268, -850, -811, -478, -233, -552, -473, -497, -959, -734, -759, -490, -235, -433, -660, -553, -651, -238, -337, -419, -490, -509, -494, -510, -223, -149, -40, -110, -284, -367, 379, 195, -227, -188, -263, -52, -28, 314, 336, 186, 122, 141, 54, 528, 600, 474, -72, 101, 174, 465, 437, 494, 680, 459, 393, 132, 496, 823, 625, 482, 449, 21, 627, 735, 845, 351, 556, 430, 778, 899, 546, 631, 439, 654, 695, 740, 517, 661, 388, 399, 417, 503, 596, 519, 327, 455, 361, 302, 626, 540, 469, 63, -79, -115, -4, 200, 196, 177, 51, -26, 172, 115, 243, 15, -221, -385, -431, -234, 144, -217, -525, -524, -464, -346, -452, -223, -94, -257, -258, -819, -438, -384, -345, -496, -660, -680, -740, -314, -433, -59, -725, -599, -662, -415, -407, -535, -490, -849, -571, -592, -271]
1953b71p6n60K14J94l6J46k41j6P5j05l8M56j68o8K31Q9l42k38O71R4j23l12P2
1976c52K7L11j89K79J8j18n1K05J80j30K0N3k46j13K95L15l0j63j47J87j79M63
1998F35k97K17j51j82j61J79L58J9j61RJ27k07N01j12q8m67J49j07L12J34j11
2019E96k24pk74K31L22M4l07O4k1n02L85L02Ok7p47M12j45J82p3J63l11j76K68
2042A61j70J36j29L88o72m4K22K74k9n3l21P2R0o4K95n9l93k69R5K1l3k1K57l58
2066f04j04L37J95j77p7l58m9K58L64k41o1K9j59M44k99J54p6l3j92j70K8L43
2088d48P6K17o30KJ97L23l1l08K39K82m60K47KJ24p1mO1l0q2J3K11m08J52P0J56
2113a00L37j61j2J17j60l2k3M59p8j87m18N20j05M15m52J05j46J05m2R4K95J44
$$ y = [-271, -347, -907, -693, -499, -535, -389, -630, -646, -571, -676, -714, -258, -426, -494, -263, -174, -516, -754, -83, 11, -112, -424, -352, -325, -14, -203, 76, 94, -24, -75, 130, 310, 180, 200, 253, 7, -106, 189, 504, 474, 311, 164, 351, 172, 635, 338, 555, 404, 222, 61, 240, 598, 617, 456, 465, 592, 385, 886, 774, 686, 219, 368, 261, 573, 707, 596, 372, 365, 91, 322, 644, 688, 381, 445, 424, -78, 307, 609, 615, 588, -159, 253, 108, 290, 217, 380, 69, -107, 161, -9, 127, -2, 386, -286, -330, -108, 166, 137, 84, -237, -165, -75, -139, 156, 97, -296, -565, -470, -449, -482, -503, -246, -604, -708, -371, -176, -353, -430, -788, -837, -579, -215, -456, -517, -488, -647, -203, -502, -348, -424, -457, -649, -819, -791, -448, -372, -155, -785, -783, -586, -263, -294, -602, -363, -81, -541, -294, -292, -168, -239, -243, -182, -212, -294, -281, -70, -478, -326, -256, -100, 237, 76, 64, 181, 21, -11, -34, 425, 347, 160, -258, 262, 157, 572, 120, 225, 79, 184, 142, 236, 531, 675]
2135F75m50J23k8K20l89M16l37J49J99l63K17K07k55j50p1mK57P4M6m7k41J19
2157C67K9L4j08l9M0j14R8N2M1O07m41l63k29K48p7P0k08K32j76j14J42J86J29
2180D06l89l9J20O4j50M53p65K97l85K15o4k84K63K01K09l06k15K21K30k87N2
2201a53j49M9Q1L02l80k3l66M81j37P0j13j74K62Pr7P8j30K01N2P1o3l55M07j46
2225b25J59j52m08K55J82k00L53j80O3N0q4K12J25p2j36J16N0J42l63M68k71j64
2247h0n4L19J97j36k81K49j53q4K68J48j16l9j59k6L24j29K46l85J07J07j3q3
2269B27J44m6k79K14M7J28K0J26k01m3j82L18p2Q5m4j12j75j40K37Q8n4L9j05
2292B20l0O5j82K78m7p39L97K28j97J11J5j11j95J71J10n2q4J67j24k30m5K7P79
$$ y = [675, 225, 348, 320, 540, 151, 567, 230, 379, 578, 215, 432, 639, 384, 234, 163, 159, 416, 490, 536, 489, 248, 367, 396, 430, 322, 283, 323, 209, 307, 359, 400, 1007, 566, 203, -26, 222, 145, 215, 7, 239, 63, -51, 91, 277, 406, 17, -22, 98, 162, 12, 465, -300, -3, -388, -173, -237, -521, -258, -57, 152, -154, -369, -148, 82, -205, -153, -302, -253, -172, 130, -250, -273, -639, -158, -295, -225, -338, -512, -250, -243, -340, -262, -392, -191, -139, -68, -131, -486, -79, -225, -66, -218, -626, -371, -189, -389, -36, -216, -153, -103, -187, 25, 150, 78, -58, 58, 108, 250, -113, 355, 84, -80, -134, 185, 382, 246, -35, 214, 61, -23, 245, 393, 277, 238, 79, 53, 377, 248, 494, 109, 216, 323, 310, 227, 371, 325, 46, 260, 307, 435, 455, 581, 380, 337, 155, 473, 401, 486, 442, 330, 155, 15, 252, 340, 286, 325, 220, 190, 255, 73, 351, 304, -435, -38, 190, -7, 104, 119, 8, -187, -16, 94, 42, -42, 125, 1, -229, -274, -247, 532]
2315E32o30k11K23j74N8m5m7J11o2o5k09L82j81K1MK04n51L54J53K40k00l15J91
2338b17j04K54j98J86l35j23Q9R1P00n67K7J5Q7j87Q8P4k6j26j35J24K35n6oK24
2362A14k49R4j56J45j1l1O9k97pP5K11o1J80l49N39n67L97K25q7m10m7L24j67
2385f6K05j84L43nk49L78l06J19K31n23L84l79J2K40R1j35l44L6K24k73L25P3
2407A97L34l13j6l9J68j09J38k39J05J01m59RL65k15J79j35p5J29J18n07Q3K51
2429G0k01o2L92m51J67m8K21j81j58K6j26J86J7K57j18m1n7j46j88N8K77l4J9
2452a21m79L32Q4N7j80K7J9k90M82l7r6n3M02l78R7q7K15o05N71j21k15K99j10
2475a87j7J97k92n8J33O3J59o5P4k13K01j29K96J9k54J71K03j97n7R1L14l46m0
$$ y = [532, -98, -309, -86, -260, -202, -247, -294, -183, -245, -310, -519, -137, -318, -297, -293, -89, -640, -286, -133, 107, -93, -408, -217, -321, -67, -265, -79, -414, -537, -448, -357, 343, -224, -197, -182, -95, -282, -194, -120, -146, -272, -407, -283, -48, -104, -110, 114, -135, -41, -197, -52, -63, -94, -25, -322, -329, -254, -43, -104, 76, -273, 266, -301, 96, 321, 234, -176, -223, 101, -66, 139, -45, 298, 293, 44, 422, 116, 235, 466, -57, 327, -52, -40, 200, 291, 156, -188, -152, 72, -201, 124, 197, 531, 218, 202, 163, 331, 222, 360, 121, 226, 327, -132, -123, 242, 27, 206, 71, -4, 125, 243, -264, -181, 70, -131, -193, 199, -252, -85, -133, 88, -93, -251, -225, -351, -165, -148, 109, -9, -50, -107, -253, -441, -383, -106, -140, -121, -600, -268, -184, -127, -307, -280, -261, -551, -69, -106, -202, -255, 147, -231, -134, -221, -6, -611, -40, -161, -376, -77, -187, -204, -7, -299, -357, -224, -161, -2, -67, 7, -206, -5, -134, 162, 181, -73, 98, 301, 104, 47, 138, 452, 106, 66]
2498F6j68Q7K77m4r2J49j08K70jN5o2m25K52j35Q2j41M71J29mm99K98o2n5M8J6
2523D04j06M6k12J89K81k89M9l92K25m4N69l08l0j80j6P0K5l20L39l90J62j43
2545g1m9K07J70j80M4m8j74K87j97k52L59kl24m8L48j86j15L21l72K59k02R7K8
2568a00J53o91K95J68j58K83j27k17j9m1M7j19L91j13j34P9l92L71k38l8L83j63
2590c80j24j59K45k86L50N3j0k41J53j27l1J07n9l2K36J9k16q9N53j12j87J16
2612b21qk14K71m3n2P4j01J14k77K67J34j09J28J39k44l9N35l78l8o8L27L5j87
2635D5K17R5lm46J46M22l46QJ45p5M4l40L50K35j81J76m96M07l14J74J19J4l86
2658A0K21M2q8j85L87J66j52J98m02J34J71k63M2l66L44J57q3L2L05p12L82l7
$$ y = [66, -102, -15, 262, 218, 126, 275, 167, 437, 436, 491, 429, 4, 256, 121, 203, 62, 533, 662, 658, 159, 457, 395, 340, 388, 404, 298, 344, 132, 321, 602, 313, 362, -30, 195, 151, 720, 412, 382, 202, 186, 256, 281, -39, 300, -90, 72, -71, -120, 87, 257, 77, 121, 73, -101, 186, -11, -263, 96, 94, -230, -278, 70, -116, -231, 90, -282, -23, -225, -128, -100, 53, -638, -343, -175, -333, -50, -177, -394, -413, -454, -407, -526, -135, -248, -382, -303, -695, -324, -562, -600, -217, -380, -504, -663, -418, -704, -354, -301, -311, -552, -399, -526, -557, -450, -509, -541, -305, -286, -502, -591, -38, -150, -337, -221, -229, -443, -172, -215, -267, -193, -294, -180, -457, -190, -56, -165, -37, 102, -142, -181, 354, -24, -62, -130, 197, 232, 45, 262, 357, 354, -92, 54, 476, 130, 138, 283, 208, 252, -88, 262, 497, 316, 492, -4, 403, 89, 263, 382, 396, 10, 231, 273, 185, 0, 387, 553, 401, 599, 197, 331, 502, 239, 281, -85, 259, 416, 333, 365, 670, -42, 340, 303]
2680C03k32M58r5L9p43J90K92j68j27M3J23r5K9l10R21l83m3j80j63p5p0K57l52
2703c81O21n30J40J2J96P6n61K8L91k0J9K5q5q4R7J82j61j27J88k15l64K86lP2
2727a98j84K48L0o5j33RL71K4k47j33j45J87J8K55j15j05m5J85P7j75n2k1n1O1
2751b04r3J36%Q7J31P1n79M49j71M01k00k53K09k60N04o8n6K17o8k2P0l46J71
2774A26K8r6L01k71L1K66o8j17KL7k6L6j00J36m7m3q5M7lQ8K98l09n7j60M21l8
2800C97j84j36M2n8K57m05J60M01j19j26j41k99J8J88J90j31P2K9j9l72J19J74
2822E7j51j82J22K02OJ1k61K00j15m0j85J49J14j46j54J93O5k12l0K47J02k51
2844b59M3j64K18J46k02J52q3j98P5K34l54J73j0O0k96J39Q3K02j08j14K5L65
$$ y = [303, 71, 529, 434, 473, -270, -80, 212, 44, -83, -40, 83, -12, 17, -293, 628, 245, 202, 22, -141, -216, -286, -29, -381, 240, -290, -150, -138, 58, 134, -427, -399, -8, -28, -9, 16, -69, -153, -56, 126, -35, -162, 26, -189, -553, -267, -270, -198, -382, -134, -104, -169, -302, -293, 78, 102, -145, -278, -423, -236, -218, 37, -78, -183, -228, -43, 34, -141, -193, -214, -265, -204, -297, -161, -161, -74, 57, 128, -451, -2, -173, 228, 28, -225, -16, -276, 228, 160, 104, 321, 253, 231, 301, -45, 126, 154, 58, 359, 88, 119, 385, 317, 200, 202, 239, 213, 249, 149, 285, 238, 195, 110, 157, 154, 242, 540, 231, 174, 14, 435, 397, 213, 77, 119, 61, 318, -87, 73, 474, 355, 229, 88, -211, -193, -5, 185, 54, 126, 155, 136, -236, -117, 57, -94, -276, -154, 48, 54, 65, -196, 4, -111, -151, -336, -187, -73, -219, -373, -180, -115, -327, -357, -110, -8, -259, -216, -380, -162, -16, -218, -66, -149, -347, -272, -38, -392, -219, -229, -169, -465, -326, -243, -41, -149, -263, -238, 127]
2866A27k40j26K55k36J67k55L68j84J47L9n64O66k87j70K47k79J11J18J79k25
2886a42nk27K36K04M9j14M7Nj37L56o0l8N8O7j89m9M12l63j95K41j87K77K39k08
2910B77j53J36j04L34R0l27k50J06J35K12o1j77O0k2j18n3KL14j86R8j40l25N55
2933D03k10j6J60k52k17L16L57m70Q2K11k48p1j18j8K06M8k18J21j76K16k56J38
2955a2j69J3O5L65k62k88J13l2r7J04J7J3mo8j19J7K77j90O3N7nl19K67O7l36
2980d63M07j76K25l87r6L37J40Pm30M32l62pp5L39L4k45J0K3O1p0K53j11j46O5
3004b35k52M43o4J24m9K7j91J66K9j86L01p5k80K88k81M95j61n0J38k72L42l16
3026e9J50K7l9R1l5n7K39k83K7j11L12O4j16l5q3K72n60J44J84jK92l07K44J64
$$ y = [127, -113, -239, 16, -220, -53, -308, 60, -124, 23, 62, -502, 164, -123, -293, -46, -325, -214, -96, 83, -142, -147, -374, -138, 66, 115, 1, 48, 53, -84, 272, 212, 174, 232, 299, 110, 61, 473, 110, -85, 156, -31, 246, 485, 277, 124, 260, 156, 490, 580, 253, 3, 109, 244, 456, 395, 218, 278, 256, 138, 85, 87, 401, 215, 313, 173, -152, 403, 193, 177, 337, 85, -132, 184, 541, 71, 153, 364, 116, 45, -73, -91, 115, 163, -55, 66, -110, 106, -150, -12, -181, -168, -103, 262, 0, -288, -175, -207, -304, -200, -183, -170, -174, -242, -361, -344, -67, -257, -194, -137, -142, -461, -194, -127, -463, -56, -232, -7, -394, -490, -153, -13, -6, -436, -4, -366, -373, -448, -109, -75, -320, -310, -287, -226, -296, -43, -154, -300, -235, -487, -44, -108, 16, -33, -6, -197, -31, -2, -188, 113, 38, -242, 46, -235, 260, 99, 49, 187, -85, 257, -59, 91, 118, 79, 170, 135, 78, 317, 34, 61, -50, 262, 326, 210, 175, 92, 364, -196, -52, 132, 131, 423, 116, 360, 524]
3050E24l50Q5P3j39J08J59l50j41K39Q7J25l62K3l8J13o6K90j49k72J78j19K27
3072B45l08K6q3L13M7k0j65K14l16M07m18Q7m1j93K10J74k82K27l87K91r3j02
3094a67P3j44L8J88Q7j35k1k85K39k15p2K33K47k51J43j40K14k1k71L69ln08L11
3117i1m3J1j05l3J59p8j50M58k38k4m1k69N4J01o6K99l06K2R0N09k40K56n25K14
3141c6R8J48k59j01q1J76j8Q8J43j38J24j02O9K57k68r3m6J76J84k20o8K00k52
3164a9J66qK87l06m9K39l32J20r3Jr3K96j79J22M9J55j65J04m25K17J51pl56K37
3188A12k1M01k70j73J36r9o2q3Q8R5o6K37J09n27j12J32K94nj69r1n3J03k5J9
3212c0p8J45l12k3L04o2J02l3J42m18K9L7M2N0l37R8M08n50J54J21OJ89j14J27
$$ y = [524, 174, 259, 332, 193, 301, 460, 110, -31, 208, 295, 420, 58, 81, 43, 156, 90, 380, 231, -41, 137, 18, 245, -63, -37, -120, 193, 240, 220, 55, 269, -47, 360, -58, 29, -12, -205, 5, 179, -103, 124, -263, 28, -65, -167, -94, -238, -200, -12, 75, -60, -81, -366, -127, -342, -414, -181, 66, -185, -42, -182, 32, 11, -260, 109, 106, -402, -91, -134, -123, -228, -261, -102, -180, -330, 128, -110, -134, -175, -444, -390, -289, -355, -56, -362, -340, -250, 259, 19, 275, -250, -36, 62, 210, -49, -150, -231, -55, -73, 15, 158, 20, 144, 42, 111, 368, 100, 7, -39, 137, 321, 101, 33, 233, -19, 147, 139, 426, 120, 71, 310, -22, 98, 5, 6, -87, 209, 30, 152, 201, 356, 191, 295, -130, 87, 238, 231, -125, 112, 91, 492, 222, 49, 185, 86, 24, -59, 29, 124, 58, 295, 404, -123, -235, -103, 191, 186, 17, -74, -127, -24, -49, -30, -108, 37, -275, -298, 6, -56, 46, 13, 155, -263, -234, -197, -155, -105, -442, -344, 64, -486, -332, -211, -205, -16, -130, -3]
3236co8o4M0J46k07k10J65J34l1N9k05QK35j07J04n7k04J98R6m13L47K15n44M43
3260G7K4j02j5K55m04K62m0l7M7k2P7o7j15K28J12m53L67k77K65p3K31k72L11
3283C79j49j49K46l15K07m0p5j78L59O6j21j09J15k76L45Lk20K4L32q7M1k05j45
3306D8L19J09j64J1n1l06L20j40L55j47k91oK01K7P2k73K8k93K65L47k40k18L14
3329B87O0q2O1mm82j26K48J46L4j91j57J43j48J29K2l2j86K55m11M39M9m28N9
3352c15J40J21kj50K80k88M3j83K85j89k62L99p2j81K77j90l09K77J80l13L33
3373a19l00J68P7k07R6P4k15K88l23L89r4n2q9J80l08L78j54Q4J81k12J08R8j66
3396a18l3pj1J1L52j33j07R1p0k13L90Q4K1j92l7J5j02j05K31p7p1K65o8J10k45
$$ y = [-3, -71, -135, -95, 51, -156, -366, -201, -67, -98, -39, -244, -236, -1, -108, -4, -61, -265, -67, 29, -384, -37, 178, -366, 77, 101, -1, -16, 239, -165, 97, 57, 20, 67, 45, 122, 55, -60, 168, 280, -173, 194, -83, 182, 109, 340, 68, 379, 230, 81, 327, 12, 219, 179, 104, -74, 285, 351, 230, 121, 236, -40, 305, 308, 88, 112, 444, 357, 398, 193, 48, 367, 476, 312, 323, 272, -34, 286, 146, 501, 354, 63, 57, 258, 285, 357, 84, 112, -181, 84, 431, 191, -27, 287, 347, 265, 326, 322, -160, -286, -38, 108, 142, -49, -206, -63, -211, -82, -60, -92, -278, -23, -434, 5, 54, -374, -315, -175, -54, -56, -206, 74, -214, -171, -354, -69, -258, -520, -121, -193, -374, -97, -287, -596, -319, -139, -452, -119, -419, -251, -174, -381, -285, -211, -426, -138, -461, -72, -166, -218, -307, -127, -435, -57, -211, -127, 54, -158, -50, 48, -118, -151, -158, -169, -158, 194, 61, -46, 45, -25, -238, 152, 236, 257, 65, 28, 43, -59, -164, 67, -10, -81, 184, 116, 226, -19]
3421a9oP9R3j8n6K5K95l58o6K40L6q9j3j64j2O3Q8q4K95j44J8l37J43L35j19l61
3447a36K60K1J15R9j81l4K13l41Q2rJ2K32l95O8J88j38J38j29O2J16j33J01l31
3470a20L23l06J8M6j2k35j35N01j49j13J23q2R0Lk62J73j03m8L60l18K79l63J98
3493a32K07l8p6k12j4L27k61j82L21r6j13J44K61m06j01L91l7p6j2j69n5N01n02
3516c30N00n7k86K25j22J44k78L05L5p2m2j01O5o7J33m8m7j20K43J86k35j79K69
3539A21k9j46M08o8l31J37m5k5r9N3P4J07j22L0J78m7j61M1j91N15l10N4n8j08
3563b2J74k57M79j08j63jm0J84k59J12M7j46k1P3m2M0K7K22j80j7J07p0l39L16
3587A16K16k33m0j36K2K18l24K85J34l20QJ29q2J37j94k65K0L77N5q0l31J46J77
$$ y = [-19, -25, 54, 147, 129, 73, 98, 393, 35, -31, 209, 245, 156, 143, -21, -33, 30, 118, 34, 329, 185, 203, -134, 9, 344, 225, -136, 124, 145, 260, 359, 178, 144, 357, 16, 98, 89, 101, 333, -62, 6, 194, 56, 194, 65, 127, 243, 110, 211, -120, 203, -103, -85, -39, -51, -286, -421, 80, -69, -182, -59, -141, -51, -48, -310, -137, -240, -288, 72, -246, 33, -330, -132, 75, 37, -39, -251, -265, 62, -199, -381, -60, -156, -269, -125, 136, -270, -371, 20, -17, -93, -105, -274, -329, 172, -330, 170, 113, -173, 52, -70, 74, -204, 101, 136, 64, 22, -79, -14, -81, 52, 4, -43, -163, 80, 266, 31, -148, 121, 92, -54, 354, 286, -45, 92, 47, 22, -77, -24, 50, 157, 35, 65, 243, 196, 35, 76, -115, 400, 90, 144, 86, -22, 152, -105, 374, 266, 103, 102, 62, 246, -13, 99, 146, 0, -21, 52, 10, 50, 77, 299, 119, 102, 209, 139, -200, 116, 332, 99, 59, -77, -55, 163, -161, 124, 258, -62, -54, 75, -7, 130, -64, -329, -309, 68, 123, 43, -288, -142, 35]
3610C5r5j55O7M2n9j36M87l78K30n27N90l72j20J79k60L08N6j99j13L42r5rm1
3633b23l3O3k21j46M78l52K11K9L29m60J54j08J48K67l17M60o04K44K8J57k40
3654a36j51K46jj59l29R68k38j29k7R7n01L90J5J24l16M17l73K19k9j91K87k31
3676d8K22J33l86M38k73mJ03n0J41k56j03L50n7k20O2J11K1n6N0m6R8P5k17Q8
3700A76j12K08J94j80n9q4N6k09p8L56j57K2m7J48N0J41n17J04ol4J21k62L84
3723B15j97K77m67K98j53J78j95L8m6k68L47k8k85Q3R6J68k84K84k40k41K75L3
3745a12P2j69j1R2j57j16N27j83j82J12j43K71k30R1J94p8l47M79l04KK47j57
3767a02O4K53O4k36r2J0j85J8j12M47l24L72j99N8j61J05N2p3R4j09q4P4K11K49
$$ y = [35, -60, -215, -148, -106, -165, -301, 186, -192, 38, -489, 101, -271, -391, -212, -472, -164, -108, -307, -420, -78, -173, -182, -223, -256, -193, -414, -560, -82, -434, -223, -194, 135, -325, -171, -279, -131, 136, -181, 279, -325, -81, -53, 104, -136, -287, -41, -42, -201, -530, 438, 200, 71, 44, 141, -360, 30, 45, 169, -147, 270, -103, 116, 87, -104, 183, -48, 174, 307, -79, 359, 86, 82, 185, 135, 276, 20, -83, 267, 210, -10, 52, 163, 184, 128, 178, 132, 230, 305, 88, 176, 64, 272, 466, 286, 227, 143, 199, -10, -88, 268, 111, 133, 86, 234, 284, 425, -92, 12, 6, -28, 93, -169, 215, 18, 295, -172, 126, -27, 151, -44, -6, -52, -320, 27, -1, -286, -203, -107, 61, -223, 61, -179, -420, -145, -112, -40, -209, -220, -128, -285, -401, 126, -57, -239, -127, -270, 1, -229, -138, 56, -22, -369, 110, -194, -192, 55, -102, -38, 215, 279, 43, -49, -39, -224, -206, -318, 129, -195, 177, -22, 36, -125, -20, 32, -41, 53, -56, -140, -66, 145, 394]
3791C94k94q3l7R2K54j56q0q3J94m80N60o0l64L44M8l7r4J37l7k58J97j09k1k9
3815bJ56K54l76K87q5N9j45j51J04Q3j24J02P5k01J25k2O1r7J70k89M2o8M1K06
3839B05K0K34k81n00J46K71j2Q0m20M09k53j29L40m59J98J11j01K93l64j34L48
3860Bl04K47n8j93L51m1j2Q8m77K24l2j33L97j37n9j8K3K56m99R9l2K9Q6K83k71
3885a81M0r9J29j46j53J79J2K00kj28P6q6j97L9J04J73j29K26k64p7K27j11j70
3908c38L30m7O5K0j79J92j18J2m0L6P2j34J38j17R5J15J18k50p8M23j83k52L56
3931B36J10k50R8j62L26m41M46P5k37l1J97l11J29OJ13J9m19J38M2lK2J43l0q0
3955A36L8j52L42j51K0k06K11j26k09L32j29Q0K9J6p2j47k6J75k22J11K23j47
$$ y = [394, 100, 17, -20, 72, 326, 170, 90, 7, 201, -279, 281, 221, -143, 201, 249, 212, 118, 255, 218, -40, 157, 48, 27, -2, 154, 408, 32, 319, 234, 293, 148, -3, 101, 184, 60, 162, 237, 36, 161, 139, 200, 103, 273, -16, 26, -42, -1, 205, 225, 459, 178, -322, -176, 95, 83, 163, -257, 152, -101, -230, 110, -349, -151, -40, -141, 152, -212, -346, 2, -302, -55, -113, -306, 45, 4, -8, 80, -397, -173, -205, -338, 59, -78, -137, -155, -132, 124, -375, -276, -308, -279, -193, 90, -181, -141, -240, -111, -257, -410, -231, -219, -19, -21, -149, -73, -159, -356, -317, -213, -40, -169, 57, -207, -284, -57, -168, -338, -8, -55, 10, 30, -149, 43, -75, -63, -103, -67, 5, -129, 9, -108, -13, 102, 220, -30, -108, 315, 132, -120, 236, 346, 96, 194, 32, 358, -83, 363, 438, 201, 170, 367, 56, 185, 191, 304, 323, -96, 42, 84, 81, 103, 246, 216, 136, 174, 22, 364, 213, 233, 27, 238, 112, -97, 235, 106, 186, 215, 231, 159, 12, -14, 161, -61, 50, 273, 126]
3977A26n4J22k97K32k67l2J48L43NN9n19K00j4j3j52j45L3k5O9L02jK1kl28MR6
4003h9r1k93L06R3k08J08L74m85K68mq7j66R0J95j35j23M2K15k13J51k07J6k09
4026d52J71K5R8k2J03K68j61n3k46J82ll9K07k68J82J02j2j5J23j25k53J03J17
4049C2J52k95J64J79r2l9J87k25L3K4k29O7J32m3N3J86m61L72j39N1p4J3P3j56
4073c5L56j46k71P3J63%j72K52k44K12J49m05L14l88M80j65j36Q9J18l70K76M9
4095A99j7j46J9M6K28l28j50K03k4L32l00l48j45O55k66J10ro5j99j56K04J61
4117DK39j47l88L94j75j12R5K6R9q6P8p9k36J31K03L0l40K10KK11j05k68qK5L1
4142a66J29j28J3k16J47M12m18K37j7l23K66N4L9J3q9j13J88k82J41Q7J8lj26
$$ y = [126, 72, 194, -103, 129, -138, -170, -22, 321, 326, 385, -134, 66, 52, 39, -113, -258, -225, -250, -181, 121, 120, 141, 139, -189, -185, -89, -180, -473, -167, -74, -282, -174, 200, -285, -17, -21, -108, -274, -184, 11, -124, -247, -205, 10, -203, -52, -259, -243, -452, -281, -256, -158, -180, -77, 191, 30, -23, -269, -87, -90, -129, 78, -190, -8, 94, 82, 67, 190, 65, -188, -85, 32, 184, -111, 53, 232, 140, 101, 288, 63, 96, 120, -109, -42, 90, 47, 100, 286, -175, 197, 58, 109, 35, 48, 121, -35, 321, 175, -96, -23, 140, 140, -32, 220, -24, 188, 337, -68, 246, -142, 338, 173, 37, 126, 244, -126, 150, 199, 182, 36, 55, 101, 329, 1, -149, 54, 30, 362, 62, -286, -431, 224, -42, 68, 59, -6, -205, -361, -157, 4, 243, 96, -292, 102, -73, -185, -90, -64, 35, -51, 27, -52, -288, -157, 46, 76, -264, -54, -52, 159, 54, -214, -222, -197, -166, -37, -165, -152, -368, -221, 191, -227, 10, -7, -330, -64, -10, 29, 42, -47, -160, 28, -254, -113, -26, -8, -11, -137]
4165a37o0m7M70m79r0L03o8K64k91K90N0j05J24k81k2J59P3l42J48nR2k2m6Rm4
4190e7J38K44j22k64L14j18k37L08J73k92J20pJ01k14J92l19J42Jl32M57O2k95
4212ej22L46k01j39K57j13l5m7N1P1o4N1J01O7o3J45m13L51n8K55k89LL8j31k2
4237C4M8k26K71m4R5k9j46K48j97r7p4R1j68J6l4m9J47K24k62k11M98j32j74K88
4261A17k23j52K82k46K86k93k94L15n4P7J03On0j96J71K85m23J65j45K24k36K78
4283cl83J67L38k17j13J19Rk05M22j38J49Rk47J58j34p6N6q9J09J60j41J94l66
4306b22J87J19j76L71l4j63K19j41l88M94j36n9J06M15n03j16L35j92o2q6K37
4327B05j80J91M2j28J38k29K14k10L78l20P3K02l75J14M74n65K34k17J10J56j49
$$ y = [-137, -197, -244, 226, -253, -343, -40, -108, 156, -135, 155, 205, 100, 224, -57, -79, 80, 153, -189, -41, -46, 46, 24, -22, -13, -57, 81, 325, 203, -61, 253, 135, -102, 206, 379, 87, 207, 200, 301, 87, 279, -40, 102, 103, -229, 228, 290, -5, -127, 219, 18, -121, 136, 23, -12, -59, -8, 63, -1, 50, 151, 218, 155, 300, -113, 238, 180, 435, 146, 149, 187, 56, 34, 82, -144, 127, 83, 178, 149, 3, 251, 54, -43, -117, -26, -194, -178, -212, -261, -114, 110, -152, -363, 135, 3, -171, 117, -106, -258, 24, -222, 64, -229, -523, -208, -262, -185, -82, -76, -126, -322, -151, 134, -289, -124, -269, -45, -281, -3, -386, -219, 119, -98, -211, -92, -83, -288, 134, -4, 145, 154, -93, 65, -69, -145, -89, -178, -69, 91, -50, 144, -222, -35, 84, -92, 279, 245, 82, 301, 160, -228, 266, 130, 71, 177, 592, 89, -27, 308, 116, 54, -32, 205, 25, 216, 258, 130, 268, 39, 253, 43, 421, 101, 174, 376, 1, 115, 589, 24, 258, 41, 151, 307, 158]
4348A58K68j76k86j92O91k40k78R6J52J72k62k10M87m42K83l47N7N10m66J12m9
4369C8p2j36m0L41j09m31L97m8j12L51k84J11j23Mq9j22K50Mj19M8j24J06J51
4392hj34Mp8K88j20J37jj01j70J46j3j63L21k72K98m05J01O8J83m26M93n5n0l9
4416Dl4k4J25o3O7k71k1N5J8K41j45J40K6m52J67p4K45j8K6n4R7N8l40L72j38
4441GL16j67l87L10N6qm64J98J44k77L47n6l0Q8J24M1Q8q3k0l23J58m7K49k19
4465D5j40L60l51J27K6K02k61j6K66j56K6j4o1K53r6K6r8k48N81m78L1j31N83
4488D76l37l03J51n3J40J20j79K5Lq7P3r6K21l09Q2j11J02J62k31r7L41jP9Mk13
4513c8K65k01J33m40J08L0M6r8Q5L74l76j02j02J83k01L90j53j45J2N0K15o2p2
$$ y = [158, 426, 250, -36, -228, 463, 223, -55, 41, 193, 365, 103, -107, 380, -62, 221, -126, -69, 441, -25, 87, 38, -34, -170, -210, 131, 22, -409, -12, -60, -172, 179, -105, 6, -117, -113, -202, -324, -74, -70, -189, -141, -265, -159, -8, -142, -138, -216, 72, -48, 89, 88, -13, -183, -37, -50, -213, 108, -164, 134, -271, -170, -102, 81, -345, 148, 93, 43, 4, -30, -54, 71, 8, 75, -196, -217, -162, -144, 97, -48, 92, 118, -334, -167, -241, 4, -14, 12, -42, 55, 113, -227, 145, 7, 323, 156, -231, 79, 135, 127, -337, -139, 5, -272, 75, 19, -11, 77, 201, 242, 330, 247, 227, -96, 62, 15, 264, 45, -95, 265, -86, 41, 67, 269, 8, -8, 258, 102, 128, 114, 53, 306, 210, 236, 138, -110, 471, -7, 24, -107, 476, 139, -164, -13, -66, 74, 194, 15, 40, 43, -44, 29, -67, 154, -155, -73, -184, -82, 80, -151, -248, 93, 92, 171, 175, -38, 227, 26, 159, -281, -173, -143, -97, -195, -110, 264, -112, -214, -316, -133, -334, 56, -97, -242, -230, -180, 35, -27, -99]
4536i9L33l95p1k9J44J26N7j80j10o6L90j82p8K48q5j89J53J61l83K65k97J09
4558a78o3N1L07o1n7J12m28K64k5MJ01L92m53J28O9L5j51j93L68j90l96L14K11
4581A61J92m35J71J09l4O1k56L40J50k44k87JJ8J20K09M1l1l43J51Jp4n8J77J18
4605B58Mn0m24J61J6K64p9r1K26l91L92p2k59k1r9K56j02r4R3r2J45N0J99l29
4629c9K7k3n9J68m90L26l4L1K23k70K22k42J92J8l34k3N33j64j92qM39l98Q4l68
4653c81K02J08K2j54K60l75pK44J06p6o8j22J07Q4o0L88n08K57LK5j70j1J20J76
4677A70n7l43K6Q9r6P9J07j42J36L7j92J80J84m9m26K99j20J50k6o5L82k50k75
4700b02J71J34J89j87j23P1J6j1K4L16j91l00N64k31m68L95r0L2L02m61J52j48
$$ y = [-99, 234, -161, -232, -261, -117, 9, 66, -114, -224, -290, 100, -82, -160, 88, 3, -186, -33, 128, -255, 10, -287, -178, -241, -190, 117, 56, -1, 111, -317, -53, -78, -74, 27, 419, -34, 94, 163, 198, 47, -146, 222, 32, -364, -50, 161, 353, -82, 89, 198, 164, 225, -31, 309, 459, 215, -72, -71, -53, 67, 276, 317, 286, -57, 94, 95, 21, -37, 140, 258, 262, 212, -212, -51, -35, 229, 150, 59, 285, -106, 286, 214, -45, -66, -165, 91, -11, -105, -12, -104, 41, 91, 290, -39, -12, -35, -94, 74, -416, -90, -124, -93, 130, -140, 82, -160, 32, 50, -284, -307, 226, 62, -130, -138, 301, -97, -13, -381, -179, -71, -49, -203, 57, -318, -325, -81, 25, -51, -119, -241, -134, -50, -110, 278, -230, 27, 30, 55, -115, -126, -6, 170, 113, -230, -204, -115, -211, -132, -25, -167, -31, 6, -186, -6, 178, 129, -297, 2, -118, 32, 6, -59, 323, 73, -202, -31, 103, 292, 105, -18, 53, 69, 58, 82, 398, 207, -93, 471, 240, -228, 167, 77, 109, 411, -50, 102, -46]
4722d6J8K55k2k0k85J76j61J4L53Q3m26J7K28n4P0L5J05r5j09J09k1j19k36L76
4746B45Pj85Rk28L69k18p9K23j45j01K14p8j63O8N1M2R0l27J91M4j29M3J25J0
4770G8J27l55P8l0K04k54P5k7J92k38L00k35k6J72l16J75O8N2L2r3K9j24j35L02
4794E1nN2l14j27J30L59o1k60K46r6m7L3k43M93j81k2P8k46J69j95J95k04M78
4817B83m49K75n9j89N5K07k93L28M4j52j94L19k88pOk04R7Q8J01K5R4ol28J87
4841f0P6j28L03l06N3j01J79J94j58K66l03p7M3J60k41K47J34k74J53J71k99j28
4863i6J97j71J32J35k60K7J35J98k26k49n8K29o4n2M46k52j04k4K5q3Q2KJ8Q7
4887G4M3j37m44L13kK70j34n3J27oj40K61p7m06P5K02k02K53j96J57j64oN3j13
$$ y = [-46, -28, 227, 205, 185, -100, 76, -85, -71, 282, 365, -61, -44, 184, 130, 200, 235, 340, 245, 136, 245, 224, 105, -131, 245, 252, 67, 76, -152, 217, -1, -80, 143, -2, -103, 111, 33, -130, -62, -11, 31, 121, -206, -15, 29, -100, -57, 68, 78, 205, -150, -72, -102, 102, -152, -77, -104, 88, -150, 150, -85, -111, 61, -255, -80, -12, 40, 72, -21, 8, -116, -251, 51, 46, 98, -216, -343, -213, 146, 85, -175, 71, -25, -72, -39, -282, 211, 30, 8, 86, -160, 9, -186, 9, -195, 283, -166, 109, 50, -139, -84, 123, -170, 158, 202, 50, -144, 175, -113, -120, -114, -318, -221, -133, -32, -7, 87, 81, -247, -60, 16, -112, 191, -115, -62, -163, 16, 210, 52, 318, 15, -62, -19, 141, -100, 147, 281, 7, 160, 331, 32, -96, 101, -70, 62, 197, -63, -36, 99, 297, 71, -178, -236, -7, -71, -123, 323, 71, -33, -57, -32, -115, -33, -31, -13, 74, 117, -20, -464, -151, -153, 117, -17, -70, 57, 51, -89, 172, 95, -311, -236, -34, -236, 17, -179, -22, -186, -192, -139, -252]
4911b52Q6J09m8j64L80m09K16q7P1NK6Q0k25J4K23m3jK1j27o3J02K3k09L49j06
4936b9Q5j09L2J09o3k40M6N7K90j30L7j9l35K97Q4k29J55k96O40j54l05k13L95
4959A05L5j83j13K77n2j60J95k02L85m26J79qk56J05K56o6J36L8j31k63j08L82
4981A25rn5k09J99M20p13L76k51K92l63K18K14k41O3P9r9q5o4K72K23l05J72k32
5004B7J24j40J89j8k93J78O5l43M2K19o6pP1M1k05q3J64Qj00J48m0j97K5M9l58
5029e00J92K73j42n0J58lk7Q2k6j43M8J01Q1M1l69J04k3r0K35J86m7k83J64J58
5053A20J0j24j29K51j85j02K55l85L20Kk20K23q5J68k89k19J65K34l2k8J56j41
5075c5j7J79l13L90n9P8k33p5R0J37n46J74K38pL3Q2K5j79Q4%j12k3J74K07k73
$$ y = [-252, -166, -57, -105, -269, 111, -298, -82, -169, -98, -93, -67, 13, -212, -198, 25, -18, -19, 2, -125, -188, -86, -63, -272, 77, -29, 56, -53, -21, 88, 25, -215, -169, -112, 178, 48, 85, 66, -269, 28, 112, -117, 38, -258, 382, 228, -77, -290, 105, 140, -43, -156, 121, 69, -91, 104, -98, 287, -139, 40, 32, -224, -119, 137, 71, 207, 245, 114, -149, -257, 125, 116, 61, -148, 51, 471, -242, 134, -117, 175, -188, 30, 244, 3, 66, 145, 46, -39, -103, 169, 392, 87, 259, 27, 151, 11, 200, 182, -111, 67, 132, -211, -169, 50, -16, -23, 48, 89, -116, -199, -35, -27, -127, 21, -19, -216, -191, -142, -500, -308, -35, -177, -227, -69, -72, -99, -17, -43, -186, -138, -37, 44, 85, -284, -180, -203, -293, -58, 128, 81, -202, -38, 120, 130, 6, -123, 128, -57, -159, 96, -289, 31, 33, -187, 36, -49, 119, -170, -389, -224, 10, -22, -50, 106, -35, -52, 127, -186, 204, 145, 223, -10, -85, 5, 142, -404, -230, 8, 1, 34, 116, 141, -38, 46, 46, -66, -89, 85, 292, 19]
5100A9l2J89jn6j79K82o62M99j0q1j42L62j17j57K78N1j67N0L09l12L1j11R3p9
5124E7K53k95K10l09n9K63O6j0J45k43j09R0L06k39K6m74N51k35j77K92L0m3J02
5147A98m97L25l7j86J81k23J74kq9L85j88Q1k04PJ81r7N4j46M7J28O1j35m21L42
5171f1j06R5j28M43l51J1n2L79m75P6K30k59k2K20j25J70k69J95N0k36K35l9l1
5194e0j49J63K00n40K43Kj1J42Q9Nj3r7K55m37L78k31j37K14j94q4O08m36J39
5217E9R3n90N21k2LK40Q3m92j1J19J06k54L6m9K50k79M30k27J71j60L10j12k8
5240A97k87K88l92M32K2k22o0p2L72k91K10l05K66k27R4K58J10k93J40j52k86
5261a98K42J3J87j78L6k76L05M3m11L43l38M97m57pJ65j35J7lk12K62PJ91j09
$$ y = [19, -13, 176, 175, 119, -60, 222, -440, 59, 49, -32, -174, 188, 71, -86, 192, 243, 76, 126, 435, 123, 154, 43, 136, 57, 310, 15, 225, -84, -143, 120, 186, 176, 321, 78, -31, 59, 365, 126, 152, -322, 229, -6, -183, 109, 139, 96, 198, -299, 26, -11, -197, -16, -239, -65, -67, -156, 229, 41, 122, -82, -75, 106, 9, 63, -83, -36, 92, 153, 18, -403, -61, -167, -72, -200, 243, -108, -97, -149, 230, -245, -169, 61, -198, -220, 0, -125, 45, -224, -29, 21, -215, 20, -19, -50, -199, -36, 164, -376, -133, -131, -142, 0, 89, 94, 81, -16, 239, -198, 180, -51, -188, 26, -168, -252, 356, -80, 59, 152, -438, 83, 61, 64, 304, 387, -105, -116, 3, 109, -145, -109, -158, 92, -187, 243, 16, 187, 27, 337, 225, 197, -90, 198, -194, 238, 260, 38, -22, -94, 278, -13, 197, -108, 158, -69, 25, 283, 393, 100, 240, 88, -198, 44, 57, 244, 66, 102, -174, 131, 174, -237, 106, -232, 265, -192, -199, -34, -169, -152, -155, -367, -105, -98, 93, -16]
5284a6k60K42k11J03N4K7K1K40l89J42j3P0l56M30n6j99M22J0l66K46l48J35K09
5307A37k89j87J76K71j02k14N7J24j47n3J21j8K70k23K28j6p0J02o5K92l69j32
5329a07J72k30p2K21J42k06M9j84J76rJ41j13n5J47K42j97J94l72K56j36Q4q4
5351E9l4K73o54N38n8k26R3k01L37L0J5Q9k38K29l98L51k34M1R5j67L6Q6j09J62
5375A15p8K11l26J41J75J51m75R2J22J81j98J9m8k23K15K7K16j94m8L27j58n6
5397A88j92K99n1j27l60J92r6J74K29l89J22J10j61k05J04N2L16j70n9l4k42K39
5419f1j08o1L33j89k56m7O12j53l24J22l8P8j92J81k17J88L7J50nk11M43k90J69
5442A61j16j85J31J04P8k45J07j99J16j77K64m2l6j99K42l49L22K2r3P5J94k96
$$ y = [-16, -276, -34, -245, -142, -88, -61, -40, 200, -189, -47, -60, 10, -346, 84, 28, -171, 251, 261, -105, 141, -207, -72, 137, -152, -339, -163, 108, 6, -208, -151, -27, -174, -227, -106, -124, 146, -77, 151, 135, 65, 167, 102, 394, 25, -107, 65, -165, -237, -16, 126, -80, -31, -215, -39, -48, 93, -20, -75, 72, 314, 117, 311, -61, 195, 59, 143, 59, 25, 298, -356, 182, 124, -102, -9, -210, 127, 157, 172, 261, 23, 252, -146, 205, -29, 12, 107, -60, -24, 62, -47, 115, 37, 248, -78, 63, 238, 389, -86, 6, 128, 309, 111, 130, 82, -141, 74, 101, 317, 123, 75, 402, 244, 188, -4, 295, 244, 117, -243, -51, -147, 27, 256, -133, -11, 99, -62, -267, -163, -111, 205, 35, -24, -58, -300, -61, -169, -230, 103, -86, -342, -389, 223, 70, -254, -132, -170, -92, -284, -103, -320, -132, -95, 55, 50, -161, 282, -8, 161, 45, -140, -9, 95, 173, -72, 35, -164, -48, -225, 39, -3, -39, -238, 4, -345, -23, -1, -94, -19, 175, -121]
5464a21j3J94j40n8P5J15l01M77q0n10L11J38m9K41l57j48K87j96K27J3m19N17
5486B03j83J9p9j97N96m7j35o5k72J07J8J61j29J11j68r9N44j31o2j33L9l9K8
5509H7Q7j2l4j57j0k1R9K81k80J57M9k26o1J81M7q1l54kN01j81J64l51L11P1k72
5534gJ64j47r2K18j80k7k26N06l98Q5P4J09k65J02m7J57l38K81k39Q1L38k21N4
5557a8q6j23M58m92K79q4j69N6K81k31K24k87l7K6j45N20j68k07n3J21p9L46l85
5580b53K82k03J00K19m38K27k55J92j09K62L5k04M7K8J9K58j29J18O8k67j07P7
5602c3K64l74M2Pm2K75j72M5n2pM7K01j77Q3K8j29J01l04M81j50k56N7l6K54J50
5627C03l08j22K07j16l8K65k55J60j53J37J88p1M2l19L01k08J80l41l5L16O5j42
$$ y = [-121, -134, 60, -80, -138, -63, 52, -249, 228, 148, -362, -51, 87, 38, 279, -78, -226, 61, -135, 92, 105, -314, 203, 20, 39, -40, -237, 359, 312, 177, 112, -160, -53, -35, 126, -3, 108, -60, -159, 385, 254, 192, 59, 98, 59, 87, 174, 162, 128, -29, -39, -60, 39, 320, 40, 197, 246, 20, -41, 140, 187, 106, -248, -250, 251, 70, 234, -117, 194, 265, -7, 157, 10, -82, 136, -44, -71, -297, 209, -189, -104, -30, 79, -186, -84, -131, 26, -312, -31, -270, -189, 149, -72, -18, -104, -227, 231, -261, 18, -66, -235, -179, 102, -129, 95, -192, -229, -203, -348, 172, 4, -203, -256, -135, -214, 132, -253, 29, -174, -74, 145, -293, -66, -321, -129, -238, 24, 59, -145, -98, -70, -51, 207, 78, 196, 264, -3, -110, -33, 231, -143, -101, -94, -136, 139, -33, 12, -40, -47, 0, 201, 24, 107, 135, 6, 107, -197, 284, 134, -122, -65, -101, 153, 303, -5, -127, 80, -36, -74, 191, -64, 96, -57, 80, 268, 197, 239, -80, 221, 13, 193, -148, -183, 133, 198, 56]
5649E6j90J04K30j66M06n60J34J28j98M8j89K97j53J2q2J00O2j95R9k0J29j20
5671f8J93p9k61J77J59l30L15j31j51o9J01j52L86l19M62k14j59q1J87m34K17
5692b51J33j0k66L75J31j63J22K02l34j12L24l63L64k63L22l83L84k77k01M34
5712A68j65k47J81R4j63K12l63M38l8l3J01k39J02n5J75p6m5k68J45k37J86M75
5734C48m4J7m17J81l4K30k32J7j1j64J16q6Q2K94m11N4m8L1K2M19j35j93J85k58
5758c7M4J58o1k41L85j75N6j04M5K6k51J98j21L76l40J62j03j19K03j90J5R2k
5781A6K62k32j01p3N9p1K98k08j46P7J09K7n1L57k28k6l8o6j73K09J96n20L67
5804D4k62K8K8J1J68j76K41l59K55l2j61J95j40K46j03o9J04l06J29q2R5K9M9
$$ y = [56, -134, -30, 200, 34, 440, -120, 14, 142, -56, -8, -197, 100, -53, -41, -123, -23, 39, -156, -57, -77, 52, -68, 125, 46, -215, -38, 121, -209, 106, -25, -176, -245, -144, -296, 90, -229, 233, 19, -140, -221, -34, -468, -251, -118, -128, -394, -19, 112, -51, 71, 273, -61, -173, 151, -212, 152, -111, 211, -172, 212, -65, -266, 168, 3, -244, -63, 31, -132, 80, -283, 155, 117, 84, 185, -54, 48, -7, 168, 92, 47, -221, -76, -313, -127, 348, 304, 321, -96, 85, 51, 281, 49, 66, 55, -109, 7, -79, 3, 297, -114, -60, -108, -77, -55, 364, 229, 36, 221, -37, 7, 165, 104, -137, 248, 73, 129, 25, 70, 96, -155, 43, -78, 298, -42, 120, 17, -102, 101, -89, -74, 18, 16, 278, 46, -55, -128, -69, -140, 158, -50, -196, -119, -10, 17, -34, 323, 95, 69, 31, -35, -208, 1, 197, -323, 44, -218, -190, -162, -151, 17, -159, 82, -277, -22, -54, -215, -20, -160, 86, -17, -86, 18, -288, -159, -241, -146, -117, -68]
5827f8K76r9j3m2M0j34O2J36r8j47k25L03J28k01r4N30j37m87L79o0J84k82J78
5850A29j16j58K47l90L08q2j6j50Q6K56j87n3P1Q3M0K08k00q3P5k56L75l9M7k9
5874A66j68j2M27j65O0j52J20j40p4J90l18j32M27k32J62j56J5J0J65k31J42k27
5896a23K97K6k9K16j71L8l79%j34M19l43J09N57l40k70K72j2r9q4p2J53Q8k01
5919h2J30o9k09K63j25K88j40o2q7j00j61R3K60K07m12K71K7j04j47J30l7l26
5941c92M70k94L15j56Q2j78J85J4m7l7P4j33oK26n2l23L33m9k81m9K8J35J53r2
5965g4K79k41q%rK2k25K70o1q9n8Q7J38k55Q8K82j70j12j61J04J41P9l5J29M0
5990A61k23J67Po7J24k93M5J47l95K41r3KK20J32n1k11Q3J59j1R9k24k8K80k36
$$ y = [-68, 208, 109, 96, 54, 94, -40, 22, 158, 60, -87, -312, -9, 119, -82, -176, 354, 217, -270, 109, 49, 233, -49, 129, 13, -145, 102, -288, 20, -62, -78, -228, -142, 114, -73, -126, -55, 28, 68, 276, 76, -7, 68, -188, 187, 148, 195, 166, -2, -14, 413, 248, 308, 156, 276, 136, 62, 252, -66, -198, 229, -3, 159, 3, 18, 28, 193, -38, 104, -123, 174, 200, 171, 387, 216, 254, -125, -125, -259, 160, -183, -74, 483, 143, -127, 145, 133, 34, -50, -122, 31, 119, -82, 48, -21, -230, 33, -92, 196, 56, -6, -93, -193, -354, -261, -1, 206, -206, 65, 92, -12, -159, -29, -66, -392, 78, -216, 99, -57, 25, -153, 32, 46, -1, -38, 36, -97, -103, 123, 71, -252, 81, 32, -249, -298, -270, -135, 18, -74, 205, -36, -44, -44, -53, -31, -256, 14, -47, -136, -194, -107, 31, -224, -136, 146, -24, -136, -297, -193, -52, 27, -8, 121, 161, -62, 105, 112, 45, 169, -124, -79, 68, -327, -86, -179, -177, 43, 175, 124, -87, -4, 155, 144, 243, 19, -9, 271, 35]
6014C5J85l28K12j9K50l20k79M57j29k97K17L38jl26l8R7j6j05J76j72Q7J17M3
6037A84J65l77N9j79j18J53L21j42k58K45j3j66j22K45oR4J04k52j57L75J62k46
$$ y = [35, 220, -108, 104, 85, 335, 15, -264, 193, 64, -233, -16, 322, 321, -5, -43, 54, 38, -67, 109, -63, 24, 141, 184, 349, -28, 31, -148, -266, -113, 208, 66, -192, 53, 40, -126, -248, -3, -9, 85, 189, -63, -220, 155, 317, 71]
$$ [...]
8191A60
##END NTUPLES=NMR FID
##END=
