##TITLE=1H_LR-698-R3-EA2
 CDCl3, 8 sc, 
 31.1.2020
##JCAMPDX= 6.0         $$ Bruker NMR JCAMP-DX V2.0
##DATA TYPE= NMR FID
##DATA CLASS= NTUPLES
##ORIGIN= UXNMR, Bruker Analytische Messtechnik GmbH
##OWNER= root
$$ XWIN-NMR		Version 3.5
$$ Fri Jan 31 14:54:35 2020 Russian Standard Time (UT+4h)  she@DPX200
##.OBSERVE FREQUENCY= 200.1315
##.OBSERVE NUCLEUS= ^1H
##.DELAY= (6, 6)
##.ACQUISITION MODE= SIMULTANEOUS
##.ACQUISITION SCHEME= undefined
##.AVERAGES= 8
##.DIGITISER RES= 18
##SPECTROMETER/DATA SYSTEM= spect
##.PULSE SEQUENCE= zg30
##.SOLVENT NAME= D2O
##.SHIFT REFERENCE= (INTERNAL, D2O, 0, 15.7039)
##AUDIT TRAIL= $$ (NUMBER, WHEN, WHO, WHERE, WHAT)
$$ ##TITLE= Audit trail, XWIN-NMR		Version 3.5
$$ ##JCAMPDX= 5.01
$$ ##ORIGIN= Bruker BioSpin GmbH
$$ ##OWNER= she
$$ F:/spectra/data/she/nmr/H-F/1/audita.txt
$$ ##AUDIT TRAIL=  $$ (NUMBER, WHEN, WHO, WHERE, WHAT)
(   1,<2020-01-31 14:48:46.96 +0400>,<she>,<DPX200>,
      <created by zg, POWCHK disabled, PULCHK disabled
       configuration hash MD5:
       00 E9 B6 7A A2 85 ED C7 34 08 36 98 17 FE 4E 26
       data hash MD5: 16K
       8F 4F 3C 56 08 5B 98 95 0A E7 BB CA 93 59 C7 FD>)
$$ ##END=
$$ 
$$ hash MD5
$$ A5 65 AE 7F FD 75 1C 7E 19 C5 0E 51 3F AD FA 18
##$RELAX= 
##$RELAX= 
##$RELAX= 
##$RELAX= 
##$RELAX= 
##$RELAX= 
$$ Bruker specific parameters
$$ --------------------------
##$DU= <F:/spectra>
##$EXPNO= 1
##$NAME= <H-F>
##$PROCNO= 1
##$TYPE= <nmr>
##$USER= <she>
##$AMP= (0..31)
100 100 100 100 100 100 100 100 100 100 100 100 100 100 100 100 100 100 
100 100 100 100 100 100 100 100 100 100 100 100 100 100 
##$AQSEQ= 0
##$AQ_mod= 1
##$AUNM= <au_zg>
##$AUTOPOS= <>
##$BF1= 200.13
##$BF2= 200.13
##$BF3= 200.13
##$BF4= 200.13
##$BF5= 200.13
##$BF6= 200.13
##$BF7= 200.13
##$BF8= 200.13
##$BYTORDA= 1
##$CFDGTYP= 0
##$CFRGTYP= 5
##$CHEMSTR= <none>
##$CNST= (0..31)
1 1 145 1 1 1 1 1 1 1 1 1 1 1 1 1 1 1 1 1 1 1 1 1 1 1 1 1 1 1 1 1 
##$CPDPRG= <>
##$CPDPRG1= <>
##$CPDPRG2= <>
##$CPDPRG3= <>
##$CPDPRG4= <mlev>
##$CPDPRG5= <mlev>
##$CPDPRG6= <mlev>
##$CPDPRG7= <mlev>
##$CPDPRG8= <mlev>
##$CPDPRGB= <>
##$CPDPRGT= <>
##$D= (0..31)
0 1.2 0 0 0 0 0 0 0 0.06 0 0.03 0 0 0 0 0.0002 0 0 0 0 0 0 0 0 0 0 0 0 
0 0 0 
##$DATE= 1580467726
##$DBL= (0..7)
120 120 120 120 120 120 120 120 
##$DBP= (0..7)
150 150 150 150 150 150 150 150 
##$DBP07= 0
##$DBPNAM0= <>
##$DBPNAM1= <>
##$DBPNAM2= <>
##$DBPNAM3= <>
##$DBPNAM4= <>
##$DBPNAM5= <>
##$DBPNAM6= <>
##$DBPNAM7= <>
##$DBPOAL= (0..7)
0.5 0.5 0.5 0.5 0.5 0.5 0.5 0.5 
##$DBPOFFS= (0..7)
0 0 0 0 0 0 0 0 
##$DE= 6
##$DECBNUC= <off>
##$DECIM= 24
##$DECNUC= <off>
##$DECSTAT= 4
##$DIGMOD= 1
##$DIGTYP= 9
##$DL= (0..7)
0 120 120 120 120 120 120 120 
##$DP= (0..7)
150 150 150 150 150 150 150 150 
##$DP07= 0
##$DPNAME0= <>
##$DPNAME1= <>
##$DPNAME2= <>
##$DPNAME3= <>
##$DPNAME4= <>
##$DPNAME5= <>
##$DPNAME6= <>
##$DPNAME7= <>
##$DPOAL= (0..7)
0.5 0.5 0.5 0.5 0.5 0.5 0.5 0.5 
##$DPOFFS= (0..7)
0 0 0 0 0 0 0 0 
##$DQDMODE= 0
##$DR= 18
##$DS= 0
##$DSLIST= <SSSSSSSSSSSSSSS>
$$ [...]
##$SUBNAM2= <"">
##$SUBNAM3= <"">
##$SUBNAM4= <"">
##$SUBNAM5= <"">
##$SUBNAM6= <"">
##$SUBNAM7= <"">
##$SUBNAM8= <"">
##$SUBNAM9= <"">
##$SW= 24.9337058887773
##$SWIBOX= (0..15)
0 0 2 0 0 0 0 0 0 0 0 0 0 0 0 0 
##$SW_h= 4990.01996007984
##$TD= 16384
##$TD0= 1
##$TE= 0
##$TE2= 300
##$TE3= 300
##$TEG= 300
##$TL= (0..7)
0 120 120 120 120 120 120 120 
##$TP= (0..7)
150 150 150 150 150 150 150 150 
##$TP07= 0
##$TPNAME0= <>
##$TPNAME1= <>
##$TPNAME2= <>
##$TPNAME3= <>
##$TPNAME4= <>
##$TPNAME5= <>
##$TPNAME6= <>
##$TPNAME7= <>
##$TPOAL= (0..7)
0.5 0.5 0.5 0.5 0.5 0.5 0.5 0.5 
##$TPOFFS= (0..7)
0 0 0 0 0 0 0 0 
##$TUNHIN= 0
##$TUNHOUT= 0
##$TUNXOUT= 0
##$USERA1= <user>
##$USERA2= <user>
##$USERA3= <user>
##$USERA4= <user>
##$USERA5= <user>
##$V9= 5
##$VALIST= <valist>
##$VCLIST= <CCCCCCCCCCCCCCC>
##$VD= 0
##$VDLIST= <DDDDDDDDDDDDDDD>
##$VPLIST= <PPPPPPPPPPPPPPP>
##$VTLIST= <TTTTTTTTTTTTTTT>
##$WBST= 1024
##$WBSW= 4
##$XGAIN= (0..3)
0 0 0 0 
##$XL= 0
##$YL= 0
##$YMAX_a= 189854
##$YMIN_a= -93786
##$ZGOPTNS= <>
##$ZL1= 120
##$ZL2= 120
##$ZL3= 120
##$ZL4= 120
##$ABSF1= 10
##$ABSF2= 0
##$ABSG= 5
##$ABSL= 3
##$ALPHA= 0
##$AQORDER= 0
##$ASSFAC= 0
##$ASSFACI= 0
##$ASSFACX= 0
##$ASSWID= 0
##$AUNMP= <proc_1d>
##$AZFE= 0.1
##$AZFW= 0.1
##$BCFW= 1
##$BC_mod= 2
##$BYTORDP= 1
##$COROFFS= 0
##$CY= 11.3945322036743
##$DATMOD= 1
##$DC= 2
##$DFILT= <>
##$DTYPP= 0
##$F1P= 16.9975609425685
##$F2P= -3.02152046262296
##$FCOR= 0.5
##$FTSIZE= 0
##$FT_mod= 4
##$GAMMA= 1
##$GB= 0.15
##$INTBC= 1
##$INTSCL= 1
##$ISEN= 128
##$LB= 0.24
##$LEV0= 0
##$LPBIN= 0
##$MAXI= 10000
##$MC2= 0
##$MEAN= 0
##$ME_mod= 0
##$MI= 1.114404
##$NCOEF= 0
##$NC_proc= 0
##$NLEV= 6
##$NOISF1= 3.799351
##$NOISF2= 2.8
##$NSP= 1
##$NTH_PI= 0
##$NZP= 0
##$OFFSET= 15.70392
##$PC= 1
##$PHC0= -9787.823
##$PHC1= 14.00081
##$PH_mod= 1
##$PKNL= yes
##$PPARMOD= 0
##$PSCAL= 0
##$PSIGN= 0
##$REVERSE= no
##$SF= 200.130013532006
##$SI= 16384
##$SIGF1= 3
##$SIGF2= 2
##$SINO= 400
##$SIOLD= 16384
##$SREGLST= <1H.CDCl3>
##$SSB= 0
##$STSI= 0
##$STSR= 0
##$SW_p= 3612.71676300578
##$SYMM= 0
##$S_DEV= 0
##$TDeff= 0
##$TDoff= 0
##$TI= <>
##$TILT= no
##$TM1= 0
##$TM2= 0
##$TOPLEV= 0
##$USERP1= <user>
##$USERP2= <user>
##$USERP3= <user>
##$USERP4= <user>
##$USERP5= <user>
##$WDW= 1
##$XDIM= 8192
##$YMAX_p= 0
##$YMIN_p= 0
$$ End of Bruker specific parameters
$$ ---------------------------------
##NTUPLES= NMR FID
##VAR_NAME=  TIME,          FID/REAL,        FID/IMAG
##SYMBOL=    X,             R,               I
##VAR_TYPE=  INDEPENDENT,   DEPENDENT,       DEPENDENT
##VAR_FORM=  AFFN,          ASDF,            ASDF
##VAR_DIM=   8192,          8192,            8192
##UNITS=     SECONDS,       ARBITRARY UNITS, ARBITRARY UNITS
##FACTOR=    0.0002004,     1,               1
##FIRST=     0,             0,               0
##LAST=      1.6414764,     0,               0
##MIN=       0,             -93786,          0
##MAX=       1.6414764,     189854,          0
$$ Real data points
##PAGE= N=1
##DATA TABLE= (X++(R..R)), XYDATA
$$ [...]
1993g87L46j18M5l3q9K77L64L5m17j45M69j06K97j11l38L54k59J30J66L49j60
2014B69j96j55j31N03J08L6j39Q7J23l06O1K00N04k16k14k40J27L96j86k08k5
2035C98N48m10L67k69J21K16k77k4l04L22MJ73k0J45n14J20o2K5L60k44j63j80
2057C32L47lL7l22j5k39L50k35L88n31J22J15m62J77J53K04O5l84k56K36j48N34
2079D65o48N3NJ27k64j80K17J83j64k97q4K02J85N0n65K1K86j00lp2P3l3j64J56
2103e51l88K99Lj91M9j49K30J19j20k8k26N75j76J2j63J35L8J46l41M4K03J53
2125c27k17K7l0J30M2j82J73p5l7q3L89j28N66l14j58RJ10L60j86r6m9K68p4o3
2149E5j05J83L3On4P7L75p9Pl08Q7K25j06K1J99j87J60j81pL08R4l0m26j06N68
$$ y = [-787, -441, -559, -514, -547, -636, -359, 5, 40, -377, -522, -53, -159, 138, 27, -311, 43, -216, -86, 80, 429, 269, 73, -82, -213, 290, 398, 434, 295, 382, 505, 199, 260, 460, 964, 748, 534, 294, 421, 817, 631, 423, 398, 946, 536, 903, 634, 755, 971, 694, 670, 366, 688, 692, 865, 845, 990, 476, 596, 534, 559, 919, 675, 512, 332, 679, 676, 713, 391, 376, 137, 487, 252, 640, 109, 231, 346, -116, 61, 214, 418, 483, 99, -157, 79, -69, 465, -183, -130, -125, 2, -262, -442, -225, -42, -206, -503, -587, -385, -200, -150, -715, -694, -408, -508, -511, -583, -510, -543, -707, -551, -939, -640, -637, -828, -779, -928, -698, -579, -699, -727, -953, -378, -554, -542, -705, -570, -532, -386, -727, -683, -480, -327, -544, -517, -547, -417, -375, -557, -384, -459, -496, -579, -190, -318, 248, -66, -224, -215, -105, 255, 69, -27, -76, 192, 118, 55, -50, 133, 166, 172, 118, 195, 570, 491, 498, 190, 277, 502, 396, 417, 616, 429, 589, 408, 401, 709, 803, 773, 347, 241, 809]
2174H09m98J45J23J0j33J33j9J95j73K68k89n00J68K88J46j56k08L9M0L03p24
2195c3Q6M81l43J66m50K66K62M1l22m12J88J61m0km21L07j06k5j15N4N21n52j75
2218d63J1P2J73n9P9J3j72k71L87j20l29L35m5q5k33L67J22J1l92k81K65L51j57
2241d21p7j1r3L13l40K39n1K91p81J64J84J43N40m99j74pR2K83j60J90j17J67
2263a25K6l20M05k71L33j57K3k78M89j62j98K27J57N5Nk80L30J49m1l12k46N44
2285C53k7L19k30j79M03O1k81n6j5J56j11j67K83N3M1M3l18j76K27J82j63J9j32
2308B85K57j88r4J89J86m8n00p3K98L37J38l90l84N30l24J61l49K44pj98j2k77
2330b19M36K02j93m21j31K21K21m56J24L70k69j08Lj95JN8O5k43q9J83KJ83r4
$$ y = [809, 311, 456, 579, 589, 456, 589, 570, 765, 592, 860, 571, 71, 239, 527, 673, 517, 309, 348, 388, 691, -33, 53, 534, 191, 357, -93, 173, 435, 476, 154, -258, -70, 91, 51, 49, -372, -65, -171, -196, -311, -257, 264, -288, -463, -452, -380, -207, -266, -187, -174, -346, -617, -230, -350, -679, -344, -389, -474, -707, -340, -218, -207, -599, -880, -615, -264, -421, -498, -509, -602, -289, -629, -390, -441, -150, -931, -767, -583, -440, 100, -399, -573, -580, -488, -205, -365, -175, -292, -125, -99, -419, -14, -285, 48, -109, -86, -364, 125, -37, -235, -8, 149, 204, 209, -71, 259, 408, 367, 55, -191, 353, 326, 645, 415, 236, 639, 700, 419, 363, 348, 504, 393, 226, 509, 562, 603, 646, 328, 152, 379, 561, 398, 417, 285, 542, 354, 260, 449, 635, 587, 87, 14, 312, 649, 787, 397, 13, 543, 219, 380, 31, 275, 268, 70, 58, -219, 217, 419, 226, -195, -326, -105, 116, -340, -216, 154, -115, -223, -220, -415, -414, -356, -291, -534, -623, -440, -438, -255, -349]
2353c49r4K51O4m79R0K70l00K81n93K95L17Q5k57P1j46K74m97M03j06o2N1rk4
2376d64l0L07J3k03R1k59K03J22n5L8J87r4j8j05L23r2j1J28k44J8K22J82k58
2399ApK28k10MJ43M09k09k15m7r1L83R3o52M05O0j6K56k76J68J6J31m26L02j36
2423C14J89M26n39J85k46J84K70l05k0q2r1K10k69L63j53k45L55n0n7k75P3K39
2445D76m59L22O0j61j18L58l76j64K17k51K37M1k27l8M5j52j53K2N24l57j30K18
2467f6m09L45j53j9j25M7k65L44J7k04K30Q8j95o3L7p9K04r5Oj96O8J75Q8j81
2491d01k69L39j11M6K06l28K91k12l2o2K02Q3r7p9j03K64J12k65K43j6l3k97J73
2514c46J6M6M1J26k28J91K48j6m45L81k56K39L12n52M05R2l4j18j06M44k89j83
$$ y = [-349, -443, -192, -128, -607, -517, -247, -547, -266, -859, -564, -247, -162, -419, -348, -494, -220, -717, -314, -420, -482, -431, -440, -464, -494, -187, -174, -377, -286, -545, -342, -220, -275, -237, -50, -144, -162, -267, 56, -36, -47, 81, -163, -145, 77, 259, 1, -6, 222, 12, 16, 159, 568, 359, 144, 97, 6, 389, 482, -170, 235, 295, 279, 535, 259, 427, 443, 574, 148, 450, 314, 503, 929, 390, 575, 329, 513, 783, 478, 458, 376, 285, 495, 226, 589, 436, 191, 546, 496, 439, 164, 237, 476, 17, 339, 399, 238, 120, 478, 102, -62, 155, -96, 141, 182, -45, -83, -38, -190, -343, -321, 203, -154, -284, -66, -475, -130, -283, -302, -427, -380, -645, -301, -284, -488, -258, -170, -365, -428, -391, -470, -266, -361, -355, -551, -483, -308, -220, -401, -670, -331, -442, -396, -190, -518, -227, -439, -471, -533, -331, -248, -345, -424, -527, -263, -151, -416, -173, -189, -222, -519, -346, -330, -284, -243, -117, -345, -154, 94, 78, -367, 14, -242, -3, 309, -243, 162, 254, 220, 102, -4, 440, 151, -32]
2536c2M91p4r6j63J16o7r9K47N6K36n52N33j53Q0K1J10J07Jk93j52K08P6L0k85
2560C46L50l70P9J13r8j93M78n8k98N8j8M77p81L04k52J26m3K24k04k5P4J71m73
2583a3J41L4n1K91n54J33p2J20o6J78m9N3l79M7n2OL45n50j01J04J39k5J0j08
2607d19J59k00J66l09N8L88k14j90k3M4J78J60l26j09L97J75m64L5o4M8K6j78
2629f62kk2N39k38m29L60M2K00kj65n5J09L7O3J14l29K16J85m2m00L38Q8j16J05
2653f6P0k90K77j37R6K37k61J49k21K86n6J49K00k08PK8J7J33qR7j90P6j7j06
2677B62L30l7j77j06k4L04mj14K10k17Q6j00J29j9J08l34K10l06K99K0k42L93
2699F71n10J2rm0J31J16L1J27k31j49J43k49J04J6J31l08J27J47j45j08j23K40
$$ y = [-32, 459, 385, 289, 126, 242, 175, 76, 323, 379, 615, 63, 596, 443, 523, 544, 654, 761, 762, 469, 317, 525, 601, 631, 346, 696, 326, 405, 518, 420, 227, 705, 647, 349, 407, 389, 866, 85, 389, 137, 263, 220, 444, 240, 215, 289, 460, -13, 128, 162, 111, 402, -152, -19, -91, 29, -37, 141, 92, 145, -234, -187, -239, -233, 112, -438, -539, -435, -296, -321, -311, -419, -260, -460, -294, -603, -545, -157, -371, -561, -584, -540, -362, -202, -528, -637, -240, -65, -529, -494, -558, -510, -484, -662, -664, -686, -147, -385, -814, -454, -412, -212, -214, -379, -434, -325, -288, -225, -111, -440, -224, -39, -81, -481, -143, -55, -171, -66, 4, -286, -9, -146, -50, 187, -74, 75, -146, 140, 84, 233, 433, 225, 232, 260, 277, 410, 402, 499, 309, 385, 368, 262, 592, 555, 378, 272, 248, 552, 548, 434, 644, 427, 513, 413, 542, 523, 631, 297, 507, 201, 500, 520, 278, 671, 161, 173, 164, 124, 255, 371, 402, 529, 298, 149, 292, 43, 147, 163, 294, -14, 113, 260, 115, 7, -116, 124]
2721A24r1oK6R5n92K88M0O4pl15J93j73K44k5p0k84j10J97L8N5J04j84K60l40
2745d69j68K17J21J4O3L1nl62J56j5KP3j72J95r8J21l30M31m45L26j32K36j36
2768c46K13n5n7l0m4J58K06l03J51l27L95j09K33j07L5JQ6j35K38l53K01o5j04
2791a18K38l12M43q4M2K6J33k28k59K53J01j44N84l39J17l02J19K04m70K18PL0
2813B59O9k2l7L51p2n2j58j93K01L1L8k28K15J2K15k17j31J18J60k64M5M9j25
2836B64m9o2J68j9M4K4k90k20L48k22l2J36j7j49J62m3L4J31k17K72l61N8J1l45
2860c74K59k19M22m05m6J92j6j5L7q0l35K44J35k7l63K64l27L04j18K20j30J1
2882c67k22q8K15J86k11K04o7J2Q6Q6j5J24m81K67J82k53k04L94j63M8K4j61M4
$$ y = [124, 33, 27, 53, 148, -444, -156, -116, -52, -59, -374, -181, -354, -110, -135, -205, -489, -599, -402, -364, -309, -205, -389, -129, -469, -637, -420, -299, -285, -222, -191, -196, -558, -402, -417, -415, -342, -514, -319, -417, -296, -626, -195, -640, -314, -446, -210, -346, -133, -188, -245, -275, -319, -161, 45, -258, -107, -434, -39, -148, 85, -22, 13, 14, 100, -35, 203, -150, 51, -14, -118, 120, -192, 251, 167, 209, 235, 368, 140, -119, 134, 235, 91, 675, 336, 453, 151, 270, 474, 4, 222, 229, 259, 328, 306, 269, 620, 548, 496, 338, 145, 346, 377, 415, 187, 402, 414, 629, 412, 281, 399, 559, 295, 340, 389, 264, 215, 153, 321, 302, 346, 370, 80, -140, 208, -14, -46, 90, 73, -76, 86, 43, 77, 208, -9, 263, -98, -40, -29, -374, -115, -334, 88, -317, -363, -171, -187, -202, -165, -245, -580, -336, -201, -228, -591, -327, -654, -350, -468, -248, -378, -367, -589, -677, -462, -276, -487, -283, -350, -338, -252, -166, -181, -57, -538, -271, -89, -342, -546, -152, -315, -267, -243, -404, -360]
2905c60L28k97K51m6j46K50k24K86j56j15M7j9L04m9K2J02J10k70J49k12P9J59
2927A93l00K54K51k60nK98n66N3J64N08k17J76m99J71P3J18j6PR4K8j46j12n2
2950B15m8n2J02J56K27n33L88j59J16m04J22l9L7K48J56k16m3q9J3L6l17J80j1
2973H5J15L29n86pK44J07q9l81k8L26j64qJ24j30q6k95L88j16K59j25j9k85K16
2996a26R7n19L12N4j80o9K98J23n15R1J89r2Q6j08J45K33k22k48M50n3l38R4j48
3019d46l8O44j84k35k28K33J54l98L06L4O1k92K9R5L04M9L1j98P3k39J37J15k40
3042b33L64Q2j41k8MnJ3j4J59l52J20K17k79K29p6J51K04k78J28j21k72J25K57
3065B54j19j83K05J80j07o4nkj5K53q1k6j14oJ00r1Q4k82J58K67k0k88m50M61
$$ y = [-360, -32, -329, -78, -124, -270, -20, -244, 42, -114, -229, -182, -201, 103, 54, 76, 178, 288, 18, 167, -45, 34, 193, -107, 147, 398, 138, 133, 431, -135, -82, 82, 590, 373, 549, 50, 221, 294, 412, 396, 403, 497, 525, 379, 267, 215, 167, 115, 217, 373, 600, 67, 455, 296, 412, 8, 130, 91, 128, 376, 532, 316, 273, 184, 197, 233, -84, 96, 85, 200, 529, -57, -64, 180, 287, 198, -183, -211, 115, -49, -57, 67, -63, -149, -444, -56, -172, 87, -38, -57, -342, -126, -29, -548, -236, -182, -362, -431, -133, -10, -525, -434, -245, -337, -251, -359, -214, 19, -203, -451, -1, -54, -392, -298, -446, -484, 160, -24, -259, -487, -254, -100, -498, -192, -158, -97, -389, -360, -265, 39, 88, 119, -79, -6, -245, -108, 7, -233, 131, 213, 72, 44, 48, 43, 56, 42, 201, -151, -31, 186, -93, 136, 60, 211, 415, 137, 265, 144, -128, -3, 254, 135, -48, 157, 337, 230, 166, 161, 159, 144, 397, 316, 290, 176, 170, 270, 179, 263, -19, 139, 406, 386, 98, -352, 109]
3089A09oK46J8l11J50Ll05R7R6K52j98J27j62O8k1k11L8k79K99K54o77K71J65
3112B3j85L97j69n96L84J03q5n3j00R2j39kJ50j18P0J6J2K14n6r1l00L32Oj75
3136b70n9o4p6J24J32p9j9j28J22J83j5k03J99j7j62j59L80j12L5J86k86L1R1
3159a66o6O8M7k6J67p9j34J12m4R5k88L16j36K05j66O8P4J73j34Q5j22J70j47
3182G2j7jK24k68K03M2K71m25J71l88N5M98k10p3J24N2k66K17j95J95j38K62j81
3205B24K19j42r5k48L26j59J02K62m27L12j75L3N6J60l07j43J27j70K14m1k71
3226a43%M63k70k37L7J98q9J27K26n83k6K60O6r0J33l34L84k16m48M09q1N0O9
3249i5l13K07J67k32K79m61K42k51K34J64k58p3J78R5q4l1Q4J51m18M1L49k12
$$ y = [109, 103, 349, 367, 56, 206, 209, -96, 1, 97, 349, 151, 278, 116, 184, 163, -48, -10, -289, 10, 264, -413, -142, 23, -162, 235, 66, -530, -146, -43, -128, -181, -281, -189, -328, -330, -180, -298, -228, -212, -200, 14, -42, -133, -433, -101, -95, -270, -329, -393, -469, -345, -213, -292, -311, -439, -317, -134, -149, -352, -153, -170, -332, -491, -111, -223, -188, -2, -288, -257, -166, -232, -164, -117, -143, 24, -55, -189, -77, -121, -26, -314, 2, -134, 71, -95, -27, 47, 220, 86, 171, 49, 219, 72, 55, 54, 278, 10, 213, 255, 526, 101, 272, -116, -61, 437, 227, 154, 278, 330, 64, 281, 86, 281, 143, 405, 224, 443, 301, 206, -42, 284, 125, 227, 489, 62, 374, 199, 232, 288, 448, 141, -2, 125, -45, 169, 128, -143, -143, 320, 50, -187, -150, 48, -41, 86, 312, -271, -297, -37, 29, -61, 72, -262, 122, -94, -542, -133, -214, -164, -95, -408, -201, -34, -266, 13, -448, -206, -457, -223, -59, -317, -390, -212, -117, -201, -232, -148, 3, -415, -374, -25, -237]
3271b37j68J18k6J13p2P1k1l7J02J09m8k53J95j53k6k0m4j2R5K16j19RL86n30
3295c52L30l13N01J58m41J99L7j02m0M3L1J56P0k81J87r8K03l2n7o3K54k45J77
3318C22Kk32J82j27K1L40k86J61k74J89om4J68r3q8j9J92l49K06R5j66J61j08
3341B47N5j32N6j9rJ16j09j6k5m5K11k55J64j81J1N8J96k77J17j63j87K66J02
3364A81j32K6j44k09R3J75R2j82K36k27j8n9J84k28k5J94k48K47j45j43L3k03
3386e02L27J60k22Or3J17k74Q2J16L7J38o3P5k32L10Mk46p3K28j04m3jm7J68J30
3411bj15J17m93K1K74l2K52q0K80k34j15J09j05J61Nl82N33J49m04j31K77Kl1
3434E6oQ0j6J12j55J35k51J98j34K33l38K77l9K3L82m78K10M2k05L05l62K77k99
$$ y = [-237, -405, -287, -313, -200, -272, -201, -222, -259, -157, -48, -96, -349, -154, -307, -333, -353, -397, -409, -314, -98, -217, -208, 178, -352, -22, -335, 166, 324, -117, 82, 119, 17, -23, 20, 51, 207, 277, -4, 183, 85, 288, 256, 199, 136, 390, 145, 322, 324, 92, 274, 147, 168, 508, 222, 383, 109, 298, 292, 248, 416, 323, 235, 216, 408, 59, 265, 360, 194, 355, 247, 302, 170, 226, 207, 198, 314, 205, 189, 164, 119, 330, 75, 239, 58, 69, 127, 323, 46, 163, 0, -187, 79, 181, 49, 75, -69, -278, -185, -10, 82, -100, 136, -91, -109, -168, 16, -212, -237, -43, -291, -44, -189, -332, -299, -502, -175, -15, -237, -231, -324, -207, -481, -399, -283, -246, -108, -171, -96, -328, -18, -14, -260, -333, -105, -209, -252, -253, -300, -132, -2, -117, 0, -493, -472, -198, -230, 22, -58, 222, -12, -127, -18, -123, 38, 43, -339, 194, 343, -61, -192, 85, 87, 56, 50, 130, 114, 226, 71, 206, -45, 153, 19, 252, -86, 191, 152, 175, 557, 79, 289, 331, 126, 431, 69, 346, 47]
3457D7J97Q1o5m5L69n05L31l06L56k13j44N6L4J18L5N5m10J59J70k74K99j07l13
3480g5J48K29j70M1j05K76j10j88p6J1j36K62J86k75p6J47k91qJ80q5K25j29J6
3503cj41K6j93N7R8j60p2L65K5J05n06O3J57P6q0Ok00O6J71o1j40j25K47n33N98
3528a54r7n5L84l11m6N8j26j9J42K8J50q3j1l58M53K4p6J43k79l5L37m74j4K98
3552a21J6L22k59m0K38j14J22l55K86K10k25k41j90M65J53j05j15J52m73J42K95
3573A63k68J06J38j07l2Q8p9oK35r5J27L27m49k80K01J67P9K1j45N8J4p3K8oJ45
3598C57J0j5j95m0m2N5L81m81J95J23k86k7J88j07j2M6N4J19j95j00N4r2K0j06
3622i6J05L22n10K41J21k66k71N16l91J42j83m6q6J95K99j61j33K5j15K19K9O0
$$ y = [47, 244, 325, 260, 215, 584, 79, 410, 104, 460, 247, 103, 159, 193, 311, 346, 401, -9, 150, 320, 46, 345, 238, -75, 73, 302, 132, 173, 68, 344, 234, 46, -30, -19, -155, 107, 293, 18, -58, 89, -202, -210, -30, -115, 110, -19, -3, -144, -118, -311, -254, -156, -316, -388, -23, 2, 107, -399, -336, -179, -103, -183, -177, -377, -311, -140, -201, -341, -466, -219, -752, -154, -251, -306, 78, -233, -279, -221, -347, -366, -224, -196, -46, -129, -140, -498, -45, -21, -97, 46, -233, -268, 69, -405, -419, -121, -105, 217, -42, -82, 156, 42, 164, -191, 95, 305, 80, -161, -351, 114, 267, 162, 47, 199, -274, -132, 163, -105, 1, 139, 32, 0, 88, 9, 3, 238, 143, 270, 597, 148, -132, 69, 236, 315, 336, 191, 249, 263, 190, 218, 212, 357, 367, 352, 157, 117, 75, 130, 511, 30, 225, 348, 62, 35, 223, 116, 104, 150, 204, 323, 128, 28, 82, -10, 10, -96, 9, 331, -179, 62, 183, -83, -354, 162, -229, -87, -270, -316, -402, -207, 92, -69, -202, -177, -292, -73, -44, 16]
3644A6j4q2j99L20j4j29k93L56j13j05NK42q6l01M97L9l96RJ18l50L96j97M9J23
3668a09O5j32k3k2J8l0J94j63J56K32j31%j64L5k02J71L43l98J50j61K22Kj92
3691a39K97r7j16j14M31j3k99j03K28M2J5K0K25l85K9j6J08m4k19R3J73j37P2
3714E1R2L7J55j95Q3l5p5K77k34R0J18m41K57n7J11l54K8P4K37m9l5j05J76j17
3738H9J35n7K17k49p7j2L4p4q5R5k73J69j19K6J28O9L2o6L3k09R6J49n3j68L6
3763a34J85q2J5K37k90o4o8J29k71J07K51j70Q1j21L32n50k3M44k24NJ72M1n5
3786e3j92J97j18p3r8N50m34n7J88L31m44J15n75N92j70N5J06k25M88l65K48n53
3808d87Q94m33j33L25l71O2J73J70k94j73L59jj06R6M8j89jJ05Q8K9J6l2J77l42
$$ y = [16, 2, -80, -279, 41, 27, -102, -395, -39, -152, -257, -252, -10, -96, -397, 100, 139, -257, -248, -130, -480, -84, -281, -232, -109, -44, -176, -199, -221, -203, -233, -39, -202, -46, 186, 55, 55, -109, -74, -276, -105, 238, -160, -10, -171, 51, 53, -139, 158, 61, -55, -169, 262, 249, -50, -153, 75, 117, 132, 152, 377, -8, 21, 5, 113, 69, -150, -57, 116, -21, 51, 143, 180, 335, 140, 223, 188, 113, 390, 156, 246, 364, -77, 180, 123, 234, -120, -92, -18, 219, 170, 135, 30, 206, 89, 224, 167, 384, 135, 58, 46, 80, 6, -79, 16, -257, -88, -207, -181, -53, 16, 48, -18, 15, -194, -98, 51, -2, -170, -134, 51, -31, -16, 221, -69, -133, -201, -72, -343, -236, 15, -155, -74, -195, 137, -413, -436, 8, -216, -211, -39, 2, -53, -245, -48, -166, -239, -337, 213, -221, -278, -90, 241, -203, -88, -663, -71, -241, -186, -80, -305, 183, -182, 66, -487, 407, -26, -159, 166, -205, -143, 30, 200, -94, -267, 92, 91, -15, 81, 129, -60, -61, 44, 132, 161, 177, 145, 322, -20]
3832b0M7J63n5Oo4m3LJ20r5j43J4M42k88l4N7j4L3P2j69J02k09L74l06J67J85
3857C45m8j87O3j9J56K81n06j09K21J49l98p1J15M82m24J1r4K99l7J4k39p5j38
3880b09J69K36k54J02j12j20j8L30k85J93L0o3k60R3NJqn8L1L64k54O1J59l61
3904b28K63p5k12L37j94j77P4K68l1k82R4n5J07P3k08K62l73J20P0J34j26J1j09
3927b57l1J8J60J24n9j56L4R0J03k75L08j83l71L28K29m3j98L83q7l76L95k29
3949i3J06J43qk9m9j14%J69m0N5NN4j98R9J29k08J66J09m56L62J86n92N01N9j36
3974B20j18J1J45q8j1J2J25k68K4J21J50l93m3K86J09j19k03M67k35p1l6J35J6
3997B36j95L1j72O9J09J90n88L53J55k73J70j15l2J17m04K75J53J19k80kJ37k50
$$ y = [-20, 27, 190, 135, 141, 77, 34, 37, 157, 62, -81, -67, 375, 87, 53, 110, 96, 129, 201, 32, 134, -75, 299, -7, 160, 345, 297, 110, 173, 154, 310, 591, 85, -24, 197, 346, -52, -123, -8, 474, 50, 61, -33, 266, 229, 243, 4, -71, -209, -40, 196, -58, 44, -68, -188, -206, 124, -161, 32, 62, -1, -261, -168, -163, -162, -170, -228, -197, 167, -87, -26, 133, -228, 35, -40, -252, 85, -109, -286, -212, 56, 25, -257, -163, -218, -111, -38, -246, 16, -357, -237, -167, -33, -159, -148, -257, -288, -270, -110, 14, -45, -201, -167, -77, 26, -249, 59, -124, -495, -167, 62, 19, -179, 204, 117, -259, 136, -93, 13, 156, 148, 119, 70, -44, -44, 125, 85, 140, 145, 199, 1, 100, 229, 21, 187, 296, -160, 202, 388, -204, 297, 356, 220, 102, 113, 258, 170, 159, 171, 296, 28, 52, 173, 323, -70, -113, 173, 282, 163, -40, 427, 192, 121, 85, 220, 236, 41, 72, -100, -31, 78, 268, -320, 33, 188, -85, 85, -30, -62, 55, -349, -74, 79, 198, -82, -84, 53, -197]
4019a97J20M4O8j1k19K03k27K19q5j53Q3J94k41j19J10j38K59NJ47k09k55L47
4041e5N2j57j86j6jM78o33J23L28j88Q4K19p5j12J86j36k39J4L72j63J51l81N26
4064A91j82K67n56L23j3j47lR6o3J2k15M04k07Q3r9Mj16j6N22j49r1K8J87k45
4088A5J14m3nRJ06M5j22l05M73j33J5O0j52J17O7j38P1r3J67j0j15K42k42R0M4
4113B77l39N7o2O1R2K33k20l08L76k51K12L4j3J8j60R1L9r5J53o5J06P6k51K7
4137H8k01K6o3J80j36K72j44J12k5r6l7j41r8K88L6j57j1J62k34m9K57K70l26
4160b7k0J62k21L9p7l5K88l7j97m2M0K26l9k86J15Q3j12K15k18j2m8j39P4K33
4184c5l22K58l1K84l02J14m8K8K0q6J45k72Q8j87P34k59j92R3OOm0j25j6L75l32
$$ y = [-197, -77, -33, 35, 24, -195, 8, -219, 0, -85, -238, -155, 39, -202, -321, -211, -349, -90, -85, 62, -147, -402, -55, -3, -160, -346, -362, -363, 115, -518, -395, -67, -255, -171, 48, -27, -139, 47, -89, -328, -314, 58, -105, 46, -335, 191, 9, 276, -280, 43, 30, -117, -120, -24, -87, -75, -290, 114, -93, -10, -109, -105, -221, -237, 285, 136, 45, 73, 260, 15, 129, 86, 81, 90, 196, 241, 119, -186, 287, 154, 169, 229, 77, 194, 261, 123, 194, 101, 268, 258, 143, 385, 143, 233, 277, -62, -5, -67, -6, 86, 319, 99, -209, 167, -84, 128, 162, 149, 167, 7, 98, 137, 42, 195, 130, 236, 312, 61, 88, -113, -87, -150, 30, -106, 166, 22, 134, 109, 13, -24, -165, -263, 25, 61, -96, -107, 55, -179, -228, 29, 299, -27, -47, 115, -106, -67, -144, -179, 109, 72, -125, -167, -127, 99, 60, -226, -111, -28, -140, 75, -143, -155, -203, -342, -268, -35, -357, -99, -130, 154, -148, -34, -82, -54, -34, -120, 25, -247, -159, -346, 388, 129, -63, 30, 36, 42, 2, -123, -139, 236, -96]
4209i6K35j37JJ55l04N0J02L21m3r1k00%K9J97N6k47J60K11l07j16O8k82L45Q3
4233A90j07L43j87P0k41j40J31k8K48k7k70J63l42L62J79l70K87n18L77j33J44
4254A31J87k64K51l07L6J14l1k08l6M00l84J09n4K57l87L00j52J59k78M40p1l25
4276a13q9J95K4k46L46j86k3LJ04Q1k02J49m37N92j73J08l32R5k37L17r5J74j98
4299a43l41L18J3j46j8J84k43L02l27K34R9j17J25K0j86K44k70K68k89J54M2J09
4321C2n6m0K54k24o9O4k75L65j95M35j72k19J24o8j81J79rn4M5O1K8j51M97j20
4345B51k35O3L4j47j13L89l17L56l78R2L3k09L25Q9j55J03P8k98J91j07N7j39
4367c7J71R7k67J0L05n8j63J68oL1k50K38J6j2l59K55L07m59K80J21j98Q8j8m07
$$ y = [-96, 139, 2, 3, 158, -146, -96, 6, 327, 284, 193, -7, -7, 22, 219, 275, 28, 188, 399, 92, -24, 44, -238, 107, 190, 83, 426, 239, 309, 68, -72, 59, 31, 279, 252, -18, 145, -197, 165, 344, -26, 261, -257, 120, -13, 131, 318, 54, 305, -2, 34, 148, 117, -91, -127, 273, -111, -2, -56, 201, -186, 114, -38, 121, -157, 283, 212, -113, -202, -7, 17, -229, 117, -69, -92, -89, 15, 96, -106, 43, -394, 198, 25, 133, -199, -104, -341, -24, -119, 55, -143, -484, -166, -153, -299, -317, -133, -376, -74, -401, -167, -68, -185, -60, -40, -226, 18, -252, 16, -273, -119, -77, 32, -24, -64, 190, -34, -103, -39, -314, 51, -144, 291, 119, -100, 24, -44, -225, -46, -55, -109, -64, -3, 25, -126, 371, 251, 16, 79, 113, -34, -147, 242, -75, 281, -97, -5, 28, -181, 144, 233, 78, 181, 259, -39, 152, 45, 102, -37, 134, 231, -36, -26, 279, 221, 58, 226, 220, 251, 1, 239, 255, 243, -116, 139, 446, -13, 267, 388, 190, 278, 260, -147]
4391a47J68R4j54L51m39kJ05k6M3O2j60j77K01J19r5Q8l9K30j81J75q1M6m25L3
4415b11K94L6k69K27k40J4n3j48K58l7L0l5J13l34M02j63J91k86P5J98r4L8k8
4438b2k8l2O5L3j04M4O0J44m56mJ10O7j30K90q0O9l83L81O7K1k48q9L01j17p4
4463a15M9K7q2L09n42K74N8K89j78Ok29p2J61P6m3m7K2L9K51k01r7j15M14k51
4487CJ48j36J22j18J8J16J08k61r9J43Q8j1Qk60J44P2o0M4M9l27K36J33J86j66
4511A80k79J7j02K38K90l87k9K19p3J14j26J5j63rm1L00J49j59M7j16k01L44o31
4534d03L08Q9%Kj91K22q4k8R0l8r4L11j93k2K77k11j37r6R8P5k0r2M7p9j40J85
4560a24K9L17n37k2N51l22l47L81r2J87j90R8N8n4l5n3J97rP1l38J1J81J10m33
$$ y = [-147, 21, 115, -39, 312, -127, -129, -24, -50, -7, 55, -105, -282, -81, 38, -57, 31, -8, 222, 41, 216, 135, 181, -244, -211, 83, 119, -150, 77, -163, -149, -202, -350, -92, -129, -99, -134, -21, -355, 47, -116, 75, -211, -136, 62, -32, 6, -22, -50, -82, -17, 16, -88, -44, 16, 160, -296, -300, -190, -123, -253, 37, -43, 26, -357, 24, 91, 112, -136, -225, 76, -41, -115, -66, -39, -121, 188, -354, -80, -22, 267, 89, 95, -134, -206, -45, 31, -12, -59, -37, 2, 253, 52, -45, -160, 254, 3, 151, 15, 137, 19, 37, 153, 261, 0, -99, 44, 132, 121, 129, -131, 13, 85, 25, 69, 118, -209, 27, 160, 346, 180, -99, -82, -184, 54, 344, -43, -72, 147, 74, 188, 62, 77, -86, -95, -136, 164, 313, 154, 201, 85, -116, 228, -403, -95, -6, -6, -4, -195, 27, -57, -85, 5, -33, -127, 184, -9, -31, 246, 35, -102, -198, -100, -25, -45, -137, -90, -169, -309, -124, -95, 222, -315, -337, 214, -108, -455, -74, -166, 21, -169, -71, -13, -67, -102, -155, 42, 33, 104, -234, -223, -42, 68, -365]
4584c65K84O4J72j54k74L83j23R9k94J31K78j73n4M11m51J89j65L9j39J14n4L26
4606B44l72L61J07l66J93m07K27l4P2J16K55m02K49p2L7J53n32q3M22j36M1K04
4628B77R4n70J73J46jL3Q2k2j10j49L42m28K49m6K45k99O9J1R1j83J09N0j2l66
4652b15J58L92l06j64J1K63l54J84J77j43k85M27j36Oj01j5K2m6l6oL5j45K97
4675B0J64r7R5l67K1k02M64J85m63M30l94k52L75q0j56J44m0J94M9j47j52L67
4697A58k13n9j62J92R9j36Q5K31j97k28N1J16k7k3L4J19j91R7R8l7r1J59k87J97
4721a5J73k4k55J87p7kN3j11J66m48M04p9J11j4p8J01J49l03M4K04j92K8j05J10
4745B7j62J70J65j00k9Q3n5j97Q3j93L46k29O4P8J41k2l18j8K54j30K35R9k32
$$ y = [-365, -81, -17, 155, 1, -273, 110, -13, 86, -208, -77, 201, 28, -26, 385, -66, 123, -42, -3, -142, -28, -82, 244, -128, 233, 340, -26, 167, -240, -13, -47, 25, 141, 396, -6, 243, 171, 208, 361, -171, -254, 168, 32, 73, 277, 371, -199, -26, 120, 119, 152, 234, 212, 102, -47, 295, -133, 116, 70, 315, 16, 85, 96, 187, 4, 113, 163, 151, -215, -57, 335, 29, -135, -124, 139, -215, -31, 146, 3, -282, 145, 9, 15, -86, -101, -79, -125, -161, -167, -132, -277, 20, 184, 87, 182, -185, -164, -366, 98, 283, -180, 250, -144, -396, -21, -101, -257, -113, -153, 41, 90, -57, -209, 158, -55, -114, -276, -84, 15, -121, -36, 195, -2, -230, -179, -63, -90, -113, -79, 40, -151, -54, 44, 7, -84, 75, -212, -15, 158, 134, -121, 66, -11, -13, 40, -71, 95, -353, 51, -28, 83, 69, -9, 92, 241, -62, -18, 186, -6, 22, -83, 27, -135, 35, 200, 100, 71, 154, 99, -98, -15, -208, 138, -91, -27, 51, 192, 170, -148, -166, 88, -42, 193, 292, 60]
4768F0K15k5j27k0N3k24J49j49K08J3j50L9k1J09r9j61K16k3j46J95O9k96O4L1
4792b0k20K69m53K55K44k06K62k48k14J80P5n6K26p2k69L20j94K94r9j79J40o9
4814c4l5k11L32m86L59J17k55M09l07Q0J48k95L71k35j63K97l03K19L6j90K08
4835F2k72M8J18p4Q6j13n6J45k5oj50J50J5j8Q5R2J15J7j29j21J67K5k25J05o1
4860b0J8o8P0k03L33k46J32K69J4l13J14n1M4J20k04J78m1J12j82Q7k05J34J63
4883B55k00NJ0J90k20l5j1J31j18J92j54m35N56j55J66j56j37k71N63j74q6J48
4905F4j39K20j8l03K63O2m48M81J35l49J5m7j0R0j88J13L4k5J00k86J52j4N1k00
4929b47N2K2K61j4j93K79n66J88J05J01Q8j70J65O4l8j17m1J93k37K00j81J29
$$ y = [60, 275, 250, 123, 103, 156, -68, 81, -68, 140, 153, 3, 42, 21, 130, 31, -130, 86, 63, -83, 112, 181, -115, -51, -20, -240, 29, -424, -169, 75, -131, 131, -117, -331, -151, -76, -132, 94, 22, -247, 73, -121, 173, 74, -105, 35, -34, -69, -280, 52, -434, -75, 42, -213, 196, -111, -31, 117, -178, 193, -42, -205, 92, -211, 8, 44, -146, 62, -210, -162, -44, -118, -32, -145, -201, -56, -81, -87, -237, -87, -72, -90, -5, 87, 202, 219, 90, -31, 136, 161, -64, 41, -20, -2, -70, 0, -203, 130, -116, 16, 285, 299, -14, 100, 49, 93, 213, 9, 187, 146, 258, 76, 163, -42, 92, 255, 55, 60, 70, 260, 40, 5, -6, 125, 7, 199, 45, -390, 166, 11, 177, 21, -116, -387, 176, 2, -84, 64, -75, 145, 127, -176, 87, 149, -299, 182, 317, -32, -17, -64, -74, 16, -172, -59, -25, -50, 50, -236, -84, -98, -47, -247, -195, -173, 88, 74, -119, 160, -406, -218, -113, -12, 76, -94, 71, 135, 97, -20, -61, 132, -105, 95, -86, 43]
4951D3q2k9j74J34L82j84R1l81L1J79q5mj08K75j73j51K22M3k44L45n5r4p2j10
4975b01K1J83k12M04l12P9j9J70j4j01P8l7j45Q9L4j25N7l8n0J62L26k90J05n2
4999A12J42l64K26K8J45p0j88j6j9j51m8J81K34k75L11m57K38q4L91j55K9k64
5021e4J68J12k6j26J34l6mk5O5j79k13K55N0Q4J0o5l61K94j18J81k68L42M3j77
5045H6r5nj18J04K06k31j92M72j39j16K96l50J73j37l53M15K86o50M83k74m7M4
5067a42K0k14N10k86Q9PM60m74k14M9j10O5K07j8j29K36j23K04k25K02m46%J84
5090a48L17k37k17n7L41r4O8J13J5j29J03m34L79n5K31q7j48Po9n8J23K40j59
5113D5J7L1j43L26l00o1J14p1L00l79M40m06kr8M68j66OO3j39l64L81m18L49R8
$$ y = [43, -39, -68, -242, -108, 274, 90, 181, -200, -169, 10, -75, -79, -187, 88, -85, -236, -14, 29, -215, 130, 75, -19, -91, -201, -180, 3, -209, 195, -117, -38, -57, 113, 99, -2, 76, 39, -106, -17, 17, -108, -51, -89, -139, 23, 349, 59, 164, 112, 254, -110, 116, 144, 289, 219, 31, 15, -4, -155, -203, -22, 212, -63, 248, -209, 29, -55, 336, 181, 210, -54, 114, 226, 200, 74, 208, 172, 168, 143, 208, 29, -184, 71, 121, 205, 215, 150, -211, 83, -35, 146, -122, 220, 263, 86, -9, -14, -132, -28, 178, -53, -245, 227, 88, -28, 268, -82, 91, -46, -399, 16, 302, -348, 135, -139, -186, -142, -122, -336, 174, -112, -23, -16, 444, -30, -244, -195, -305, -240, -33, -51, -180, 56, -67, 137, -88, 114, -332, -332, -148, 169, -68, -285, -342, -1, -95, -27, 86, 101, -28, 75, -359, 20, -35, 196, 109, -39, -32, -101, -159, -36, 204, 45, 62, 93, -50, 276, -24, -85, 29, -42, 258, -121, 319, -87, -89, -187, 281, 115, 121, 184, 45, -319, 62, -356, -7, 91]
5137I1j59K18j01J52j12Lm9r3J10m6K03k56Q2K98l34O8J39m55L1j0L18J05l39
5160a36K06J19m24k4K14q7J77Q1j11o7J57m14M12j56R4J28l2l45K9K59m76M44
5182D8J21k60J14O4o6N9j29J09k66M47k50J44k39K22o7m16L68l6l3j28L74k09
5204b9J16k27r5L39k47J24j42L41l38K45j4j54k60K18K63l48L63k71N3J20k56
5225a99J08m34O91l69O8pj74L48r3m3O0J20j63J32k54R7J29o5K90m14J69J48j94
5248d9P1L6jj16k22K65m6j44O5L03j43K5L05ol50l5K61K2l4j39J46k69K47j15
5272G7N3J52l45K5q0K77O4k01n4P9J75J24l40K91l10J62j93L4q9K13K4k33J24
5295B9O0R1k4j44K25j21Q1k84N6j92K29J99p3n4q0l9n0N6L10k43L25l56n4J50
$$ y = [91, -68, 150, 49, 201, 89, 92, 43, -50, 60, 14, 217, -39, 43, 341, 7, 75, 214, -241, -210, -220, 98, 203, -136, 70, 189, -235, -259, -45, -132, 45, 126, 15, -52, 105, -309, 103, -53, 41, 169, 137, -208, -179, 80, -396, 48, 169, -91, 23, 87, 21, 80, -49, 60, -206, 241, -9, 135, -104, 118, 51, -365, 3, -33, -66, -194, 180, -29, 87, -140, -235, 104, -143, -19, -161, 180, -158, 87, 73, -81, -341, -123, 140, -208, 155, -116, -63, 57, -199, -91, -525, 166, -203, -135, -142, -316, 32, -61, -104, -44, 76, -87, 45, -209, -112, 17, -48, 242, -172, -3, 145, -49, 22, 58, 57, -59, -281, -16, -62, -206, -141, 162, 19, 44, 349, 343, -7, -42, 219, 241, 207, 68, 214, -55, 192, 77, 130, 282, -63, -38, -118, 159, 223, 22, -32, 47, 222, 346, 6, 297, -13, 149, -44, -10, -99, 114, 138, -95, 29, 89, 180, 156, 12, 237, 116, 197, -87, -31, -223, 6, 205, 132, 78, -2, -41, -91, -35, 275, 32, 357, 1, -53, 97]
5319I7p6P5j03k1K70l56J47r4j37K70j00j29k09K26O6N1q9M2K71k27k6o4j70N
5343b81M17j52k14K62k45j1L67J80l45l4L3o5O6l3J58k60J62o8K21j84j53NM02
5366B28j17j33r7L49p8k42L23k42k9J08J27k97j33K41K8j8K09l96J27m3J25L6
5388G6j01q8L4K0r8M07j07j32Q2k31J52qQ9J1J58j78O1j4p9j59M37n63K80L23
5412C72k40J62n22K30J90j53p9l9P6N0n4pj13j31lK97j04M7n6K54l94K65k3j45
5436a20K91Q5p9k38K63l86K85J44m80O3J95J87j30K38j05j21j29J89k49J52J12
5457A67m3j74J91k18oO3J57j70K49K4k55L1k37K35j08j92J49K29j40K34l43N7
5479a00L32n00J28J04Q3r5k9k0j80N09l17P7j62L56k87J58n3J51k08J62P9j51
$$ y = [97, 21, 96, -7, -28, 242, -114, 33, -61, -198, 72, -28, -157, -366, -140, -74, -23, -112, -70, 201, -26, -52, -116, -286, -281, 136, -16, -230, 32, -213, -224, 143, 323, -22, -56, -23, -88, -22, -55, 103, -157, 5, -63, 158, -26, -179, -174, 228, 111, -22, -119, 230, 152, -90, 233, -9, -38, 70, 197, -100, -233, 8, 36, 18, 227, -169, -42, -85, 40, 76, -25, -113, -79, -59, -157, 250, 143, 11, 93, -138, 14, 6, 95, 106, 264, 86, 147, 133, 54, -105, 332, -231, 49, 372, 132, 294, -228, 2, 192, 39, -40, -79, -3, 47, -7, -14, -127, -258, -261, 36, -68, -21, -77, 177, -217, 48, 25, -120, 171, 256, 177, -61, 202, -184, 101, 245, -235, -172, 23, 210, 80, 318, 213, 92, -37, 152, -97, 55, 167, 124, -50, 141, -77, -83, -20, 137, -33, 216, 240, -15, 16, -221, 14, -94, -286, -137, 92, -48, 186, -157, -100, 232, -268, -140, -36, 47, -48, -77, -97, -277, 232, -85, -8, -170, 186, -101, 57, 4, 155, -53, 109, 188, 37]
5501C7J84j78l10K51j01r7M31m22l0N2K00j7NJ52l18J48J35j25pl15L28L3J30
5524A66k60K51m3j63K10P4l82N6P8K65J9k72j24l7L16k47J54Q3k20K97l32L46
5546B35o3r1K00j51J29j04j2q8L9j89K31l47J24J51J70k73N1n8q7k3J2p3L78k47
5570h6M9J46j87k4L05j55p0J1k46L75K8k40K0j5q6K5K7L1K24k8n3j31qk19O8J56
5596h3K88m19KJ84J45J94n27K74N1j57J06K3m47K36M43m73P3j26P4J89j53J27
5618B4k24M0P7j59J75L3q7K66j02l34L48j17K4J21j61j68J01L5L07l48M9J71j9
5641E2j4j42M7R3n1o6J10j20K0M7R5P9j24j81J85j08J05J2l05L64J10j02m24M35
5665A17J24j25K6l19K55pJ43k56J25M2l3m5k4K31k61R9q5O2K1j71L30j43q3J64
$$ y = [37, 221, 43, -267, -16, -117, -214, 217, -205, -235, -183, 17, 0, 5, 157, -161, -13, 122, -3, -10, -325, 3, 36, 166, -94, 157, 114, -49, 161, 235, -147, -91, -13, 252, 271, -1, -125, -162, 154, -93, 61, 144, -76, 221, -111, 235, 172, 81, 281, 130, 259, 155, 143, 55, 94, -95, 136, -211, -87, 64, 234, -39, 12, -46, -133, -156, -144, -217, 161, -86, -37, 109, -78, -102, 203, 48, -22, -11, -257, 118, 146, -94, -74, -89, -175, -150, -123, -92, 132, 104, 51, -80, -88, -307, -239, -83, 205, -214, -212, -28, 117, 311, -216, 58, 109, -48, 58, 81, -366, -130, 313, -160, -87, -213, -139, 50, -103, 24, -200, -160, -83, -242, -67, -34, -121, 145, 43, -291, 57, -60, -36, 85, -76, -244, -143, -108, 199, -149, -100, 71, 52, 38, -104, -57, 36, -15, -81, 29, -91, -71, -24, 71, 150, 26, -155, 30, -78, 27, 39, -266, 98, 208, 106, -318, 117, 241, 116, 142, -177, 78, 71, 214, -42, 83, 125, 92, 47, 23, 254, -7, 92, 7, 69, 90, -81, 249, 106, 23, 187]
5689A87Q6l48MJ02k43N8M42m22Q8j56R1L20m06J31O7j83J40K6k30P7q2L02j39
5712h8k44L12K16j8K0k91J81j64J15k13J88k4p7j63L42R3j45J54l10O6M6l45P5
5735b74J79p2J22K7Kj01M71l68l29O6M31n8k49l2P9L01k52R2q7m4k3J33j95M9
5759a32J31J27Q6o6k99k67M32m8r3K08J70j87Q4J26j50K72m40k6J55k79K06Lj1
5782Br6k8K52K03n6k40j17K00j87n9L94q7j07k87L01o4n6K38j11k14L38l84J13
5805e2L61q4j78o2n0R3l8J05k02J16j13L65j00j38K8P2j96j15J67m3J12j5j3L55
5829C75o00M07k35L1J2j07K93l14j7L78l64J57j22J14k71J64M7q0K84j47K90l00
5851ej32K15o4l6J79j75k88K78K25n8p7j96L64l05j12l9J87K29k86nRj65L12j30
$$ y = [187, 273, -75, -71, 31, -212, -154, 288, -134, -46, -202, -111, 209, -197, -66, 1, -182, -42, -16, -246, -169, -251, 51, -88, -332, -20, 196, 178, 198, -93, 88, -76, 39, -174, 14, -10, -87, -250, 92, 185, 40, 194, -116, -50, -4, -349, -274, -95, -167, -45, -18, -16, -117, 354, -14, -343, -277, 154, 96, -153, -185, -106, 195, -57, 35, -52, -96, -119, 14, -181, -132, -1, 126, 212, 146, -153, -420, 12, -36, -129, 79, 249, 62, 146, 272, 122, 394, -46, -72, 83, -196, 10, 13, 2, -94, -122, 130, 333, 277, 37, -80, 120, -67, -126, 268, 181, 74, -213, 88, 24, -32, 206, 95, -119, 219, -165, -52, 309, 225, 47, -15, -65, 28, -10, 95, -107, 9, -104, 261, 161, 23, 51, 123, -73, -188, -21, -64, 48, 33, 20, 375, -225, 182, -53, -22, -10, -117, 176, -138, -155, 223, -141, 16, -106, 8, -263, -99, -52, -132, 152, 5, 295, -5, -137, 78, 14, -22, 157, -18, -306, -28, 197, 139, 62, -134, 230, -75, -187, -226, -39, 190, -96, -101, -92, -257, 55, -75]
5875g5NJ6j19L3P4P1k1qj79L28P9n8k44K49j97r7J02J15m8p5j48K27J31l26K03
5900C8K5M8m8N8l17J43j7J16J24L48m99j42M7L6n3J99m3m3K65kj74m5K03m89L47
5925A25L7l01N52m41p0J02k24J30j32L27K58k54j85K07k48K68l93L46j59n7J89
5946G7l7L2M6k9ml9k33L47j24o8K8L70j22j7k45On6p5K00j12P7j71j26M70j87
5971HJ17k74rJ46k8R3L9j70J1L4K0LK42m27L48l18K6J7J0L34k27Q3o7j49K6Oj17
5998b23J32K09k01L1J58J72j16k63K48m96N16Mj02j81J73R4k88k8K49j50L29m70
6020b03K00M7j86J65J28k55J71l92J90K25k7j30J12Q4m4l05J35O8LL21k24l9L2
6043G6K9j1k29K19m84M98j51K53r2p6oj9p6P5%k05p0L38Pj97J59j69K15k08K16
$$ y = [-75, -70, -54, -173, -140, -66, 5, -16, -24, -203, 125, 204, 146, -98, 151, -46, -143, -41, 74, 26, -49, -197, 30, 161, -165, 38, 63, 111, 63, 121, -196, -53, -70, 46, 170, 518, 19, -123, -76, -40, -93, 106, 63, 20, 285, 283, 109, 64, 267, -222, 125, 162, -139, 413, -28, -98, 4, -220, -90, -222, 105, 363, 109, -76, 131, -117, 151, -242, 104, -55, -112, 77, 40, 72, 118, 89, 85, 46, -187, 160, 36, -32, -4, 366, 244, 227, -18, -12, -68, -143, 57, -55, 22, -149, -275, 195, 8, 125, -149, -158, -12, -40, 53, 92, -78, -67, -33, -13, -10, 232, -195, 153, -165, -139, -122, -112, 222, -5, 78, 11, -138, -112, -106, -223, -91, 118, -83, -52, 106, 278, 162, -101, 147, -349, 167, 171, 69, -112, 61, 155, -133, -161, 88, -62, 267, -203, -3, 44, -142, 23, 151, -104, 67, -325, -135, 90, 63, -67, 45, 129, 85, -220, -85, -17, -14, 307, 83, 44, 76, 105, 94, -135, 84, -400, 98, -53, 200, 108, 32, 26, 7, -69, 6, 6, -199, -269, 69, 76, -121, 38, -131, 84, -124, 92]
6068I2j32M44o92K50J11KN7K1r6K5l7j27O9N7Mm30L05P9p9r6L91k16q7j05J35
6093e5J5O7P3mr1K10Pk27J84k48J71L9l54K51N9J44k63l7j38J50j00K70j63j41
6117a81NJ59j83L2J83J81l27P5O9k98K59j04j08L27j81L27r0l22L15l43M85o02
6139c22M16r8j86q4L93M5l25Q6J50j15K02K05j21k19j46L74k00P9j90L16m3k93
6161g6J78r6J4J90n00J50J99R3k12L5L79m76K33J22K7j43j5j78K41j17m5no1J74
6185A11k07L2J3J23k06M9j13J13R5J15k66J79lK37k55r0K25k37J7r8L10k5m5J01
6209A75j19o8J18R7l06J24Q1j41J39m31L52k35K3K93l1k16M27l32j54QJ05n5r9
6232b45J2J95j31K09j36K5P6k21J33O9l71N01j73O7j4M09n50L8K19K29l41K7P8
$$ y = [92, -40, 404, -288, -38, 73, 75, 132, 153, 57, 82, 45, -82, -13, 44, 48, -382, -77, 2, -77, -173, 218, 2, -85, -190, -55, -40, 27, 100, 96, 5, 215, 222, -5, 179, -69, 102, 141, -213, 38, 97, 241, -22, -59, -197, -47, -147, 123, -40, -181, -176, -17, -200, -168, 15, 196, -131, -56, 13, -285, -26, -130, -238, 89, -92, 235, 145, -177, 138, -205, 280, -322, 94, -4, -190, -274, 119, 164, -161, -75, 75, -40, 162, 367, 246, 27, -119, 255, 55, 134, -56, 260, 217, -76, 102, 6, 20, 210, -290, -140, 59, 152, -60, -25, 354, -122, 111, 233, 260, 117, 102, -76, 165, 48, 3, -2, -63, 111, -96, -64, -51, 72, -134, -85, -198, -85, 10, 125, -141, 38, 35, 272, 17, -73, 152, -85, -68, -166, 144, 119, 74, 175, 56, -12, 106, 203, -103, 21, 102, -39, 100, -331, 21, -214, -191, 102, 71, -145, 282, -50, -204, -196, -91, -146, -245, -233, -38, -169, 40, -96, -71, 5, -216, -83, -14, -385, 116, -57, 10, -4, 405, -145, -107, 112, 341, 0, 27, 105]
6255A05Q9j94K61k98M5qj87Q7J7k6J06J60K18m21J30P3j51q2q9K50m0kjk06K9
6280a35K53j80K86l96J27j10j5J57j28M5L28l9m8k04N3N8l23K74k58M70k83J57
6302H9j27p1J58J53j58J38j23j45N8j05k3Q1j51J70J4j48K52j92l8L9J06m9p5
6325a47j88M88l18J1J46k9J44k71P0O0M6k55L87k05j47J39K0N8j01K12j10L9r6
6348d7K56j60k8p4K89j07m1m7j38L5M2m5K94m57J07K31l1l15M54k08P8j07n6J27
6372E2l70K88J40p8N1j7J55p7k03M11m32k51M54N0o6j73J47m83K83N10q13O83
6394B61k15p0j54K11j31K7j07L77k44P2j74J64P1j1J11m02K32j15K54j72l3J18
6416G0r9K2J23NK13k10j83r6J29K5K9l19J58j8L4m1O9R4O1n7j16P8J58r2J42r2
$$ y = [105, 194, 0, 261, -37, 8, 0, -187, -100, -83, -109, -3, 157, 375, -46, 84, 157, 6, -76, -165, 85, 45, 43, 42, -164, -135, 118, -62, 224, -172, -45, -155, -170, -13, -141, -96, 232, 193, 145, -59, -6, 52, -271, 3, -255, 215, -68, 89, -38, -109, 49, 202, 44, 182, 59, -86, -28, -133, -156, -75, -226, -56, -42, -190, 62, -130, -168, -129, -23, -72, -147, -335, 153, -165, -154, -8, -37, 107, -164, -94, -34, 12, -243, 144, -61, -208, -69, -49, 9, -92, 120, 10, 49, -47, 209, 49, 21, -53, 236, 129, 88, 41, -97, -62, -20, -65, 229, -228, -121, 110, 79, -236, 218, 10, 88, -19, -75, 52, -318, -30, 110, 32, 83, 66, 221, 144, -59, 352, -80, -331, 123, 173, 107, -66, 81, -402, -119, 391, -422, 261, 46, -24, -178, 33, -98, -71, -178, 199, -45, 27, -147, 17, 88, 77, 188, -214, 18, -97, 157, -15, -48, 70, -29, -7, 116, 121, 334, 124, -59, -155, -26, -1, 28, -291, -133, -151, -117, -158, -89, 5, 66, 9, -107, -29, 129, 37, 179, 87]
6442H7k65K13q7M3j56R9L03l50np6P6k40N98J87m75l5K45l8j05K70k23j75mJ87
6466G4q4k77K40j7J67J97m66l1J15pJ24k2N0J59l13K18l71K78Q6j78O5J09l75
6489b59L98j70J30On4l13J32L66j11l74M12l45J63P5j4J4O4q1K03j6l06J77m29
6512c32L08L49p16J41K16l3J66R9N8m2k21Q7q2k25M66k25J74j10J72k70k24Q7
6534a57K35j17K07k63J40k88K38M0kNJ35m06K00J40l69J67M8K70j14j55K4J5M83
6557D76m00l26K01q3l3J76l4K29l8r9N7K8j63L45k98K79n23J88n7K06k84P6k2
6580i9r2K44M6l27m4M00j64K6k05K44k48M47n75L55j85M07R2l20J60j32j67K22
6602H5J58l72J71j56J15j63J00j61L52j87J9J18J03m49L86jr1j62N8r6O8L92l39
$$ y = [87, -178, 35, -52, -9, -165, -66, 237, -113, -118, -194, -118, -358, 240, 427, -48, -83, 162, 124, 19, 289, 66, -109, -113, 74, -10, -287, -47, -64, 103, 300, -166, -197, -82, -89, 35, 13, 63, 222, -91, 127, -244, 34, 120, -58, 7, 116, -259, 139, -31, 99, 105, 51, -262, -130, 236, 125, -249, 163, -182, -19, 56, 42, 56, 120, 39, 242, 226, -80, 97, -332, -24, 325, -391, -250, -34, -67, 99, 198, 256, 214, -7, 80, -2, -227, 239, 14, 188, 78, 250, -20, -244, -157, 78, -39, 168, -95, 45, -243, -5, 35, 33, 38, 173, -233, -33, 107, -262, -95, -47, 223, 109, -46, -22, -7, 476, 76, -250, -49, -132, -165, 11, -23, 206, 168, 69, 126, 154, -9, 336, 38, 317, -206, -18, -75, 131, -153, -77, -99, -191, 53, 99, -228, -272, 128, -36, -10, -215, 29, -219, 228, -347, 8, -177, 230, 322, 2, 162, 30, -137, 85, 243, -129, 42, -114, 1, -162, -62, -223, 129, -58, -39, 79, 182, -267, 119, 118, 27, -135, -77, -173, -105, 287, -52]
6625e2J53M6n47N11j19k1J43p6j38qM1j63M21m17P3L15k76j96L24J03k81L91j44
6648H3p3k4k08J44q5K11J43j30l72N1L02k12J57k09R8l98O56n0r1Q4O5l21k62
6671d41N84l20J0K4K6M5L6pj27J66J63l02%n6K85l91O24n27J29L74k00j05P6J33
6695A99j7k86J27O7l41K76K06q0j62K6P9k94J01L73l56K26j72j39J36N2j65M19
6717B75k19K64j77n9o6L2L42m21j89L80k90M6O2j11K46Q8k4j97J78q6j35J2L95
6740C46l40ro6q0J96K8j48K2Q2k8k59K8P6J33l1J23l78L20J16k43J74o9K0q0k71
6765c38M55k10K1N1O1k41J61k5p4K4L79j20K5j58j36j16j09L55j95N77k63k94
6787a70J26M3RL9k36L22j73J52k64K65k88K04J0k19K48m9j89J57p1L3O4j31L04
$$ y = [-52, 101, 147, -400, 111, -8, -29, 114, 38, -100, -108, -67, -230, 191, -226, -153, 162, -114, -310, 14, 117, -164, 227, 83, 10, -14, -222, -78, -163, 48, 191, 61, -311, -260, 42, -170, -13, -222, -124, -522, 134, 84, -7, 77, 142, -179, -441, 143, -177, -167, -143, -117, -72, -36, -43, -170, -4, 159, -143, -143, -199, 86, -305, 319, -208, -79, 295, 95, -10, 66, 199, 182, -104, 23, 90, -251, 25, 231, 151, -11, 15, 94, -200, -99, 274, -82, 144, -28, -167, -31, 21, -144, 275, 56, 320, 143, 84, 18, 50, 392, -29, -218, 162, -128, -82, -20, -131, 115, 203, 179, -18, 160, 74, -61, -49, 346, 6, -3, -69, -149, 47, 75, -73, -51, 31, 3, -256, -228, -152, -19, -50, 73, -305, 15, 131, -112, 62, -7, 13, -67, -338, 117, -93, -72, -21, 40, -201, -40, -65, -139, -115, 264, 144, 169, 11, -125, -241, -350, 5, -190, 387, 124, -170, -44, -1, 8, 47, -189, 133, -40, 112, -152, 113, -175, 29, 39, -180, 68, 19, -170, -13, -84, -51, 13, -118, 186]
6810A86j18j7r4L3m1R9lk1K2j70k96L04J87k09L64l85K80l67K59j24j02RL36O7
6834A99r5K2o0k75M81j30n7j79L73k33K19k95M8j7N9j01J23J5l41L41o8r6q1J61
6858A3K10l32rK97p2j7J2r7j88K57J60l35K3k9J43n7M09l18k01L76k21j63K74
6881A35r3k07K11m4L5o7J47n3j75j87m3K61J82k94L50k68M5l6J41j79K44k97q5
6904b77L87k37J64O7l23L01j17j89L50m72N94n6r2j46R3K11l41k58L90r7J26l52
6926b74K49Q0r6j78p0K77j20K8r7q3L16L2k87J8J74J99k24o7J45O1O5m4j56j05
6950a57k0N3k70K18p7J13j70L93Q0k75k3K77l46P7l4N2K4r7L31MJ7j76m9K60j60
6975D5j96L1j24K98n2q9J36o3j19L7q6R2Jn4K11l24L46J26k47K02j20j0j23M1
$$ y = [186, 68, 51, -43, -10, -51, 48, 45, 24, 46, -124, -420, -116, 71, -138, 226, -159, 121, -246, 13, -111, -213, -204, 132, 199, 104, 126, 66, -209, 272, 142, 85, -94, 279, 46, 265, -30, 18, 1, 60, -41, 82, 97, -244, 97, 29, -67, -148, 13, 223, -109, -118, 179, 107, 90, 102, 5, -183, 74, 234, -101, -78, -107, 36, -21, 388, 70, -131, 245, 24, -139, 135, 42, -165, 46, 2, 37, -30, 117, 64, -111, -298, -341, -80, 102, -192, 158, -110, -65, -101, 40, -139, 105, -192, -277, 110, -127, 37, 104, -219, 82, -35, -224, 126, -346, 248, 192, 100, -46, 47, 258, -83, -341, 49, -48, 78, -274, -25, 55, -41, -219, -289, -12, -132, -104, -201, -284, 32, 64, -223, -205, -31, 168, -56, -123, 22, 83, 148, 104, -52, -157, -177, -124, -394, -176, -253, -140, -310, 83, 163, -112, -135, 142, -204, -127, -161, -109, -85, -182, 149, 153, 170, -6, -55, 205, 45, -151, -120, -244, 54, 2, -87, 49, -14, -133, -96, -182, -90, -89, -143, 68, -256, 90, 216, -31, 171, 51, 41, -82, -41]
6999d1MQJ14K5K7n0k25K1j7J74N6k72J50j6O2j88M08k61K9j62P6R7k8L9M2k44
7025a72J33j58J40K48k73Q0Q6l72N66j97k13J30J05l26K32q9j52M64k60J87J20
7046B79k86j65J68l24N80l63q8K69J57l11j07N01l13j72M66l97k54P1J38J41R2
7067H2j26j67K58J3r7J25l3K08l39J83m2P1j10Pk76K18J95j71q7K31kl6J7j4j98
7092i0Q2Q4K4M2j22j31J57k01K84k11J59l29J96K8Kk5K34l67n3K62K6m1J65O1
7116B36m56M46L1j5k86m2M0J05k09J17P8k02L63j46k38J95J46j39K8L8o0J23m45
7139b92O65l91j15L71k05J45k05P9K8j41j82L03p3q7K62l3k13j37K83L7k94K44
7161D9kK36L8j58m00K33q9j34J55N1k01OM4J38MK44m44Q3j1J74R1j04k46K59O9
$$ y = [-41, -37, -29, 85, 110, 137, 87, -138, -117, -134, 40, 96, -176, -26, -42, 20, -168, 240, -21, 8, -154, -78, 19, -9, 30, 72, -172, -39, -197, -57, 191, -82, -2, 84, -288, 278, 81, -132, -2, 103, -223, 9, -80, -232, 232, -28, 159, 279, -7, -172, -4, -328, 252, -111, -199, 70, 227, -84, -191, 310, -3, -175, 291, -106, -360, -289, -151, -10, 82, -44, -211, 47, 60, -37, 88, 55, 263, -76, 107, 65, 136, 26, 33, -243, -25, 170, -1, -88, 143, 141, 105, 122, 108, -90, -8, 76, 100, 142, 20, -111, 46, -155, 129, -82, 77, -252, -56, -28, -26, -51, 183, -184, -237, 25, 51, 10, 175, 236, -220, 226, 257, 242, -44, -86, -46, 59, -150, -33, 45, -157, 206, 60, -178, 17, 163, 24, 52, 90, 30, 153, -292, 373, -18, -133, 238, 33, 178, -27, 52, 80, -61, -243, 60, -13, -100, 162, 129, -84, -221, 62, 99, -195, 49, 47, 283, 321, 163, -237, -4, -93, -227, -72, -21, -222, -216, -172, -34, -30, 214, -230, -147, -158, 16, 107, 3, -243, 16, 85]
7186H5K00k02l33L86j53j65R1L00k06K8m75L62o8K07j1L0N8j62j6o4n1K09Np3
7210a8K20j44j79m4n0r8J87J85K21j10P1L1m46J60n7R1J65N0l17J48R3l80M80
7233B59m79L66k23O3j03Q3jQ7k82J54K0KJ27l35K97j30J79k27O6kN19m34j6K9
7257A9K26j43k45L07k85q0O35l86J27l14j40L71m1J40l88N70l76K37k82K0j58
7278a86K01j41K29K67m57P5K42M5j7k92R7j99J54J8j16K03k36Q9J1j20K26mL16
7301D05r6l57Q3JK3l9j47M30m86K54k21J81N2j50Ll52J79K57K0L08l56j63M4L54
7325B27j95j97K08k65K35j82J11j48K84j84k68J06L21k52L23j16l49N78r7j75
7345c5q8Mj46M08o8L8l03j20M52J1j85r5n9L67L7n33J20J92j28K64k98J06k6N2
$$ y = [85, 285, 83, -250, 136, -17, -182, -91, 209, 3, 31, -444, -82, -150, 57, 46, 76, 134, -28, -44, -108, -159, 50, 55, -18, 202, 58, -121, -165, -215, -313, -126, 59, 280, 170, 241, 272, -174, -14, -71, 20, 185, 235, -82, 66, 159, -221, 259, -220, 146, -77, -14, -117, -34, -35, 52, -230, -76, -56, -54, 73, -262, 35, -95, 84, -143, -77, -79, 440, 6, -10, 19, 245, 102, -143, 164, -121, -201, 434, 48, 175, -139, -279, 92, 51, 191, -197, 373, -3, 234, -48, -28, -186, 15, -126, 103, 370, -87, -12, 230, 275, 258, -34, 63, -136, 18, 36, -80, 123, -113, -24, -13, -133, 93, 89, 405, 309, -48, 35, 36, 59, 20, -127, 303, -183, 71, -150, 31, 83, -67, -64, -416, -237, 20, 40, 348, -8, -171, -127, 227, 32, -165, 43, -222, 13, -169, -58, -206, 78, -106, -374, -268, 53, -199, 124, 8, -341, 237, 140, -35, -123, -119, -265, 143, 75, 113, -190, -310, 142, 153, -32, -127, -186, 181, 218, -315, -195, -3, -131, 133, -165, -59, -85, -33]
7369c3k25M05J21k81r5J28J53k74k63L92k38K56j31J67l1J79k3k87M53l43J38
7390A68J1k97Q3K15l76K97p6j21K0N1L7m4k88L11J42R4q0j37J10n9j41L61q9k3
7414A69j20K67k53J6l8j64J3J49J76L1k38j42L45j35j67J93k69oL76N0j69nj41
7437f2K30j04L8l04K29nN8j24K40r4m48M87k85Ll8J56J30m2N0l04R4J27L2N6J74
7462B94m18p5L24j97n2J2J57k93k0L99k01J42q9J51J07l55K26k6J32m9l9r2p7
7485c9L0j77K37L7Pk81R4O7j04K50m45M91l45J51L6j95p5j5L48n2j50R5O2J09
7509A36k8q1j0J92k50j27K88m3k69RK22M8l31L74j90N1J19j33J34j99j02K20M
7532C4J05J90l33J38o1k81K49n4M7J78j56m4k45J16M10l55J2J56j27j4j35L74
$$ y = [-33, -258, 147, 268, -13, -108, 20, 173, -101, -364, 28, -210, 46, -85, 82, 51, 230, 207, -80, 373, 30, 168, 179, -118, -35, 180, -196, 101, 25, -96, -76, -25, 12, -32, -320, -9, 133, 227, 147, 10, 120, 61, -80, 281, 192, 169, 49, 316, 63, 79, 41, -123, -110, 39, 215, 246, 8, -134, 211, 76, -91, 102, -167, -173, 203, 253, 84, 79, -62, 168, 64, 102, -202, 27, 22, 80, -44, 196, 102, -346, 141, -144, -141, -179, -23, 107, 65, 115, -189, -95, 32, 64, 120, 294, -124, -199, 125, -72, -124, -112, 45, -248, -268, 131, -70, 72, -17, 134, 241, -114, 112, 86, 218, 169, 130, 38, -39, -9, -186, 51, 88, 95, -186, -92, -25, -129, 121, -324, 167, -178, -27, 9, -186, -261, -276, 72, 20, -130, -35, 27, 136, 108, 27, 17, 209, -41, -168, 120, 77, -192, -183, 39, 87, -244, 130, -60, -9, 110, -23, 111, -88, -190, 30, 34, 139, 329, -4, 134, 73, -208, 41, -13, 34, 212, 56, 12, -233, -117, 293, -62, -50, 106, -21, -35, -170, 204]
7554B04j54J02k99K77J88p8j06k08j75L57N7r5R5j6k75K92k93K07j38K27k48L20
7576B41j07l80K41j67L0J87l48J63L5J52j1l87L84r5R0k61J15J35J43p0l90L99
7598I9J3k63P0j9jk6j22L08k57J41O3n9J17K50m41P0q0J09j04M45n04K57p7j77
7622a88J35K83k02J32M5l33L14K1p2j92N5n6m06L88k5l5m2K53j80J30k11J01J99
7645A14o3j31L11l05K1M22l47R5j16o5k57K39N3k05J1J31Q1J39j44K39j29j67
7667g3N9R2j33L8nR9L9j63q9J96J24j79k7n0L13j22k78L45k33J63l7L9M7k20j65
7692b20K69j07K1J23o6l6j92K05K20m95L07n3l79J18J34L36l52K27k63J15K65
7713A77j35O0J84j84k60P9M10k96o8PN9j21lJ42J69J8l38j8j28K21J41q0J1k28
$$ y = [204, 50, 152, -147, 130, 318, 240, 134, -74, -249, 108, 165, 70, 165, 149, -126, 166, -127, 80, -58, 169, -79, 241, 134, -246, -5, -172, -142, 45, -303, -140, -105, 47, 36, -351, 33, -62, 28, -233, -118, 17, 160, 90, -300, 99, 112, -151, -81, -100, -101, -127, -249, 59, -198, -57, 6, -53, 64, 314, -127, -57, -137, -28, -132, 313, -191, 66, -11, -188, -53, 230, 28, 160, 205, -128, 186, 207, 135, -57, -2, -58, -464, -76, -101, -136, -178, 75, -105, 25, -186, -85, 114, 51, -80, 231, -74, -53, 369, 22, 117, 1, -64, -321, -82, -29, -234, -223, -92, -11, 128, -16, 223, 94, -73, -14, 78, -55, -17, -22, 77, 116, -47, -136, 60, 184, 5, -22, -72, 241, 119, -159, 186, -47, 116, 79, 118, 165, -55, -220, 49, -58, -37, 86, 20, -16, -208, -3, 217, -278, 29, -24, -403, -285, -151, 185, -167, 60, -203, -88, 177, 42, 102, 286, 102, -158, -79, 331, 35, -33, -26, 33, -88, -91, 51, 220, 238, -100, -118, -246, -25, 116, 36, 47, -181]
7737a81l5K66M9q5j8j74J02K40k53O4p4K25l7P5l55M65n47K07J30j85J58J3J23
7760A73m25K09O0L1J27j5J2k68K0J20Ln6J21j26P0J36l55J22j6K49m37J38J63
7783E6J5j6p6l35L65J94k05L7l71M61M9l91L97r8j26K80j87pQ8O1j86r5LL44k73
7808a6R1J5o3K89m42K18n9N8j2o4k24J64j89N03j20j60l6j48J04J42j08J37o1
7831A9P6q8l76O62k91Q7k2K8j2j87j54N0L94K3r7J14pj18k49P9J50j5l36K72J91
7856A93j13Ql00K59JJ7q7J84k77J35l0n8K00j32K62j77K5m26M59k98L76r7k03
7879g9k7K59k05K06k54K27O0k55J91j06j1j15l7J35q5Q4j12j0K12r5Q3L0M5j89
7903d8O2m8J20j63P8j05l4K54m6m8k10K83k33k7J37m9K86j39j3L6Mr2m8R1J67
$$ y = [-181, -216, 50, 99, 14, -4, -178, -76, 164, -89, -25, -99, 126, 89, 164, -191, 274, -273, -66, 64, -121, 37, 50, 173, -252, -43, 17, 48, 175, 160, 172, -96, -76, 44, 47, -9, 112, -14, 56, 192, -163, -41, -57, 192, -245, -107, 56, 71, 55, -21, -356, 9, 203, -2, 35, -336, 125, 174, -217, 180, 82, -44, 236, 49, 42, 130, 191, 5, -90, -87, 257, -16, 75, 90, 27, 316, -126, 92, 33, 91, 79, 15, -209, -45, -234, 269, 149, -11, -47, -195, -91, 51, -57, 80, 19, 95, 7, -369, 293, 2, 89, 67, 95, 83, -104, -258, -208, 186, 209, 112, 226, 219, 101, -148, -69, 81, 66, -270, 2, 193, 80, 88, -212, 47, 48, 65, -22, 162, -115, 20, -10, -68, 132, 0, 262, 85, 110, -316, 143, -155, 221, 124, -79, -106, 153, -52, 154, -100, 127, 187, -68, 123, 17, 6, -109, -146, -11, -96, -12, -124, -134, 78, -17, 66, 96, 141, -48, 14, -34, 86, -77, 1, -104, -138, 116, 70, 22, -188, 95, -138, -165, -28, -77, 209, 70, 57, 93, 97, 5, -43, 48, 215]
7928B15j58j54k04M76k43k13K85o1j3j95J89R8r1R9l49L50L2k19j52J60K26O4
7950A42j58j45KPj70M59k37K28j24JP1k81L22L2o4k18m7P1L53k57J36j08M6j41
7974h0J54q0R6j61J64qj08J35k78L4K20k05J32J62l61M13l6j36j06j84n6K38K13
7997A62j08l4p3K87k77p9k3j50M38k48M3p3R7q5J73k88J43M13p8k47n7N7l01L05
8021cj08K20o7l2j14J19P8k39J22R1J73Q9o23L75l18L21nj82K3K70r5k89L26p0
8045F2j06K30rn35L68K7k09K21r7J10k40K76m3j14J76k4O2j38k83K35l2L9K23
8068A99m2j76k0J25l0k87J82o9J00O0k23K4m1L68k12J54k52J38j89j9M12k17J58
8091A43o1P5k68P6M1o3j10N2J74k18MJ29P0RM5k6M2m9j1k25N17k97K14l63J00
$$ y = [215, 57, -97, -301, 175, -68, -281, 4, -57, -70, -265, -76, 22, -69, 30, -319, 31, 63, -156, -308, -148, 78, 142, -16, -161, -159, -152, -322, 137, -100, 128, 4, 5, 76, -205, 117, 149, 85, -133, -180, -109, 244, -13, 123, 15, 61, -80, 74, -6, 90, -71, 93, 85, -23, 112, -166, -132, 88, -117, 15, 177, -184, 229, 193, 57, -49, -233, -289, -51, 162, 54, 20, -53, 234, -43, -122, -145, -295, 143, -105, -62, -135, -38, -123, 50, -238, -95, 318, 240, -7, -64, -7, -308, -3, -111, 109, 42, 10, -104, 15, 93, -146, -24, 67, 240, 329, -294, 81, -237, 84, 79, -103, -80, 190, 95, -194, 132, 62, -44, 186, 177, -358, 10, 37, -172, 49, -48, 62, -178, 98, 55, -59, 117, 93, 155, 17, -266, -31, -63, -24, 199, 157, -19, -39, 86, 56, -231, -49, -118, -18, 42, -181, -157, -198, 170, -42, 112, -140, -2, -191, -210, 202, -15, 143, 82, 157, -111, -35, 6, -57, -167, -115, 59, -159, -155, -26, 44, 53, 98, 72, 114, 65, 54, -171, 346, 49, 263, -100, 0]
8116@Q4r7mO9j39m1L54qk11l04L92lM5j48j08K67j46J23J30k74j02j20J30m8q3
8141b42L25J05j73m0K2j99K47j45k9J50j57R3j35L44k82p6J35n0L1L33k34JJ59
8164A83m1k28Q0J32j80o9Oo9L04k85J21Kk4L83j22p5J91j18J0k27K05q1j44K29
8188A83j45j29J92
$$ y = [0, 84, -13, -17, 52, -87, -128, 226, 218, 7, -297, 95, 92, 137, -11, -119, 148, 2, 125, 255, -19, -121, -241, -111, -159, -242, 83, 188, 15, -25, -3, -202, 45, -100, -129, 21, -136, -43, -178, 166, -116, -192, -57, -107, -76, 257, 23, 24, 183, 142, -86, -6, 126, -54, -123, -117, -186, 118, -167, -46, -44, -68, 315, 193, 118, 309, 191, 201, -26, 179, 98, -46, 183, 38, -91, 101]
8191A01
$$ Imaginary data points
##PAGE= N=2
##DATA TABLE= (X++(I..I)), XYDATA
0@%%%%%%%qJ6j6J6k1K9l2M0m8N6p2Q8j04J20j36J59j86K12k44K78l14L57m05M57
31B42n15N78o46P22q03Q92r93J102j221J352j498J660j838K035k255K506k791
48a471L116l491L932m459N099n903O943q346J0359j3507J9162l2451J17719R3152
62A89854k14258j5411J04596K1478q4333L7377P6815j8778o1547K9449K1125l9746
74D6621j5711L9449j9958m7123L0035O3583k2247l9540K0920P264n5598j716O5905
87G1884o669q3939m001P1085P148l9106K3466K1778o7159n0431N8055L9323n8911
100a7477k1969P1594J5765q2368k1671P4424J7172o9687k9632L4070J1528o708
112b4959J7058K9l8843k843M1052l733m2417R265L3944l1147m0260M2696N4085
$$ y = [0, 0, 0, 0, 0, 0, 0, 0, -8, 8, -8, 8, -13, 16, -16, 24, -24, 32, -40, 48, -56, 64, -72, 87, -99, 113, -131, 147, -167, 190, -215, 242, -273, 305, -341, 381, -422, 470, -523, 579, -642, 710, -788, 872, -966, 1069, -1186, 1320, -1471, 1645, -1846, 2086, -2373, 2726, -3177, 3766, -4580, 5779, -7728, 11434, -21017, 96702, 189854, -24404, -39815, 64781, 86259, 1926, 39303, 116118, 97340, 35793, 65242, 86367, 46621, 30910, 70359, 50401, 3278, 33313, 96896, 74649, 35109, 56029, 63293, 7695, 5979, 71884, 65215, -18724, -22725, 48360, 55508, 16402, 39868, 61646, -5513, -55944, 2111, 41434, -17477, -39446, 32148, 47913, -34455, -56126, 18298, 35470, -34217, -63849, -29779, -18251, -24959, -7901, -7872, -46715, -49558, -8506, -12239, -54656, -45391, -11447, -42594, -82854, -40158, 13927]
125A3927l1064m2286K7007J7809m5884j5301N6982K2836m8838j7373M0567J1750
137i868k6332M713J9332k2160k3495K9014K8303k0788j6687K1520R026j8260L958
150b1724K2019o914k0349P636R308j2539Q719L6735j350m3367n866L8680N111
163A6099k9374O352K9853j1784k7204J9245L0979j6537k5375J5597J6636j7217
175G270q164K3908P929k2037n129J9803L747j0841M054M569j4867q209J9282J2194
189C3509j1300m705R675n936j4101R821J6828j1536j7798R720J3808j1116q563
202H306J4906N948j9580q959J4931O375j1133k406N261n352p199J0056Q616j1574
216H196j1223O140K993p749J179J0613l285j2998K96Q143k951o086N116Q15j1444
$$ y = [13927, -17137, -59423, -32416, -14607, -60491, -75792, -18810, 4026, -44812, -62185, -21618, -9868, -36200, -31487, -12155, -34315, -57810, -28796, -493, -21281, -37968, -16448, -7422, -25682, -21724, 295, -6619, -26968, -19332, -10024, -22563, -13844, 22891, 21541, -21826, -27692, 10988, 16099, -13275, -6923, 22930, 11146, -16058, 3187, 34166, 17629, -7746, 7851, 24487, 7270, -894, 23014, 30943, 8906, 3777, 23580, 27327, 16486, 20540, 25109, 10242, 2033, 21315, 33509, 22209, 17504, 27179, 21243, 7142, 16963, 33791, 22255, 4457, 14177, 27985, 16869, 8306, 23212, 29160, 9580, 621, 15552, 21927, 10794, 8388, 13649, 8297, 1098, 11154, 19770, 8196, -3027, 3113, 6106, -1643, -464, 10149, 6864, -6134, -5838, 2305, -646, -6732, -1616, -801, -12245]
231a2245k495J2830L958j2204m781Q907k90j0281J855J0640k557j1939j200R309
245a0493L250l530k222o8k401k86L127J303l53P91q69l898J047O334K331n098
261a1035k855K429K052J004K742J140l889k407M358L441j582K35K662j416m294
276g415K392P741K817n375l837K337L573J397m43j6N72o00n17J038L472L200k381
293G955n071m58M654L281p8j921j989j222K266K944k34j320J07j369k688O41N751
310A1249K457n434n114J545L264j84J56R92k723m237J196L913K03j591K41k213
326C720m943L12P154K174o363n166K391K059o12L74J626k763l980n27J939J879
342g26J814n14o182m021M445N844j686m184k48N31k844k0N967J779n701l215J633
$$ y = [-12245, -14740, -1910, 2048, -10156, -14937, -6030, -6320, -16601, -14746, -4106, -6663, -18602, -19802, -10493, -7243, -10773, -12995, -13063, -15464, -15750, -12623, -11320, -11673, -10882, -11751, -15649, -14602, -8268, -5937, -11035, -13890, -11461, -9409, -8405, -5663, -4523, -8412, -10819, -6461, -3020, -4602, -4367, -1705, -3121, -7415, -5023, 2718, 5535, 160, -3677, -1340, 2233, 3630, 3187, 3171, 3743, 3143, 2626, 3664, 7136, 10336, 7955, 2884, 2426, 7080, 10361, 10283, 8362, 6373, 5151, 7417, 10361, 10127, 8807, 8914, 7545, 4857, 5498, 11249, 13706, 8272, 3158, 4703, 7967, 7783, 7939, 8931, 6208, 1971, 3167, 7080, 7283, 5692, 5933, 3720, -1223, -911, 6243, 8417, 2054, -3112, -721, 1338, 726, 1100, 2726, -37, -4017, -4544, -2605, -726, 1088, 574, -5608, -9629, -5184, 660, -1026, -5210, -5458, -4927, -7771, -7791, -1824, -45, -5746, -8961, -7328]
359g328P87l29M547J968p266n283N606O533k635l455K854L40o148LP999L096n250
376c961l372J430N75R31M634J182n754l250M326L001j778J327L799l207n795J809
392d103P048J665l292j194k69j669K340N182j62m513l86K439j448q21N343L583
408I743o108n955M219O046j687j940J627o96m452J384O046k19l982L62J393l361
424B420j516O960L116o843n562M075M319k517j093K358o99m693m93M149O67j251
440C397%j456l741J167N082N04m913j965K495j84k101J628K903k855l603L77J876
457a389Q3P14N19k309m211K426M352j171l705J215K210k774k792L485L697l172
473b822l536J062K023n88N42J704j773k737J582K673r33j984K574J016l425j484
$$ y = [-7328, -6541, -6870, -2323, -355, -7621, -12904, -7298, -765, -3400, -6855, -4001, -3661, -9809, -9806, -1807, 1289, -3961, -7333, -5903, -5328, -4397, 237, 1419, -4335, -7585, -3259, -258, -2036, -709, 3090, -117, -5912, -4103, 2945, 4610, 1318, 124, -145, -1814, 526, 5708, 5546, 1033, 647, 3086, 1638, 817, 6160, 9743, 3635, -2320, 1899, 7945, 6258, 4318, 5945, 5249, 797, 2181, 8227, 8008, 4026, 4388, 5781, 2420, 904, 7864, 10980, 4137, -1425, 2650, 6969, 4452, 3359, 5717, 5018, 325, -168, 3981, 4648, 3397, 3397, 1941, -1800, -633, 4449, 4953, 40, -1925, 570, 386, -1715, -87, 2816, -39, -3642, -3265, -1389, -1306, -592, -73, -2382, -6593, -4167, 185, -986, -4691, -3476, -1266, -4040, -6832, -3347, 350, -2822, -6358, -5296, -3273, -3861, -3319, -1615, -3388, -6125, -4543, -1870, -2803, -4787, -2213, -1197, -4622, -6106]
489f106L623L404k488k543P39J467k32M87J269r23q70R19R1n21J215J728n63k691
507a995N71K965L14j724j43P74O0m20J016N99p85L13J83q49p81K338K063k572
525A927k536J917K760j297j913J510J501j857j502Q44J795k31p61K18m95q94J122
542B108J138j304j612J254J731j179j674J085J240r92j731M64J163N13q99j344
558c9K07N36L22l38o19N39K79o20j246J29J543J65j149m62J61J98j56j32Q5m45
578a042R43l18r00m89J298N71p42j976Q52K014k89j720nJ060N0j252P4J346K34
597b91n92r43J38K77P98L73k19j176l11J381J90q21J17J236o5j456m02J361J541
616A136q88j674J23J554M15q77J92L63n0l02l30O50O69L67j077q73J70J349O43
$$ y = [-6106, -2483, 921, -1567, -4110, -3371, -1904, -2136, -1649, -380, -1303, -2173, -1254, -1163, -1684, -469, 1259, 696, -1995, -1424, 1541, 1855, 131, -12, 762, 822, 402, 1418, 2017, 1232, 1545, 1728, 879, 98, 2436, 4499, 1927, -609, 1308, 4068, 2771, 858, 2368, 3869, 2012, 510, 1354, 3149, 2918, 2157, 2375, 1880, 986, 2108, 3246, 1942, 330, 1584, 3315, 2136, 462, 1547, 2787, 1795, 64, 528, 1691, 2204, 1305, -39, 168, 704, 1026, 688, 69, 608, 887, 267, -979, -850, 693, 858, -291, -753, -592, -394, -550, -682, -597, -1042, -99, -417, -1317, -1806, -508, 63, -679, -2655, -1803, 211, -78, -1798, -1803, -743, -693, -1945, -1871, -525, -291, -883, -1826, -1688, -1411, -613, -240, -459, -1635, -1946, -565, -375, -1196, -1079, 157, 92, -1364, -1766, -405, 1136, 248, -1426, -1303, 251, 666, -211, -19, 344, 294, -8, -338, 312, 981, 1348, 271, -602, -432, 917, 1560]
635A560l05j213N7L51K95o3K57M69J92j226j186N67K251N87k256r46Q16J094m03
654H98o26M77N89j016r63L37J092L84o32j019m60M4J098R08j203p95J71N53l93
673e56o74J135R70j553j501J71K083P40j311j093J37N09J7L0P37k14n40j070l7
692b020J257P81q4j031r99L26J018R92k9r95k00j34L05K00K83J014L43j779p35
711a487J455J393l1r62m78M90K69Q1L89M25Q7q90m02O78Q17P90l20j238n01R29
731A494R62m1k69o01L55j68m04N51J027M09j573j044L54J585K69q83o04J64J05
750A688k40K1O01K34q67q08k74L01Q51L49j173r54p2Q97L76q75m33L44j09o25
770g68n90Q18Q19o38j548j87P51M39l25o42j36R0j94m79L38P29p91n93k40p7P62
$$ y = [1560, 1255, 42, 99, 450, 745, 682, 939, 1408, 1600, 374, -812, -245, 2006, 2593, 337, -609, 207, 1301, 898, 272, 749, 1338, 322, -641, -304, 788, 1172, 540, -479, -939, -895, 203, 1111, -92, -887, -716, -163, -556, -1230, -95, 875, -678, -2179, -2008, 75, 815, -496, -1589, -1452, -943, -926, -896, -159, -373, -913, -1983, -2020, -763, 18, -66, -1097, -2096, -1770, -752, 240, 211, -784, -984, -1118, -813, -613, -330, 684, 1027, -752, -1487, -32, 1361, 1330, 368, -110, 380, 649, 730, 1119, 1544, 1631, 741, 339, 1017, 1834, 2624, 2304, 1066, 565, 1494, 2456, 2415, 2146, 1545, 1900, 1732, 1328, 1879, 2906, 3315, 1742, 698, 1052, 2637, 2906, 2023, 1419, 1583, 1688, 1448, 1469, 2070, 2304, 1437, 629, 355, 656, 1507, 1856, 683, -271, -343, 554, 930, 55, -378, -34, -143, -768, -1358, -540, 279, -359, -1907, -2094, -1343, -904, -1229, -1871, -2007, -1917, -2111, -2590, -2252, -1523, -2314, -2907, -3147, -3224, -2462]
791b462K77m03n70n59J77J210r5p28J9O82n18r16L74J551R8j432l69P24P14k97
811b523J48J23K11j6l59L53K85N05K37n41m65N89J115K99q87J37K32N87J40K37
831D07L64J1J75n22J36R66R75n49r88K9J283N18m64j87P02j32n80J31Q12O16l25
852C378m03l2m3j93J396J60j497o1J013K48j119K93J074l05j804K46J214K70m26
871C409o90k4k29R0L63j48m34m21L64m19n05M37N91p24j083R0L03M04n10m72n00
892a08Q9N2j63l85Q3N59q18j532K33J627o1j436o82N93O6o57N17N4l28j023L34
913b986K82j89L28K66l39j397r8J451L53q65q20Q81K01p82L55Q47J65q83o81M92
933c419O26K26L26o01q15O43Q54K90l23R3N76m55n57R53P40L43p11p5l44O94R92
$$ y = [-2462, -2185, -2588, -3158, -3717, -3540, -2330, -2425, -3153, -3134, -2452, -2970, -3886, -3512, -1961, -1863, -3295, -3664, -2940, -2226, -2523, -2375, -2252, -2041, -2057, -2416, -2063, -1778, -1273, -1036, -1577, -2042, -1453, -338, -39, -926, -789, -557, 30, 170, 407, 771, 782, 957, 435, 571, 1537, 2512, 1963, 975, 1004, 2287, 2805, 2341, 2154, 2856, 2724, 2144, 2275, 3087, 3703, 3378, 2975, 2943, 2900, 2707, 4103, 4263, 2766, 2705, 3718, 3966, 2847, 3140, 4214, 3909, 2105, 2351, 3565, 3835, 3409, 2719, 2695, 2466, 2556, 2919, 2771, 2337, 1916, 2280, 1861, 1356, 1793, 2384, 1660, 577, 667, 970, 1374, 864, 392, -108, -19, 33, -130, -515, -432, 127, -691, -2223, -1990, -363, -424, -1860, -2542, -1949, -1883, -2540, -2023, -1969, -2297, -3320, -2986, -2704, -2893, -2565, -2299, -2638, -4035, -4133, -2682, -2329, -3194, -4014, -3133, -2932, -3714, -3359, -2512, -2347, -3230, -3911, -3419, -2793, -2567, -2241, -2842, -3657, -3014, -2160, -1870, -2193, -2100, -1524, -1979, -2536, -1583, -843, -500, -1211, -1286, -1630, -936, 56]
954E6K49o21l68R98N4l35K21J416J90j932L27J117P08k72l91K62n15O2R43L56
974B525l02k09M05k57l13K93J299J90j642k86J174M96m60j0J26m07m12R9N51Q8
994B948K72l44j190k49J018M91j57j086L41k3o11N15K19j94n02k99j76j04L03
1013A172Q41p10j569m96J309K95p00n35M82O3j319M1P53M11r99o24J43j04N44
1032a002K56m25n45o41L50L86n87L11L80k54j459K99Q31P75n86q58j22K91M14
1051b186m1J6l77O57k74m20L56O40M54q81l48J71P35L61J49o06r2K25M24J97o2
1072i02R4K52p4o42K83J020N18j191r0P25J71O3J57K96K44j98m95L89M31K30r4
1093A187n6m76M75N04M5j53k39J59J56l67L68L30N42n63m22q7M59J31N13q56j51
$$ y = [56, 305, -316, -684, 314, 368, 33, 254, 1670, 1860, -72, 255, 1372, 2080, 1808, 1417, 1679, 1164, 1226, 2169, 2525, 2223, 2014, 2419, 2162, 1849, 2142, 3441, 3631, 1989, 1703, 2877, 3373, 2913, 2903, 3029, 2622, 2210, 2309, 2860, 2948, 3220, 2876, 1686, 1437, 2455, 2946, 2789, 1703, 2044, 2021, 1410, 1925, 2144, 1950, 1448, 1149, 973, 869, 1172, 2013, 1303, -266, -762, 547, 842, 142, -393, 89, 152, -1167, -1126, -373, 38, -961, -1585, -1442, -1546, -1002, -746, -1171, -1716, -2357, -2007, -1621, -2208, -1897, -1517, -1771, -3230, -2931, -2100, -1325, -1911, -2769, -2891, -2600, -2186, -2227, -2211, -2588, -1931, -2205, -2625, -2269, -1629, -1175, -2056, -2404, -2233, -1498, -1137, -988, -1594, -1686, -1461, -1037, -840, -902, -808, -556, -630, -1272, -989, 31, 549, -642, -732, -7, 164, 227, 384, 680, 924, 726, 231, 620, 1051, 1281, 1187, 1131, 655, 1130, 1634, 1679, 1526, 1287, 1446, 1602, 1235, 1603, 1933, 2475, 1912, 1490, 1403, 1862, 1993, 2506, 1650, 1499]
1114A499M01J72o44J16M98j85o13j89M55K76j94L2n75r1Q1R4K36j15n23J38n6
1135H13n11j38P15l29p31m30N13N77m24m24j12j8K8l65J28m2n8K6l40l64K35j45
1157a396N02l71m19L54J97n3k94k4j34L77q04J4Q86p3l13l95L7Q04k50q4l81O47
1179a173m9m24L8K95O75j49l23j14P3K85L46j73k42J29K85M59m78N7O99J18q16
1200d82j92Q14M68k46pj52L24J76n2p1K8J08j19J84l9M24m3j79j04J23L6L89M3
1223A431m26J07M91R5j08m09L52K55m83l61L38P38l13n49k92N2L36K92m32K77
1243A391l25n4l15P6L65k62K74p58l8j8O48j20k87o96m2M36j17j99K1k4j07n06
1265f57p5N75N33m71p64m1q5N85k36j03j70j39k89N3K16K54M0j99n87K83j24O13
$$ y = [1499, 1900, 2072, 1428, 1544, 2042, 1857, 1244, 1055, 1510, 1786, 1592, 1624, 1049, 958, 1039, 1133, 1369, 1254, 731, 869, 813, 302, 164, 879, 550, -181, -611, -98, 479, 55, -369, -481, -499, -471, -836, -708, -750, -808, -782, -1122, -1486, -1251, -1396, -894, -1265, -1684, -1330, -1133, -1186, -1480, -1504, -1638, -1261, -2065, -2051, -1165, -1238, -1551, -1946, -1909, -1105, -1355, -1439, -1820, -1173, -1222, -1646, -1608, -1313, -638, -787, -1110, -1224, -1151, -866, -520, -693, -935, -806, -521, -62, -540, -483, 216, 334, -482, -674, 140, 608, 362, 355, 203, 527, 703, 651, 580, 608, 716, 597, 781, 742, 1166, 1123, 944, 840, 963, 999, 1388, 1431, 1005, 1112, 1603, 1698, 1590, 1181, 1533, 1788, 1305, 944, 1282, 2020, 1707, 1158, 866, 918, 1254, 1546, 1114, 1391, 1066, 1012, 697, 773, 1138, 876, 1150, 392, 354, 336, 984, 864, 577, -119, -161, 275, 158, -41, -20, -44, -151, -657, -732, -157, 376, -95, -859, -900, -985, -400, -636, -739, -909, -1048, -1337, -1284, -1068, -814, -774, -973, -1560, -1277, -1401, -788]
1287g88k85j90n94P43j09J7p6N93k21p33j78L95Q47j73n32j39J61K36m0L85k05
1308h86j65p5J94J83K69L92m10n2o94P86J48N26j41q13K89L55J7l20R97j91k89
1329A20m10M15O05M37n81l42N4L89j66N16l6j49j60m4K02J56M23O9k98o10O7Q20
1351A477l52P4l46R5K77k49K5M9N85l78p91JK79L96K8m57J14m24J88K28J95%j53
1374H61n62J12j29K78N28Q3j085j22J59K99N7o46K66l4k10l30M44N43q2q24k85
1395f79q3N54K59m75k72J60k19K9l0K49j83J21m05j66L75M31j97m27l36J90O25
1416d79l13R1l85K28l1l16N2J96N23l15l56K43L0M87j45k19k88L02j47j04O8K90
1438e88M32p05K32J03L65j1k47k57K25M0K55k08L16M1pj85j20L59L04R0n7l65
$$ y = [-788, -1073, -1263, -1857, -1114, -1223, -1206, -1282, -689, -910, -1643, -1821, -1426, -579, -752, -1284, -1423, -1262, -1026, -1066, -681, -886, -1051, -1126, -932, -749, -480, -88, -498, -550, -1244, -458, -310, 216, 75, -738, -449, -94, -77, -397, 600, 409, 120, -290, 125, 730, 1167, 586, 244, 298, 687, 521, 1037, 1001, 852, 692, 648, 850, 1006, 1429, 1498, 1200, 590, 657, 1477, 1125, 1199, 853, 948, 1225, 976, 1001, 1050, 1635, 1257, 466, 467, 746, 1142, 1170, 713, 827, 403, 591, 819, 1014, 1014, 861, 299, 411, 282, 560, 1088, 1171, 86, -36, 123, 422, 479, -167, 99, 65, -145, -475, -31, 512, 430, -394, -679, -762, -208, 51, -424, -696, -536, -755, -726, -756, -507, -690, -569, -974, -1140, -765, -334, -531, -958, -1294, -1104, -479, -792, -701, -1086, -858, -889, -1205, -1153, -957, -434, -749, -1105, -862, -832, -345, -490, -709, -997, -695, -842, -946, -878, -588, -156, -861, -629, -526, -161, -172, -419, -676, -451, -411, -156, -364, -48, -7, -14, -199, -319, 40, 344, 434, 377, 12]
1460A2M4M40M9k26J56r5P7J40k31K13m5P1j26n83M98O52k29m64K84L4L65k56N1
1483H31j32L46k04L2J74j62L66j47m19j33L66K46j53n8l21M59n03J28j88L9N15
1504A082k45o99J25K17L44n03k44K46M10m07l37K34L02p7n75J46k32J49M97n05
1524g2j89L6J89j15m6k62r9Q6j05J22J32K49m47l35j55M86J81l18l64K98K92l21
1546g57J12j50L25p4l07k43N4M86k0l75j57j93L29N41j86m93K20k2k24J89p2N77
1568d40nk60m53P38R0O9n3j30l26J70j6K79L6n7K41l39O9N38Q6J1j25p9m6K23
1592B21J3k82M21J15k15l12R6P28J01k77m55J43K80J39O4l53K81N1j71oK52L76
1614A210k81k59p3L21o2M19l31k38o1L99n1q0k67J02J62l87j8K90P2J59l58l36
$$ y = [12, 56, 496, 545, 319, 475, 380, 457, 597, 366, 579, 534, 605, 479, -104, 394, 1046, 817, 353, 637, 671, 1036, 780, 831, 699, 1045, 841, 873, 1047, 885, 1251, 1104, 685, 552, 918, 1164, 1011, 953, 632, 1091, 588, 716, 528, 567, 1082, 837, 138, 263, 480, 824, 321, 77, 323, 733, 326, -11, 223, 525, 448, -127, 19, -213, -64, 433, -72, -261, -225, -36, -151, -197, -459, -558, -472, -577, -455, -323, -74, -521, -856, -1011, -525, -344, -662, -1026, -728, -436, -757, -645, -795, -470, -544, -851, -1094, -1040, -554, -574, -949, -1106, -1299, -970, -429, -615, -1108, -888, -910, -1134, -945, -1017, -440, -445, -705, -1158, -420, -330, -261, -314, -444, -770, -600, -616, -337, -301, -358, -117, -456, -387, 151, 237, 248, 123, 44, -2, 221, 234, -48, 373, 488, 273, -39, 57, 785, 886, 609, 154, 297, 577, 716, 780, 427, 708, 759, 588, 582, 834, 1210, 929, 670, 597, 918, 856, 1275, 944, 706, 645, 1044, 993, 913, 646, 748, 910, 523, 505, 795, 867, 1026, 668, 332]
1636C32j5J90J11j0m9K09m04k58L11J32m3j16m67N8J47J43j37r2k20J08n2L6l01
1659c87K81Ml27Q1k4K17N6n8n29L04j17q8m3j61N10o39nJ17o9K63Q2n99j11L23
1683i19L42k93J76j20K27k35rk3J70M79m80m15K14M3N62j24n77J72N79k39l37
1704h07J64K88k38J28j30J12M74j71L36m40j84M07L71o66J61J67O0Q4j37R5L63
1725D37K92n56j98n2N37J91m25J76M8j14J85Q3L0K54k92j33k48M43J84r8j39Q5
1747F90j41J84L00m06L65j71J11n70R1K72P51n20o23K17L63q4j39L84m97j80K38
1768F35k6p5MP1p4k46J12P6k87lJ41k44J75j2pm61L08K84n08l80N39J32l09j71
1792c26l5L6K70j2l56J8lk01J2J0j89K14rr9n7K35K79k25j90j09k09M43l13R1
$$ y = [332, 317, 507, 618, 608, 559, 768, 364, 106, 417, 549, 506, 390, -77, -19, 128, 271, 134, 42, -178, -70, -122, -86, -387, -106, -102, -429, -348, -372, -155, -99, -157, -686, -382, -499, -587, -630, -791, -281, -920, -925, -808, -877, -614, -532, -1131, -1242, -919, -577, -870, -694, -814, -587, -822, -831, -854, -684, -205, -685, -1100, -886, -843, -281, -405, -982, -810, -231, -470, -807, -643, -355, -593, -465, -595, -483, -9, -180, 156, -284, -468, -61, 310, -356, -195, -28, 32, 116, -21, 74, 437, 729, 173, -25, -77, 460, 651, 226, 402, 450, 336, 521, 604, 634, 888, 596, 463, 215, 658, 842, 744, 605, 690, 549, 733, 1033, 627, 992, 821, 932, 362, 453, 725, 1476, 956, 333, 550, 913, 829, 690, 1074, 577, 397, 635, 609, 534, 538, 609, 535, 289, 401, 477, 190, 187, 328, 84, 259, 247, 240, -221, 87, 371, -137, -517, 22, 154, -155, -326, -361, -325, -55, -67, -423, -405, -408, -609, -597, -587, -776, -562, -571, -670, -727, -492, -213, -438, -628, -737, -946, -503, -816, -725]
1816g25l1J79k94m79O35J34n5k58m6R8K57J45l21j49L07J17l25R1K05Q4K29l56
1838e58j8oN43n0l87J34J45K25j30j96r0L71k2j83J31P8M04k08l30L70K51j1k09
1861B54K21k15J14j30J74J35j5P1k2m4j95M79K19j91j18l64L22K06k63J84k74
1882E48P82l83l03K7L87j69j42j41r2L74j65j28J75l16K1RJ1O1M3k44k18k90P91
1905F38k95K87n79P0L92l92K57m12K18k87J47m41K09j41M61j05k92k26L05J50
1925c6l10qJ44m25P0J59k98L29R9j38m57n9M67K2m76J57j82L94l30J47n5J8K14
1948e54j27j06J26R1l43p9J51J80m0J24l1j30K36k21L62p5R1K30j13l52M03L31
1970A54j95l20l6L14KJ40n22N00L5K05m14O0k1L55J20k34J25R0ml3L59n19M47
$$ y = [-725, -756, -577, -871, -1350, -715, -581, -636, -894, -940, -842, -585, -440, -761, -910, -603, -486, -811, -720, -515, -431, -202, -558, -576, -582, -39, -89, -476, -342, -197, 28, -102, -298, -388, -17, -39, -222, -91, -13, 391, 183, -147, 223, 474, 463, 254, 475, 260, 374, 244, 418, 553, 538, 609, 587, 543, 348, 827, 1046, 855, 737, 373, 695, 901, 638, 822, 548, 1330, 947, 644, 671, 1058, 889, 747, 606, 514, 888, 723, 595, 770, 454, 475, 484, 495, 556, 599, 355, 137, -153, 638, 343, 630, 51, 121, 513, 121, 378, -34, 184, -103, 44, -397, -188, -329, 132, 27, -265, -491, -186, -36, -346, -354, -210, -635, -565, -406, -704, -375, -276, -414, -871, -930, -463, -441, -917, -760, -942, -548, -878, -731, -786, -768, -554, -681, -787, -661, -570, -913, -992, -841, -661, -701, -577, -608, -738, -502, -723, -361, -436, -345, -115, -228, -580, -177, 154, -41, -361, -397, -83, -81, 59, -463, 37, 72, 277, -137, -77, -98, 257, 377, 143, 268, 358, 354, 321, 680, 161, 608]
1993F08J57m62L7J88J65nl24j60J09L58K46o96N29J19k24o1p1M11P8k33k71K0
2015E18J76L18N7l53j63L51l36Ol54M88K85l42l17k53O17L1l67j7k46MJ14j17
2037A00J72j46N3j84L58k13n1N1q4n9l06l0L08j92r4J15M0k88j17J26J81J23p76
2060i13M27J93M8m35K32m89L65j74m5j28K79L57m72p0J3K15J00j29K31n14j12
2081a021L09j67K91k7K08k14r9J22l6L81l00p5l53L73%Q9J41J6K85r1l23K81o2
2104b72l7J84l55K68M81k49k63L68j76K69j55l6K41j20Nj43J03L82M4J41m44N9
2126B95J65J88K1K11m25K11k2L5r8J45j94K46p2l39J98J54J09n54J89K59p8j64
2148D80J05O6P1k15p7J08j02M5j63kP30p02L7j22q0J52J8k3J46l68K54j24Q2o2
$$ y = [608, 765, 303, 340, 528, 693, 688, 364, 204, 313, 671, 917, 221, 750, 869, 645, 584, 513, 924, 1002, 769, 498, 518, 694, 1012, 1069, 716, 553, 904, 568, 574, 220, 708, 993, 651, 334, 81, 698, 729, 362, 345, 99, 103, 217, 100, 272, 126, 179, -5, 353, 140, 89, 140, 56, -3, -309, -339, -31, -223, -317, -202, -162, -450, -567, -441, -260, -137, -913, -486, -293, -245, -680, -448, -937, -572, -746, -791, -919, -640, -283, -755, -825, -812, -597, -497, -626, -395, -909, -1021, -712, -879, -588, -615, -407, -621, -720, -598, -634, -253, -553, -628, -981, -608, -608, -519, -378, -362, -77, -168, -491, -210, -272, -309, -125, -480, -212, 269, 20, -243, 125, -51, 218, 63, 27, 268, 148, 153, 10, 113, 495, 539, 680, 236, 295, 460, 648, 669, 880, 455, 666, 644, 679, 581, 726, 532, 778, 706, 367, 565, 719, 828, 274, 463, 722, 644, 480, 585, 651, 722, 507, 430, 538, 436, 481, 318, 316, 1046, 344, 381, 259, 179, 331, 349, 326, 472, 104, 358, 234, 316, 254]
2172B54l18M40k97k08J69o1J87n70K10l9Q3J5q1n8K05k6m41K27J88o1j34j51j29
2195e96N0J60k56Q9r0L25k2m05K8J45K02k2j54p6J65j23pj23L67k9p2Pm78K14
2219g01N33j96l92L24R5J43k01j68J06J79j25R7K67J18k00j44K22l66M87J52n9
2240A71l29PR6K51k29P9L00q9m08j22M21K76J9l40j14K99J22K6k03J74k04L0L15
2263E48km3L73m16k36J18K10Q2j1l1l5q3K8j45K27q5O3j64l19K30K33m65L38k08
2287B07J58j32J21j59L01lj92O9j69J20O6k69P0j75q0L5R5k19l6M3k1K41m56J08
2311b77O3J7k07k85M39J03J48k24q9K15k74J74l16J86J90k70J61j47j26K30o5
2332c54k50l18P23k40j78j0K83L4m6k44q5O22k58qp3j67K50J62j22n9RL01R0j61
$$ y = [254, -64, 376, 79, -129, 40, -21, 166, -404, -194, -233, -150, -135, -216, -274, -69, -95, -536, -309, -121, -182, -316, -467, -596, -546, -386, -642, -553, -643, -318, -340, -745, -717, -572, -370, -392, -546, -622, -457, -580, -587, -710, -343, -372, -444, -437, -915, -701, -168, -364, -756, -432, -337, -194, -395, -563, -457, -278, -403, -306, -39, 79, -121, -265, -43, -409, 78, 230, 171, -158, -151, -55, 196, -33, 46, 346, 257, -151, -273, 148, 424, 443, 103, -11, 288, 410, 436, 233, 407, 203, 233, 548, 546, 503, 876, 460, 224, 342, 552, 634, 623, 592, 557, 474, 502, 357, 584, 499, 562, 398, 79, 309, 542, 77, 415, 207, 365, 233, 354, 195, 496, 493, 301, 370, 201, 321, 387, 118, 188, 13, -67, -32, 63, -156, -192, -149, -170, 71, -385, -277, -214, -197, -404, -689, -250, -147, 1, -223, -312, -97, -371, -197, -513, -327, -137, -407, -246, -393, -519, -289, -354, -604, -922, -199, -439, -617, -627, -344, -310, -356, -600, -685, -63, -321, -329, -402, -569, -319, -157, -279, -338, -329, -28, 62, -99]
2356i9j84j00K52Rk24J43L06J17r7r1j95J81RK49m0o8L5Jn5L8J57j66j46J17K80
2381D29p0k4L1P0m5N0Pk72J98m2R8J53k97J47L0j27J90N8J39l50m0L4J55o3j44
2406C15Q3k8M23m09N1k76N5rP2k4j14J35J31l1m37K08J27Mo32M95k61M2N49l98
2430G1m20L95m20L09l39J48K30k32J06j20J5J86k19Qj59P1K10l43q1J65j79j19
2452g17L23j54J93j77j3q4K32m0J37l72M65k89J78j16J65L2l16J41J72k64K33
2473b71j05N0j33J45n4K73k51k71M80JQ1k30m2L35l28J43K9q1K98J00J84m48K77
2496A82P8n2j16L5j5O9J5KL6%K22K2j23N25l80R7Lk97K30j82NK01m13L23k4K68
2522G11r5k19K29m06K76k26K14j17J28k53P7K80k55R7j30j39J32M6j56J93l06
$$ y = [-99, -283, -383, -131, -122, -346, -203, 103, 220, 123, 32, -163, 18, 27, 276, 236, 168, 203, 204, 149, 187, 344, 178, 32, 149, 429, 359, 335, 366, 436, 391, 441, 448, 176, 374, 332, 430, 583, 286, 433, 463, 336, 526, 584, 723, 373, 333, 367, 522, 459, 315, 398, 370, 793, 384, 435, 159, 214, 205, 277, 253, 139, 274, 405, 374, -63, 145, 272, 276, -356, 139, -122, -80, 469, 71, -349, 46, -374, -65, -404, -256, -26, -258, -152, -272, -257, -71, -290, -282, -441, -370, -160, -503, -584, -419, -598, -717, -394, -548, -355, -532, -545, -629, -397, -437, -300, -672, -207, -496, -318, -434, -269, -237, -553, -412, -240, -504, -271, -376, -326, -459, -314, -368, -95, -346, -617, -137, -136, -55, -285, -327, 8, -320, -177, -148, -229, 69, 169, 353, -95, 182, 260, 208, 92, 127, 112, 181, 196, 198, 234, 234, 456, 478, 355, 880, 500, 597, 600, 303, 533, 351, 356, 557, 144, 467, 443, 711, 616, 397, 626, 220, 496, 270, 484, 367, 495, 242, 319, 599, 344, 441, 311, 172, 304, 350, 194, 387, 81]
2543H1K20J23n3P5K0j32k60k04M43k08J05Qk17L3L11k96j81j99N16j72r5k6K28
2566A20l41J99k14j33J46N3j85k00L13l01K13J47m55O28l49K5k09L97j86k04J03
2587d33l56K29M0K98m80J08J21JJ96j45K59l04L3p4J52j10L15k39Q4j63J43m6
2609c71k11K71N5K37k65K13m78L98K82l79QK44l9K3k46L97J26k40J98j97M52m10
2631F8k94N54k9J15r5J65k30Q8J12j98j55J58J39J91j93K05k20J39j63N3M6j0
2653D46J87k14n24N72L2m3pj97P4K10l9k3M2l0K7q6j38J58j67K25j99L51m75J03
2677B85j17NK92k11L4q5j33p3q6R9k41J33k76K2L83j71r9J89j29J26qm9j91J80
2701a21J21k58j82N45k66r7j37j99M46j32k16L2Q1q0j21K95m14L11n0l25K75K8
$$ y = [81, 301, 424, 371, 446, 466, 334, 74, -130, 313, 105, 210, 218, 1, 34, 345, 49, -132, -331, 185, 13, -82, -108, 120, -221, -22, -236, -369, -223, -170, -355, -555, -242, -543, -330, -183, -638, -10, -359, -334, -543, -146, -332, -536, -433, -789, -560, -520, -222, -702, -594, -473, -472, -276, -421, -162, -466, -433, -507, -355, -465, -150, -389, -305, -468, -325, -371, -582, -311, -256, -19, -284, -71, -549, -151, 131, -248, -240, 4, -35, -12, -258, 139, 265, 25, 223, 26, 478, 68, -226, 328, 299, 414, 319, 484, 254, 342, 454, 256, 101, 259, 398, 589, 396, 601, 381, 520, 357, 410, 456, 446, 633, 419, -105, 467, 499, 456, 449, 252, 326, 536, 497, 474, 516, 486, 513, 427, 289, 447, 280, 505, 306, 657, 182, 285, 168, 173, 465, 254, 288, 203, 70, -3, -89, 10, -231, -98, -374, -352, 31, -140, -239, -50, -179, -53, -61, -110, -301, -121, 0, -258, -440, 105, -161, -258, -395, -594, -148, -280, -496, -464, -383, -463, -584, -289, -703, -392, -442, -767, -492, -464]
2723d64J53k37K4o8Q6J09N3j4O9Q5m69L88j00K53j22j98J63J91p2P8l16J56L72
2746A20j11J18j46l65K31J07K50m91M15K2k33J42J28j72Q6K01p6k48K41r5J28
2767B52k34M82j95J15M6j94J26Qom37M10Q4q3J72k74L55k32n1l9Q9p1O9J56j91
2791C57M7k5j83M06k97r3J42L4m18J93K47k47K24j91pk3K57l44l6K65m78K75K24
2814C29l15j7k12L7K29m4j85Q2j92L44No1j37n4o2K06Q0j66j86M0R6j70kJ4P9
2839b62o2j80J80l03N05l33K02q8M8p7J12J32k29m4J10M8j69j66L69j89J25L5
2861b36k90K10J46l45L44k32P0P5l17L43p5nJ42o1Q0P1j39J81r7M7k6j25L97O7
2885B25q1j29j51L65k36K13J61j05m84L69j5R9j32L73k51Q4R2k33P1J12J38l42
$$ y = [-464, -311, -548, -524, -592, -506, -397, -344, -358, -289, -204, -673, -285, -385, -132, -254, -452, -289, -98, -170, -92, -408, -252, 120, 9, 127, -19, -384, -153, -46, 204, -287, 128, 150, -83, 59, 187, 15, 101, 302, 226, -22, 219, 124, 252, 18, 500, 305, 420, 466, 272, 398, 406, 400, -37, 373, 457, 374, 546, 272, 627, 395, 344, 305, 394, 323, 392, 548, 357, 404, 379, 196, 602, 305, 212, 354, 388, -30, 163, 410, 163, 387, 196, 189, 166, 423, 79, 43, 308, -170, 105, 329, 14, -3, -215, -178, 51, 7, -178, -96, -288, 56, 61, 0, -137, -191, -253, -47, 33, -133, -319, -279, -183, -353, -355, -341, -262, -324, -504, -324, -627, -122, -455, -253, -341, -293, -370, -258, -126, -355, -399, -289, -241, -410, -576, -207, -396, -271, -236, -526, -316, -170, -515, -171, -403, -333, -258, -575, -232, -307, -312, -170, -231, -151, -80, -219, -38, -135, -88, -114, -239, 158, 225, 144, 15, -136, 229, -7, 206, 367, 262, -222, 147, 132, 231, 99, 472, 221, 305, 397, 164, 235, 347, 485, 143]
2907A43L04j16k0K40j66O9r4j48J11m0J74j13m4j06q8L80l83m5K35p4K67j85k20
2930H1L14k06J77j3k56M18l71L38l17J34J15n86N73j18j78j48M6r0J12p3K82m39
2952b05j61M36J68n4m55K20j40M3Om9k13L05k21N9L1jO5j99J10l6k60J16j10J58
2976c87O6%Q4k44k56L96j02J36l6p0L65j37k04K3J62J0j53K6r7N31m61kj3K4J65
3001a74n8K06m2o1l0J30K18l27kJ3k7K11k72M12P1j68N5K4Rj41j61j2L85J04j81
3026A82N5J21J9k38j22Q5j23K43oR3k7Q0j20J16k38O7M23l99J79j43K2k52J64
3049A81m8L2L07l68R9J05K4k4r0j23K12J4l63J18L13q4l4p7p9K33j72j69N9j32
3073f6Q7J20l36J42Q7k60N27j79n24L94l1k4r3l74M44J2J48j63l15K54J9k19L08
$$ y = [143, 447, 331, 311, 551, 385, 454, 360, 212, 323, 283, 457, 344, 300, 194, 106, 486, 103, 58, 293, 219, 486, 301, 81, 395, 189, 366, 353, 97, 515, 144, 482, 165, 299, 414, -172, 401, 283, 105, -43, 3, -87, 25, -48, 234, -205, -366, 70, 238, 184, -271, -51, -191, -148, -142, -191, -404, -99, -320, -261, -230, -231, -166, -365, -255, -291, -551, -435, -545, -387, -321, -321, -237, -481, -737, -341, -443, -307, -343, -413, -48, -185, -389, -366, -204, -194, -347, -321, -418, 113, -348, -350, -363, -339, -174, -232, -26, -68, -129, -159, -29, 189, -138, -140, -127, -154, 57, -215, 197, 268, 100, 155, 179, 188, 47, -114, -126, 259, 363, 182, 237, 358, 377, 139, 17, 102, -21, 222, 216, 309, 282, 362, 242, 358, 120, 187, 610, 211, 390, 247, 269, 17, 181, 133, 165, 472, 104, 203, 308, 332, 308, 218, 95, 307, 321, -42, 76, 389, 305, 271, 194, 115, 348, 176, 7, 66, -66, 21, 141, -195, -53, 34, -226, 301, 122, -402, -8, -39, -63, -156, -530, -86, -74, 74, -89, -404, -150, -131, -350, -42]
3096d2j46l83M27L1j27j27L1j5R8K67l19K0J52k20P7j53J86k21K20k74J13K82
3118a23k28K73j45K88n55M61k28L64l11k76K55L22L6j74j15N9n1l05K56K57j69
3139a09q0J69J72r1k49K32J58j38P3m6K03K13k20k26j13L50Kq0J74O2k21k77L02
3162B60J9q3M5j65K93m54N29m24L46NJ2r4O4k2K3O6k63J84J62l04J01j07j12m1
3186D0J46K41m44J65M8J23k92K62R3n64M0j5K68o1k15k0J77N4K73k26j27j98K54
3209B2j62M8J77ol96K19J64k51J31j1O2k97K39k62J18J00j50K76m00J41J74j74
3231b38l4l9j31J11p0K21O3J32k60l7J79j61l4j11L25k28J27l50M36k03K36m1
3253a07j53K63l92L32k70J13m6J19J93j28l49L80K66l37J42L3j84K85l43L93J42
$$ y = [-42, -188, -571, -144, -113, -240, -367, -336, -351, -253, 14, -305, -285, -133, -353, -276, -429, -243, -464, -244, -518, -405, -123, -351, -78, -223, 65, -490, -29, -257, 107, -204, -480, -225, 97, 133, -41, -156, -97, -148, -453, -197, 60, -109, -189, -20, 152, 61, -188, 44, 202, 64, 137, 91, 294, 507, 287, 61, -52, 298, 300, 220, 394, 456, 235, -42, 260, 279, 196, 241, 76, 369, -85, 444, 20, 366, 371, 383, 289, 353, 331, 354, 420, 157, 341, 503, 199, 300, 193, 81, 40, 186, 427, -17, 148, 196, 319, 27, 289, 382, -182, -142, -157, 111, 50, -165, -185, -8, 46, 319, 93, -34, -232, 22, -140, -92, 85, 79, -317, -98, 66, -185, -54, -65, -3, -300, -61, -323, -205, -105, -255, 21, -379, -238, -64, -238, -272, -311, -442, -331, -401, -180, -117, 15, -245, -282, -103, -264, -298, -409, -84, -312, -185, -535, -99, -302, -66, -107, -260, 3, -389, -57, -327, -214, -260, -141, 52, -76, -425, -45, 221, -116, 26, 59, -125, 160, -183, 210, 352]
3274C52n06K96r9J82k62K87m0J80j25n1J62m8k80K92j78L5j6P5k29K45r3Q8J60
3297D27j02j89K46Lk2K17k84j41P8J7J2k3j23Q0j02J60r8p6L54j19j00n4l15N45
3321C91P0m44M2N4k48L09j18Pm0K8j3k29J08K54m27J65o0oK02l94L68K35k84k46
3345b76R2k37K06K83k34o7j3J45L8l85M5m4K56K22m76K19k51J14j66L49n8J4j30
3368c54J72K5PK39k81j19L1K9M2O5k01L0J91r4J79r7P4p5j4j14l7K90j73P2r1
3393b04O4J21n1K26j55n7K7%K71P7r9J8j27J02k97M13k72L9j95K64K14r0lm25
3417a39N81q0j45j63L10J8l97L96q3K54m07J89Q9k40l5j42L40l78L08k05K51k20
3439A02l9J86J2r9j33J62J9m1O8k99J94R5j89M4k2Ol7J42l26L46q2j53J27m9q6
$$ y = [352, -154, 142, 43, 225, -37, 250, 210, 390, 265, 214, 376, 328, 48, 340, 162, 197, 181, 256, 27, 272, 179, 267, 427, 325, 136, 382, 385, 363, 580, 296, 155, 233, 250, 262, 239, 116, 196, 94, 254, 156, 80, 434, 315, 215, 161, -154, 391, 461, 17, 59, 113, -135, 174, 56, 63, 23, 51, 38, -191, -83, 171, -256, -91, -151, -157, 45, -349, 19, 254, -30, -276, -184, -421, -215, 68, -166, -233, -246, -101, -63, -448, -403, -447, -191, 31, -445, -226, -477, -363, -529, -180, -238, -224, -354, -182, -157, -150, 89, -192, -311, -280, -251, -209, -144, -345, -315, -124, -218, -39, -136, -62, -137, -151, -265, -302, -12, -185, -113, -204, -140, -19, -70, 156, 1, -56, -29, -29, 242, 319, 220, 238, 111, 213, -84, 329, 57, 96, -99, 165, 379, 289, 286, -139, 442, 362, 217, 54, 364, 382, -15, 381, 298, 552, 145, 334, 423, 183, 148, 6, 346, -32, 276, 71, 322, 102, 63, 249, 261, 162, 29, 191, 210, 169, 237, -62, 132, 227, 38, 82, 60, 66, 29, 171, -155, 191, 109, -44, 83, 34, -52]
3464e2pj16j37M09j83J80j1j03Nq2L5n7j24J03K4q1j72L95J45m16K97l8k27j11
3488c24j99J74J68K50m26JK02j24J22m42L33q2J37k23L59j56J11j15j29k5r3K22
3510b59K21m2j19mO8j15K69r7j65J57k29Q3q7M26p4l45O4L32O7k75R0j48R3K65
3534A76k78J69L2J59k68m1J89J71j85R6J57l00J74k56K9L86j26m00K07J27p7J67
3556C08j83K8J68j60M3j11K35j51J3K32j72r0K05k94K90k16J33R7j28J6j19J2
3578A56J6k9K04k35J42p8N3r3j52K94k23L4J77r3k83Q5J0j35O7J19n8j35J41J11
3602I5j03r1Pj53j07K35J03p6j51J76j46K45k30m8J62j22k35K81j94J77J35P2
3624C2k40l99M64k83N0K13m05L38J29K4J06k08j44R0K10J36k80k59L23J07q8k43
$$ y = [-52, -59, -175, -312, 97, -86, 94, 83, -20, -15, -97, -62, -119, -243, -140, -116, -197, -369, 26, 171, -245, 52, 14, -213, -324, -523, -349, -181, 69, -357, -356, -154, -278, -156, -598, -265, -347, -210, -433, -74, -230, -119, -234, -363, -388, -481, -259, -38, -80, -199, -203, -135, -250, 19, -78, -243, -86, -315, -232, -319, 107, 33, -312, -248, 84, 151, -124, -34, -182, -89, 176, -102, 67, 99, 258, -10, -51, 138, 309, 124, 220, 377, 77, 251, -5, 24, 410, 284, -116, 91, 218, 141, 308, 125, 153, 321, 161, 204, 93, 328, 177, 190, 422, 250, 160, 365, 71, 361, 145, 278, 375, 247, 263, 144, 156, 172, 143, 347, 112, 254, 176, 229, 136, -16, 278, 55, 89, 266, 173, -110, -25, -15, -150, -83, 36, -22, -157, -16, 95, -8, -99, -92, -245, -352, -117, -14, -90, -241, -65, -211, 34, -196, -244, -82, -204, -439, -158, -352, -175, -40, 32, -208, -607, -143, -426, -376, -163, -568, -230, -101, -77, 29, -179, -323, -233, -23, 113, -167, -426, -103, 4, -84, -327]
3646c27M01p8m5Nk05J76Pk37K22Q4j43l8pL65l89J68j00L47j87K97l66r0J85K44
3670B89j57k02J08J14j07K67k90L09j89r0R9o2j84m7N28l87K17K12k93K03j22
3691B16J61k53K07J01k52j04J4K27m05N29q9j02l28O5%J62O6L5j68K9J02j88j24
3714i9J63m9J26k77J31K33l88M2K93J3Q7k81l7K71l34K60j02k42J26k1kq0k39
3737d06K32J49Qk73R3O9j55Q6J14j27L28m29L0J29j00K23J26l87K11Q6m87J18
3759c62r9L33l10K31k12L03j23k9M67n29R0K02q6l29M47M1J57k52r8L20l36R1
3781h3J52K39l90R1p6JK38m81N53r0Jr5l14J73L43n9l07L17j46J85m2O6n03L70
3805A43Lk70Q9k4K77J5kj82K34j79K43j33j40J19K14m70N26j65J3k00j30K03J97
$$ y = [-327, 74, -4, -49, -44, -249, -73, -66, -303, -81, 3, -140, -178, -185, 180, -209, -41, -141, 206, 19, 316, -50, -140, 45, 289, 132, -70, 38, 152, 45, 312, 22, 331, 142, 52, 151, 89, -95, -142, 386, -1, 216, 428, 135, 338, 216, 377, 124, 331, 432, 180, 76, 90, 317, -88, 441, 352, 250, -78, -13, -13, 149, 215, 250, 82, 111, 213, 25, -99, 64, 15, 141, -136, -5, 228, -160, -118, 175, 188, 275, -6, -43, 228, -106, 154, 52, -190, -64, -85, -87, -167, -406, -174, -25, -17, -290, -197, -128, -283, -197, -83, -210, 118, -311, -281, -152, -252, -29, 97, -290, -79, 7, -480, -362, -461, -128, -438, -207, -419, -116, -239, -268, 199, -330, -240, -38, -124, -453, -6, 35, 192, -60, -158, 162, -174, -83, 69, 308, -82, 9, -67, -66, 172, -309, 244, 154, 155, 60, -254, -81, 262, 203, -104, 213, 67, 252, 210, 276, -227, 143, 146, -124, -35, -59, 218, 233, 231, 49, 283, 104, 347, 214, 74, 193, 407, -63, 463, 298, 311, 111, -19, 184, 381]
3828C81M1k9j00n25K58NK97m35M73%n42J27jLK14j44k41L11k6J56l41J66J22l16
3852a46K8j25K4J90o8J60O3m88N52k15k32QR8kJ6K00k95J27n42N55j05jK39k83
3876b42J70j18l9K67k38N8o7J03K26l2m01K51L2l66L05k21K00p7Q5k4M9j40J45
3899g4j30n0oQ9J71R4k74K70n5j84p6P4K84J02l69j3J35k51M16j12k56N74l41
3922A8O2j78K43r2k08M83l62L37k17k51L38K09l93j05K61k43N47k69o9J26nk91
3944e9M8L80k67M14j54K6n2k00J25k27N2j94J63m8K64j68M4J32J12Pm52K20K38
3967D04m55P7K26k09J7J25J21k22q7k3J62k52J01j07L00j77J6k5J83j64m8J12
3989G5n7j35Q5k35J89PJ35k62j50M65m47K46k37k5K17J49m96N61j95Q1n8j88K08
$$ y = [381, 422, 393, 293, -232, 26, 31, 328, -107, 366, 366, -176, -49, -50, -47, 167, 23, -218, 93, 67, 223, -118, 48, 170, -146, -118, -243, -219, -29, -97, 63, 126, -362, 190, -25, -257, -249, -151, -153, -137, 63, -232, -105, -647, -92, -197, -198, 41, -242, -72, -190, -229, 38, -200, -142, -209, -106, 120, 88, -313, -62, -30, -396, -91, -312, -112, -189, -104, -128, -79, -219, -74, -204, -254, -260, -171, 0, 94, -180, 90, 35, -149, -225, -151, 133, 235, -134, -147, -12, -263, 153, 41, -215, 359, 18, 80, -98, 145, 53, -155, 328, -34, 303, 86, -165, 173, 382, -11, -116, 145, -98, 449, 180, 111, 237, 232, -59, -11, 369, 102, 516, 362, 388, 336, 136, 261, 34, 86, -108, 55, 7, 271, 103, 147, 279, 391, 398, -54, 166, 404, -51, 26, 252, 43, 60, 185, 306, 84, -3, -26, 136, -116, -15, -122, 178, 1, 17, -8, 175, 11, -37, 75, 18, -117, -32, -267, -78, -71, 64, -198, -348, 117, -330, -84, -321, -346, -129, 20, -476, 85, -110, -29, -87, -275, -67]
4012f7J16J15l85L9j41J21L13m22j57M34k26K28j70L03j15J72j25l32K03J53j25
4033f8K18n18M34l29J84Rp6K69j3j04j1j26K85l34O2L24l31O7K75j37j06K0J30
4056A24q2O4K0L7rn7J18kp5l0L6k55N49k10o5k58M9P6L03j49L63n96J14O1J38
4081B64k26J57J15j00R3p1k42P8K4K9l9j33K0L28l52K67j62j80m3L49o7j52p3
4104a16r8K68J9k42M6J68j16J01j34NJ72J7R2l64p1R9m3jP7j06K11J04j68J35
4128E5k98M11m80L48l52L61l34J91lk60N15n54N3K16k52J43J09j3K66m35r6M2
4150c67K06J87k68J69j97J13K59M1k28JK94k47j23J75k33K1K62l55M5K43K86j50
4172A34j68L4r1K24k82r2M19k21q0J73mM7r8r6j7K89k8q1J76k85l5K9J40m0J03
$$ y = [-67, 49, 164, -221, -182, -323, -202, 111, -311, -468, -34, -260, -32, -202, 101, -14, 158, 33, -299, -96, 57, -68, 150, -368, 66, -263, -79, -70, -146, 123, 110, 6, -5, -131, 154, -180, -118, 206, -125, -58, 217, 80, -26, -6, 124, 42, 106, 126, 163, 154, 97, 215, 213, 138, 108, 144, -111, 438, 228, 163, -95, -46, 30, 333, 184, 547, -49, 65, 126, 264, 38, 195, 310, 210, 303, 232, -10, 68, 92, 121, 82, -51, -31, 297, -55, 212, 50, -130, -173, 176, 109, -43, -116, -214, 54, 73, -169, -123, 45, -71, 30, -104, -99, 73, 90, 182, -182, -253, -154, -197, -198, -121, -227, -16, 88, -80, 55, -243, 168, -312, 36, -316, 45, -289, -98, -101, -361, 154, -400, -347, -131, -383, -240, -131, -144, 122, -313, -409, -367, -161, 26, -242, -73, -270, -157, 102, 143, -85, -84, 210, -37, -160, 15, -218, -197, 65, -290, -245, -2, 284, 134, -34, 0, -91, 133, -149, -241, 178, -43, -123, 50, 46, 93, -5, -101, -118, 171, 143, 62, 238, -47, -82, -53, 87, 47, 150]
4197A50j97K80K9l98J57L09k20K8K36l15J9L14l84K94k96K58j45M08j89J20m35
4218B3L26J08k92K52q86O15Q5j3k42R5k8P3j23j73L94j65J95r1j15J22l33L45
4240A72p3K1J14m46J14L8mR6k04J58k01L59k00K42j47lk85K79L5m8j96K07O0N1
4264A39m35J49r5k74N75l58k4K85q0q2J86k43M7J58pJ39k27nJ37j93rJ97j55M27
4288B52m56K50q1J20o8m08L51k26K63k6l9k6J36l12K81n2nL07j17j21q8j7J91
4311A09l18J82K79k00K2j6q0J02N6r7J66Q6l80R4p3J75K6j68j2K23K5k97K27j35
4335dM95j77O0o65M06J77j94j18M78m38j26j10M06n2k40L58k20J37or2j52J82
4357A05j88K22k3L04n21J55j32K02Q5l44J17K1J20l09R8P8J58n21L96p0J26l10
$$ y = [150, -47, 233, 262, -136, 21, 330, 110, 138, 374, 59, 78, 392, 8, 302, 6, 264, 119, 527, 338, 458, 23, 349, 457, 165, 417, -469, 146, 231, 218, -24, 71, 43, 116, -7, -180, 214, 49, 244, 153, 38, 160, -173, 172, 99, 120, 234, -212, -98, -60, -64, 32, -172, -14, -215, 144, -56, 186, 39, 36, -249, 30, 65, 17, -179, 28, 88, 139, -296, -147, -242, -516, 59, -299, -323, -38, -118, -200, -14, -257, -210, -52, -59, 80, -147, -152, -15, -208, -217, -20, -175, 252, -204, 46, -35, 85, 17, -391, -40, -266, -3, -29, -68, -94, 42, -270, 11, -41, -46, 261, 144, 23, -65, -82, 109, -209, -27, 252, 52, 74, 58, -22, 80, 136, 39, 205, 291, -89, 5, -68, 107, 133, -35, -47, 176, 201, -96, 131, -4, 491, 314, 374, -291, 115, 292, 98, -20, 458, 20, -106, -216, 190, 138, -102, 256, 36, 173, 167, 75, -77, 105, -83, 139, 116, 420, -101, 54, -78, 124, 209, -135, -18, 3, 123, -186, -88, -10, 148, -373, 23, -47, 79, -231]
4379b31K15k4j18Q7J30j74n5L19m61N01l02N1O8j32P3o6qr8L36k05J55j74P8k31
4403b66K5N7k9L91k84o3K49j32p1K28j36m3j39K84k78M6L93j65k66J42K6J76r9
4426D6j78O5K8j79M24l50J14L14l47%NJ18Q5m09L01J74j95M8k07J83l46J02oK43
4450C3J8j53K59k73j98M81k9M8j61N2K78l23j58K91j04lJ8L23n83K36J32q0n9
4473D5J42n60N39J15l42k7P0L49j37M2j23K35k09j88J57k3M1k94M11m72L59j43
4495a3J13k11L80L3l61k19K05Q1K4J24k33J61j7k59J63J27k78o0L23l09J30Qk58
4518c46O46k74k90N0L87j69j11j5J56j22l47M02j61m5%K75j3R9l48K96Mj24O4
4541A4m65L57m4K19n5j0J48j62k8p8K09n5m60L39K08o3o3K88m48K34R7k61K31
$$ y = [-231, -16, -40, -158, -71, 59, -115, -170, 149, -312, 189, -113, -62, 6, -126, -53, -119, -127, -225, 111, -94, 61, -113, -35, -266, -241, -184, -213, 178, -106, -169, 80, -52, -123, 105, -31, -74, -213, 71, -207, -161, 232, 67, -199, -57, -31, 145, 46, -132, -67, -39, -218, 206, -144, -30, 284, -63, -63, -58, 60, 145, -264, 37, 211, 16, 64, -143, 40, -306, -204, -210, 33, 51, -102, 157, -116, -314, 167, 138, 186, 25, 77, 355, 32, -126, 165, 61, 58, 76, 399, -184, 52, 184, 104, 45, 187, -373, 166, 281, -61, -88, -18, 331, 194, 236, 113, 348, 139, -49, 108, 85, 126, -168, 243, -229, 130, -13, 100, -111, 269, 302, -59, -278, -73, 8, 32, 156, -77, 84, 67, -192, -29, 98, -180, -240, 83, -226, -96, -88, -346, 300, 26, -264, -214, 173, 4, -107, -122, 34, -88, -435, -33, -194, -239, -239, 36, 23, 122, -226, 70, 74, -50, 14, -451, -94, -138, 81, 26, 16, 164, 2, -26, -104, 105, 50, -410, -71, 137, 74, 11, 299, -149, 85, 182, -79, 152]
4564A52j5q5l11M25k23%o6l0Q6M7K92k95J07K00k47J79r7j65n6K22p8K2j46J22
4588D0r1J72P1k41J65j33j66O00m34m2K40j14N5J70k89J46L41k08q4l32L83j84
4610F5OnK17J19l33j09J79j71k65L26K9J5j24n1J53J17r1P6l28j64M51L8k20J64
4634I4j90mJ69j33Q2k59N59l67J67k82M14k25J45K3q3k36O3j33Q1jP3M0L66m94
4658a31K3K82j00j23j62p2M61m71J11m3J5M40k14N6k73n4R1m6J73J95k76J25O4
4681G1K0j34k4m8j01K76k32K18k42K74p3j35k5J07R1J1K51n56R9R4R4j28K89j57
4705D0mL2J88n28M56l69J99r5L43j82l2R2J55k53J41L2j91K43n6m23M20q0k14
4728h6K22j11N1j42K88l00L81r5l56N79l57j24L95l37P2j41P6j18K11nl29L11
$$ y = [152, 137, 52, -259, 166, -57, -57, -123, -153, -67, -20, 272, -23, 84, 284, 37, 216, 119, -46, -102, 120, 42, 64, -82, 40, -51, 121, 192, -49, 116, -17, -183, 417, -17, -59, 181, 67, 122, 292, 3, 149, 490, 282, 198, -134, 249, 65, 71, 66, 283, 402, 69, -40, 139, -32, -297, 29, 58, 73, -51, -102, 51, 168, 77, 153, -175, -339, 112, 150, -70, 94, -96, -100, 69, -64, 18, -241, 318, -49, 118, -164, 250, 25, 170, 193, 110, -126, -63, -196, -115, -116, -43, -3, 363, -131, -108, 174, 74, -49, -211, -283, 178, -293, -182, -225, -210, 230, 16, 72, -201, -255, -164, -210, -37, 158, -118, 7, 71, 91, -43, -67, -115, -216, 60, -172, 46, -196, 78, 5, -130, -155, -48, 43, 54, 305, -251, -152, -58, 36, -92, 197, 40, 36, 68, 256, -272, 184, -185, 14, -81, 262, 80, 48, 140, 295, 42, 183, 215, 24, 267, 211, -212, 208, 128, -86, 136, 25, 76, -66, 222, -78, 303, 208, -148, 431, 74, -50, 345, 8, 80, -61, 15, -103, 108, 103, -226, 85]
4750H5l28L69J04j42l1m8Qj84K10j16j7J92k08pQ3K57j43L7l6j90K9q5L9l79M07
4775i4o6J43k19L34j13k22KL38j77j49K92j1Q0l89K82k00J42j57J0j20J59k97
4797d32M82k32J13j36R6J74k6j64J22j66K10r5k05J64K00n0k62K54k58J84q0M09
4819C02m11J76L6q6%o2k94L89P5p1k80J58P1K5Q5j08K38l30J51k81L70k67R8r4
4843a10J51m9L38J8m74J14J52J6k2N2m7k97K20J85j58m6P4L2l58N75m38K31j94
4866c5j27R2j2K41j95J36p2R2j81j6r5N4j96K70J7K35j53k47l8L01K52n6k91J90
4890A66j55J49j33l49L81l7j36l2M64r8p6j54L00Pl99n8rJ62J27j61o0R9J8J30
4914A46p8k71K72j72L72j82m86L97j77R9P6l43jJ80J62n8j48J76l7nr4J64l6m54
$$ y = [85, -243, 126, 230, 88, 57, 9, 17, -167, 43, -73, -90, 102, -106, -113, -30, 227, 84, 121, 85, -105, -76, -161, -122, -501, -94, -160, -17, -236, 98, -15, -237, -235, 103, -74, -223, 69, 58, 138, -251, 31, -169, -27, -184, -174, -294, -135, -432, 50, -182, -69, -205, -109, 65, 39, -125, -3, -169, 41, -54, -259, -95, 105, 55, -207, 47, -211, -27, -107, 302, -109, 67, 103, 17, 17, -45, -339, 50, 125, 54, -226, -68, 3, 28, 113, 5, 243, -87, 64, -217, 153, -114, -16, -110, 41, -8, 330, 348, -126, -12, 140, 156, 134, 186, 139, -158, 62, 247, 89, 43, 117, 149, -209, 366, -72, 159, -35, -162, -70, -82, 159, -36, 100, 28, 120, -61, -77, -172, -118, -314, -44, -27, 208, 55, -192, -230, 71, 323, 267, -24, 166, 11, 160, 27, -322, 59, 22, -114, -146, 318, 220, 144, -10, 290, 297, -102, -160, -169, -7, 120, -41, -101, -2, 16, 146, 68, -203, 69, -103, 269, 87, -399, -2, -179, -80, -4, -347, -348, -168, -6, -64, -212, -36, -73, -78, -172, -8, -44, -498]
4938d98K90J39Q0k10K01j56j42M62j08PJ66k89Q8J10p3k65M9L92Jl35J81nJ55
4961B40l88L37l50K62l28J76K26m76J03J85K04k53j43J45j18L70r4J55k00j6q8
4982e1N6k24J74P3nm4JL7k4K65l74K45J60l85K01P5l83J66K95mk03N0k1j11R4
5007F3J40m0j14J6J39m5J55j52l10l7L93j0m88M74k41lK71m09kn1J87QP3L8k20
5032a65J76Q1O7l67M2L28L1m34K62k30J6K29R8k61Q1K00l91L4K43n4j44J27J00
5055F9j69J53k30j17J91J50p9K2l32K33L15k98J8j59K69l51J50k1M09k70j8J14
5077D9j09N3L01m06K38j15K0j62n1N25k82k15L06k34P4ql00O23l43QK1p7kK01
5101A15l4j07L4n9J61k67K12o6L57k64P4Q9l65o6L69P3m22R3J39j44J81j82J14
$$ y = [-498, -208, -69, 11, -199, 2, -154, -296, 166, 58, 65, 231, -58, 30, 140, 67, -198, -149, 243, 244, -91, 90, 85, 240, -148, 189, -161, 101, -227, -51, 175, -301, -198, -13, 191, -62, -205, -60, -178, 192, 98, 253, 53, 37, -51, 5, -219, -45, 28, 23, -21, -20, 17, -7, 258, -116, 129, 289, -96, 105, 180, -203, -37, 258, 254, 51, 101, 80, -31, 63, 203, 163, 49, 65, 204, 159, 314, 162, -148, -185, 208, 198, -290, 184, -57, -60, 211, -198, -200, -251, -64, -56, 17, 55, -165, 11, 92, 159, -208, -166, 162, 193, -241, 21, -209, -193, 36, 134, -127, -46, 154, -237, -203, 40, -14, -158, -31, 69, -100, 53, -177, -294, -103, 47, -32, -10, -342, -109, 206, -92, -74, -233, 36, -315, -165, -186, 223, -47, -65, 49, -60, -7, 294, -112, 126, 11, 31, -131, -182, 343, 61, -154, 152, -82, -8, -16, -316, 307, -36, -28, -7, -84, -86, 115, 81, -26, 8, -51, 110, -157, 55, -11, 346, 82, 156, 245, -120, -186, 183, 256, -166, -73, 66, -78, 103, -79, 35]
5124C5j00J85l4j60J40j55K62l11L65k36J97l0k63M2J11j94K92k50P0K4oj27K61
5147A18k45k5M60k89j30j53L17l0K8j21K02p5O7N8k57J6O7m7j33J80l9k2K96n56
5171c13ML47l18L18l37R5M4M64l58J22k58K05j0j50L96l30r9N2K00J54j45l59
5193b76J87n7L80l47j43K07J06k12J06k00rL90j47k5J14N8l74J34L85n32J32n9
5215a82J96L6O0m2K41m24j0L3j03J87o5J75j57K26j21K00J92k33j14l19N42k38
5237H0J7kk0N0j45m0Q3r1J05J56n26M83k78J52j28R7l5N8J26N7j74k62N10l6k62
5262b5o3J22j7k6J15j06p8M4Q1K5O7k71J96P2l15Q6j33K53l03K25J54j8K1k89
5286a83Q0J18o1R0k23K53j27J71j28Q2k85K55j56R0k91K62K7P8k2L1l93K54j4
$$ y = [35, -65, 120, 86, -74, 66, -89, 173, -138, 227, -9, 188, 158, -105, -63, 48, -146, 146, -104, -34, -10, -16, -143, 118, -127, -152, 308, 19, -111, -264, 53, 23, 51, -70, 132, 57, 124, 182, -75, -59, 8, -39, -172, 8, -31, -53, 243, -313, -309, 38, -280, 38, -299, -204, -160, 304, -54, 68, -190, 15, 5, -145, 251, -79, -178, -126, 74, 228, 83, -276, -89, -146, 234, -113, -256, -49, 57, -155, -49, -249, -258, 132, -15, -40, 74, 132, -242, -108, 277, -255, -123, -182, 14, 50, 110, 68, 309, -115, -125, -92, -195, -8, -73, 102, -55, 171, 50, 250, 442, 209, 95, -224, 318, 80, 97, 95, 75, 125, -20, -60, 23, -68, 37, 193, -333, 150, -128, 24, -104, -7, -42, 16, 142, 199, 25, -237, 273, 237, -25, -88, 34, 17, -9, 106, 0, -78, -34, 47, 72, 139, -132, 64, 136, -179, -93, -226, 27, -276, -51, 103, 85, 106, -183, -103, 15, -46, 44, -179, 74, -53, 118, -10, 72, -213, 42, -114, -24, -315, -53, -26, 52, 30, 61, -332, -78, -92]
5309i2n1J03n7K84k35J8J25j64m19N14r6j04K45k43P2K57l08J50r9j16J10N0r9
5332a55K06K9k75J60l5N9J80k60j22N3R7j12p4L98r3K62n0K9m78K27k14J54J98
5355A84l21J11j96K95L07l11N7j62R7L7K5q9J32O7j68J85m05R7K71m21J25K81
5377A98k97K36n5j86K41n8l18L3L44l64L40k17R0q2L02k08O6P3j88n2k7K61M3
5400A75jk7r8r8K11m2M9k72K49k09r0J67O7l99J57n9M52m02K63j4k04j22L94j53
5424fN8j00On6J54L85o06K03j31J61j45K00P4m24J55j08N5L4L57l66l05O48m38
5447a95O4n5j07K10J26j53L72k77K33l26K3P4j94K83j81J91o2o7K51k74K37J38
5469C11n17L64j46R8m44R2J25N26n85Q0K0K3M6K3J60o4k49L9L06J31l99o1k5p2
$$ y = [-92, -143, -40, -97, 187, -48, -30, 95, -69, -488, 26, -70, -174, 71, -172, -100, 157, -151, -1, -100, -216, -106, -56, -155, 51, 80, -195, -35, -70, -11, 169, -91, -213, -160, -63, -175, -249, 149, 56, 318, 268, 297, -181, 46, -168, -14, 184, -137, -26, -222, 73, 380, 69, 126, -36, 61, 98, 123, 34, 166, 233, 65, 250, -155, -58, 213, -208, -83, 198, -99, 137, 82, -104, 137, 79, -239, -206, 138, -226, 114, -103, -13, -95, 207, -1, 65, 138, -50, -102, -129, 132, 175, 174, 147, 49, -49, 162, 120, 169, -103, 146, -63, -153, 14, 81, -318, -161, -220, 232, -170, 93, 79, -125, -247, 147, -6, 52, -48, -42, -98, 56, 441, -165, 38, -93, 68, -77, 123, 197, -227, -72, -180, -125, -91, 266, -100, -405, 243, -195, -131, -186, -293, -83, 43, -110, 262, -15, 218, -108, -85, -11, -205, 78, -103, 88, 26, -41, 210, -64, 173, 311, -206, 158, 12, 110, -334, -242, -117, 409, -176, -96, -76, -53, -7, 16, 176, 112, -137, -98, 208, 339, -60, -121, -146, -218]
5493b18N80n74J85qO8j0j03J56j39p5L56R5l99K73j22J67j68p4J34j23l56M96
5515A41K10j66j42K13K39n58J85J67k11j58J79k04J60Q4k00K39k62L41n6j42p
5536E2k46K35k30J91k06K69NK16n18J46K3l6N94o77J50k1j16K07n3j27L35n45
5558c52M95N1k34k07J00K47j77K34k75j34J24LL9J98k9k42P3k0R2j61M7J42o0
5581d6P3M8k29K83k16J59k4q4j82K8J92P1j19p1M8p8K0J77k32K35J88j17l3j6
5605G5R2k76J37P8om9k61Q5p0K39m2j01J23q5on9M44l02j8j26J69KJ72j62j85
5630a32j59L91k01J61K26j21r8j43P2O9N3J5n5O0j16K09m58K69J23r3j30k6J95
5653A11R2k48o5O4M36l42J8Q5j33J41m7p9p0K82k42M8j14j4P1M4j58k4K32m07
$$ y = [-218, 362, -212, -27, -35, 33, 23, -80, 76, -63, -138, 218, 313, -86, 187, 65, 232, 64, -10, 124, 1, -355, 141, 351, 185, 43, 256, 495, -63, 122, 289, 78, -80, 99, -105, 55, 139, -61, 178, -84, 257, 201, 59, 52, -194, 41, -189, 2, -204, 65, 70, 286, -232, -86, -63, -99, 495, -182, -32, -53, -169, 38, -15, -142, 193, -352, 143, 194, -40, -247, -147, 100, -77, 157, -118, -252, -128, -125, -86, 112, 83, -159, -86, -106, -14, -175, -128, 14, -46, 27, 75, -154, 129, -87, 72, 48, -36, -218, -190, 2, 73, -46, -117, -69, -147, -127, 50, -182, 53, 241, 124, 91, 75, 167, -109, 28, 106, 100, 51, -210, -125, -195, 44, 2, -99, 24, -61, -67, -126, 318, 16, -2, -128, 41, 43, 215, 53, -132, -291, 100, -101, 60, 286, 165, 67, -76, -4, 65, 118, 133, 78, 138, 22, 231, -227, 42, 165, 72, -58, -84, 111, 203, -45, -110, -46, 390, 48, 66, 151, 18, 159, 112, 33, -37, 245, 3, 51, -63, -77, -6, 38, -120, -144, 88, -319]
5677c19L01J98k19k24Q8Q0J53l49lJ22j28M76j91j56J39n3K21k52o5K3k26O03
5699B19l66J13J02j06J5n8Q7j49J98J27j12j25Q1p1K52k98R4jk46L14l71N02O
5722B07j42J56n16J50j0J40K19n2k88M7J16q7k45L98J25j25l1L9n9J58j23k18
5744a41L29j07j86J29J0J00rj93J41Q4k65K13k01q2M38l20J90j24J41q3J05l5
5766A34k23K59m40N47k72J64r7J67j94M6j38r5K7J08m3J33M1k0n2n8n5m0K09M5
5790A53j22J7J08j16j71K67l10k26P08o84K40K20j30M9l04K86M0R4l30J97J24
5811A10j46j85K83k02q4L12k12L70l73K31j0k69L87k38O1J56k14J07k2p6o9l6
5833a19N3L39l47l33K92j8K91L5M2n82L57j27q0J30k3j75N88m27J55j70J67Lo6
$$ y = [-319, -18, 180, -39, -263, -175, -95, 58, -291, -294, -172, -300, 176, -15, -171, -32, -85, 136, -116, -181, -158, -384, 219, -147, -34, 68, -38, -23, -81, 6, -143, 55, 182, 70, -55, 26, -45, 207, -91, 3, 2, -244, 70, -301, 201, 207, 65, 221, -295, -145, -155, -15, 204, 152, -136, -89, 27, -60, -305, 93, 218, 93, 62, 101, 42, 200, 77, -141, 188, 81, -105, 24, 34, 134, 125, -68, 73, 157, -108, 105, -96, -178, 260, -60, 130, 6, 147, 64, 169, 134, -89, 170, -270, 277, 5, 169, 72, 239, 45, 91, -47, -142, -115, -7, -50, 83, 124, 104, 52, -6, -61, -101, 108, 153, 31, 48, 156, 40, -131, 136, -174, -400, 308, -376, -136, 84, -46, 3, -301, -15, 25, 119, -211, -14, 110, -36, -221, 62, -140, -224, 88, -124, 246, -127, 104, 94, -175, 212, -26, 35, 191, -23, 84, 62, -14, -83, -119, -66, 273, -74, -407, -115, -133, 158, 193, 235, -347, 10, -117, -197, -67, -90, -265, 323, -104, 51, -119, 48, 51, -15]
5856a5P6m38N07p9J6j92J77m1P8j44k13J17J70k26J10N2K49k94J51J25k03J20
5878A03o4J19m49J97j18K37J5k49J87J0N1J08R2l72P9L05j06j06k01O0K18P9j86
5901Ij0K10k5j23J49k21P5J23L6l51K08N7k98J1L02j92l09L23o3N2O9K51k65N8
5925G6K0Q5k57J36k07K21p7l9J3k8M2kQ2j16OO8l9J41l05O5J64k00M14m17K32
5950G8j08M6l10N8M58j95k39K29P4k10j49K70o9K9QK74l73M4P2l0j04j94J86J91
5974C6j1j20j85L64n2k47NL47j51R7m3J11m37K78rj8K1j69PK22J36j81J78p0j89
5999h0J17r3R2J9J28k36Q6n4L2m2j29J46Q2M1L7j90L34l77K2j5k81M50k80J24
$$ y = [-15, 61, -377, 130, 51, 67, -125, 52, 11, 89, -55, -268, -151, 19, -207, -97, -45, 204, -90, 61, 186, -17, 103, 39, 158, -291, -94, -212, 25, 40, -209, -22, -12, 39, 147, 239, -133, -54, 251, 145, 39, -162, -102, 116, 195, 9, -1, 209, 184, 61, 210, -11, 64, 187, 223, -128, 80, 137, -161, -150, 152, -40, -349, -26, -89, -37, 32, 283, 18, 76, 96, 181, -76, 60, -147, 74, -3, -42, -29, -57, -15, -17, 65, -51, -45, 23, -16, 125, -180, -115, 49, -151, 263, -154, 78, -30, 16, -294, -236, 222, 27, -212, 17, 91, -119, -268, 2, -67, -38, -30, 244, -129, -85, -13, -43, -147, -341, -155, 36, 25, -95, -280, 84, 32, -215, -210, 137, -14, 83, 40, 151, -286, -8, -17, -35, -14, -183, -176, 46, 182, 1, 179, 109, -80, 37, -56, 36, 55, 183, -53, 33, -21, 11, -31, -160, -14, 68, 109, 146, -44, 290, -87, -65, -80, -361, 89, -191, -67]
$$ [...]
8191H4
##END NTUPLES=NMR FID
##END=
