##TITLE=1H_LR-698-R2-CHCl3-1M
 CDcl3, 8 sc, 
 30.1.2020
##JCAMPDX= 6.0         $$ Bruker NMR JCAMP-DX V2.0
##DATA TYPE= NMR FID
##DATA CLASS= NTUPLES
##ORIGIN= UXNMR, Bruker Analytische Messtechnik GmbH
##OWNER= root
$$ XWIN-NMR		Version 3.5
$$ Thu Jan 30 15:53:33 2020 Russian Standard Time (UT+4h)  she@DPX200
##.OBSERVE FREQUENCY= 200.1315
##.OBSERVE NUCLEUS= ^1H
##.DELAY= (6, 6)
##.ACQUISITION MODE= SIMULTANEOUS
##.ACQUISITION SCHEME= undefined
##.AVERAGES= 8
##.DIGITISER RES= 18
##SPECTROMETER/DATA SYSTEM= spect
##.PULSE SEQUENCE= zg30
##.SOLVENT NAME= CDCl3
##.SHIFT REFERENCE= (INTERNAL, CDCl3, 0, 15.7039)
##AUDIT TRAIL= $$ (NUMBER, WHEN, WHO, WHERE, WHAT)
$$ ##TITLE= Audit trail, XWIN-NMR		Version 3.5
$$ ##JCAMPDX= 5.01
$$ ##ORIGIN= Bruker BioSpin GmbH
$$ ##OWNER= she
$$ F:/spectra/data/she/nmr/H-F/1/audita.txt
$$ ##AUDIT TRAIL=  $$ (NUMBER, WHEN, WHO, WHERE, WHAT)
(   1,<2020-01-30 15:52:19.48 +0400>,<she>,<DPX200>,
      <created by zg, POWCHK disabled, PULCHK disabled
       configuration hash MD5:
       00 E9 B6 7A A2 85 ED C7 34 08 36 98 17 FE 4E 26
       data hash MD5: 16K
       51 CA 33 6E 8B 7A 4D 97 61 C5 32 B7 C0 58 84 29>)
$$ ##END=
$$ 
$$ hash MD5
$$ 8F 3F D3 CE 63 16 3D FE FA 98 C7 AE 48 34 78 22
##$RELAX= 
##$RELAX= 
##$RELAX= 
##$RELAX= 
##$RELAX= 
##$RELAX= 
$$ Bruker specific parameters
$$ --------------------------
##$DU= <F:/spectra>
##$EXPNO= 1
##$NAME= <H-F>
##$PROCNO= 1
##$TYPE= <nmr>
##$USER= <she>
##$AMP= (0..31)
100 100 100 100 100 100 100 100 100 100 100 100 100 100 100 100 100 100 
100 100 100 100 100 100 100 100 100 100 100 100 100 100 
##$AQSEQ= 0
##$AQ_mod= 1
##$AUNM= <au_zg>
##$AUTOPOS= <>
##$BF1= 200.13
##$BF2= 200.13
##$BF3= 200.13
##$BF4= 200.13
##$BF5= 200.13
##$BF6= 200.13
##$BF7= 200.13
##$BF8= 200.13
##$BYTORDA= 1
##$CFDGTYP= 0
##$CFRGTYP= 5
##$CHEMSTR= <none>
##$CNST= (0..31)
1 1 145 1 1 1 1 1 1 1 1 1 1 1 1 1 1 1 1 1 1 1 1 1 1 1 1 1 1 1 1 1 
##$CPDPRG= <>
##$CPDPRG1= <>
##$CPDPRG2= <>
##$CPDPRG3= <>
##$CPDPRG4= <mlev>
##$CPDPRG5= <mlev>
##$CPDPRG6= <mlev>
##$CPDPRG7= <mlev>
##$CPDPRG8= <mlev>
##$CPDPRGB= <>
##$CPDPRGT= <>
##$D= (0..31)
0 1.2 0 0 0 0 0 0 0 0.06 0 0.03 0 0 0 0 0.0002 0 0 0 0 0 0 0 0 0 0 0 0 
0 0 0 
##$DATE= 1580385138
##$DBL= (0..7)
120 120 120 120 120 120 120 120 
##$DBP= (0..7)
150 150 150 150 150 150 150 150 
##$DBP07= 0
##$DBPNAM0= <>
##$DBPNAM1= <>
##$DBPNAM2= <>
##$DBPNAM3= <>
##$DBPNAM4= <>
##$DBPNAM5= <>
##$DBPNAM6= <>
##$DBPNAM7= <>
##$DBPOAL= (0..7)
0.5 0.5 0.5 0.5 0.5 0.5 0.5 0.5 
##$DBPOFFS= (0..7)
0 0 0 0 0 0 0 0 
##$DE= 6
##$DECBNUC= <off>
##$DECIM= 24
##$DECNUC= <off>
##$DECSTAT= 4
##$DIGMOD= 1
##$DIGTYP= 9
##$DL= (0..7)
0 120 120 120 120 120 120 120 
##$DP= (0..7)
150 150 150 150 150 150 150 150 
##$DP07= 0
##$DPNAME0= <>
##$DPNAME1= <>
##$DPNAME2= <>
##$DPNAME3= <>
##$DPNAME4= <>
##$DPNAME5= <>
##$DPNAME6= <>
##$DPNAME7= <>
##$DPOAL= (0..7)
0.5 0.5 0.5 0.5 0.5 0.5 0.5 0.5 
##$DPOFFS= (0..7)
0 0 0 0 0 0 0 0 
##$DQDMODE= 0
##$DR= 18
##$DS= 0
##$DSLIST= <SSSSSSSSSSSSSSS>
$$ [...]
##$SUBNAM2= <"">
##$SUBNAM3= <"">
##$SUBNAM4= <"">
##$SUBNAM5= <"">
##$SUBNAM6= <"">
##$SUBNAM7= <"">
##$SUBNAM8= <"">
##$SUBNAM9= <"">
##$SW= 24.9337058887773
##$SWIBOX= (0..15)
0 0 2 0 0 0 0 0 0 0 0 0 0 0 0 0 
##$SW_h= 4990.01996007984
##$TD= 16384
##$TD0= 1
##$TE= 0
##$TE2= 300
##$TE3= 300
##$TEG= 300
##$TL= (0..7)
0 120 120 120 120 120 120 120 
##$TP= (0..7)
150 150 150 150 150 150 150 150 
##$TP07= 0
##$TPNAME0= <>
##$TPNAME1= <>
##$TPNAME2= <>
##$TPNAME3= <>
##$TPNAME4= <>
##$TPNAME5= <>
##$TPNAME6= <>
##$TPNAME7= <>
##$TPOAL= (0..7)
0.5 0.5 0.5 0.5 0.5 0.5 0.5 0.5 
##$TPOFFS= (0..7)
0 0 0 0 0 0 0 0 
##$TUNHIN= 0
##$TUNHOUT= 0
##$TUNXOUT= 0
##$USERA1= <user>
##$USERA2= <user>
##$USERA3= <user>
##$USERA4= <user>
##$USERA5= <user>
##$V9= 5
##$VALIST= <valist>
##$VCLIST= <CCCCCCCCCCCCCCC>
##$VD= 0
##$VDLIST= <DDDDDDDDDDDDDDD>
##$VPLIST= <PPPPPPPPPPPPPPP>
##$VTLIST= <TTTTTTTTTTTTTTT>
##$WBST= 1024
##$WBSW= 4
##$XGAIN= (0..3)
0 0 0 0 
##$XL= 0
##$YL= 0
##$YMAX_a= 356960
##$YMIN_a= -148956
##$ZGOPTNS= <>
##$ZL1= 120
##$ZL2= 120
##$ZL3= 120
##$ZL4= 120
##$ABSF1= 10
##$ABSF2= 0
##$ABSG= 5
##$ABSL= 3
##$ALPHA= 0
##$AQORDER= 0
##$ASSFAC= 0
##$ASSFACI= 0
##$ASSFACX= 0
##$ASSWID= 0
##$AUNMP= <proc_1d>
##$AZFE= 0.1
##$AZFW= 0.1
##$BCFW= 1
##$BC_mod= 2
##$BYTORDP= 1
##$COROFFS= 0
##$CY= 11.3945322036743
##$DATMOD= 1
##$DC= 2
##$DFILT= <>
##$DTYPP= 0
##$F1P= 16.9975609425685
##$F2P= -3.02152046262296
##$FCOR= 0.5
##$FTSIZE= 0
##$FT_mod= 4
##$GAMMA= 1
##$GB= 0.15
##$INTBC= 1
##$INTSCL= 1
##$ISEN= 128
##$LB= 0.24
##$LEV0= 0
##$LPBIN= 0
##$MAXI= 10000
##$MC2= 0
##$MEAN= 0
##$ME_mod= 0
##$MI= 1.114404
##$NCOEF= 0
##$NC_proc= 0
##$NLEV= 6
##$NOISF1= 3.799351
##$NOISF2= 2.8
##$NSP= 1
##$NTH_PI= 0
##$NZP= 0
##$OFFSET= 15.70392
##$PC= 1
##$PHC0= -9786.903
##$PHC1= 13.00081
##$PH_mod= 1
##$PKNL= yes
##$PPARMOD= 0
##$PSCAL= 0
##$PSIGN= 0
##$REVERSE= no
##$SF= 200.130013532006
##$SI= 16384
##$SIGF1= 3
##$SIGF2= 2
##$SINO= 400
##$SIOLD= 16384
##$SREGLST= <1H.CDCl3>
##$SSB= 0
##$STSI= 0
##$STSR= 0
##$SW_p= 3612.71676300578
##$SYMM= 0
##$S_DEV= 0
##$TDeff= 0
##$TDoff= 0
##$TI= <>
##$TILT= no
##$TM1= 0
##$TM2= 0
##$TOPLEV= 0
##$USERP1= <user>
##$USERP2= <user>
##$USERP3= <user>
##$USERP4= <user>
##$USERP5= <user>
##$WDW= 1
##$XDIM= 8192
##$YMAX_p= 0
##$YMIN_p= 0
$$ End of Bruker specific parameters
$$ ---------------------------------
##NTUPLES= NMR FID
##VAR_NAME=  TIME,          FID/REAL,        FID/IMAG
##SYMBOL=    X,             R,               I
##VAR_TYPE=  INDEPENDENT,   DEPENDENT,       DEPENDENT
##VAR_FORM=  AFFN,          ASDF,            ASDF
##VAR_DIM=   8192,          8192,            8192
##UNITS=     SECONDS,       ARBITRARY UNITS, ARBITRARY UNITS
##FACTOR=    0.0002004,     1,               1
##FIRST=     0,             0,               0
##LAST=      1.6414764,     0,               0
##MIN=       0,             -148956,         0
##MAX=       1.6414764,     356960,          0
$$ Real data points
##PAGE= N=1
##DATA TABLE= (X++(R..R)), XYDATA
0 0 0 0 0 0 0 0 0 8 -8 8 -8 16 -16 24 -24 32 -39 42 -53 62 -72 85 -97 112 -128 149 -168 191 -216 246 -277
31 -277 311 -349 392 -436 487 -542 602 -668 742 -820 908 -1005 1114 -1234 1368 -1519 1691
48 1691 -1888 2117 -2385 2705 -3096 3588 -4220 5077 -6309 8241 -11736 20104 -84453 -24941
62 -24941 61919 -124653 -133406 -26944 -13795 -89981 -13989 70233 -14325 -148956 -108702 -12378
74 -12378 13195 39408 114275 79957 -51443 -83284 22359 77089 50516 52506 75298 35310
86 35310 12377 86401 149410 89758 8310 13955 64077 103517 154953 183073 124151 39002
98 39002 35683 81835 99941 120243 166919 158439 80493 57151 129267 175655 139123 99640 94484
111 94484 80341 82569 149314 204902 159210 77861 62943 84630 88668 114715 171601 169106 90443
124 90443 49194 88872 118569 97445 88287 100567 77424 42636 73134 136510 131218 64660
136 64660 26317 34467 41889 50574 83565 102795 63778 7899 1367 33023 49083 42035 35141
149 35141 26440 6023 -4112 18160 46807 35942 -10702 -43544 -36152 -9496 11664 24159
161 24159 21029 -11702 -55119 -63115 -29459 -2268 -8609 -26097 -36174 -48564 -57237 -40711 -13954
174 -13954 -20256 -57790 -78766 -65494 -43604 -30797 -24617 -34336 -66966 -94865 -86248 -52553 -30942
187 -30942 -35089 -52195 -70481 -79310 -69424 -48618 -38808 -50847 -72836 -84092 -73860 -48679 -29130
200 -29130 -33076 -56939 -80591 -86829 -70031 -37650 -15171 -26299 -59438 -78245 -69825 -50213 -32636
213 -32636 -21943 -30345 -58134 -72191 -48764 -15365 -9392 -26292 -42265 -54782 -60505 -39513 -741
226 -741 11984 -16371 -46527 -47535 -32693 -16702 1449 10180 -9291 -38256 -37204 -7256 14173
239 14173 11301 -1802 -16089 -27038 -18763 11852 36988 28787 -242 -19291 -15910 2925 25612
252 25612 38312 29389 5248 -9922 62 25918 43908 39501 19111 1617 2327 20146 42364
265 42364 53405 42244 15388 -2036 8312 36822 55946 53557 36649 17475 8668 20555
277 20555 45936 59217 46478 23180 12886 20242 37719 54533 57822 39582 14195 7716 25839
290 25839 48909 57767 48845 29038 10474 9538 29360 51003 53362 35398 15216 8437 18749
303 18749 37238 48464 40802 19275 1613 2634 21139 40922 44251 27432 4855 -5812 2373
316 2373 21134 35546 32087 11330 -9112 -10836 5467 22301 25679 14088 -5530 -19181 -13654
329 -13654 7344 23091 16690 -4501 -22362 -25914 -14175 5056 15454 4437 -19176 -33445
341 -33445 -27494 -9860 3874 3453 -12779 -33709 -40004 -25987 -5349 2130 -8911 -29510 -44643
354 -44643 -41929 -22584 -3271 -2812 -20922 -41754 -48621 -37753 -17384 -4570 -12124 -34051 -49714
367 -49714 -45966 -27556 -9787 -6840 -21966 -43556 -52097 -39282 -16624 -4001 -10857 -30779 -47647
380 -47647 -46819 -28060 -6521 -1590 -16395 -36750 -44892 -34592 -13439 1345 -3069 -23202 -40098
393 -40098 -37939 -18826 1455 7667 -5225 -26768 -37308 -26289 -2944 12204 8457 -9934 -26769
406 -26769 -27529 -9961 12100 19864 6553 -14324 -23644 -13479 8020 24178 21653 2757 -15712
419 -15712 -16705 1604 23970 31846 19738 -1278 -12502 -3886 17741 34634 32912 14064 -4653
432 -4653 -6194 11421 32745 40264 28306 7258 -4707 2956 25107 42673 40212 20668 1489
445 1489 -996 14775 35462 44321 33337 11535 -1635 5946 27005 42414 39661 21800 2921
458 2921 -1002 13616 34803 43322 31170 9657 -2950 3260 21943 37784 36803 18833 -412
471 -412 -4883 8586 27795 35469 25285 4781 -7874 -3113 15001 30198 28657 11612 -7068
484 -7068 -12278 183 19136 27002 16986 -2251 -15069 -12044 4318 19560 19523 3344 -15384
497 -15384 -20055 -8137 8266 16074 8308 -9725 -24072 -21674 -4225 10873 10100 -5014 -21538
510 -21538 -27231 -18607 -1537 9022 1846 -17548 -30878 -26787 -11646 1207 2275 -9212 -25826
523 -25826 -33812 -24449 -5932 3569 -4215 -20410 -31763 -30239 -18136 -3369 660 -10908 -27844
536 -27844 -34573 -25113 -9332 -656 -5425 -19051 -30422 -30251 -18228 -2857 1030 -9686 -25079
549 -25079 -30685 -22252 -9164 82 -1404 -13793 -27156 -28496 -14740 323 3108 -6220 -17725
562 -17725 -23425 -19294 -5938 6442 5347 -8826 -20538 -19067 -7538 3813 8862 3953 -8445
575 -8445 -17663 -12633 2906 13805 10973 415 -8597 -10259 -2369 10819 18470 12361 -942 -7870
589 -7870 -2651 9466 18910 19224 10567 -198 -3367 4631 17899 24802 19300 7073 189 3871
603 3871 13683 22570 25067 18279 6605 1285 9202 22916 27615 21516 13292 7674 6275 13234 25220
618 25220 30036 20421 7753 5930 12861 19648 24429 26059 18726 5759 2756 14744 25756 24721
632 24721 17081 11623 6924 5227 12965 24740 24556 11588 1499 3617 9852 14484 18423 18101 8461
647 8461 -3480 -2701 9526 17371 13997 6170 -397 -4791 -3652 5677 14724 10824 -2502 -11244 -8376
662 -8376 -315 5317 6885 2063 -8370 -16865 -13247 -589 6398 1116 -9812 -17098 -17777 -12852 -3882
677 -3882 2191 -3737 -18117 -26146 -19817 -8158 -2909 -6004 -13457 -22691 -27841 -21514 -7576 -1322
691 -1322 -10609 -24283 -28939 -23961 -15798 -8115 -5773 -14585 -28926 -32835 -21198 -7798 -5699 -13487
705 -13487 -21964 -27668 -27881 -18128 -4365 -2366 -16000 -29172 -28388 -17900 -8144 -4154 -5649 -15816
719 -15816 -27456 -26402 -9504 3447 -342 -12616 -19822 -20025 -15260 -4103 6538 3395 -12884
732 -12884 -22717 -14719 -597 5936 5198 228 -8884 -16254 -9635 8063 17238 7801 -6034 -9262
746 -9262 -4353 3583 13021 18050 10410 -4854 -9020 3986 18155 20526 13240 6300 571 -673
760 -673 9302 23825 26768 13324 695 2088 11438 19054 22864 22671 13384 2442 2468 16399 28790
775 28790 26506 15828 8485 6875 9818 18772 28347 26833 12738 2609 6733 17683 23794 23546
789 23546 19393 10954 3231 6281 19250 27278 20953 9197 4268 6275 10548 17256 22464 17982
803 17982 4852 -2895 3583 15414 19004 14270 7953 1156 -3275 1410 13669 18560 9223 -3589
817 -3589 -6418 -1020 4586 9084 11150 4675 -7947 -12799 -3426 8054 8728 1290 -5577 -10442 -12397
832 -12397 -5623 5812 7927 -3780 -15836 -15789 -7968 -1383 1398 -122 -8523 -18840 -19100 -7400
846 -7400 2647 319 -9103 -16202 -18382 -15317 -7206 889 -1124 -13455 -22945 -19493 -9067 -2368
860 -2368 -2630 -7657 -15906 -22357 -18880 -6166 2104 -3376 -15366 -20838 -18135 -11399 -3813 547 -4808
875 -4808 -17175 -23447 -15794 -3005 1366 -3625 -10630 -16892 -18501 -11186 794 5035 -4098 -15795
889 -15795 -18226 -10742 -2380 2934 2579 -5305 -15491 -16594 -5597 5946 6268 -1998 -9755 -12347 -8931
904 -8931 -133 8495 7721 -3166 -12717 -10314 -277 7605 8537 3797 -4045 -9922 -6646 5104 13152
919 13152 9325 -737 -6655 -5002 1139 8813 13110 8469 -2008 -7350 -1251 8885 13316 10816
933 10816 4420 -1734 -3751 2439 12258 15907 9060 -41 -2786 1627 8493 13973 13482 7058 -1013
948 -1013 -2385 4934 13427 15127 9782 2923 -510 1435 7769 14348 14553 7045 -581 -1142 5224 11598
964 11598 13614 10530 4351 -851 -491 6999 13760 13192 5608 -255 -648 2944 8359 12254 10891 2982
980 2982 -3189 -1428 5838 10400 9624 5320 201 -3463 -1240 6406 11291 7716 151 -3722 -2692
995 -2692 1444 6208 8712 4660 -2923 -6657 -2805 3626 6505 4866 -58 -5376 -6967 -2796 3964
1010 3964 5881 1587 -4898 -8052 -6063 -832 3581 3241 -2055 -8021 -9263 -5117 775 3115 -173
1025 -173 -6079 -9883 -8589 -3749 1216 1711 -3111 -9369 -11172 -7271 -1476 1461 -1064 -6415 -11008
1040 -11008 -10601 -5225 374 1238 -3976 -9751 -11733 -8350 -2812 1228 -226 -6246 -11316 -11026 -5301
1055 -5301 113 1201 -2628 -8148 -11476 -8642 -2220 2362 1007 -4847 -9928 -9730 -4904 1106 3207
1070 3207 -82 -6179 -9708 -7142 -813 3933 3212 -1998 -7340 -7844 -3509 2670 5775 2441 -3527
1085 -3527 -6983 -5006 928 6031 5768 1216 -4396 -5873 -1539 5142 8114 5264 -657 -4738 -3344
1100 -3344 2634 8142 8623 3571 -2433 -3828 247 6409 9911 7851 1393 -3440 -1778 3652 9162
1115 9162 9444 5125 -512 -3057 721 7313 11246 8271 2490 -2200 -1682 3393 9632 10639 5906
1130 5906 -812 -3015 177 6682 10426 8813 2462 -2887 -2740 2958 8501 9789 5604 -916 -3870
1145 -3870 -1260 5112 9499 8156 1691 -3898 -4411 977 7039 8994 4369 -2502 -5781 -2909 3159
1160 3159 7699 6639 556 -5608 -6361 -1077 5214 6956 3012 -3621 -7364 -5338 1005 6122 5072
1175 5072 -1122 -7181 -7726 -3027 3031 5423 1797 -4673 -9063 -7147 -597 4693 3761 -2033 -7936
1190 -7936 -9338 -4624 1758 4775 1279 -5524 -9783 -7662 -1461 3833 3308 -2167 -8104 -9627 -5181
1205 -5181 1624 4850 1252 -5322 -9679 -7507 -1581 3581 3858 -1080 -7518 -9355 -4865 2272 4941
1220 4941 1835 -4505 -8356 -7050 -1334 4354 5182 -136 -6936 -8278 -3480 2786 5513 3593 -2354
1235 -2354 -7237 -6414 -12 5899 5932 685 -4746 -6126 -2790 3189 6891 5219 -1264 -6266 -4744 1476
1251 1476 6440 6641 2535 -2620 -5360 -2480 4192 8295 5589 -713 -4491 -3341 1334 6263 7435
1266 7435 3788 -2554 -5111 -1383 5099 7830 5372 579 -3479 -3395 714 6395 7981 3339 -2769
1281 -2769 -4538 -1236 3690 6560 5584 1029 -3785 -4541 378 6242 6511 2415 -2346 -4264 -2642 1611
1297 1611 5734 5461 39 -4973 -4777 -31 3951 4503 2075 -1847 -5317 -4660 917 5042 3637 -1384
1313 -1384 -5002 -4457 -2156 1396 4044 2281 -3102 -7034 -5013 593 3174 1916 -867 -4188 -6165
1328 -6165 -4442 810 4365 1555 -4367 -6412 -4417 -1524 1012 2601 257 -4954 -7839 -4163 1517
1343 1517 3098 552 -2763 -5166 -5766 -3338 1956 4180 46 -5521 -6359 -3022 313 2342 2156 -571
1359 -571 -5479 -6614 -1779 3878 4034 123 -3485 -4290 -3071 45 4401 4900 -48 -5369 -4806 417
1375 417 4067 3984 2425 -778 -4302 -4004 1929 7048 5324 -534 -3339 -2026 248 3214 6145 5533
1391 5533 -570 -4826 -1924 4380 6528 4317 2072 -184 -2681 -908 5080 8679 4688 -1289 -2426
1406 -2426 729 3210 5270 6323 3905 -1347 -3494 1073 6589 6890 3343 314 -867 -954 1682 6093
1422 6093 7234 2621 -2660 -2547 1662 4825 5158 4014 1368 -2104 -2934 1514 6682 5786 466 -2322
1438 -2322 -1579 -92 1999 4395 4826 189 -4577 -3260 2097 4063 2183 614 -701 -3119 -3577 818
1454 818 5158 2614 -2904 -3927 -1801 -644 -65 2312 2035 -2384 -6140 -3403 1606 2386 -414 -1566
1470 -1566 -2612 -4225 -4046 145 3194 233 -4602 -5271 -2703 -1350 -678 607 159 -4003 -6718 -3862
1486 -3862 822 1285 -1182 -2892 -3606 -4770 -3877 -9 2385 -479 -5334 -5920 -2792 -730 -104 400
1502 400 -743 -4521 -6623 -3077 1826 2270 -1401 -3944 -4220 -3610 -1982 1451 3295 -763 -6093 -5687
1518 -5687 -995 1746 1766 711 -1381 -4415 -5308 -419 4645 3819 -1553 -4485 -3511 -1503 1131 3821
1534 3821 3901 -1036 -5816 -4130 1926 5059 3256 690 -1944 -3680 -2386 2737 6785 4210 -2077
1549 -2077 -4319 -1744 2023 4163 4835 2797 -2040 -4866 -1087 5406 6958 3219 -987 -2249 -1706
1564 -1706 1036 5400 7126 2724 -3427 -3864 889 5200 5587 3725 853 -2610 -3137 1638 7171 6763
1580 6763 973 -3002 -2107 299 3383 6038 5426 530 -4727 -2991 3300 6441 4300 1286 -1325
1595 -1325 -2980 -1496 3324 6920 4278 -2027 -4161 -1426 1944 3807 4508 2243 -2642 -5175 -1165
1610 -1165 4103 5029 1794 -1451 -3422 -3287 -353 4030 4728 380 -4127 -4657 -1379 1951 3361 1953
1626 1953 -1583 -4670 -4144 -399 3257 3307 -401 -4064 -4594 -2293 741 2524 1765 -1738 -5132 -4888
1642 -4888 -684 2519 1862 -1171 -3576 -4375 -3676 -488 2894 1805 -2918 -5564 -3841 -897 699 1395
1658 1395 504 -3099 -5849 -3867 962 2591 320 -2207 -3470 -3983 -2614 1189 3033 431 -3716
1673 -3716 -4693 -2257 266 1701 1750 -388 -3771 -4391 -1108 2074 2826 754 -2122 -3314 -2573 376
1689 376 3093 2931 -116 -3168 -3069 -589 2308 3431 1691 -881 -2675 -1903 796 3475 3589 1162
1705 1162 -1914 -2347 6 2681 3731 2684 385 -2198 -1815 1738 4240 3775 1437 -594 -1393 -371
1721 -371 2588 4926 3841 302 -1791 -465 1856 3639 4098 2746 -181 -1961 -37 3282 4464
1736 4464 3210 913 -753 -909 952 3898 4613 2256 -757 -1424 40 2335 3966 3431 809 -1503
1752 -1503 -1567 786 3418 3667 1914 -669 -2277 -794 1614 3362 2770 398 -1823 -2199 -249 2232
1768 2232 3037 1227 -1143 -2523 -1827 446 2245 2126 -100 -2589 -2827 -1129 1085 1901 770 -1657
1784 -1657 -3240 -2948 -348 1508 1472 -810 -2853 -3351 -2274 81 1271 386 -1902 -3699 -3261 -1288
1800 -1288 641 727 -732 -3087 -4278 -2830 -509 832 37 -2101 -3810 -3824 -1839 263 976 -755
1816 -755 -3216 -4204 -3040 -839 664 283 -1702 -3765 -3813 -1931 478 903 -420 -2593 -3673 -3126 -690
1833 -690 1342 932 -1116 -3041 -3254 -1482 531 1937 723 -1764 -3104 -2268 36 1875 1571 137
1849 137 -2297 -2637 -913 1357 2533 1326 -665 -2094 -1904 358 2548 2853 1143 -1172 -1766 -389
1865 -389 1878 3159 2580 324 -1393 -957 1331 3257 3659 1995 -151 -1123 154 2880 3955 3473
1881 3473 1006 -484 -505 1432 3674 4454 2908 311 -714 465 2950 4239 3930 1753 -328 -573
1897 -573 1522 3808 4417 2866 496 -795 60 2695 4061 3663 1522 -736 -979 1077 3247 3961
1913 3961 2548 -233 -1292 -661 1438 3478 3256 896 -1443 -1936 -61 2158 2854 1687 -642 -2545
1929 -2545 -1790 673 2475 2005 -110 -2258 -2867 -1434 847 2245 678 -2127 -3574 -2748 -653 946
1945 946 677 -797 -3225 -4526 -2602 103 969 -562 -2949 -4099 -3887 -2036 -83 311 -1614 -4240
1961 -4240 -4987 -3107 -974 2 -990 -2641 -4795 -4758 -2753 -113 -16 -2466 -4364 -4723 -3413 -1648 -99
1978 -99 -410 -2879 -5055 -4582 -2356 -136 -126 -1650 -3425 -4429 -3620 -1054 974 -33 -2603 -4019 -3503
1995 -3503 -1725 208 927 -54 -2443 -3780 -2628 232 1984 967 -937 -2485 -2402 -1159 1324 2821
2011 2821 1440 -1427 -2608 -788 1358 2579 2500 1060 -936 -1584 328 3252 4176 2272 -12 -526
2027 -526 344 2159 3746 4435 2288 -495 -384 2070 4641 4357 3193 1980 532 397 3174 5588
2043 5588 5297 2285 540 980 2631 4132 5140 4783 2113 -158 997 4064 5767 4665 2687 1450
2059 1450 794 1769 4298 6242 4263 1097 -44 1616 3638 4168 4180 3126 436 -495 1273 4407
2075 4407 4953 2763 518 213 511 1724 3266 4010 1950 -951 -1319 1070 3032 2616 1411 167
2091 167 -1396 -1693 316 2762 2572 -512 -2311 -1513 -220 344 906 881 -902 -3258 -2568 -6 1298
2108 1298 -83 -1949 -2137 -2833 -2772 -1078 694 -441 -3233 -4208 -2448 -1217 -1399 -1387 -1414 -3071 -4669
2125 -4669 -3551 -1069 -366 -2517 -3663 -3502 -3343 -3287 -2219 -562 -2269 -4286 -4359 -2429 -1740 -2454 -2715
2142 -2715 -2219 -3452 -4392 -3477 -1224 -899 -2979 -3873 -3176 -2856 -3013 -2230 -932 -1554 -3796 -4254 -2222 -822
2160 -822 -1730 -2068 -1455 -2128 -3534 -2665 -168 90 -1865 -2755 -1946 -1172 -1640 -824 723 56 -2599 -2691 -366
2179 -366 661 -23 -433 -28 -821 -2008 -476 1862 2064 -26 -1338 -421 346 505 1688 2506 1117
2196 1117 -1169 -761 1753 2855 2152 1184 857 520 -18 1912 3931 3619 1069 -377 962 2445 2915
2213 2915 3086 3280 1754 21 734 3903 4999 3221 1230 1340 1644 1773 3472 4965 3713 659
2229 659 -69 2182 4080 3866 3084 2581 1245 357 1753 4589 4899 2310 408 891 1983 2673 3731
2246 3731 4079 2275 -302 -320 2759 4250 3147 1624 856 349 244 1800 3699 3151 350 -1317 200
2263 200 1758 2046 2012 1662 270 -1551 -899 1808 2942 1028 -976 -1141 -691 -382 567 1827 667
2280 667 -2104 -2842 -905 796 420 -323 -832 -1852 -2883 -1729 407 657 -1371 -3066 -2666 -1857 -1585
2297 -1585 -985 -463 -1650 -3594 -3840 -1859 -547 -1226 -2065 -2661 -3317 -3492 -2600 -717 -982 -2887 -4096
2314 -4096 -3256 -2429 -2028 -1911 -1645 -2628 -4278 -4067 -1982 -905 -1756 -2930 -3108 -3259 -3034 -2067 -826 -911
2332 -911 -3039 -4113 -3074 -1555 -1377 -1308 -1403 -2271 -3512 -3213 -886 176 -1009 -2362 -2445 -2169 -1734 -484
2350 -484 574 -328 -2131 -2606 -1200 250 684 154 -171 -1229 -1680 -576 1189 1918 436 -844 -769
2367 -769 109 916 1763 2161 1107 -651 -704 1073 2587 2717 1622 1027 341 347 1659 3312 3418 1624
2385 1624 244 791 2237 2878 3248 2908 1868 429 829 2969 3966 3550 1956 1397 1356 1794 3340 4017
2403 4017 3437 1615 816 1670 3156 3663 3456 2849 1319 916 1673 3737 3748 2889 1367 815 1254 2184
2421 2184 3241 3086 2007 412 176 1537 2776 2959 2057 913 200 290 1223 2471 2398 827 -521
2438 -521 -544 360 1387 1827 1252 -116 -1292 -984 208 1363 993 -162 -1261 -1450 -802 139 577 176
2456 176 -1513 -2276 -1885 -603 -124 -160 -1111 -2146 -2485 -2128 -944 -207 -992 -2271 -2990 -2583 -1983 -1025 -817
2475 -817 -1491 -2916 -3420 -2603 -1595 -1143 -1414 -2390 -3182 -3124 -2372 -1141 -984 -1956 -2910 -3251 -2808 -1655 -1222
2494 -1222 -1281 -2175 -3114 -2855 -2112 -1061 -983 -1649 -2207 -2800 -2450 -1391 -464 -707 -1582 -2401 -2155 -1453 -239
2513 -239 -203 -540 -1654 -1967 -1585 -468 206 -51 -537 -1290 -1315 -544 333 711 246 -329 -930 -726 371 1064
2533 1064 1170 487 -284 -486 151 989 1718 1262 285 -32 414 1044 1569 2068 1337 581 311 824 1686 2376
2553 2376 2090 1459 573 713 1428 2255 2261 1864 996 803 1191 2000 2687 2284 1576 856 1062 1497 2476 2382 1918
2574 1918 983 670 1006 1902 2192 2171 1482 613 634 1342 2036 2120 1603 989 245 419 1365 1897 1831 894 98
2595 98 89 510 1044 1597 1158 147 -407 -75 536 1119 999 41 -426 -679 -405 355 1077 363 -658 -1095
2615 -1095 -893 -291 81 422 -244 -1121 -1398 -1001 -203 51 -397 -830 -1734 -1684 -1188 -93 -37 -875 -1175 -2007
2635 -2007 -1042 -708 -91 -317 -1133 -1954 -2099 -1460 -505 -284 -869 -1636 -2115 -1933 -1156 -277 -493 -1326 -1962 -1932
2655 -1932 -1371 -635 -290 -719 -1329 -2106 -1911 -890 -106 -255 -1086 -1596 -1838 -1179 -635 95 -162 -1238 -1729
2674 -1729 -1290 -245 91 65 -267 -854 -1439 -825 286 798 300 -992 -1053 -466 -34 552 847 458 -549
2693 -549 -1017 -276 809 1165 687 12 -390 -450 188 1336 1492 698 -241 -458 211 1023 1491 1394 772 -425
2713 -425 -164 927 1930 1790 704 267 -11 214 1109 2209 1689 572 -290 254 1176 1864 1623 1242
2731 1242 472 -162 228 1309 2415 1624 459 -120 477 948 1409 2104 1385 121 -794 505 1723 1700
2749 1700 1030 463 195 -274 396 1661 1891 535 -427 -82 382 712 1157 1073 382 -659 -877 393 1443
2768 1443 984 128 -54 -150 -316 93 976 861 -439 -1183 -547 350 325 238 270 -303 -1242 -898 340 751
2788 751 -132 -918 -940 -538 -686 -338 295 -7 -891 -1704 -698 250 -240 -630 -491 -617 -1505 -1296 -208 240
2808 240 -864 -1383 -1220 -958 -937 -1049 -157 -362 -1429 -1769 -931 29 -523 -773 -711 -885 -1462 -1495 -171 -65
2828 -65 -812 -1506 -1251 -536 -1019 -622 -172 -330 -1406 -1604 -769 -9 -289 -1006 -782 -767 -1173 -1061 13 411
2848 411 -559 -1569 -991 -210 -284 -260 392 119 -1378 -1332 -148 792 276 -558 -525 -413 -547 -289 882 1132
2868 1132 -437 -1350 -426 470 779 386 567 313 -761 -684 767 1646 1019 -28 -404 432 354 791 1653
2887 1653 1363 -16 -982 318 1586 1264 756 741 720 22 475 1633 2072 930 -380 183 1099 1366
2905 1366 1393 1794 1252 -152 -400 1348 2317 1629 488 679 841 470 1107 1976 2000 632 -359 536 1571
2924 1571 1550 1035 1135 711 -189 -99 1602 2224 1056 -213 9 688 778 1019 1326 1062 -188 -699 457
2943 457 1515 1004 310 160 347 -189 -36 1035 1321 51 -868 -417 429 157 -46 153 192 -887 -1216
2962 -1216 -182 689 182 -882 -596 -336 -592 -802 95 148 -878 -1568 -729 82 -422 -844 -557 -496 -1245
2981 -1245 -1365 -695 -122 -807 -1364 -994 -536 -962 -1339 -459 -383 -1372 -1762 -1324 -385 -787 -1192 -941 -757 -1517
3001 -1517 -1525 -874 -306 -665 -1357 -1175 -733 -990 -1120 -570 -366 -1036 -1535 -967 -403 -483 -952 -681 -779 -1125 -1128 -447
3023 -447 286 -376 -811 -808 -542 -293 -543 239 212 -459 -1097 -646 321 466 -136 3 5 -273 -311 488 1014 259
3045 259 -460 -589 94 475 435 809 742 -84 -461 411 1418 1195 353 293 366 404 589 1242 1492 582 -231
3066 -231 222 967 1262 1088 1138 757 97 215 999 1804 1092 461 391 583 743 1131 1537 1167 531 147 547
3087 547 1401 1403 1038 779 330 224 403 1316 1480 1017 258 157 459 751 1112 891 466 -59 -304 227 1248
3108 1248 975 149 -74 -46 -70 349 724 599 -42 -465 -323 230 610 442 172 -390 -628 -439 -150 422
3128 422 242 -538 -738 -740 -422 -292 253 -139 -659 -1102 -801 -110 -52 -36 -754 -967 -1009 -946 -160 -70 -715 -1107
3150 -1107 -1262 -788 -581 -343 -413 -718 -1157 -1187 -694 -424 -293 -728 -1080 -1094 -1134 -764 -264 -178 -705 -1100 -1174 -913
3172 -913 -325 -308 -462 -753 -907 -1030 -620 -210 -132 -685 -1038 -996 -718 -337 -98 -75 -543 -1014 -770 -371 -4
3193 -4 -107 -321 -500 -703 -422 -29 388 219 -241 -556 -452 -77 375 572 344 -310 -262 -37 377 744 488
3214 488 132 -200 -46 234 754 784 476 109 114 236 524 1010 679 323 -1 147 404 949 963 888 533 451
3236 451 526 789 1162 968 708 473 122 753 824 820 813 605 228 450 736 1117 925 610 173 446 602 721
3258 721 996 899 548 38 216 758 963 659 686 301 296 574 862 1002 636 317 91 320 661 698 797 418
3280 418 52 105 157 599 574 403 42 -249 -224 118 500 318 52 -160 -426 -274 132 391 221 -236 -440
3301 -440 -467 -162 71 188 -138 -484 -761 -445 -173 70 -112 -595 -703 -702 -536 -270 -131 -359 -528 -660 -802
3322 -802 -399 -177 -104 -544 -677 -742 -643 -368 -347 -244 -745 -1038 -956 -606 -364 -566 -623 -765 -962 -658 -425 -244
3344 -244 -476 -865 -954 -599 -626 -459 -415 -426 -766 -1016 -614 -430 -270 -266 -583 -755 -733 -441 -90 37 -232 -757
3366 -757 -636 -552 -178 86 -138 -96 -551 -559 -183 77 247 -226 -256 -335 -336 -112 420 338 -37 -300 -320 223 228 172
3390 172 335 127 19 46 302 932 631 76 17 291 290 399 914 613 236 -179 260 644 779 526 588 406
3412 406 475 388 763 1013 847 480 260 683 830 725 980 651 349 164 559 1155 917 667 465 654 449
3433 449 502 812 1093 756 305 520 753 733 647 723 724 210 342 525 1078 696 327 85 454 362 256 698
3455 698 652 272 -183 226 561 434 186 187 495 130 -236 276 477 240 -226 -186 254 58 -178 -127 287 -289
3477 -289 -419 -324 11 -70 -246 -62 83 -311 -670 -467 135 -266 -720 -662 -21 -456 -596 -292 -179 -525 -864
3498 -864 -659 -375 -93 -651 -618 -323 -850 -1002 -504 -2 -299 -1039 -841 -620 -311 -922 -524 -141 -882 -1219
3518 -1219 -794 -221 -151 -720 -735 -597 -964 -884 -399 76 -489 -1123 -993 -318 -190 -386 -339 -304 -750 -1285 -522
3539 -522 231 -119 -790 -886 -373 -425 -267 99 275 -336 -787 -396 185 376 25 -57 -84 -339 -503 75 895
3560 895 406 -619 -394 1 256 206 352 497 -298 -551 267 1007 879 102 -117 40 368 212 641 906
3580 906 218 -424 -66 727 999 319 478 415 38 -124 619 1096 596 -36 -104 487 697 353 647 672 52
3601 52 -280 171 1225 907 178 89 153 219 172 669 1047 392 -312 24 525 792 364 197 463 -66 -223
3622 -223 212 885 508 -46 -288 412 268 53 386 374 131 -332 -71 404 395 -16 88 278 167 -135 68
3643 68 496 223 -268 -378 173 83 -266 -191 348 68 -440 -223 219 155 -477 -259 120 -9 -503 -283 131
3664 131 -69 -484 -456 133 -29 -473 -326 -52 27 -555 -279 -25 -163 -237 -350 134 -116 -718 -563 111 45
3685 45 -604 -349 -165 -172 -450 -184 211 -94 -696 -571 42 43 -120 -235 45 -258 -518 -278 297 323 -395 -538
3707 -538 -125 -99 -226 -161 286 -123 -863 -403 296 346 -357 -418 -55 12 -457 -111 416 78 -484 -508 29 225
3729 225 -58 -63 -110 -220 -519 -29 338 285 -121 -378 -208 -19 -68 71 353 217 -309 -232 312 387 37 30 126
3752 126 -224 -224 149 674 314 -322 -525 32 222 169 350 244 104 -276 -49 649 520 38 -35 -51 31 -120
3774 -120 202 667 153 -155 -261 204 432 299 112 120 -5 -108 122 597 574 -38 -117 -2 251 153 260 271
3796 271 -55 -126 23 202 179 292 65 245 -6 -77 274 415 337 -28 -254 440 295 204 236 317 -45 -117 7
3819 7 210 347 93 -67 75 -56 -39 75 296 229 -78 -104 84 100 245 78 -34 27 -289 101 253 49
3841 49 -42 -91 8 36 85 -41 2 142 -193 -165 35 151 -104 -49 -44 -188 -165 -352 53 -65 -308 -389 -280 -296 24
3866 24 0 -72 -181 -439 -483 -269 -21 -117 -214 -539 -506 -305 -83 46 -87 -435 -378 -369 -94 -214 -418 -271 -281 -353
3890 -353 -232 -108 -112 21 -359 -325 -392 -380 -339 133 -133 -347 -432 -336 135 -71 -55 -67 -200 -271 -6 -153 62 -158
3914 -158 -172 -229 -102 98 -93 65 0 -317 -185 107 127 162 57 -35 -137 -38 157 250 50 127 -178 -9 202
3937 202 194 138 268 144 -180 63 219 353 166 181 -67 74 -20 213 336 355 106 30 343 291 385 340 379 139
3961 139 226 278 356 424 226 404 113 183 402 401 477 196 212 220 299 202 427 323 104 -74 91 52 302 408 338
3986 338 -87 -87 187 58 95 146 76 -125 -45 118 271 346 3 -55 102 -37 171 107 44 -139 -176 -73 18 130
4010 130 122 -58 -224 -179 75 -40 173 -74 -64 -131 -319 -313 -186 -24 17 -205 -235 -204 65 -37 44 -85 -233 -184
4034 -184 -222 -270 27 -50 -422 -208 -269 -75 -101 -108 -26 -151 -246 17 65 -6 -255 -272 -471 -487 -277 -20 -8 -112 -396
4059 -396 -388 -174 -129 -176 -44 -228 -257 -184 -125 282 -60 113 34 -52 -158 -115 69 -46 -230 -315 -84 68 10 79
4083 79 1 66 -361 -143 14 38 184 -25 -16 -102 -66 180 177 219 -38 -54 1 319 352 48 125 58 8 -2 434 -50
4109 -50 65 -68 203 255 118 134 184 201 -119 105 184 327 101 62 126 104 13 -153 383 495 -20 -25 157 144
4133 144 -64 25 290 251 -44 21 81 253 -55 -34 262 300 31 30 493 153 98 -204 78 155 52 145 325 372
4157 372 -221 -2 202 196 33 -61 74 26 -228 -73 -20 152 -202 -280 -153 -5 81 -33 162 -61 -302 -260 121
4180 121 265 16 -123 -129 83 -197 -79 258 45 -318 -361 -9 -64 -90 -89 44 -263 -388 -404 108 92 -59 -306
4203 -306 -286 -29 -101 90 231 40 -361 -502 20 133 1 -323 -103 -253 -354 -121 278 175 -239 -412 -90
4224 -90 82 -30 -18 94 -170 -369 -228 77 100 -194 -367 -248 -69 -167 -181 238 202 -301 -456 -7 200 -157
4246 -157 -274 12 59 -307 -187 341 70 -453 -387 -50 -5 -36 -148 113 -124 -416 -277 113 498 12 -366
4267 -366 -254 -128 -168 -46 463 86 -330 -350 136 355 63 6 35 38 -10 -76 301 231 -240 -245 225 404 -56 -34
4291 -34 118 238 -386 104 175 465 10 -129 230 362 10 21 312 405 -52 -4 430 263 48 106 254 413
4313 413 11 22 408 348 -33 106 384 448 178 22 279 473 97 104 486 623 77 -123 388 708 138 158
4335 158 268 286 92 146 644 511 -250 -5 457 483 238 145 329 241 -92 118 344 455 -116 -210 148 361
4357 361 62 -53 253 78 -315 -141 247 186 -226 -316 115 32 -145 -149 147 -236 -336 -232 126 170 -142 -355
4379 -355 -201 0 -217 -456 -29 -1 -430 -632 -366 -24 -209 -221 -66 -317 -629 -450 61 101 -81 -530 -300
4400 -300 -280 -355 -364 91 -217 -543 -625 -79 -175 -289 -283 -272 -295 -601 -261 -27 -135 -487 -789 -217 -97 -273 -228 -97
4424 -97 -125 -474 -386 -53 -11 -210 -596 -233 -122 -270 -179 -165 -5 -305 -417 81 76 -101 -100 -240 -91 -242 28
4447 28 194 105 61 -263 181 237 215 -70 167 99 -129 26 251 408 225 -227 239 307 182 302 177 316
4469 316 176 -27 353 297 228 -57 417 424 4 159 339 586 263 295 311 375 417 231 373 399 404 249 369 437
4493 437 203 283 377 431 130 -1 404 540 192 140 -41 345 246 187 159 124 189 44 178 365 265 263 195 271
4517 271 81 136 186 54 6 89 -124 257 -22 -41 221 130 -105 -325 -54 -162 -151 -59 -193 -159 67 -159 -78
4540 -78 68 -146 -200 -34 -132 -125 -295 -60 43 -290 -305 -66 -42 -171 -271 -195 -214 -427 -192 -237 -96 -351 -356 -144
4564 -144 -172 -221 -278 -341 -135 -315 -202 -182 -121 -267 -346 -251 -170 -233 -199 -147 -221 -126 -225 -151 -202 -66 -110 -142 -123 -173 -157
4591 -157 -222 82 -163 -198 -243 -216 -153 -54 -28 52 -142 -77 -75 147 -26 -98 -88 -271 -145 -216 33 -80 76 -168 -63
4616 -63 90 -133 -58 -1 -44 -24 96 234 -20 139 128 80 64 7 32 157 107 261 77 12 14 276 164 118 184
4641 184 -14 72 -20 249 112 28 70 100 -23 154 114 113 87 140 58 28 326 224 198 107 156 -70 174 264 29
4666 29 17 161 -65 72 107 135 225 51 -7 204 180 -34 84 -103 111 172 250 149 182 258 -92 90 117 79
4690 79 67 -8 46 11 160 1 271 242 -22 -74 102 38 127 222 22 82 6 -41 193 64 157 120 188 -33 139
4715 139 75 100 216 -114 -82 -87 68 240 -179 -114 119 75 -12 -37 13 100 -198 -137 -40 9 12 112 -2 -83 136 -105
4741 -105 2 -25 -94 -34 -198 41 -92 50 155 6 47 -77 -122 -143 -14 48 39 -105 -72 -126 13 -91 -120 211
4765 211 -183 -68 -71 -15 117 74 -152 -205 -41 2 -130 -17 -47 -271 -96 -74 118 -244 -109 -300 24 -136 -153
4788 -153 -5 -179 -159 -238 -83 -67 -138 -104 27 -66 -191 57 81 -18 -270 117 -3 -189 -195 -43 77 -194 -256 49
4812 49 -29 59 -317 -101 -11 -135 6 10 -65 37 -113 18 82 -9 -142 28 -57 55 -130 -56 197 21 81 -162
4836 -162 111 -83 -123 10 -49 7 40 79 134 -106 -18 151 193 -117 -174 -82 318 158 116 232 202 51 32 165
4860 165 300 -26 -39 50 61 99 -147 198 78 -137 -182 40 245 156 109 61 75 -204 155 113 230 -81 -59 102
4884 102 -22 -309 351 90 -719 -76 -262 294 227 487 -498 -74 177 -456 87 -105 362 -140 -127 -267 191
4905 191 -40 65 78 45 -98 316 15 178 599 -632 230 157 151 -101 406 -113 -356 -113 435 818 -432
4926 -432 -504 7 22 -267 -284 -36 58 -253 -231 -60 -13 -49 -179 12 -63 8 -175 -81 -29 -262 -420 133 166 -17
4950 -17 11 -116 -25 -49 -155 -119 -16 -25 -106 -13 211 -188 -79 -236 -48 18 -68 15 338 -78 -181 -27 259 28
4974 28 -17 48 420 40 -243 113 359 188 -91 -199 -141 531 -23 167 68 39 -120 57 243 56 -54 -52 175
4997 175 192 162 130 85 -33 -2 152 197 78 157 281 102 299 -99 375 13 -72 -94 63 18 228 53 272
5020 272 -16 -77 37 134 358 47 12 -136 -100 -311 -64 36 261 -21 -272 1 412 229 -121 -37 132 -100
5042 -100 -17 251 393 -45 -467 -398 164 382 214 -80 -15 44 -577 -353 -431 -108 -151 -409 -47 -20 -266 -87
5064 -87 -25 -192 -375 -103 133 -217 -222 46 88 -161 -67 19 272 -143 -339 -363 102 -22 -18 -59 -87 -162 -333 -157
5088 -157 23 -129 -360 -141 -13 -45 -187 -71 111 -187 -357 -23 278 201 -162 -214 66 11 -54 5 223 85
5110 85 -118 48 126 -16 -128 101 164 -9 -236 89 354 -26 -277 24 120 105 -69 123 73 89 -119 34
5132 34 256 285 89 263 134 118 -20 80 263 89 -146 177 419 217 -48 32 185 14 -40 87 326 -7
5154 -7 -54 85 262 -64 65 32 110 15 -54 153 179 10 -92 114 284 49 129 56 180 -11 40 87 122 135 38
5179 38 -31 195 290 -154 32 -11 -133 16 -86 61 -29 -209 -111 -121 -98 -53 21 23 22 6 -83 173 41 -155 108
5204 108 -54 -70 -200 138 144 -253 -194 75 33 -32 -65 -89 132 -54 -202 -121 149 72 -179 -121 145 -151 -105 116
5228 116 276 -105 -80 -164 47 -40 -32 -97 55 79 -11 -110 -79 -77 -248 -68 71 110 -38 88 -23 22 -38 90 -28
5253 -28 37 -57 -96 100 20 -7 118 -29 -178 60 19 68 179 11 -21 79 64 33 -141 397 86 137 97 167 -44
5278 -44 -14 -73 14 71 45 19 14 31 103 -76 183 111 -72 -78 78 -70 -109 -62 186 175 13 -11 17 120 180 45 88
5305 88 117 -24 39 -61 179 -41 -86 44 37 -75 -133 21 -39 -283 23 49 -182 13 -76 -63 -91 116 -62 27
5329 27 26 -115 -52 34 53 149 -144 15 182 70 -33 64 18 129 81 -83 171 56 -40 31 106 210 -30 -40 -180
5354 -180 173 32 239 385 105 17 19 20 -9 25 85 134 -208 32 -17 6 -20 61 -35 147 106 60 36 -23 171 -71
5380 -71 22 2 200 -41 43 -28 116 -2 103 -55 125 89 48 3 19 44 127 -16 69 -133 -38 -166 -124 96 -67
5405 -67 -32 -66 -43 -68 -174 7 56 -59 -303 32 193 -151 -38 -230 -103 -132 -158 -130 -302 -116 -195 -202 -211 -114 -161
5430 -161 -152 -280 -210 -81 -8 -105 -2 -113 -242 -186 -55 -39 -222 -62 -229 -41 -313 -70 -328 -67 -114 -327 -257
5453 -257 -232 -67 -20 -91 -140 -56 -199 -95 -181 -49 -101 54 -164 -112 -175 -38 -217 -113 -57 -3 64 -113 7 -223
5477 -223 15 -241 -42 3 -95 51 -77 263 17 -85 -138 -128 123 102 157 103 162 -20 132 9 -36 225 19
5500 19 126 299 132 104 331 -57 74 44 178 300 165 143 227 132 -3 78 15 125 -81 235 108 223 66
5523 66 173 171 456 81 350 123 149 56 116 236 122 130 160 -23 164 -59 140 124 197 -56 30 182 104 -35
5547 -35 -95 107 76 -64 15 156 52 -17 -49 33 -18 23 -123 2 31 20 126 275 118 -181 33 -42 -1 54 12
5572 12 22 -38 -86 -94 -89 -32 72 -157 -60 -62 -181 -7 48 18 -302 -115 7 -28 -176 -32 42 93 -343 -220 -86 34
5598 34 -47 -58 39 65 -140 15 111 -24 34 -208 -14 -45 -257 -259 48 -84 -141 -185 -16 -196 -204 -69 71 -111 -105
5623 -105 -23 -120 -15 -231 -8 129 -59 -221 46 73 208 -15 -12 67 21 -99 -52 -7 55 -109 -186 98 1 -144
5647 -144 17 79 122 -114 -8 54 6 5 9 87 -42 -102 106 203 -10 -22 100 12 178 -12 -53 97 55 -129 37
5672 37 180 -53 -157 -109 -19 161 -139 115 17 -51 -67 -162 129 53 -264 23 -96 93 21 -122 303 -2 114
5695 114 -70 94 150 25 -16 93 -53 -207 32 201 -11 -185 21 119 -12 76 148 -102 -25 -204 -8 175
5717 175 -77 -126 -114 30 -74 58 -23 207 148 -203 -100 231 125 -62 -100 -16 -72 -83 -176 158 246 -192 -142 -100
5741 -100 46 -60 36 0 133 -370 4 235 51 50 0 51 -31 -86 60 -12 134 -228 76 85 382 -168 -200 273
5765 273 -14 96 2 206 108 -62 -167 223 127 -81 146 36 -7 -318 64 298 14 67 -277 -105 168 -24
5787 -24 46 185 -94 -59 65 60 25 -19 -108 -4 -3 -13 -182 140 85 -159 -63 80 55 -124 167 139 21 104 -63
5812 -63 59 -229 -98 22 -285 54 -37 -56 83 136 -25 -87 -25 -27 -232 -180 51 21 24 116 113 91 -199 378 310 -15
5838 -15 27 -246 72 -304 -289 71 227 42 -140 274 27 117 -257 -169 47 163 -15 -114 -44 -50 -113 -59 103 124
5862 124 80 56 -28 116 199 201 212 92 -152 179 129 33 -48 27 100 77 -210 393 291 500 112 -130 -654 172
5886 172 203 -436 294 -7 -135 -118 265 75 -38 118 115 73 71 -32 147 -76 61 -270 151 176 58 -27 189
5909 189 -1 189 261 211 82 203 91 103 188 -151 22 -77 -83 -89 51 23 280 -66 -55 39 180 114 395 -138
5933 -138 74 193 303 550 -163 43 -12 -40 -112 43 49 -27 232 454 -161 57 303 -23 -103 -278 -276 -357 -68
5956 -68 121 21 149 -336 251 -303 -38 -163 50 43 25 123 75 -45 48 -464 -27 -266 -75 1 -119 21 -15
5979 -15 -64 2 -277 -348 -214 101 -28 -294 141 -182 38 -68 -70 -188 -112 -133 11 -47 61 -149 -160 72 99 -263
6003 -263 -25 -183 -52 -73 -80 -174 38 -101 -6 43 -96 39 70 211 -85 40 -124 35 0 170 -63 -139 672
6026 672 181 162 87 -83 31 33 -414 69 308 -154 -294 152 140 234 -127 129 70 17 -123 51 -20 209 -54
6049 -54 96 154 -143 268 7 76 217 341 -77 -203 -43 188 157 175 719 304 -75 -296 -189 -51 -43 286
6071 286 -217 -323 -13 -89 -18 58 145 -125 -153 -20 271 146 -14 -127 -52 -184 -30 -81 -49 49 -102 37 -96
6094 -96 140 -71 -27 71 -68 -21 -89 144 110 36 188 -186 44 132 -92 97 -225 -189 -57 -183 -3 -353 62
6117 62 123 -260 -237 -541 -117 134 -544 -339 81 32 -44 8 214 -84 9 -223 -239 -182 115 -117 -142 11 87 -251
6141 -251 -139 -180 -131 181 -41 -35 -51 -144 -398 -465 -236 -412 48 224 92 -162 -233 -228 -370 -131 -75 344 -327 389
6165 389 140 140 519 -168 224 75 24 6 36 -111 54 43 82 -28 -141 141 -221 -160 -143 -83 310 403 -125 64
6189 64 -98 87 174 30 47 38 525 513 371 56 -71 -12 100 -62 -284 -163 96 74 -8 349 35 79 244
6212 244 34 251 -177 178 212 -176 11 84 -114 230 -43 298 140 129 66 229 83 51 351 -118 348 -8
6234 -8 138 -101 236 -28 -35 -181 -247 -89 89 -85 29 -77 97 45 -30 125 69 148 74 80 -114 142 -97 54
6258 54 -20 71 -54 -1 41 19 300 109 -103 23 55 -24 144 48 33 -185 -65 214 -94 -4 -139 -21 -191 131
6282 131 -125 -96 -167 143 20 -161 95 -40 -51 -210 -85 93 -62 -67 112 8 -150 185 -134 120 -293 106
6304 106 107 -275 18 -146 125 -58 46 44 -29 -110 44 124 -116 27 -207 -143 38 -145 -216 -133 73 -95 -128 9
6328 9 49 118 -53 -119 4 121 -12 -312 -97 -5 -48 116 126 151 -75 -1 -3 117 -72 -146 169 -21 -168 -244 84
6353 84 28 -178 -349 -6 116 -124 41 108 139 -37 -139 -34 105 -110 -31 -47 -66 26 -132 97 55 -203 -65
6376 -65 -57 167 -69 -169 -150 93 -80 6 319 -56 130 -112 -19 92 -202 -115 31 107 -211 180 -73 397 9
6399 9 492 -80 -464 358 -185 92 -137 168 -255 191 50 46 105 76 217 14 -13 288 101 -48 49 9 472
6422 472 195 -345 51 106 335 328 -100 43 128 -109 209 -104 191 0 164 -14 39 55 55 27 63 -143 68
6445 68 80 -66 -93 63 23 -71 -214 31 -34 -67 -112 107 52 -48 -152 116 -10 -99 -123 42 6 -268 -38 8
6469 8 -63 -18 -10 26 -4 -107 -162 -162 8 -172 123 67 -117 -196 -55 -17 -12 -119 -272 -101 -1 -82 -168 -53 -61 -68 -171
6496 -171 -38 84 -101 -110 147 -150 -82 -44 -8 53 -215 -104 -111 45 105 -109 -61 -23 -69 -161 103 18 16 23 -18 -112 34
6523 34 103 -51 -184 8 26 70 190 -78 -182 300 204 51 -199 -14 -60 -34 243 188 -14 -59 3 23 142 -22
6547 -22 123 3 152 -48 -95 105 182 84 108 108 64 -7 -124 87 79 40 -2 13 137 -68 -86 131 33 78 -37 180
6573 180 51 31 -183 169 124 -17 -24 -5 164 -48 -2 72 158 223 -13 51 168 140 18 121 110 -148 -13 -50
6597 -50 145 23 -37 -163 -304 75 -62 -113 -74 -168 -171 -115 220 26 -21 -111 -163 94 -12 -145 104 -183 -43 -117
6621 -117 94 -132 34 -80 -66 16 -233 -53 10 23 74 15 -184 81 4 -57 -64 -37 -26 -91 27 9 -19 106 80
6646 80 -162 -84 -72 -100 -113 20 165 136 -163 -101 29 -91 -192 -22 -107 -45 -278 21 35 13 33 -34 -182 -176 -29
6671 -29 -88 12 159 285 -70 -206 32 107 91 180 43 65 4 -30 -89 7 121 0 0 -55 -80 77 7 66 6 -142
6697 -142 162 116 123 -269 37 53 40 110 -100 55 -36 80 -83 193 55 40 40 24 248 154 -116 38 -35 128
6721 128 104 12 -50 57 -21 -84 -30 -81 -99 26 17 -124 58 -69 -148 -33 4 -66 -325 -64 -60 8 -78 81 -121 26
6747 26 154 82 -113 65 86 -28 54 -13 92 -33 119 85 24 146 149 66 86 26 88 -160 187 28 2 -12 28
6772 28 74 108 249 31 58 20 -33 -148 23 -59 38 0 123 -109 24 22 189 9 -179 70 55 121 -19 61 3
6797 3 -114 -43 -136 162 -54 -11 56 -143 -57 -42 63 52 151 96 -53 -72 214 82 -109 190 -7 -41 22 -115 -68
6822 -68 -45 114 8 3 35 90 -36 16 -43 -29 73 16 69 -82 67 -123 -27 78 -2 -35 93 18 19 -17 -193 -30
6848 -30 -117 0 -1 -119 -22 -15 -73 124 -99 -169 53 -107 -61 -139 -222 -15 114 -108 -88 -60 69 28 -56 -61 -120 0
6874 0 57 -87 23 77 -20 13 22 242 -67 3 -73 42 101 3 -188 30 -208 -66 -109 41 0 -117 -34 64 57 -29
6900 -29 -72 35 46 -125 173 -71 -104 77 -85 114 4 -109 115 -60 -69 3 3 246 -7 -39 122 134 -49 167
6924 167 -18 365 89 -176 -54 268 67 -127 152 13 94 20 0 192 -20 -136 -147 123 30 47 40 -60 46
6947 46 -91 40 122 -230 135 -87 188 4 152 -81 -169 -193 -153 171 61 -76 -189 -155 40 117 -186 20
6969 20 82 -59 -58 -59 47 87 -110 37 29 115 -12 -115 -66 -31 120 -154 -216 -31 77 -140 142 -35 -228 -125
6993 -125 -182 3 -241 -6 -133 39 97 -5 32 -144 -7 56 -18 -19 96 -136 -9 33 -123 -103 11 -41 -212
7016 -212 309 33 -68 -99 -71 12 -60 -69 -63 46 -288 -26 111 -11 71 12 87 -53 -179 -53 86 2 93 -4 95
7041 95 -27 17 101 -87 57 67 -11 67 36 -51 116 69 4 61 1 169 55 -62 59 -142 150 103 -181 -93 11
7066 11 21 -41 285 196 23 -81 31 -3 105 47 35 102 99 -48 149 50 -174 -115 -62 136 139 90 4 56 -16 -23 -69
7093 -69 319 -42 -60 10 -19 -67 137 64 50 124 -38 176 12 -61 -24 -64 144 5 -39 226 -10 -185 -46 -110
7117 -110 -91 -246 -166 123 88 -4 -115 -6 124 -46 -244 -149 143 -74 -125 -117 175 -143 44 -50 -43 -60 -201 -62
7141 -62 -19 -36 -65 130 84 136 -281 -141 11 -73 6 -269 -119 -70 -212 -52 -103 -25 -78 -122 -11 75 -43 -98 57
7166 57 -147 -88 -116 100 -135 88 -186 32 23 6 -41 94 97 -204 92 14 100 -82 -46 20 96 -40 177 108 -56
7191 -56 -65 118 53 -59 -124 11 65 -139 -100 309 212 107 15 -97 -86 -140 -54 59 -102 -12 -106 44 80 60 -18 -169
7217 -169 -80 17 9 -140 164 -80 -2 186 94 112 -36 128 50 -27 -187 -115 230 42 69 163 42 154 -12 211
7241 211 182 -60 -159 41 -94 51 38 -196 37 72 46 31 86 184 120 58 230 -95 -18 -71 3 -2 -36 129 171 -150
7267 -150 -108 90 42 -114 -123 -13 -58 86 -221 15 56 64 -157 -49 37 40 -123 -56 -48 -139 -10 -64 -126 209 -75 -12
7293 -12 -140 82 -172 127 107 28 213 9 141 -80 -240 -30 28 -93 -99 -45 -159 -210 -156 -143 152 88 -203 -4
7317 -4 126 -116 59 59 21 -3 -304 -12 26 173 -64 -72 -69 -41 -35 14 146 -31 -53 -214 46 -29 66 -72 -91 -67 51
7344 51 -39 16 7 -240 -76 109 -8 -126 -122 4 -23 -45 -33 182 -49 2 105 156 37 -275 22 158 91 -45
7368 -45 -31 -121 133 -94 -225 57 -268 -106 -92 -4 14 -11 210 -42 10 164 12 2 -19 -33 -54 15 -50 26 163
7393 163 109 74 -66 9 -55 202 -75 19 -47 -148 -71 -74 79 -72 -25 16 51 146 65 -164 -72 -58 -70 -161 75 27
7419 27 182 254 -78 -2 -5 -89 22 76 30 159 55 -89 -84 -62 -131 -108 49 31 164 141 -198 8 171 144 168 37
7445 37 -264 98 94 98 94 -74 -91 -148 223 -257 -27 43 4 -3 -75 -25 114 -123 42 2 -136 -92 17 121 -119 101
7471 101 33 3 -55 4 64 81 -93 206 62 49 68 -68 63 29 18 -76 -21 -51 24 -11 20 -166 39 36 86 -85
7497 -85 -144 101 123 299 -99 -118 -60 136 -85 -128 118 -56 -49 -16 -121 -91 -23 -85 -48 97 44 -5 104 46 -158
7522 -158 8 -10 -86 -116 3 -97 -75 9 -227 -94 73 -164 7 45 -13 -64 18 -199 -86 65 -12 48 77 -41
7546 -41 -179 66 -41 -230 -18 -117 -105 -19 -89 -141 355 -161 -165 165 -121 -190 170 -36 -149 -99 40 -16 -190 48
7570 48 -132 113 70 65 78 -23 124 44 19 38 40 235 -128 62 -176 9 20 5 -100 61 8 234 67 136 -56
7595 -56 -1 -132 -92 -43 -132 71 177 -1 72 66 142 130 168 -121 32 132 -202 -211 139 62 132 38 -34 -146 78 98
7621 98 9 -57 -245 -157 70 258 -42 -179 156 33 169 49 95 10 -133 128 18 301 133 49 -152 -294
7643 -294 -9 -11 -51 -131 -128 53 -132 -111 -25 53 11 -196 -1 30 -142 -71 38 -107 6 -54 55 49 -73 -151 90
7668 90 -50 -150 -90 -65 -69 -166 -4 105 -85 96 -38 -41 -184 -176 -7 -38 68 78 -115 82 157 172 176 -111 -33 -57
7694 -57 11 12 -90 -118 -134 -49 -17 -135 113 23 -176 26 20 180 61 62 103 47 5 -83 28 -124 -121 -3 94 18 85
7721 85 123 -50 28 74 65 -78 -175 94 -80 176 -23 -61 -2 206 -11 -122 123 -84 -45 -8 111 205 -156 31
7745 31 162 57 58 -11 81 -35 77 64 -60 271 172 -157 144 -56 -62 39 119 -81 -49 -64 131 52 22 -205 112
7770 112 41 -107 1 178 -46 -7 79 87 216 92 -13 -102 -23 -117 -66 3 -146 -76 54 -97 180 -49 -146 -70
7794 -70 -48 70 162 154 169 -15 124 9 97 25 24 19 -16 -120 81 -156 -4 40 147 -119 16 -225 8 -10 -33
7819 -33 -62 -155 118 21 -47 81 67 14 -225 59 366 269 -401 -193 108 56 180 12 -4 -86 -8 14 210 -132
7843 -132 47 -161 -41 27 -16 -85 5 -124 -30 50 26 90 9 -79 133 -109 4 -120 72 42 31 67 -74 -48 83
7868 83 30 102 -137 -104 -52 96 -18 -267 -126 97 -120 -287 -24 54 56 25 50 40 -97 -102 -156 -35 54 -21 -5 -95
7894 -95 77 -158 -13 -95 -102 -183 1 39 -77 -264 -156 18 44 1 65 78 -76 -81 123 123 -103 73 -65 -46 61
7919 61 -130 -80 -34 81 120 34 -140 -139 154 -279 126 144 148 304 484 -891 -385 -82 281 667 266 -18 93
7942 93 -257 -394 -287 79 29 -126 -55 -34 -128 140 123 -180 252 -282 -74 -126 68 64 -53 -205 177 224 -33
7965 -33 72 151 -291 69 50 -413 -191 259 422 -285 -200 -190 2 -20 -100 292 -172 600 -37 -171 -112 -263 -523
7988 -523 -97 471 130 -593 243 356 4 -41 -61 -325 -529 -86 -200 64 -107 -112 69 -117 87 47 121 -10
8010 -10 -124 -240 -44 355 -507 307 -121 -476 228 -27 339 20 -64 -321 -294 178 149 -235 302 -436 81
8031 81 -262 104 -101 4 -107 -226 -12 149 58 -130 191 101 112 -191 -72 -163 1 -115 -86 137 -28 -109
8053 -109 -208 -87 -153 48 193 -138 -134 -103 226 -52 99 -22 -64 126 -97 39 -75 -91 44 43 30 24 66 38 -129
8078 -129 171 -131 -171 -55 -27 -39 99 -53 -8 138 154 38 -53 140 -136 15 66 -178 61 71 -109 86 31
8101 31 177 91 144 21 189 -9 20 94 62 80 -65 44 187 -74 -156 137 -30 40 93 50 -39 102 198 -2
8125 -2 49 25 2 153 -76 99 -9 -102 -85 25 28 11 -31 82 32 106 101 12 51 -70 88 -122 -3 -43 -40 15 2
8152 2 0 274 2 154 21 -151 94 171 100 -47 40 54 144 64 73 68 -35 73 49 -169 -116 -31 -136 -30 115 79
8178 79 27 120 44 -160 50 -165 -134 -67 -16 7 -57 -77 64
8191F4
$$ Imaginary data points
##PAGE= N=2
##DATA TABLE= (X++(I..I)), XYDATA
0 0 0 0 0 0 5 0 8 -8 8 -16 16 -20 24 -32 40 -48 56 -64 80 -91 108 -126 144 -167 194 -220 251 -284 323
29 323 -364 412 -460 518 -577 644 -719 799 -888 985 -1091 1211 -1339 1482 -1642 1819 -2018
46 -2018 2244 -2500 2793 -3136 3543 -4030 4636 -5396 6396 -7776 9808 -13109 19401 -35726
60 -35726 166644 356960 47777 -5212 100360 155882 98417 189962 282971 203577 55084
71 55084 88348 171342 161306 130768 181064 171797 94565 104759 220340 234288 131615 68388
83 68388 82876 76545 91876 183877 243741 162397 58052 54063 97786 107646 116900 125038 84865
96 84865 38411 69849 126460 116154 74265 63059 37012 -16194 716 101769 146582 77616
108 77616 2062 -16846 -25932 -23480 30004 73234 28205 -38490 -29454 9543 2458 -13736 -3169
121 -3169 -25467 -88729 -92959 -16239 27313 -11467 -53407 -62912 -87365 -112112 -72191 -5702 -11981
134 -11981 -77256 -103230 -79335 -69422 -78721 -71463 -66172 -95891 -121520 -92963 -42598 -35369 -69680
147 -69680 -100099 -113992 -120644 -108789 -69516 -36852 -51547 -97417 -120900 -103004 -75715 -65730
159 -65730 -66705 -72157 -88318 -102236 -85893 -48050 -36953 -66949 -97234 -98365 -85511 -68890 -39944
172 -39944 -16829 -33918 -77471 -94561 -70976 -43415 -33439 -31435 -36734 -53295 -62100 -41513 -11890
185 -11890 -8764 -30335 -48984 -49285 -33432 -7822 12741 9840 -15593 -39873 -40958 -17992 11842
198 11842 26889 17118 -4817 -17158 -10552 9729 29715 32717 11612 -12967 -10395 18818 44235
211 44235 48508 37797 16501 -6521 -5590 30026 64405 60727 33427 16171 13182 17576 37185
224 37185 63247 61261 28451 8618 25345 51415 60739 59054 48875 24681 6172 23082 61417
237 61417 76834 59399 35458 22582 20411 33836 59122 70678 51364 22412 15677 32174
249 32174 52200 60864 53621 32940 12408 12026 35405 60616 64203 43023 15451 3316 13736
262 13736 35978 51285 49155 29189 5709 372 18682 42151 45132 26235 4401 -4758 1478
275 1478 20851 39130 36177 9884 -14983 -15919 2361 21292 28463 19529 -3574 -23135 -19404
288 -19404 2993 18722 13009 -5736 -22979 -28226 -16420 4539 15053 1270 -24648 -39627
300 -39627 -33155 -13570 2978 2985 -14209 -36309 -45234 -33455 -12521 -861 -9213 -30787 -46480
313 -46480 -43200 -25964 -10083 -8075 -23267 -44637 -54045 -41439 -18404 -6403 -14259 -33504 -49528
326 -49528 -51563 -36068 -14714 -7557 -22809 -43876 -51538 -41486 -23624 -10800 -12293 -30349 -48886
339 -48886 -49402 -30303 -10313 -5273 -17048 -36257 -48404 -41415 -18736 -806 -2960 -21056 -37755
352 -37755 -40096 -25883 -4755 5689 -4373 -25347 -36626 -28175 -7802 9350 10206 -6637 -26438
365 -26438 -30279 -13388 9290 19752 11549 -7778 -22464 -18097 3501 23248 24469 8308 -10092
378 -10092 -14784 -1192 21050 33694 25603 4018 -10060 -4767 15238 34284 37791 22726 1674
391 1674 -5728 7938 30485 42743 35981 16488 411 2348 21859 42157 44826 28694 8467
404 8467 1492 12933 34403 48519 42179 20049 2510 4538 23473 42676 46788 32047 10668
417 10668 537 10936 32906 46607 39761 18657 967 1583 19214 38878 43111 27928 5196
430 5196 -5633 4500 25958 39714 33355 12537 -5630 -6726 9655 29277 34590 19178 -3750
443 -3750 -14603 -4933 15536 28810 23563 3148 -16330 -18170 -904 19068 23430 8177 -13106
456 -13106 -24045 -16342 3065 17640 13325 -7255 -25616 -26916 -10850 7140 12594 -411 -21358
469 -21358 -33290 -25475 -5619 8257 4344 -14268 -31914 -34313 -19525 -994 5184 -6945 -26739
482 -26739 -37896 -30884 -11938 2051 -968 -18526 -35247 -37291 -23262 -5682 1684 -8523 -27884
495 -27884 -39089 -32144 -13579 -239 -2413 -17062 -32761 -36606 -23725 -4470 3321 -7108 -25226
508 -25226 -34624 -28359 -12531 1705 2831 -11460 -29021 -32677 -17944 -84 6109 -1750 -16211
521 -16211 -26844 -23692 -7521 8438 9083 -5569 -21034 -22359 -10797 4122 13034 7781 -7623
534 -7623 -19507 -15911 692 15046 15555 3262 -9529 -13599 -4939 10468 19871 15392 1055 -10175
548 -10175 -6077 8392 20118 21692 12790 -122 -6596 1101 17387 27959 21995 7586 -932
561 -932 1298 11825 23986 28944 20213 4903 -1139 8037 22304 29084 25583 15070 4592 2732
575 2732 13729 28236 31824 21192 8084 3325 8961 19829 28808 28271 16292 3807 3085 13545
589 13545 25014 27543 20222 8735 1606 4639 15862 25326 24170 12667 652 -880 7948 18200
603 18200 21461 16033 5756 -3180 -2849 8384 18848 16891 5045 -3844 -5034 -801 6723 13812
617 13812 11399 -1861 -12738 -8959 1929 7198 5684 1141 -7291 -15949 -13424 49 7694 269
631 269 -10989 -15611 -14855 -11809 -4667 2119 -3396 -18429 -24574 -16764 -7361 -4904 -6729 -11241 -20112
646 -20112 -26624 -20297 -7083 -2951 -11769 -21833 -24853 -22872 -17459 -9131 -5527 -13837 -26721 -29472
660 -29472 -20348 -10140 -7722 -11731 -18823 -26189 -27589 -18549 -6230 -3777 -14120 -24982 -26465 -19978
674 -19978 -11530 -5112 -4916 -13790 -25230 -25783 -13176 -1287 -815 -9001 -16943 -20453 -17783 -7393 4291
689 4291 4285 -8658 -19795 -16861 -5473 3479 6283 2682 -6895 -15724 -11830 3716 14655 10211 -1553
704 -1553 -7799 -6435 -5 10249 18712 14127 -1177 -9390 -737 14132 20536 17724 10741 2077
718 2077 -2707 5301 21887 28972 18556 4240 1258 7936 16667 24942 27812 18846 3715 394
732 394 14093 28506 29052 20623 12739 7146 6538 16832 31235 32372 16573 3043 5786 16746
746 16746 24769 27490 24765 13770 2037 4324 20028 30923 24978 12075 4918 4310 9194 18623
760 18623 26916 22023 5422 -4070 3060 15924 19941 17222 10576 1222 -4859 60 14774 21118
774 21118 11553 -2912 -7185 -2713 3612 9888 12708 5459 -8698 -14187 -4755 7289 8611 1696
788 1696 -5680 -11903 -13818 -6983 4663 6835 -5137 -17155 -17533 -10191 -3862 -1024 -1814 -9297 -20298
803 -20298 -22200 -11145 -159 -1661 -11281 -18281 -20440 -18809 -11583 -2239 -2581 -15240 -25830 -22775
817 -22775 -12081 -6372 -6352 -9358 -16755 -24929 -23302 -10297 -725 -5783 -16712 -21668 -20586 -16488 -8709
832 -8709 -1498 -4403 -17452 -25341 -18829 -6665 -1995 -4490 -9527 -16344 -21010 -15261 -2162 4043
846 4043 -3263 -14754 -17801 -13199 -6169 632 3554 -2578 -14025 -17945 -8217 3717 6738 860
860 860 -6489 -11315 -11049 -3069 8396 11136 1069 -10637 -10614 -1489 6492 10185 8764 985 -8401
875 -8401 -8455 3788 15278 14014 4140 -3211 -4140 194 8841 16817 15134 2601 -5961 -2118 9155
890 9155 16068 15606 9833 1434 -3650 1074 13723 20981 14895 3263 -2078 1318 8627 16062 18683
905 18683 12698 1083 -3987 3740 15230 19154 13524 5653 -280 -312 6775 16807 19663 10418 -642
920 -642 -2319 4452 12042 16339 14139 6343 -2496 -2761 7081 16014 15333 7349 167 -2358 755 8008
936 8008 14669 12966 2835 -4935 -3020 4784 10683 11113 6646 -999 -6085 -2912 6101 11711 8251
951 8251 -247 -5676 -5234 206 6347 8821 4525 -4099 -8886 -5109 2910 7207 4398 -1603 -6995
966 -6995 -8444 -4109 2868 6410 1378 -7152 -10667 -6882 -885 2536 2469 -2269 -9266 -12175 -6564 1250
982 1250 3188 -1781 -7484 -10635 -10070 -5318 1123 2231 -4211 -11684 -12354 -7340 -2158 357 -1126 -6737
998 -6737 -12663 -12461 -5559 500 140 -4798 -9894 -12020 -10059 -3840 1073 -519 -6884 -11818 -11144 -6104
1014 -6104 -674 650 -2586 -8569 -11715 -9018 -2936 1717 741 -4731 -9678 -10133 -5416 162 2603
1029 2603 -304 -6027 -9551 -7797 -1518 3508 2932 -1898 -6809 -7985 -4199 2301 5721 2953 -3491
1044 -3491 -7204 -5195 431 5502 5991 1825 -4084 -6078 -1818 4409 7957 5404 40 -4018 -3400
1059 -3400 1910 7905 9022 4644 -1616 -3571 -221 6162 9898 8469 2602 -2337 -2042 3352 9259
1074 9259 10635 6483 595 -2164 880 6647 10858 9903 4160 -954 -1467 3559 9592 11148 7460
1089 7460 1330 -1991 -11 6186 11096 9997 4259 -1209 -1917 2336 8259 10799 7382 849 -3081
1104 -3081 -1083 4677 9403 9136 3863 -2172 -3901 348 6543 9204 5892 -632 -4594 -3446 1926
1119 1926 7797 7723 2291 -3547 -6056 -2034 3605 7193 4402 -2248 -7186 -5596 -11 4945 5474 608
1135 608 -5995 -8678 -4472 2039 5438 2813 -3592 -8870 -7977 -2395 3562 4306 -824 -7572 -9843 -6060
1151 -6060 147 3899 1992 -4555 -10059 -9297 -3617 2486 3592 -1167 -7735 -10593 -7284 -385 3907
1166 3907 1875 -4309 -9682 -9465 -4207 2007 3828 -490 -7207 -10232 -6662 -284 4112 2715 -3292
1181 -3292 -8669 -9109 -3571 2954 5113 686 -5829 -8946 -6358 421 5323 4120 -1851 -7662 -7995
1196 -7995 -2515 4058 6280 2287 -4145 -7428 -4927 1390 6649 5782 193 -6072 -6387 -1147 5352
1211 5352 7596 3997 -2218 -6153 -3919 2774 8015 7304 1127 -4652 -4983 -60 5944 8578 5436
1226 5436 -1276 -5698 -3030 3711 8422 7646 2282 -3041 -4578 -709 6349 9459 5675 -1236 -4701
1241 -4701 -2275 3183 7621 8105 2996 -3223 -5150 -393 6186 8233 4954 -761 -4247 -3491 1617
1256 1617 7155 7525 2030 -4118 -5068 -823 4430 6654 4528 -893 -5584 -4682 1117 6125 5877 637
1272 637 -4422 -5279 -2369 2348 5711 4001 -2197 -6947 -5235 70 4480 4202 266 -4171 -6801 -4381
1288 -4381 1469 5252 2523 -3376 -6678 -5199 -1333 2485 3727 911 -4776 -7650 -4359 1381 3590
1303 3590 1311 -2531 -5526 -6081 -3083 2318 4286 317 -5340 -6681 -3574 238 2573 2548 -765 -5584
1319 -5584 -6729 -2262 3277 3902 -15 -3412 -4835 -3887 -746 3755 4629 -74 -5635 -5094 -689 2876
1335 2876 3517 2355 -725 -4716 -4635 670 5762 4979 238 -2963 -2956 -1185 2366 5681 5187 -273 -4544
1352 -4544 -2606 2732 5512 4833 2554 -622 -3083 -1813 3772 7800 5461 -425 -2837 -1046 2018
1367 2018 5031 6635 4824 -675 -4080 -672 5315 7343 4699 959 -1296 -2067 148 5658 8386
1382 8386 4076 -2311 -3486 482 3913 5147 5181 2840 -2456 -4368 714 6652 6627 1706 -1622 -2042
1398 -2042 -1485 1082 5643 6264 437 -4971 -3650 1296 3845 3649 2100 -839 -4678 -4032 1411 5709
1414 5709 3208 -1801 -4456 -3551 -1345 1265 3638 2267 -2990 -6808 -4260 1240 3319 991 -1850
1429 -1850 -4126 -5308 -3956 770 3849 731 -5052 -6728 -3487 -603 285 826 -532 -4569 -7560
1444 -7560 -4089 1595 2079 -1512 -4215 -4362 -4379 -3532 380 2677 -1266 -6637 -6327 -2082 -6 -478 -340
1461 -340 -1278 -4680 -6622 -2644 2560 1493 -2505 -4218 -3572 -3346 -2070 1097 2738 -1482 -5887 -4620
1477 -4620 -512 1140 680 355 -798 -3906 -4704 -417 3598 2686 -1302 -2908 -2086 -1367 88 2783
1493 2783 3409 -319 -4499 -3097 1557 3512 2495 1294 -258 -2506 -2464 1849 5619 4168 -955 -2619
1509 -2619 -880 1344 2719 4500 4222 -469 -3789 -1452 4316 6058 3550 1008 -640 -1784 -635
1524 -635 4383 7553 4197 -1678 -3157 187 3485 4909 5097 3311 -1403 -3910 180 6116 6923 2963
1540 2963 -667 -1735 -927 1661 5611 7073 2293 -3392 -3453 1575 5328 5048 3313 374 -3165 -3169 2058
1557 2058 7173 5790 -55 -3578 -2423 273 3035 5202 4031 -1162 -5409 -3486 2699 6060 3625
1572 3625 -353 -2928 -3764 -2163 2899 6011 2837 -3503 -5926 -2505 1589 3279 3005 559 -3976
1587 -3976 -6520 -2307 3757 4742 441 -3927 -4578 -3634 -924 2951 3828 -739 -6294 -6086 -1164 2312
1603 2312 2260 464 -2495 -5811 -5503 -477 4142 2467 -2684 -5273 -4830 -2508 638 3018 1393 -3454
1619 -3454 -6655 -4478 118 2763 1609 -1378 -4311 -5284 -2981 1231 3380 1001 -3442 -5668 -3731
1634 -3731 110 2229 2243 -287 -3431 -5094 -2690 2131 3700 997 -2582 -3875 -2829 -591 2185
1649 2185 3515 931 -3730 -4467 -974 2620 3002 1321 -29 -2608 -3376 -121 4429 4293 341 -2432
1665 -2432 -2053 -295 1474 4075 3917 328 -3322 -2141 1567 4090 3722 2155 -250 -2105 -1214 2640
1681 2640 5328 3660 415 -1771 -1167 1091 3500 4821 3208 -546 -2154 -485 2720 4745 3897
1696 3897 1015 -1416 -1133 877 3615 4671 3029 -176 -2204 -824 2310 4191 3480 1374 -1033
1711 -1033 -1969 -189 3138 4449 2160 -1137 -1956 -1044 989 2835 3693 1286 -2289 -2816 -244 2540
1727 2540 2839 1571 -507 -2642 -2495 75 2784 2534 -322 -2554 -2807 -1524 776 2414 1402 -1517
1743 -1517 -3843 -2929 -603 1609 1704 -271 -2968 -3946 -2568 138 1736 424 -2005 -3926 -3642 -1392
1759 -1392 827 1448 -757 -3284 -4202 -2882 -658 966 465 -2019 -4058 -3941 -1770 283 1114 -351
1775 -351 -2964 -4225 -3152 -614 966 309 -1693 -3585 -3843 -2249 411 1321 -146 -2679 -3716 -2709
1791 -2709 -739 968 1096 -660 -3034 -3573 -1750 842 1635 483 -1637 -2994 -2660 -450 1717 1888
1807 1888 -216 -2182 -2780 -1301 968 2540 1710 -580 -2390 -1831 337 2465 2758 1075 -1098 -1904
1823 -1904 -645 1872 3218 2653 452 -1347 -1110 564 2997 3568 1998 -329 -1310 -8 2234 3887
1839 3887 3355 1472 -612 -799 1038 3271 3992 2660 635 -873 -61 2251 4198 3890 1734 -441
1855 -441 -545 968 3126 3975 2921 510 -816 -200 2014 3751 3782 1918 -373 -1274 488 2703 3748
1872 3748 2703 299 -1114 -902 1154 3388 3320 1417 -954 -1718 -350 1871 3037 2200 -282 -2302
1888 -2302 -1828 411 2434 2417 624 -1577 -2950 -1755 758 2160 1248 -1276 -2903 -2968 -930 1148
1904 1148 1551 -17 -2712 -3859 -2610 -33 1183 385 -1995 -4045 -3863 -2055 446 894 -851 -3332
1920 -3332 -4624 -3591 -1083 320 -169 -2114 -4184 -4549 -2695 -202 630 -1414 -3530 -4578 -3660 -1425
1936 -1425 276 251 -2267 -4564 -4754 -2343 -108 690 -930 -3085 -4232 -3760 -1347 1097 576 -1984
1952 -1984 -3744 -3647 -1983 208 1412 770 -1975 -3598 -2682 21 1648 1486 -449 -2095 -2513 -1382
1968 -1382 1234 2665 1636 -1167 -2387 -1427 977 2692 2895 1201 -805 -1738 35 2782 3800 2587
1984 2587 444 -517 -350 1679 3725 4434 2507 -309 -441 1454 3700 4553 3870 1961 314 69 2392
2001 2392 4963 5459 3035 980 580 1752 3492 4976 4950 2620 239 580 2920 5161 4823 3420
2017 3420 1548 490 1038 3526 5397 4760 1940 -159 675 2549 3988 4535 3634 1116 -535 275
2033 275 3500 4818 3312 1101 -201 -481 583 2775 4231 2432 -749 -1928 -148 1976 2427 2102
2049 2102 692 -1640 -2850 -629 2345 2728 164 -2079 -2350 -1731 -299 1273 1734 -823 -3948 -3757
2065 -3757 -932 654 326 -914 -2267 -3766 -3905 -1414 839 -90 -2914 -4587 -4010 -2403 -1059 -511
2081 -511 -1115 -3601 -5620 -4468 -1380 -117 -1814 -3512 -4425 -4432 -3783 -1879 -342 -1482 -4589 -5721 -3814
2098 -3814 -1995 -1457 -2046 -2505 -4044 -5256 -3712 -757 -273 -2658 -4211 -3795 -3040 -2879 -1519 -283 -1822
2115 -1822 -4485 -4496 -1889 -466 -1033 -1983 -1940 -2753 -3306 -1670 681 400 -1912 -2922 -1717 -809 -752 264
2133 264 529 -566 -2325 -1708 542 1251 299 28 358 -748 -448 463 2220 1857 -194 -890 391 1249
2151 1249 1319 1558 2204 1305 -362 -123 2273 3289 1931 1322 1682 1551 918 1746 3615 3720 1169 465
2169 465 2059 3042 2692 3119 3502 2489 777 1137 3721 4461 2760 1923 2224 1856 1515 2883 4697 4117
2187 4117 1422 598 2497 3252 3058 3475 3439 1950 236 1411 3911 4512 2637 1253 1279 1460 1709 2988
2205 2988 4134 2850 111 -671 1609 3309 2719 2065 1497 341 -705 713 3346 3310 890 -1035
2221 -1035 -359 784 1242 1565 2185 350 -2170 -2100 1002 2634 1373 -557 -1354 -1521 -1683 -153 1982
2238 1982 1325 -2028 -3355 -1791 -190 115 139 -291 -2086 -3862 -2885 4 1101 -1169 -3037 -3009 -2769
2255 -2769 -2385 -860 172 -1307 -4060 -4668 -2444 -647 -913 -2137 -2529 -3436 -4128 -2992 -468 -332 -2867
2272 -2867 -4552 -3937 -2626 -1969 -1314 -1156 -2802 -4674 -4363 -1874 -226 -1549 -2691 -3255 -3568 -3408 -1954
2289 -1954 -106 -738 -3282 -4258 -2929 -1322 -1079 -1083 -1360 -2193 -3653 -2695 -499 596 -828 -2197 -2291 -2102
2307 -2102 -1392 -446 753 58 -2143 -2535 -1101 488 744 147 -184 -839 -1589 -659 1189 1972 492 -825
2325 -825 -478 352 622 1797 2197 1432 -188 -685 1271 2629 2654 1589 1276 833 400 1231 3323 3522
2343 3522 1750 353 1033 2019 2431 3063 3446 2297 823 1009 2792 4027 3379 2474 2053 1501 1612 2909
2361 2909 4272 3814 2126 925 1564 2994 3353 3499 3048 1735 718 1195 2965 4109 3241 1543 1062
2378 1062 1181 1739 2719 3449 2810 755 -279 1096 2490 2868 1989 1435 105 -438 854 2396 2770
2395 2770 1085 -718 -673 198 771 1774 1860 248 -1173 -1762 -153 1274 942 -7 -1071 -1731 -1568 -319
2413 -319 833 541 -1346 -2756 -2256 -1122 -349 -190 -740 -2261 -3218 -2704 -1065 -318 -943 -2255 -3193 -2913
2431 -2913 -2410 -1172 -740 -1473 -3108 -3873 -3068 -1675 -1141 -1227 -2231 -3321 -3633 -2665 -1415 -841 -1812 -3151
2449 -3151 -3704 -3008 -1982 -1345 -1056 -2115 -3378 -3752 -2461 -971 -868 -1491 -2400 -2851 -2813 -1672 -599 -529
2467 -529 -1568 -2564 -2448 -1703 -718 -258 -584 -1256 -2195 -1916 -685 272 498 -781 -1184 -1690 -910 193 1159
2486 1159 508 -622 -1028 -842 254 1192 1297 581 -264 -645 9 1257 1936 1501 670 76 109 1063 1917
2505 1917 2323 1634 549 249 802 1799 2558 2245 1523 685 793 1571 2576 2768 2084 1205 750 1380 2265
2524 2265 2871 2507 1955 1203 1113 1608 2545 2891 2338 1329 907 1232 2071 2656 2477 2124 992 789 1417
2543 1417 2202 2599 1949 1176 469 685 1528 2059 2021 1269 599 193 700 1659 1991 1510 451 -302 11 644
2563 644 1410 1193 456 -339 -711 -259 579 953 464 -571 -811 -1072 -242 287 323 -109 -1051 -1497 -1123 -341
2583 -341 176 -356 -1017 -1542 -1805 -1086 -398 32 -839 -1675 -2093 -1701 -988 -462 -755 -1364 -2055 -2275 -1553 -803
2603 -803 -612 -992 -1721 -2044 -2075 -1245 -598 -646 -1467 -2255 -2178 -1589 -924 -769 -704 -1612 -2356 -2028 -1166 -357 -549
2624 -549 -1085 -1677 -2046 -1463 -670 -152 -309 -1138 -1742 -1487 -624 -233 -154 -470 -1341 -1492 -1124 197 483 322
2644 322 -361 -989 -984 -224 444 1020 386 -397 -790 -382 630 1054 752 226 -271 -453 289 1018 1482 944
2664 944 -65 -170 200 836 1434 1484 915 -98 17 619 1667 1620 1248 583 242 425 843 1948 2053
2683 2053 1000 89 189 1104 1676 1816 1660 706 91 167 1393 2123 1971 971 302 207 378 1414 2145
2702 2145 1637 511 -293 108 1105 1816 1526 878 243 -252 -51 1498 1784 1148 44 -341 55 630 1258
2721 1258 1423 660 -581 -1019 54 1093 1104 411 -239 -757 -801 -208 962 1058 -202 -1265 -1011 -183 248
2740 248 453 426 -482 -1491 -1328 65 838 470 -897 -1280 -1281 -1011 -453 470 271 -1351 -1960 -1128 -110
2759 -110 -202 -337 -512 -1088 -1916 -1510 107 567 -640 -1534 -1625 -1074 -819 -555 20 -496 -1639 -2026 -940
2778 -940 -96 -383 -737 -1087 -1201 -1484 -1109 37 261 -747 -1823 -1284 -664 -465 -510 -400 -565 -1511 -1523 -578
2798 -578 473 -254 -848 -998 -811 -745 -610 455 381 -542 -1414 -768 -61 13 -230 -58 111 -902 -903 173
2818 173 772 128 -516 -222 6 -270 -108 695 917 -11 -739 -62 845 574 322 496 667 -318 -293 681
2838 681 1286 749 -85 88 427 390 437 1423 1308 396 -566 381 1479 1166 948 1026 896 -81 66 1462
2858 1462 2162 1169 375 389 811 800 1091 1569 1679 152 -296 762 1844 1622 745 782 607 300 412 1711
2878 1711 2133 742 -198 262 991 1361 1114 1432 923 -183 -560 993 2136 1114 322 222 373 130
2896 130 598 1567 1499 14 -1253 -102 983 1080 571 289 114 -842 -750 868 1606 366 -955 -814 -149
2915 -149 -87 324 541 129 -989 -1684 -339 792 377 -750 -735 -881 -1093 -739 364 587 -769 -1925
2933 -1925 -1255 -88 -296 -555 -341 -832 -1801 -1862 -471 309 -480 -1768 -1457 -961 -1276 -998 -383 -341 -1588
2952 -1588 -2362 -1289 -378 -712 -1131 -1164 -1138 -1607 -1569 -511 -45 -808 -1700 -1442 -721 -928 -870 -539 -592 -1257 -1557
2973 -1557 -789 72 -589 -1337 -939 -480 -848 -1051 -250 418 -514 -1341 -593 -64 -232 -641 -176 65 -734 -951
2993 -951 -226 365 -12 -371 -230 159 -308 -232 421 797 86 -438 165 527 391 271 595 857 80 -227
3013 -227 475 1170 1127 364 686 652 377 493 1230 1416 786 -74 501 913 1174 999 1106 1169 688 314 1005
3034 1005 1630 1411 875 614 606 691 875 1450 1492 800 45 360 1236 1421 1103 1048 701 287 127 916 1554
3055 1554 1164 358 211 514 694 839 1064 956 71 -573 181 1121 868 478 214 24 -280 73 816 1087
3075 1087 103 -592 -362 -34 375 394 435 -18 -743 -887 -121 457 245 -244 -912 -831 -498 -352 319 75 -746
3096 -746 -1298 -866 -480 -124 -324 -513 -920 -1346 -1006 -357 57 -288 -1092 -1465 -1164 -666 -411 -140 -465 -1200
3116 -1200 -1474 -1098 -316 -251 -506 -1018 -1195 -1383 -1037 -341 -326 -906 -1105 -1300 -949 -411 -447 -357 -589 -1180 -1314
3137 -1314 -746 -291 -103 -620 -867 -938 -729 -286 -70 49 -538 -787 -822 -371 -182 -6 -277 -545 -637 -399 -152
3158 -152 437 190 -147 -477 -267 -108 387 621 200 2 -439 -53 343 597 728 310 -4 -29 211 691
3178 691 896 865 55 1 185 603 777 899 690 177 59 702 1070 1074 888 475 421 303 482 1147 1294 678
3200 678 382 264 752 1024 1039 938 666 165 429 640 1186 1224 772 384 355 611 1078 1243 1022 354 309
3221 309 223 531 839 872 500 177 88 494 513 843 633 491 184 101 287 620 807 345 -99 -131 10 280
3243 280 483 326 54 -418 -58 111 235 356 239 -89 -546 -372 114 67 -21 -119 -405 -530 -344 6 48
3264 48 -114 -471 -828 -649 -443 -187 -195 -517 -979 -895 -494 -45 -91 -340 -811 -1076 -854 -428 -191 -403 -594 -869
3286 -869 -1048 -909 -433 -406 -546 -714 -1014 -954 -402 -386 -269 -710 -697 -1077 -709 -479 -271 -169 -658 -818 -1126
3307 -1126 -645 -280 -77 -563 -644 -970 -685 -168 -231 -146 -640 -670 -504 -434 -235 -144 -75 -443 -518 -378 -109 133
3329 133 130 -140 -548 -358 -232 305 237 24 -206 -319 -95 61 397 456 155 -238 -22 -58 454 467 532 378
3351 378 -39 -97 548 727 786 342 194 41 192 621 1036 830 314 109 290 590 754 781 653 551 207
3372 207 435 799 1172 870 450 272 443 540 801 856 800 520 248 519 927 868 656 584 340 326 400 821
3394 821 845 728 318 205 272 608 692 662 856 169 -84 359 817 622 553 202 251 166 278 544 659 373
3416 373 -233 -19 392 462 292 359 162 -17 -256 170 540 419 -191 -454 -223 -207 -82 98 -131 -359 -646
3437 -646 -235 97 -84 -317 -411 -397 -522 -803 -162 55 -232 -748 -689 -468 -230 -539 -401 -354 -845 -1036 -563
3458 -563 -158 -400 -672 -650 -723 -672 -906 -470 -243 -696 -1125 -856 -373 -588 -611 -608 -459 -872 -1319 -782 -191 -536
3480 -536 -934 -597 -570 -934 -930 -498 -215 -389 -947 -761 -261 -301 -624 -438 -219 -694 -872 -708 114 -79 -495
3501 -495 -441 -340 -409 -636 56 414 -45 -633 -725 258 267 -91 -21 161 -281 -586 -101 760 506 -211 -170 127
3523 127 289 125 476 791 319 -445 -109 806 844 371 320 442 13 2 507 1172 722 -330 -24 551 884
3544 884 464 682 768 141 -132 308 1248 995 238 91 630 367 680 1003 1242 643 -189 -7 802 931
3564 931 441 443 355 188 17 695 1272 1037 -26 -72 433 625 542 727 888 213 -506 156 939 858 208 -91
3586 -91 182 -74 -1 598 867 251 -531 -375 294 413 144 -6 293 -292 -583 86 712 424 -365 -635 -172
3607 -172 44 -200 184 238 -235 -918 -456 467 234 -351 -553 -210 -406 -615 -36 231 -177 -743 -728 60 7
3628 7 -416 -217 37 -523 -873 -463 184 -62 -788 -532 -107 -162 -620 -306 -14 -245 -712 -467 106 61 -524
3649 -524 -386 -7 -389 -601 -511 210 -236 -545 -564 6 -52 -413 -336 137 -212 -490 -85 -13 35 -526 -360 154
3671 154 72 -508 -341 -11 166 -122 -150 85 -213 -390 -278 284 264 -574 -348 111 -22 -204 49 394 -148
3692 -148 -507 -321 452 214 -157 -29 -31 29 -136 83 388 280 -327 -262 158 291 132 229 298 3 -163 66
3714 66 774 534 -98 -170 131 131 -5 306 671 103 -560 -152 510 541 106 79 204 -5 -205 216 851 392
3736 392 -192 -228 60 425 295 299 338 195 -504 -42 771 400 44 -119 159 46 2 380 619 243 -383 -100
3758 -100 324 526 334 55 160 -67 -279 124 610 378 -15 -344 284 173 237 119 233 83 -431 -21
3778 -21 471 273 54 -24 -133 -2 -221 85 527 269 -367 -250 76 301 107 115 102 -138 -359 -178 329 138
3800 138 -157 -348 -232 -140 -116 87 -61 20 -421 -253 40 45 -78 -153 -180 -108 -305 -162 374 -28 -280 -239 -185
3823 -185 -106 -205 -82 91 -145 -494 -503 -149 -5 -28 -95 -122 -394 -432 -286 49 76 -527 -387 -237 -229 61 81 -70
3847 -70 -286 -406 -309 -60 208 79 -268 -188 -372 -162 -50 168 -122 -131 -422 -115 -68 43 136 -75 -123 -219 -236
3870 -236 115 79 -45 -113 -86 -21 -227 83 309 -10 -381 -218 169 74 153 102 18 2 -74 189 400 384 48 -115
3894 -115 -131 180 271 199 259 -41 -86 -63 -5 246 402 196 -19 62 259 160 390 452 275 -46 30 146 301 493
3918 493 302 237 101 348 311 430 140 112 33 188 165 450 383 366 218 137 169 398 356 325 162 194 169 367
3942 367 392 576 276 169 -117 135 297 181 263 135 -100 119 205 514 361 97 77 0 -78 36 238 156
3964 156 34 -428 -114 136 316 23 -58 -43 -387 -172 43 74 44 -89 -290 -103 139 50 43 -35 -187 -241 -237 -217
3988 -217 -226 -28 -226 -336 -388 -374 -246 -200 -2 -432 -400 -367 -206 -51 -222 -235 -424 -341 -268 -30 -75 60 -197 -496
4012 -496 -348 -182 -94 -20 -166 -398 -336 -322 -83 -24 -49 -306 -318 -377 -224 -143 -95 -71 66 -143 -268 -228 -14 31
4036 31 -115 -218 -211 -126 139 -13 63 -36 -313 -45 6 125 150 141 -13 173 26 -2 208 178 210 -116 282 331 244
4061 244 198 132 83 116 123 217 443 177 160 114 90 98 37 463 118 200 -119 162 240 288 276 149 -16 -56 402 277
4087 277 371 159 274 127 209 106 201 186 203 70 123 252 331 -26 209 82 183 166 118 82 227 -57 94
4110 94 248 216 135 65 51 137 -266 27 6 178 108 -122 148 -14 -137 85 6 -19 148 -173 152 76 -75 57
4134 57 -33 -12 -240 -20 11 86 -97 -199 -30 -124 -190 -269 319 26 -205 -387 -103 -159 -196 -11 125 19 -258
4157 -258 -269 87 78 22 -151 2 -201 -281 -74 122 -109 -305 -252 -139 20 -140 -195 102 -105 -354 -379 -18 50
4180 50 -274 -101 -105 -130 -183 9 138 80 -398 -368 -47 240 -235 -268 -159 -197 -259 -167 159 131 -369 -297 -110 -46 78
4205 78 -31 82 -42 -450 -251 292 440 -130 -245 -181 107 -259 162 166 71 -293 -337 38 285 -2 -65 79
4227 79 -91 -436 -170 280 310 13 -243 4 202 298 101 363 99 -348 -73 278 562 47 21 -47 86 -79
4249 -79 210 411 350 -493 -186 217 421 252 -38 263 179 19 35 451 449 25 -263 44 197 45 127 443
4271 443 414 -159 -71 636 478 58 -29 203 272 33 91 521 316 -41 -25 365 554 215 107 322 344 97
4293 97 81 498 496 -173 -221 191 355 21 57 132 387 -21 11 203 395 -96 -105 112 402 -189 -117 327 219 -187
4317 -187 -109 182 104 -207 -533 248 155 -156 -194 136 131 -165 -184 311 127 -304 -522 -254 12 -227 14 12 -80
4340 -80 -319 -320 -34 162 -254 -491 -153 -231 -457 -228 51 77 -419 -423 -71 -89 -376 -382 -390 -156 -534 -346 -35 -289
4364 -289 -453 -571 -167 -29 -150 -241 -103 -220 -621 -484 -58 -3 -491 -370 -453 -11 -401 -257 -9 -45 -628
4385 -628 -500 -64 -45 -26 -316 -110 -263 -363 -188 188 207 -386 -290 53 138 -138 -115 37 -165 -203 -271 56 382
4408 382 4 -171 68 204 -58 71 447 372 -207 -193 263 290 423 123 226 150 -113 79 514 432 27 -150
4430 -150 275 497 142 281 267 334 63 11 550 684 339 230 131 337 105 206 335 444 149 85 513 577
4452 577 137 286 283 290 76 -13 490 443 224 113 430 301 189 276 241 510 -34 9 323 406 147 148 253 151
4476 151 77 -83 500 340 1 -154 210 442 91 69 146 139 -93 -165 64 182 -121 -84 18 17 -147 -187 -22
4499 -22 -32 -156 -294 -75 -28 119 -149 1 -231 -234 -194 -210 -128 -163 -375 -267 -181 -155 -402 -226 -137 -279 -387 -331
4523 -331 -240 -253 -337 -230 -331 -170 -366 -149 -123 -197 -88 -141 -346 -280 -376 -156 -142 -275 -410 -245 -133 -162 -223 -249
4547 -249 -154 -289 -160 -310 -369 -44 -275 -303 -151 -52 -108 -10 5 -254 -298 -65 191 20 -29 -92 59 24 -109 15
4571 15 -103 49 -256 -55 -75 36 97 -16 59 227 105 199 532 176 64 131 202 146 285 102 275 -59 43
4594 43 26 205 183 94 166 -18 207 196 328 272 285 130 -68 127 122 358 272 337 123 71 118 292 412 148 143
4619 143 -134 153 224 377 419 324 200 14 206 362 108 240 168 215 -13 131 166 139 11 283 -79 164
4641 164 9 112 197 194 -313 136 119 187 139 148 67 7 -72 34 89 17 -33 -245 -17 72 123 -100 103 -122 -104 8
4667 8 52 105 -38 -135 -25 129 -125 -98 33 74 -91 132 -138 15 92 166 -51 -12 -161 -41 -96 82 45 52 -117
4692 -117 -168 -94 -75 33 131 1 -99 -141 -90 211 34 247 -220 -89 -60 -101 -61 -115 -84 9 15 414 -107 8 34
4717 34 -86 -34 -115 -50 21 20 -84 -145 -116 -142 -143 21 -152 -106 -73 12 -110 76 -146 -145 -219 -354 -67 -42 -112 -103 -36 -248
4745 -248 -16 -106 22 29 15 -81 -92 -9 -48 91 -76 -147 -203 -127 -53 -187 -9 -273 -102 -71 -103 72 -46 -25 -227
4770 -227 -260 -52 -7 -19 116 -21 8 -134 37 34 -107 160 -66 14 -209 -100 35 121 55 -15 -183 216 161 -282
4794 -282 96 129 -132 -69 -27 121 -22 110 122 -24 -162 -64 151 181 287 117 -6 180 142 53 107 66 -20 -129
4818 -129 174 111 61 85 46 109 41 24 122 281 168 58 63 188 184 173 90 39 -7 117 224 225 47 88 -33 154
4844 154 133 123 106 336 52 -72 162 172 85 -56 7 63 -175 121 179 224 -225 -82 107 107 -105 -21 127 66
4868 66 -107 -302 278 45 -135 -95 -68 -14 -182 -27 100 -20 -224 -133 -177 109 17 -15 563 -631 -246 -662
4890 -662 -467 216 -400 -404 -492 -133 -94 -434 -53 23 -460 -467 -36 117 7 -377 -337 -36 42 -51 0 -132 -93 -394
4914 -394 -244 55 -101 -785 -209 -329 -418 157 530 147 212 -64 -79 1 -157 -152 104 87 -23 -216 -7 378
4936 378 -46 39 22 143 -31 -80 68 165 -24 -6 4 323 142 -163 8 264 70 -87 141 218 163 -125 184
4959 184 211 106 -127 3 220 158 -26 200 113 103 -125 199 211 -49 -114 279 346 -64 -199 252 215 126 -258
4982 -258 -57 83 69 -46 -450 226 26 25 91 258 -67 -171 -26 247 -218 -134 -223 162 32 -85 62 304
5004 304 -144 -204 -207 112 -261 -256 42 330 266 -502 131 -78 -137 -351 -519 272 -203 -254 638 441 -66 -693 -204
5027 -204 185 -3 -175 -45 74 -280 -384 -136 248 61 -216 -263 -252 -211 -137 176 446 -105 -539 -51 64
5048 64 108 -245 124 -231 179 -197 -936 181 285 -262 -108 339 -12 -35 -290 147 -145 -300 112 231 50
5069 50 -253 -77 252 8 46 109 199 -17 -104 11 298 326 -121 -50 100 -13 -185 177 496 -159 10 -46 154
5092 154 65 35 -18 92 170 -23 120 328 113 46 -78 304 70 14 282 316 115 -197 139 403 116 115 121 100
5116 100 132 -3 88 98 19 -40 0 156 259 7 38 47 65 -253 54 373 -144 -111 -39 227 132 -154 48 254
5140 254 36 -93 -42 324 -59 -102 42 61 -54 -62 -44 -128 -50 -93 -90 -173 84 -314 -1 25 81 -172 -56 112 -77
5165 -77 -83 -167 147 -130 -168 -13 -101 -38 -159 67 -70 -126 -151 -89 -124 -33 -124 -82 67 -10 -155 -140 176 -99 -111 -78
5191 -78 169 -41 -138 -68 257 -4 -258 88 182 36 -153 -69 -50 7 -32 111 216 -76 -257 -90 33 -51 -270
5214 -270 53 21 26 4 -179 49 -45 -93 -13 52 7 99 -39 -27 41 34 262 153 121 -33 -60 146 -98 133 113 96
5240 96 -33 103 84 71 227 63 97 -3 187 -15 44 161 110 -95 -135 -114 110 38 94 -57 -153 -244 155 82
5264 82 65 52 12 17 33 132 -60 145 150 63 93 140 39 34 87 -60 -26 32 -152 -57 -91 -78 -35 -41 81 29 54 80 -51
5293 -51 125 -77 40 107 -70 -73 -31 41 -54 86 9 38 71 108 72 -123 5 -5 -121 -107 53 -83 9 -16 -41 -89
5319 -89 107 87 138 24 -15 10 -98 58 175 83 22 23 -29 26 123 105 21 155 163 292 -57 -82 -20 221 264 93
5345 93 -9 11 -99 -27 367 58 77 -20 -10 139 -12 56 107 -41 20 -41 108 -14 -110 16 11 -145 -46 -98 -56
5370 -56 -136 -136 -213 -48 46 119 35 -30 -169 -97 -213 -126 80 8 -18 -104 59 -11 -182 27 -96 -190 -157 -196 -17 8
5396 8 -59 -71 -227 -204 -158 39 -178 -191 0 -20 -138 -67 -172 -46 -62 -155 -136 85 43 -79 2 -125 -51 -134 -3
5421 -3 65 -102 -168 -71 12 -105 -62 -30 -26 51 -183 -26 -109 -86 27 -48 -101 -152 -189 -27 -56 -74 207 65 -3 -22 -76
5448 -76 107 -75 -163 157 18 127 114 192 -49 149 -49 74 48 69 114 93 224 164 26 277 -30 75 -9
5471 -9 246 130 158 205 125 266 67 157 163 292 300 253 238 219 115 141 232 309 260 105 210 199 -7 274 274 51 144
5498 144 309 143 270 63 278 129 41 6 18 115 135 199 242 227 61 -161 83 130 -12 20 151 59 189 -33
5522 -33 52 119 72 102 1 -63 -40 -157 -12 -10 84 -159 49 0 -115 -302 -31 -7 -96 -175 -64 -241 -3 -98 -79
5547 -79 -15 -214 -182 46 225 -18 -73 -121 -38 131 -152 -224 51 -98 -274 -197 -117 -55 -230 -96 112 -111 40
5570 40 -264 -73 -29 -166 -190 1 105 -47 -177 -232 -219 -240 67 -285 96 -159 -227 -62 -42 7 -27 -75 72 -323
5594 -323 -93 69 -126 -14 12 -24 -90 -109 122 149 88 1 -117 135 23 -14 82 15 -317 -163 95 180 48 -64
5618 -64 -68 -61 195 -24 -45 114 -130 43 201 97 110 13 75 -55 120 81 -15 52 89 -42 80 149 33 -10 -67
5643 -67 307 153 -41 23 264 -70 -230 97 207 45 156 -61 217 149 -16 103 152 -7 -184 123 -49
5664 -49 139 67 -101 44 193 -59 -36 66 -13 -61 -31 96 73 29 -32 -16 39 31 96 93 -11 -27 -64 65 103 -17
5690 -17 -14 66 -150 -129 -260 167 46 2 -243 110 119 -170 22 137 18 -124 91 221 141 -165 -10 9 67 -18
5714 -18 -84 276 7 -270 -98 58 210 31 81 15 -114 -255 115 238 188 -108 -48 121 24 -48 121 106 24
5737 24 -198 5 266 287 -88 40 80 -71 -76 8 219 -63 -135 -127 -26 -50 -12 -181 221 0 -10 179 282 69
5761 69 -313 -53 67 -225 26 -106 81 0 -254 -182 107 8 -55 -49 -12 -144 210 0 121 -38 -258 2 84
5784 84 170 -77 -87 82 -66 -245 -23 109 -60 -261 -6 67 111 -112 -23 -76 -16 -68 88 73 77 -154 -25 -217
5808 -217 95 6 -103 44 58 -102 -192 113 26 -83 -133 100 -83 99 -255 160 -133 -111 -175 116 99 -42 -33
5831 -33 227 327 277 -286 24 115 83 273 -426 133 -230 -132 211 -26 195 184 158 263 -302 40 13 31 -1
5854 -1 128 17 -36 -8 -133 63 276 63 25 172 273 -204 -17 -133 274 -109 -23 231 142 20 -53 119 -145
5877 -145 -184 101 -53 -141 -154 -4 742 157 -288 231 366 -266 -203 -109 83 235 63 -69 2 27 -12 16 70
5900 70 -9 69 -83 69 104 191 -306 189 15 -24 33 -16 -157 -55 -170 -158 -56 25 -119 218 -284 -339 72 -3
5924 -3 229 -142 -218 -259 -38 -75 278 108 309 -11 -215 -94 -390 -446 56 -81 196 -320 -124 -292 -457 -430
5946 -430 -307 -19 63 -346 41 -142 -208 321 -326 -45 -8 -114 -136 62 30 107 -115 -66 24 -183 -18 -127 491
5969 491 228 6 101 -13 -16 25 148 -255 -5 149 306 140 -159 216 254 -383 -55 164 250 55 125 -110
5991 -110 71 60 -71 225 208 154 72 8 221 61 -81 78 -174 94 76 164 11 106 -6 -17 168 168 -151 -47
6015 -47 4 178 -159 -138 137 -153 293 680 249 -10 -44 288 215 97 228 -45 145 233 219 245 -227 -80 460
6038 460 -61 198 126 -114 76 -129 79 -20 -56 -136 -1 -2 11 -107 176 -103 87 111 14 -442 -122 -82 32
6061 32 -89 -51 125 265 -97 -384 -36 -284 -226 -151 -65 -198 -250 -18 45 -193 -1 -123 -104 163 63 -128 -102
6084 -102 -217 -141 -52 6 -72 -52 -27 -90 -33 -114 -51 60 104 141 -38 294 -110 -88 46 -228 -278 -629 17 -139 -89
6109 -89 -212 53 110 -79 80 -78 -124 -21 -6 123 51 -56 123 -184 85 -170 -78 49 -89 289 -19 126
6131 126 -6 -4 101 87 -177 -39 -127 -54 54 -106 -105 7 13 -17 18 330 -92 84 173 -109 170 96 -7 -158
6155 -158 -50 -244 -329 -338 -141 305 -246 -400 29 150 62 -103 178 -25 188 89 71 -142 125 -165 -85 -52 62
6178 62 -124 48 10 93 151 29 -65 64 77 215 189 -135 104 25 -13 84 59 45 -38 -10 -24 -37 105 -118 -41 -187
6204 -187 164 48 -42 117 -130 44 13 -62 62 153 59 -28 -143 287 86 143 -269 511 300 -62 175 288
6226 288 188 -364 -377 -491 434 200 -130 301 85 249 -15 -149 -14 -222 -112 -40 -193 93 170 -107 -69
6247 -69 28 109 17 -48 -125 -132 -78 -95 -155 -29 -152 -2 72 -79 -99 -175 -24 -148 -148 -11 -13 84 -184 14 102 49 51 -76
6275 -76 -39 -217 -333 53 139 84 -224 -43 -58 -141 -218 -258 -222 14 -191 -219 -69 157 -133 9 38 -61 -250 80
6299 80 -192 204 110 -80 176 73 297 -66 89 -82 83 -228 -168 5 108 -170 7 -57 -91 -46 121 78
6321 78 -3 -7 126 -161 -58 -129 52 -75 -110 -105 190 4 -272 -62 -20 -16 -185 -108 -65 17 -115 92 136 112 66 -133
6347 -133 -80 -63 -126 -85 -3 122 -118 -2 165 234 78 9 262 51 -71 -19 19 116 -110 24 -10 92 127 30
6371 30 145 -19 -72 -23 151 241 18 -87 110 -321 -202 -79 274 54 126 -129 214 131 -159 146 -49 35
6393 35 -244 150 88 259 -312 17 -30 -93 146 -267 107 111 91 131 349 26 -126 -70 187 107 57 1 102 -9
6417 -9 -212 78 3 50 -34 -171 376 -140 215 205 -141 -10 -236 -338 -189 -10 -137 -41 -90 -6 -73 -116 -65 82
6441 82 -165 -159 28 -89 -170 -166 85 -44 -167 -144 79 71 -155 -152 -33 69 -176 -88 21 53 -215 -22 150 29
6465 29 -279 8 -163 29 -242 -14 53 21 -49 -81 -20 -177 -51 72 141 -91 -85 -239 -17 -29 -113 -139 -149 177
6489 177 97 -101 -10 108 -113 51 100 145 -73 20 56 1 123 185 107 118 -83 133 -2 126 -83 36 -128
6512 -128 66 -227 38 211 53 21 -118 10 254 -158 -40 48 231 126 59 106 170 -1 -5 -12 155 244 23
6535 23 -87 53 57 -1 126 87 -6 -39 129 -33 100 101 60 15 37 -146 -27 125 45 -68 59 -79 -12 -64 89
6560 89 60 -42 -50 -15 83 97 -30 -53 4 -3 -82 36 -167 7 -131 -60 191 -153 -11 -188 -178 -177 182 6 4 55
6586 55 -133 29 -211 21 -317 -105 -75 -135 24 -112 162 46 -111 -42 107 36 -70 -2 -78 31 -1 179 -95
6609 -95 7 -63 -191 31 -71 -40 95 159 -96 -47 -154 31 -48 -107 141 -42 83 61 124 -132 -13 -79 -78 18
6633 18 -152 0 -48 55 -147 -57 1 63 -42 4 49 120 46 36 179 -7 -140 -63 74 -114 -42 -30 15 133 163
6658 163 106 -19 121 -47 27 210 84 -16 111 -14 129 -47 0 58 32 34 -123 -57 155 -95 118 -72 -60
6681 -60 59 -10 -119 109 -42 145 -11 218 86 -133 -64 -97 31 -37 236 57 3 -95 118 93 -256 -78 30
6704 30 28 10 1 -5 -81 227 -151 -132 -85 22 -50 -183 132 -110 -67 -73 74 -19 -130 -2 64 24 113 -73 -78 -114 -47 -45
6732 -45 -60 21 -8 -156 -56 -150 89 -71 -100 85 18 4 -100 -94 7 42 -51 28 20 -37 110 -54 -56 -55 42 134 80 23
6760 23 2 109 203 13 -181 -100 -116 -243 71 -176 129 27 -206 92 -110 -78 -53 77 -110 8 118 25 3
6783 3 0 -86 84 -66 98 -190 -208 -76 -23 7 85 -185 -46 11 143 73 -124 154 -143 16 -55 -160 -59 118
6807 118 -130 106 72 -9 63 170 91 82 -78 -100 -48 -27 -42 -149 36 -21 52 -95 83 -23 -57 11 0 -5 109 -32
6833 -32 88 20 41 -41 -166 -125 -63 56 119 77 65 87 -143 -31 11 -6 77 118 6 149 39 -87 33 24 -58 -38
6859 -38 49 103 37 27 -185 74 74 -20 69 -102 2 130 -55 50 81 102 10 -28 32 -102 32 70 -193 22 -34
6884 -34 -32 56 -85 -15 144 91 -51 30 93 47 127 29 -110 -56 -21 -41 6 -7 240 56 69 49 -46 -31 23 -2 98
6911 98 11 112 -57 -137 -64 121 46 169 36 55 -108 109 99 33 -29 64 0 -93 -13 12 -295 19 -67 9 -123
6936 -123 -155 47 115 -91 -20 -103 -208 -77 -3 63 -28 1 15 9 -149 -124 -29 -53 -96 -169 130 -142 41 95 75 -60
6962 -60 -217 50 40 115 -106 72 -93 68 -160 74 -73 72 -17 -20 -13 77 106 -46 -53 -4 -41 -188 -3 71 -30
6987 -30 -44 194 31 4 -124 -72 -9 123 128 300 3 -77 94 90 26 -77 -98 -3 -127 9 106 -43 2 64 -47
7012 -47 -3 3 -87 -41 217 190 88 6 -57 81 -113 -68 91 -132 -115 13 68 70 6 -117 171 58 43 -12 73 72 -71
7039 -71 109 124 147 -107 99 42 19 191 149 102 308 -70 45 -59 -69 -40 -48 47 -58 -50 -26 285 -4 23 112 106
7065 106 -33 24 -80 86 -3 -102 109 104 -72 -272 106 -7 165 65 -52 71 -53 11 -159 -33 -196 3
7087 3 39 27 -53 -85 -206 182 -116 -107 -89 157 48 -25 -93 -57 132 -188 -136 -21 -1 -31 -47 238 113 -72 -56 6
7113 6 -61 -64 -67 -56 137 -176 87 17 58 -83 12 1 97 -124 -272 39 -98 -43 -34 -141 -43 -122 -28 -13 22 1 124
7140 124 25 6 209 -65 92 -113 -38 -50 12 51 97 29 99 -41 44 -4 -43 -93 -182 123 58 29 22 10 111 6
7166 6 -81 89 69 -9 52 -113 169 236 52 2 42 -41 -84 75 121 45 -2 71 -97 146 258 111 80 71 -180 129
7192 129 336 6 19 -7 65 -36 -32 132 104 3 -91 65 -8 104 -85 24 -34 -41 -34 -37 102 118 -103 59 43 29
7218 29 57 -53 79 -85 -60 -257 44 -117 -59 6 25 126 92 -81 49 -48 -47 92 169 -31 64 19 22 17 137 106
7244 106 -68 -144 -196 7 110 109 -32 43 107 34 -104 -26 25 12 27 -16 -33 -35 41 59 221 -57 -241 26 8 34
7270 34 65 -119 -90 71 -8 -100 -21 -83 -121 47 87 68 -145 240 -46 74 -66 17 316 -148 97 64 -75 -29
7294 -29 -114 147 -31 103 7 -237 84 3 116 26 -51 64 -124 134 -79 -92 85 -117 -149 258 27 -65 -120
7317 -120 -23 -129 42 258 57 -178 -71 91 86 -243 85 203 32 -141 -56 -109 100 38 141 80 200 -123
7339 -123 110 162 11 -212 -153 119 156 -222 44 -13 43 -179 202 -12 19 -186 -312 33 -145 -44 46 51 55 116
7363 116 29 190 -4 -30 -139 162 146 55 -11 -50 76 -49 -10 28 54 -58 -105 124 -84 -65 186 123 -149 -58
7387 -58 4 42 -36 106 86 50 -19 -35 26 180 126 84 -68 22 136 -34 -150 164 -26 -56 266 82 113 -20 171
7412 171 13 -34 102 118 74 83 -9 -20 -62 -111 -60 -163 -33 6 216 109 -37 -60 54 106 108 181 -56 97 52 41
7438 41 -140 184 83 17 -52 -142 -127 114 -117 98 -103 -42 110 -234 240 -18 -28 93 -2 -58 88 -134 -43
7461 -43 -19 -215 46 -46 -115 -16 -191 53 -24 -105 -82 -95 -10 -78 -74 -178 -178 -271 117 -137 -2 -103 -151 22 139 -231
7487 -231 -87 -157 52 -48 -103 -210 14 -129 12 66 78 -215 -210 -361 -166 192 -94 -23 -210 3 -47 43 -84
7510 -84 -41 52 70 -82 -49 -59 -107 19 -106 26 52 -67 -53 38 -39 -12 99 -97 -79 17 12 -102 96 123 -87 -44
7536 -44 -54 43 121 40 -152 94 -155 -365 -239 -228 -30 7 60 140 19 34 -2 -50 14 195 153 -57 172 -4 -15
7561 -15 224 205 -13 73 143 -44 -81 98 -30 26 58 -43 151 35 -11 4 51 49 214 -35 -51 7 13 -60 91 75
7587 75 -50 84 67 141 135 -88 59 103 -123 -130 -202 -115 -50 -196 -150 12 112 102 41 13 -58 62 -60 -89 -67 63
7613 63 35 -12 -87 47 -72 93 112 -47 95 -153 -131 108 81 -82 -67 -139 -51 164 -51 87 -151 -96 -22 -104
7637 -104 -112 -77 -52 -98 -23 152 139 -68 -217 25 -65 -169 90 -178 -28 67 5 -132 -6 -5 -27 3 77 3 41 -153
7663 -153 -9 -70 60 -22 -124 5 -60 -22 86 54 70 193 -88 88 11 26 -242 97 144 77 78 -23 60 -42
7687 -42 -24 106 -29 154 132 -87 72 67 -80 4 -16 62 -12 92 -20 78 193 -1 171 67 181 64 152 23
7711 23 -54 86 51 -121 84 65 -114 -77 -128 173 57 -60 35 106 -61 143 17 4 151 49 -9 50 35 -28
7735 -28 -42 -37 23 -117 -102 124 -134 -88 -59 -176 5 95 -56 70 229 106 -33 -51 -49 43 -58 -50 136 -12 76
7760 76 112 -2 -51 -63 153 75 -1 -88 40 201 -65 77 -31 -93 -83 -32 135 169 -5 23 -90 111 4 -130
7784 -130 -8 88 -183 94 77 -150 66 -3 190 50 93 -106 72 -36 -108 39 142 90 30 96 24 7 47 -84
7808 -84 108 33 -128 136 -71 -81 -162 229 112 36 314 24 -104 187 160 -42 -26 -20 22 -95 33 126 -152 69
7832 69 201 508 30 -19 -37 -186 59 -11 13 26 -54 -144 247 86 -71 98 93 -40 5 22 -178 97 -93 0
7856 0 -41 -151 -22 10 77 19 75 -56 4 -41 40 42 42 -2 130 4 77 -78 62 16 -68 -76 -10 -171 -105 -5 -56 77
7884 77 189 1 -69 -125 -14 44 50 -48 -51 -122 36 -216 -117 -31 -56 1 83 4 -189 41 7 -20 -111 -129 -97 114 -156
7911 -156 -35 140 58 -237 -131 20 -16 28 93 -118 69 -68 -46 26 210 209 -167 88 331 -147 215 155 50
7934 50 56 -97 358 -333 254 -164 -25 200 -184 -346 -41 -268 -178 -57 -335 85 -421 226 72 50 56 -351
7956 -351 94 -31 310 345 237 -236 -571 -153 -195 -349 319 106 -283 99 84 -95 278 410 179 232 290 -97
7978 -97 59 -196 388 -115 102 -185 149 -114 71 0 779 190 -502 187 -288 217 11 688 19 326 -305
7999 -305 304 -331 -394 -222 -133 51 39 -107 -125 88 194 184 -76 282 -104 362 -144 -157 108 -240 14 -275
8021 -275 491 -352 38 136 -439 428 271 51 -198 -51 -5 168 -20 -31 148 202 -49 -56 30 59 -61 72 78
8044 78 -17 -72 81 -87 56 87 22 -154 -128 126 56 -167 36 -1 110 107 14 107 7 -50 164 15 -44 -177 -76
8069 -76 -64 -34 78 54 -118 -41 171 21 -65 -88 -25 -52 -31 256 292 88 57 -90 -33 -32 62 -118 -78 -104 42 -58
8095 -58 8 -48 54 -68 7 146 -112 47 94 30 110 245 -16 53 75 118 -14 8 137 -61 73 16 -67 178
8119 178 -75 79 -99 -83 19 -15 -60 -28 -81 120 -227 -47 -49 62 76 -139 53 35 24 42 46 -127 107 120 114
8144 114 116 144 -196 -59 -83 -106 80 124 57 -4 -134 -130 87 -215 -149 93 -26 166 30 5 -96 -242 -79 128
8168 128 74 66 86 159 151 -38 -147 211 -52 152 110 128 52 -20 -39 0 256 68 -2 34 -120 -125 94
8191I4
##END NTUPLES=NMR FID
##END=
