##TITLE=1H_LR-698-R2-1-CR6
 CDCl3, 8 sc, 
 31.1.2020
##JCAMPDX= 6.0         $$ Bruker NMR JCAMP-DX V2.0
##DATA TYPE= NMR FID
##DATA CLASS= NTUPLES
##ORIGIN= UXNMR, Bruker Analytische Messtechnik GmbH
##OWNER= root
$$ XWIN-NMR		Version 3.5
$$ Fri Jan 31 15:42:04 2020 Russian Standard Time (UT+4h)  she@DPX200
##.OBSERVE FREQUENCY= 200.1315
##.OBSERVE NUCLEUS= ^1H
##.DELAY= (6, 6)
##.ACQUISITION MODE= SIMULTANEOUS
##.ACQUISITION SCHEME= undefined
##.AVERAGES= 8
##.DIGITISER RES= 18
##SPECTROMETER/DATA SYSTEM= spect
##.PULSE SEQUENCE= zg30
##.SOLVENT NAME= D2O
##.SHIFT REFERENCE= (INTERNAL, D2O, 0, 15.7039)
##AUDIT TRAIL= $$ (NUMBER, WHEN, WHO, WHERE, WHAT)
$$ ##TITLE= Audit trail, XWIN-NMR		Version 3.5
$$ ##JCAMPDX= 5.01
$$ ##ORIGIN= Bruker BioSpin GmbH
$$ ##OWNER= she
$$ F:/spectra/data/she/nmr/H-F/1/audita.txt
$$ ##AUDIT TRAIL=  $$ (NUMBER, WHEN, WHO, WHERE, WHAT)
(   1,<2020-01-31 15:41:02.43 +0400>,<she>,<DPX200>,
      <created by zg, POWCHK disabled, PULCHK disabled
       configuration hash MD5:
       00 E9 B6 7A A2 85 ED C7 34 08 36 98 17 FE 4E 26
       data hash MD5: 16K
       83 94 6A 0F 95 B9 7B 94 10 2B 0D 2D B4 B1 6A A9>)
$$ ##END=
$$ 
$$ hash MD5
$$ F4 C0 75 11 66 7B 60 75 48 E1 F1 D9 1C 7A 84 99
##$RELAX= 
##$RELAX= 
##$RELAX= 
##$RELAX= 
##$RELAX= 
##$RELAX= 
$$ Bruker specific parameters
$$ --------------------------
##$DU= <F:/spectra>
##$EXPNO= 1
##$NAME= <H-F>
##$PROCNO= 1
##$TYPE= <nmr>
##$USER= <she>
##$AMP= (0..31)
100 100 100 100 100 100 100 100 100 100 100 100 100 100 100 100 100 100 
100 100 100 100 100 100 100 100 100 100 100 100 100 100 
##$AQSEQ= 0
##$AQ_mod= 1
##$AUNM= <au_zg>
##$AUTOPOS= <>
##$BF1= 200.13
##$BF2= 200.13
##$BF3= 200.13
##$BF4= 200.13
##$BF5= 200.13
##$BF6= 200.13
##$BF7= 200.13
##$BF8= 200.13
##$BYTORDA= 1
##$CFDGTYP= 0
##$CFRGTYP= 5
##$CHEMSTR= <none>
##$CNST= (0..31)
1 1 145 1 1 1 1 1 1 1 1 1 1 1 1 1 1 1 1 1 1 1 1 1 1 1 1 1 1 1 1 1 
##$CPDPRG= <>
##$CPDPRG1= <>
##$CPDPRG2= <>
##$CPDPRG3= <>
##$CPDPRG4= <mlev>
##$CPDPRG5= <mlev>
##$CPDPRG6= <mlev>
##$CPDPRG7= <mlev>
##$CPDPRG8= <mlev>
##$CPDPRGB= <>
##$CPDPRGT= <>
##$D= (0..31)
0 1.2 0 0 0 0 0 0 0 0.06 0 0.03 0 0 0 0 0.0002 0 0 0 0 0 0 0 0 0 0 0 0 
0 0 0 
##$DATE= 1580470861
##$DBL= (0..7)
120 120 120 120 120 120 120 120 
##$DBP= (0..7)
150 150 150 150 150 150 150 150 
##$DBP07= 0
##$DBPNAM0= <>
##$DBPNAM1= <>
##$DBPNAM2= <>
##$DBPNAM3= <>
##$DBPNAM4= <>
##$DBPNAM5= <>
##$DBPNAM6= <>
##$DBPNAM7= <>
##$DBPOAL= (0..7)
0.5 0.5 0.5 0.5 0.5 0.5 0.5 0.5 
##$DBPOFFS= (0..7)
0 0 0 0 0 0 0 0 
##$DE= 6
##$DECBNUC= <off>
##$DECIM= 24
##$DECNUC= <off>
##$DECSTAT= 4
##$DIGMOD= 1
##$DIGTYP= 9
##$DL= (0..7)
0 120 120 120 120 120 120 120 
##$DP= (0..7)
150 150 150 150 150 150 150 150 
##$DP07= 0
##$DPNAME0= <>
##$DPNAME1= <>
##$DPNAME2= <>
##$DPNAME3= <>
##$DPNAME4= <>
##$DPNAME5= <>
##$DPNAME6= <>
##$DPNAME7= <>
##$DPOAL= (0..7)
0.5 0.5 0.5 0.5 0.5 0.5 0.5 0.5 
##$DPOFFS= (0..7)
0 0 0 0 0 0 0 0 
##$DQDMODE= 0
##$DR= 18
##$DS= 0
##$DSLIST= <SSSSSSSSSSSSSSS>
$$ [...]
##$SUBNAM2= <"">
##$SUBNAM3= <"">
##$SUBNAM4= <"">
##$SUBNAM5= <"">
##$SUBNAM6= <"">
##$SUBNAM7= <"">
##$SUBNAM8= <"">
##$SUBNAM9= <"">
##$SW= 24.9337058887773
##$SWIBOX= (0..15)
0 0 2 0 0 0 0 0 0 0 0 0 0 0 0 0 
##$SW_h= 4990.01996007984
##$TD= 16384
##$TD0= 1
##$TE= 0
##$TE2= 300
##$TE3= 300
##$TEG= 300
##$TL= (0..7)
0 120 120 120 120 120 120 120 
##$TP= (0..7)
150 150 150 150 150 150 150 150 
##$TP07= 0
##$TPNAME0= <>
##$TPNAME1= <>
##$TPNAME2= <>
##$TPNAME3= <>
##$TPNAME4= <>
##$TPNAME5= <>
##$TPNAME6= <>
##$TPNAME7= <>
##$TPOAL= (0..7)
0.5 0.5 0.5 0.5 0.5 0.5 0.5 0.5 
##$TPOFFS= (0..7)
0 0 0 0 0 0 0 0 
##$TUNHIN= 0
##$TUNHOUT= 0
##$TUNXOUT= 0
##$USERA1= <user>
##$USERA2= <user>
##$USERA3= <user>
##$USERA4= <user>
##$USERA5= <user>
##$V9= 5
##$VALIST= <valist>
##$VCLIST= <CCCCCCCCCCCCCCC>
##$VD= 0
##$VDLIST= <DDDDDDDDDDDDDDD>
##$VPLIST= <PPPPPPPPPPPPPPP>
##$VTLIST= <TTTTTTTTTTTTTTT>
##$WBST= 1024
##$WBSW= 4
##$XGAIN= (0..3)
0 0 0 0 
##$XL= 0
##$YL= 0
##$YMAX_a= 87757
##$YMIN_a= -36563
##$ZGOPTNS= <>
##$ZL1= 120
##$ZL2= 120
##$ZL3= 120
##$ZL4= 120
##$ABSF1= 10
##$ABSF2= 0
##$ABSG= 5
##$ABSL= 3
##$ALPHA= 0
##$AQORDER= 0
##$ASSFAC= 0
##$ASSFACI= 0
##$ASSFACX= 0
##$ASSWID= 0
##$AUNMP= <proc_1d>
##$AZFE= 0.1
##$AZFW= 0.1
##$BCFW= 1
##$BC_mod= 2
##$BYTORDP= 1
##$COROFFS= 0
##$CY= 11.3945322036743
##$DATMOD= 1
##$DC= 2
##$DFILT= <>
##$DTYPP= 0
##$F1P= 16.9975609425685
##$F2P= -3.02152046262296
##$FCOR= 0.5
##$FTSIZE= 0
##$FT_mod= 4
##$GAMMA= 1
##$GB= 0.15
##$INTBC= 1
##$INTSCL= 1
##$ISEN= 128
##$LB= 0.24
##$LEV0= 0
##$LPBIN= 0
##$MAXI= 10000
##$MC2= 0
##$MEAN= 0
##$ME_mod= 0
##$MI= 1.114404
##$NCOEF= 0
##$NC_proc= 0
##$NLEV= 6
##$NOISF1= 3.799351
##$NOISF2= 2.8
##$NSP= 1
##$NTH_PI= 0
##$NZP= 0
##$OFFSET= 15.70392
##$PC= 1
##$PHC0= -9783.976
##$PHC1= 7.40081
##$PH_mod= 1
##$PKNL= yes
##$PPARMOD= 0
##$PSCAL= 0
##$PSIGN= 0
##$REVERSE= no
##$SF= 200.130013532006
##$SI= 16384
##$SIGF1= 3
##$SIGF2= 2
##$SINO= 400
##$SIOLD= 16384
##$SREGLST= <1H.CDCl3>
##$SSB= 0
##$STSI= 0
##$STSR= 0
##$SW_p= 3612.71676300578
##$SYMM= 0
##$S_DEV= 0
##$TDeff= 0
##$TDoff= 0
##$TI= <>
##$TILT= no
##$TM1= 0
##$TM2= 0
##$TOPLEV= 0
##$USERP1= <user>
##$USERP2= <user>
##$USERP3= <user>
##$USERP4= <user>
##$USERP5= <user>
##$WDW= 1
##$XDIM= 8192
##$YMAX_p= 0
##$YMIN_p= 0
$$ End of Bruker specific parameters
$$ ---------------------------------
##NTUPLES= NMR FID
##VAR_NAME=  TIME,          FID/REAL,        FID/IMAG
##SYMBOL=    X,             R,               I
##VAR_TYPE=  INDEPENDENT,   DEPENDENT,       DEPENDENT
##VAR_FORM=  AFFN,          ASDF,            ASDF
##VAR_DIM=   8192,          8192,            8192
##UNITS=     SECONDS,       ARBITRARY UNITS, ARBITRARY UNITS
##FACTOR=    0.0002004,     1,               1
##FIRST=     0,             0,               0
##LAST=      1.6414764,     0,               0
##MIN=       0,             -36563,          0
##MAX=       1.6414764,     87757,           0
$$ Real data points
##PAGE= N=1
##DATA TABLE= (X++(R..R)), XYDATA
$$ [...]
$$ plain form
2068 -412 550 1007 603 -291 -943 -807 169 751 579 -411 -1238 -1078 -797 351 673 -171 -951 -1666 -1392 -192
2088 -192 115 386 -968 -1344 -1686 -835 -180 364 -435 -1557 -2013 -1349 -391 -410 -290 -1098 -2133 -2081 -1147 -228
2108 -228 -227 -690 -1709 -1915 -1359 -349 -197 -41 -1061 -1964 -1715 -1025 -21 142 -442 -1570 -1666 -1181 -167
2127 -167 562 200 -865 -1635 -1364 -241 471 342 -10 -1129 -1060 -506 -103 862 269 -375 -811 -607 300
2146 300 971 739 455 -233 -795 -118 973 1227 1111 197 -633 -386 1044 1607 1641 989 -207 -113 709 1213
2166 1213 1610 963 309 -157 656 1141 1657 1552 656 128 47 990 1598 1542 969 161 162 625 1477 1902 1311
2187 1311 411 -67 456 948 1725 1523 1147 164 114 361 1149 1673 1215 418 -316 -116 684 1132 767 683
2207 683 -418 -320 -86 1099 816 549 111 -745 -586 393 1003 617 14 -433 -609 -260 347 326 130 -606
$$ packed form
2068d12R62M57m04q94o52J36R76N82j72r90q27J60K81J148L22q44p80p15K74J200
2088a92L07K71j354l76l42Q51O55N44p99j122m56O64R58j9J20q08j035N2R34R19
2108b28Jm63j019k06N56J010J52J56j020r03K49O90J004J63n84j128r6M85J014
2127a67P29l62j065p70K71J123P12j29l52j119O9N54M03R65n93o44m36K04R07
2146C00O71k32k84o88n62O77J091K54j16r14q30K47J430N63L4o52j196R4Q22N04
2166A213L97o47o54m66Q13M85N16j05q96n28q1R43O08n6n73q08JM63Q52M25n91
2187A311r00m78N23M92P77k02l76r83n0K47P88N24m58p97p34K00Q00M48l65q4
2207F83j101R8K34J185k83k67m38q56J59R79O10l86o03m47j76L49O07k1j96p36
$$ plain form
2227 -606 -1070 -586 -135 459 296 -280 -1122 -1156 -141 240 363 -6 -797 -938 -751 -227 118 -57 -399 -1177
2247 -1177 -1020 -269 175 193 -182 -946 -1053 -482 -189 232 -18 -858 -1165 -1013 -157 220 138 -314 -807 -1294
2267 -1294 -686 -13 395 13 -837 -1260 -452 327 696 673 -220 -501 -576 -250 706 981 257 -410 -445 -322 432
2288 432 979 641 402 -323 -307 400 896 1216 463 -77 -325 116 806 1092 1034 132 -343 62 481 1147 1378
2309 1378 291 53 -337 478 1017 1421 816 348 206 132 662 1281 1274 555 206 -320 343 898 1258 1133
2329 1133 2 -392 -119 645 986 698 485 -89 -270 73 656 944 678 -138 -553 -494 307 1043 495 265
2349 265 -518 -678 27 525 444 113 -366 -961 -377 -66 611 126 -657 -979 -1089 -286 117 394 -191 -983
2369 -983 -940 -743 -318 136 16 -369 -873 -895 -399 22 94 -146 -1068 -1095 -1078 -260 37 -581 -695 -880 -1303 -240
$$ packed form
2227f06m64M84M51N94j63n76q42l4J015L81J23l69p91j41J87N24L45j75l42p78
2247a177J57P51M44J8l75p64j07N71K93M21k50q40l07J52Q56L77q2m52m93m87
2267a294O08O73M08l82q50m23Q08P79L69k3q93k81p5L26R56K75p24o67l5J23P54
2288D32N47l38k39p25J6P07M96L20p53n40k48M41O90K86n8r02m75M05M19O66K31
2309A378j087k38l90Q15N39M04o05m68j42p4N30O19pp19l49n26O63N55L60j25
2329A133j131l94K73P64L41k88k13n74j81L43N83K88k66q16m15N9Q01P36n48k30
2349B65p83j60P05M98q1l31m79n95N84L11O77m85p83l22j10Q03M03K77n85p92
2369i83M3J97M25M54j20l85n04k2M96M21P2k40r22k7J7Q18K97o18j14j85m23J063
$$ plain form
2391 -240 116 -22 -396 -1042 -1070 -687 -132 148 -290 -856 -899 -832 -269 258 -42 -707 -1029 -1006 -189 86 370
2412 370 -3 -877 -1071 -654 -193 702 20 -81 -903 -871 -265 513 385 -47 -739 -591 -451 238 675 355
2432 355 -165 -624 -573 82 382 549 295 -395 -815 -360 574 855 630 -343 -411 -780 204 592 865 326 -407
2453 -407 -483 -569 581 820 465 -9 -497 -230 116 1098 501 334 -494 -605 -108 690 579 327 -350 -360 -507
2474 -507 413 640 362 22 -338 -494 229 428 699 229 -267 -197 -110 514 738 743 -85 -508 -360 90 516
2495 516 830 292 -188 -357 45 648 781 477 -74 -439 -385 174 634 941 207 -342 -204 4 472 950
2515 950 725 96 -250 -229 583 1063 686 268 -277 -295 62 593 907 677 -91 -269 38 441 783 770 362
2536 362 -259 85 253 472 723 422 -241 -351 41 515 731 627 114 -252 -58 191 640 901 312 224
$$ packed form
2391b40L56j38l74o46k8L83N55K80m38n66m3O7N63N27l00o65l22K3Q17K75K84
2412C70l73q74j94M17M61Q95o82j01q22L2O06P78j28m32o92J48J40O89M37l20
2432C55n20m59N1O55L00J67k54o90m20M55R34K81k25r73o8l69R84L88K73n39p33
2453d07p6q6J150K39l55m74m88K67L46R82n97j67q28j11M97P98j11k52o77j0j47
2474e07R20K27k78l40l60j56P23J99K71m70m96P0Q7O24K24Nq28m23J48M50M26
2495E16L14n38m80j69M02O03J33l04n51l65N4N59M60L07p34n49J38K08M68M78
2515I50k25o29l46K1Q12M80l77m18n45j8L57N31L14k30p68j78L07M03L42j3m08
2536C62o21L44J68K19K51l01o63j10L92M74K16j04n13l66J94K49M49K61n89q8
$$ plain form
2556 224 -489 12 357 920 727 21 -301 -627 94 425 620 443 -294 -982 -538 374 641 174 -463 -806
2576 -806 -590 -120 254 464 -23 -399 -782 -711 -2 76 75 -777 -1145 -1069 -266 -25 88 -348 -804 -1068 -581 -231
2598 -231 190 -226 -886 -1010 -869 -348 -99 -289 -652 -924 -1430 -633 -241 28 -238 -869 -1337 -1197 -646 -229
2618 -229 -88 -376 -1044 -1107 -729 -142 -91 -436 -989 -1253 -1272 -272 -127 -149 -574 -1072 -1043 -845 -98 -25 19 -769
2640 -769 -1105 -758 -130 52 51 -538 -807 -508 -463 135 227 -370 -506 -554 -159 360 235 558 -179 -275 -183 -235 597
2663 597 554 241 -217 -247 -72 771 815 491 -19 -328 -194 565 675 970 420 63 -187 239 748 1102 914
2684 914 139 14 247 519 677 1026 292 301 103 651 970 1082 764 485 -49 437 712 995 1000 781 275
2705 275 246 458 937 981 782 151 -31 482 559 930 1003 494 139 -263 377 558 848 627 215 -92 96
$$ packed form
2556B24p13N01L45N63j93p06l22l26P21L31J95j77p37o88M44R12K67m67o37l43
2576h06K16M70L74K10m87l76l83P1P09P8jq52l68P6Q03K41J13m36m56k64M87L50
2598b31M21m16o60j24J41N21K49j90l63k72n06P97L92K69k66o31m68J40N51M17
2618b29J41k88o68o3L78N87N1l45n53k64j9J000J45k2m25m98K9J98P47P3M4p88
2640g69l36L47O28J82jn89k69K99M5N98R2n97j36m8L95N19j25L23p37r6R2n2Q32
2663E97m3l13m58l0J75Q43M4l24n10l09J34P59J10K95n50l57k50M26N09L54j88
2684I14p75j25K33K72J58L49p34Rj98N48L19J12l18k79n34M86K75K83Nk19n06
2705B75k9K12M79M4j99o31j82N13P7L71P3n09l55m02O40J81K90k21m12l07J88
$$ plain form
2726 96 342 708 331 320 -214 -91 54 402 394 328 -424 -105 -85 162 473 282 -32 -383 -528 -122 582 294
2748 294 178 -385 -542 -316 -182 314 149 -88 -404 -816 -236 245 70 -313 -652 -730 -238 208 12 129
2768 129 -502 -814 -424 -74 102 82 -437 -542 -777 -280 101 -123 -129 -448 -371 -484 -57 320 54 -467 -417 -183
2790 -183 -103 60 603 -1 -228 -386 -327 164 403 333 -89 -469 -350 207 559 472 403 -124 -127 14 -4 650 329
2813 329 -77 29 -66 123 914 615 331 27 71 76 341 494 267 241 91 205 228 375 459 72 -107 303
2835 303 320 448 327 230 -48 167 13 575 491 823 318 -385 -45 -53 513 199 167 -152 -251 -131 483 474 101
2858 101 -100 -153 -332 -70 292 214 251 -101 -453 -516 -47 163 11 -101 -527 -132 -378 266 114 84 -218 -656
2880 -656 -607 -180 -75 5 -303 -527 -392 -264 15 48 -153 -411 -382 -470 -60 352 -354 -232 -781 -352 -128 228
$$ packed form
2726I6K46L66l77j1n34J23J45L48qo6p52L19K0K47L11j91l14l51j45M06P04k88
2748B94j16n63j57K26J34M96j65k37l16m12N80M81j75l83l39p8M92M46j96J17
2768A29o31l12L90L50J76k0n19j05k35M97L81k24ol19P7j13M27L77k66n21N0K34
2790a83Q0J63N43o04k27j58N9M91K39p0m22l80J19N57L52q7o9n27lJ41j8O54l21
2813C29m06J06r5J89P91k99k84l04M4NK65J53k27k6j50J14K3J47Q4l87j79M10
2835C03J7J28j21r7k78K15j54N62q4L32n05p03L40qN66l14l2l19r9J20O14rl73
2858A01k01n3j79K62L62p8L7l52l52o3M69K10j52j12m26L95k46O44j52l0l02m38
2880f56M9M27J05Q0l08k24J35J28K79L3k01k58K9q8M10M12p06J22n49M29K24L56
$$ plain form
2902 228 -113 -136 -536 -345 -161 120 -103 -147 -226 -378 -556 266 228 -132 152 -703 -112 235 200 261 16 64
2924 64 -254 116 -6 429 419 -133 97 -123 135 273 299 207 -64 -384 233 457 856 304 115 149 267 214
2946 214 601 326 -11 -48 -26 195 223 267 569 -139 -54 -166 151 455 580 203 29 -335 -58 258 175 74
2968 74 70 -34 -232 351 8 340 -183 -60 -567 281 289 403 7 -117 -359 -288 154 16 191 -348 -426 -592
2990 -592 -398 -62 124 -136 -587 -596 -126 85 -12 -135 -350 -787 -625 -469 100 -310 -423 -630 -744 -588 55
3011 55 -118 -497 -445 -479 -577 -96 193 -325 -373 -334 -425 -255 -35 -174 -152 -455 -487 -452 -227 100 10 -116 -390 -361
3035 -361 -528 118 16 -137 -75 -588 -12 -28 14 278 -16 -160 -265 24 292 274 -138 156 -296 52 424
3056 424 311 39 320 61 -120 427 298 509 448 265 1 507 370 647 525 368 232 412 562 689
$$ packed form
2902B28l41k3m00J91J84K81k23m4p9j52j78Q22l8l60K84q55N91L47l5O1k45M8
2924F4l18L70j22M35j0n52K30k20K58J38K6r2k71l20O17K24L99n52j89L4J18n3
2946B14L87k75l37l7K2K21K8M4L02p08Q5j12L17L04J25l77j74l64K77L16q3j01
2968G4mj04j98N83l43L32n23J23n07Q48QJ14l96j24k42P1M42j38J75n39p8j66
2990e92J94L36J86k60m51rM70K11r7j23k15m37J62J56N69m10j13k07j14J56O43
3011E5j73l79N2l4r8M81K89n18m8L9r1J70K20j39K2l03l2L5K25L27r0j26k74K9
3035c61j67O46j02j53O2n13N76j6M2K64k94j44j05K89K68j8m12K94m52L48L72
3056D24j13k72K81k59j81N47j29K11o1j83k64N06j37K77j22j57j36J80J50J27
$$ plain form
3076 689 509 581 462 262 393 543 927 866 64 212 266 302 865 542 433 248 54 847 943 461 606 150
3098 150 87 -17 657 773 497 429 25 242 519 626 483 337 117 132 -5 461 728 416 -298 16 15 62
3120 62 329 285 259 -222 -345 -368 -1 5 301 -219 -52 -263 -272 -123 -295 -215 -667 -490 -96 -98 -39 -421 -611 -494
3144 -494 -576 -346 -51 -142 -156 -447 -725 -589 -380 -431 -301 -349 -554 -944 -224 52 -248 -501 -653 -664 -374 -246
3166 -246 -193 -475 -489 -519 -574 -102 -296 -364 -545 -538 -306 -90 -113 57 -324 -289 -483 -350 -274 103 -16 -483 -508 -376
3190 -376 11 11 -147 -119 -36 -174 -66 264 155 -213 -145 -66 -318 -1 426 208 93 -381 0 101 555 463
3212 463 340 -159 -226 -46 199 406 450 52 19 87 58 263 367 175 -8 -80 162 214 128 85 -138 56 -175
3235 -175 251 268 361 153 139 -217 128 360 483 419 -29 -173 -70 141 344 417 -157 -140 -149 8 129 156 81
$$ packed form
3076F89j80P2j19k00J31J50L84o1q02J48N4L6N63l23j09j85j94P93R6m82J45m56
3098A50o3j04O74J16k76o8m04K17K77J07j43j46k20J5j37M66K67l12p14L14jM7
3120F2K67m4k6m81j23k3L67OK96n20J67k11rJ49j72Q0m52J77L94kN9l82j90J17
3144d94q2K30K95r1j4k91k78J36K09n1J30m8k05l90P20K76l00k53j52j1K90J28
3166b46N3k82j4l0n5M72j94o8j81PK32K16k3J70l81L5j94J33P6L77j19m67k5J32
3190c76L87%j58K8Q3j38J08L30j09l68O8P9k52L17M27k18j15m74L81J01M54r2
3212D63j23m99o7J80K45K07M4l98l3O8k9K05J04j92j83p2K42N2q6m3k23J94k31
3235a75M26J7R3k08j4l56L45K32J23o4m48j44J03K11K03P3n74J7rJ57J21K7p5
$$ plain form
3258 81 -144 -332 -412 -77 235 251 -182 -197 -195 -40 176 198 -176 -109 -595 -219 -104 86 -4 -85 -308 -161 -290
3281 -290 333 -129 170 21 -261 -8 -49 65 128 -160 -225 -87 -212 231 274 314 -32 -24 60 212 130 177 -41
3304 -41 -57 -49 222 282 349 325 141 171 -51 318 450 365 335 185 167 171 304 580 300 209 160 273 407 655 519
3329 519 367 129 260 346 281 456 609 166 144 487 170 590 381 512 158 137 111 489 517 512 201 283 105
3352 105 301 405 217 232 -157 104 371 212 145 -27 -340 78 -225 286 93 160 -124 -233 -28 134 110
3373 110 159 -178 -389 -595 -82 106 -38 -116 -283 -716 -722 -247 -416 -403 -4 -639 -604 -619 -90 -258 -495 -707
3395 -707 -829 -648 -506 -355 -759 -471 -716 -455 -585 -548 -473 -435 -566 -432 -643 -482 -280 -432 -561 -889 -652
3416 -652 -500 -466 -645 -548 -315 -691 -314 -165 -493 -352 -73 -624 -598 -477 -129 105 -358 -309 -409 -48 -203
$$ packed form
3258H1k25j88q0L35L12J6m33j5KJ55K16K2l74O7m86L76J15J90r0q1k23J47j29
3281b90O23m62K99j49k82K53m1J14O3k88o5J38j25M43M3M0l46QQ4J52q2M7k18
3304d1j6QK71O0O7k4j84L0k22L69J32q5l0j50j8MJ33K76k80r1m9J13J34K48j36
3329E19j52k38J31Q6o5J75J53m43k2L43l17M20k09J31l54k1k6L78K8nl11Q2j78
3352A05J96J04j88J5l89K61K67j59o7j72l13M18l03N11j93O7k84j09K05J62k4
3373A10M9l37k11k06N13J88j44p8j67m33oM75j69J3L99o35L5j5N29j68k37k12
3395g07j22J81J42J51m04K88k45K61j30L7P5L8j31J34k11J61K02j52j29l28K37
3416f52J52L4j79R7K33l76L77J49l28J41K79n51K6J21L48K34m63M9j00L61j55
$$ plain form
3437 -203 169 2 -148 -267 -46 -368 104 16 -37 -37 -117 246 284 467 271 120 -58 -6 326 252 513 415 -102
3460 -102 295 -115 513 472 218 536 249 284 422 600 433 597 135 342 616 553 599 470 392 121 312 503
3482 503 341 217 515 280 163 559 216 682 365 203 49 402 418 466 283 301 58 119 105 298 -10 180
3504 180 173 -51 186 406 328 196 180 -126 -224 -73 299 -44 -151 -220 -95 -122 132 151 -23 -348 -302 -178 -165
3527 -165 -325 -187 1 -349 -337 44 -96 -226 -274 -600 -209 -545 -259 -13 -316 -81 -389 -422 -115 -198 145
3548 145 -364 -362 -431 -306 -146 -268 -121 -350 -778 -250 -354 -122 52 -269 -376 -471 -339 -24 -206 87 -281
3569 -281 -272 -172 -123 86 -13 -219 -289 22 -15 144 -132 -35 116 243 48 74 -17 25 6 -100 -382 315 90 315
3593 315 62 141 46 23 588 505 372 176 218 441 217 508 268 58 469 411 504 218 378 310 176 125 347
$$ packed form
3437b03L72j67j50j19K21l22M72q8n3%q0L63L8J83j96j51j78N2L32p4K61r8n17
3460a02L97m10O28m1k54L18k87L5J38J78j67J64m62K07K74o3M6j29p8k71J91J91
3482E03j62j24K98k35j17L96l43M66l17j62j54L53J6M8j83J8k43O1j4J93l08J90
3504A80pk24K37K20p8j32j6l06r8J51L72l43j07o9J25k7K54J9j74l25M6J24J3
3527a65j60J38J88l50J2L81j40j30m8l26L91l36K86K46l03K35l08l3L07q3L43
3548A45n09Ko9J25J60j22J47k29m28N28j04K32J74l21j07r5J32L15j82K93l68
3569b81RJ00M9K09r9k06p0L11l7J59k76R7J51J27j95K6r1M2j9j06k82O97k25K25
3593C15k53P9r5k3N65q3j33j96M2K23k24K91k40k10M11n8R3k86J60o8j34n1K22
$$ plain form
3616 347 -5 519 362 206 321 197 168 266 469 263 226 80 -125 39 172 186 228 340 10 -34 90 202
3638 202 37 -132 86 -196 83 31 -292 -238 -10 68 -278 -130 141 358 158 -172 -98 -340 147 -190 -277 -232
3660 -232 205 -172 -54 30 -349 -296 -455 -335 -163 69 -10 -115 -308 -200 -29 -217 -164 -277 -280 -327 -28 -455
3682 -455 9 -33 -197 -171 -145 123 -129 1 -186 -227 75 -208 -123 -174 -194 36 -119 -222 42 160 82 -370 -146
3705 -146 -121 439 197 415 -101 6 -92 278 74 180 86 189 -164 62 64 249 183 286 324 -67 125 222 366
3728 366 296 250 147 55 407 106 278 242 365 229 -184 265 449 496 204 282 353 112 125 530 284 80 61
3751 61 -103 568 368 199 148 195 91 167 -69 158 115 9 -103 -142 211 -86 167 -363 -194 -121 -360 -172
3773 -172 49 -67 -325 -147 -95 26 -81 -266 188 -102 -153 -264 -151 -143 -300 -164 -574 82 0 -218 -30 62
$$ packed form
3616C47l52N24j57j56J15j24k9R8K03k06l7j46k05J64J33J4M2J12l30m4J24J12
3638B02j65j69K18k82K79n2l23N4K28P8l46J48K71K17k00l30P4k42M87l37q7M5
3660b32M37l77J18Q4l79N3j59J20J72K32p9j05j93J08J71j88N3j13lm7K99m27
3682d55M64m2j64K6K6K68k52J30j87m1L02k83Q5n1k0K30j55j03K64J18p8m52K24
3705a46K5N60k42K18n16J07r8L70k04J06r4J03l53K26KJ85o6J03L8l91J92R7J44
3728C66p0m6j03r2L52l01J72l6J23j36m13M49J84M7k92P8P1k41J3M05k46k04j9
3751F1j64O71k00j69n1M7j04P6k36K27m3j06j12l9L53k97K53n30J69P3k39J88
3773a72K21j16k58J78N2J21j07j85M54k90n1j11J13Qj57J36m10O56q2k18J88R2
$$ plain form
3795 62 -3 -243 -197 -162 -320 -227 46 -333 -164 101 -149 -181 -61 -336 -268 -84 136 -36 -311 -427 -456 -176 -100
3818 -100 119 -144 -335 -212 3 11 166 -57 -132 -449 -103 254 -133 122 -95 -22 64 -206 146 -163 -225 122
3840 122 -435 165 127 295 237 145 35 103 150 58 -16 90 -5 -93 334 300 434 30 63 224 174 117 148 84 146
3865 146 236 10 133 164 363 155 121 -292 -34 55 114 109 103 188 -182 21 -179 259 507 -9 -196 -123 66 130
3889 130 50 -113 10 -207 32 -148 -220 26 -90 274 -267 -18 3 59 -69 -88 -77 26 3 -111 -137 -252 -180
3912 -180 -429 -108 -184 -245 -33 -284 -456 -129 54 80 -300 -567 -330 -224 -309 -489 -405 -212 -257 -279 -202 -294 -239
3935 -239 70 -444 -324 -191 -302 -73 -297 -42 -460 -396 -32 -180 -23 -7 -177 -241 -25 52 192 -177 157
3956 157 -172 133 -256 84 -89 176 -50 -56 19 333 113 -87 96 103 132 -36 160 -62 51 -135 267 242
$$ packed form
3795F2o5k40M6L5j58R3K73l79J69K65k50l2J20k75O8J84K20j72k75j16k9K80P6
3818a00K19k63j91J23K15QJ55k23p5l17L46L57l87K55k17P3Q6k70L52l09o2L47
3840A22n57O00l8J68n8r2j10O8M7r2p4J06r5q8M27l4J34m04L3J61n0n7L1o4O2
3865A46R0k26J23L1J99k08l4m13K58Q9N9noQ5l70K03k00M38K48n16j87P3J89O4
3889A30q0j63J23k17K39j80p2K46j16L64n41K49K1N6j28j9J1J03k3j14k6j15P2
3912a80k49L21p6o1K12k51j72L27J83K6l80k67K37J06q5j80Q4J93m5k2P7r2N5
3935b39L09n14J20J33j11K29k24K55m18O4L64j48J57J6j70o4K16P7J40l69L34
3956A57l29L05l89L40j73K65k26oP5L14k20k00J83PK9j68J96k22J13j86M02k5
$$ plain form
3978 242 385 221 417 244 118 292 46 258 160 13 177 271 182 579 164 295 339 317 231 376 477 306
4000 306 546 346 212 128 70 302 203 186 137 6 308 259 268 -2 216 97 -60 412 181 132 -96 92 159
4023 159 25 152 -7 307 155 49 263 -209 -89 107 -91 -119 11 294 -292 184 -192 -300 -180 -59
4043 -59 -45 -329 -82 -307 -230 -117 -119 -95 -9 -135 -412 -275 -266 -286 -203 -132 -317 -493 -345 -30 128 -155 -176 -76
4067 -76 -137 -202 60 -63 -89 -463 -86 9 -175 -167 -77 -246 -489 -94 -174 -35 132 -186 -23 -157 -17 -162 -7
4090 -7 -208 -204 -466 -397 35 -112 -112 181 -128 -98 -244 69 69 75 109 -110 -59 308 228 249 -102 -92 18 -229 100 259
4116 259 -217 289 95 178 180 -73 174 118 258 91 180 130 490 269 152 92 138 288 151 190 -19 0 34 279
4140 279 -30 -80 -15 -17 -30 -68 -39 -45 -62 -98 -249 -161 -67 62 -22 126 -137 -105 -99 -11 184 -25 193 235 -402 -201
$$ packed form
3978B42J43j64J96j73j26J74k46K12r8j47J64R4q9L97m15J31M4k2q6J45J01j71
4000C06K40k00j34q4n8K32r9j7m9j31L02m9Rk70K18j19j57M72k31m9k28J88O7
4023A59j34J27j59L14j52j06K14m72J20J96j98k8J30K83n86M76l76j08J20J21
4043e9J4k84K47k25P7J13kK4Q6j26k77J37Rk0Q3P1j85j76J48L15J58k83k1J00
4067g6o1o5K62j23k6l74L77R5j84QR0j69k43L95q0J39J67l18J63j34J40j45J55
4090gk01Mk62O9M32j47%K93l09L0j46L13%OL4k19N1L67q0K1l51J0J10k47L29J59
4116B59m76N06j94Q3Kk53K47n6J40j67Q9n0L60k21j17o0M6J50j37L9k09J9L4K45
4140B79l09n0O5kj3l8K9oj7l6j51Q8R4J29q4J48k63L2OQ8J95k09K18M2o37K01
$$ plain form
4166 -201 -110 -83 75 -438 -187 215 85 -119 -123 91 -87 112 -278 -132 -67 -158 -59 -215 -348 -70 31 23 -288
4189 -288 -40 161 80 70 210 75 50 -348 248 -224 -32 -259 -243 -50 215 -9 -123 179 18 -143 -177 52
4211 52 -44 -91 110 172 275 180 -22 407 200 -12 117 136 88 391 38 248 294 52 199 3 137 203 324
4234 324 302 278 201 469 407 487 268 249 276 364 114 59 366 295 655 231 488 517 239 94 545 184 396 436
4258 436 348 515 374 416 126 413 293 32 535 141 -7 -58 309 196 150 145 136 124 113 97 29 169 220 235 138
4283 138 138 46 127 -64 -272 107 38 -109 117 203 -296 35 -54 -332 196 -70 -446 84 -219 -174 -208 -158 -389
4306 -389 -169 -28 -376 -58 -236 -467 -184 -445 107 -404 -530 -310 -243 -154 -287 -112 -209 -165 -239 -238 -128 -120 -285
4329 -285 -239 31 -27 -247 -217 103 -208 -182 -153 -9 16 -116 -432 -209 -186 9 -354 -237 -320 -361 -149 -310 -53
$$ packed form
4166b01R1K7J58n13K51M02j30k04mK14j78J99l90J46O5r1R9j56j33K78J01ql11
4189b88K48K01q1j0J40j35k5l98N96m72J92k27J6J93K65k24j14L02j61j61l4K29
4211E2r6m7K01O2J03r5k02M29k07k12J29J9m8L03l53K10M6k42J47j96J34O6J21
4234C24k2k4p7K68o2Q0k19j9K7Q8k50n5L07p1L60m24K57K9k78j45M51l61K12M0
4258D36q8J67j41M2k90K87j20k61N03l94j48n1L67j13m6nrj2j1j6o8J40N1J5r7
4283A38%r2Q1j91k08L79o9j47K26Q6m99L31q9k78N28k66l76N30l03M5l4N0k31
4306c89K20J41l48L18j78k31K83k61N52n11j26K20O7Q9j33J75r7M4p4JJ10Qj65
4329b85M6K70n8k20L0L20l11K6K9J44K5j32l16K23K3J95l63J17q3m1K12j61K57
$$ plain form
4352 -53 121 -11 -277 -95 79 -227 -97 40 93 26 -105 -56 67 71 223 109 269 -160 73 152 226 312 -40
4375 -40 -116 333 264 94 121 -267 16 109 77 145 377 -99 127 46 360 -143 61 38 165 -60 -17 -24 106 201
4399 201 49 93 357 123 -59 -97 27 102 -470 439 173 -135 24 191 89 -94 -498 215 314 191 -10
4420 -10 -363 -3 -169 25 112 -337 51 -39 -111 -105 12 -58 -192 -186 83 -22 8 -244 172 126 -249 -196 -18 77
4444 77 -39 123 -31 -342 -283 -74 24 -62 -289 -66 -344 -4 -68 16 -41 -165 -77 184 175 94 -44 44 -107 -84
4468 -84 -246 169 -77 -129 192 -88 -70 104 340 222 -168 67 277 60 44 356 -3 -102 -97 -68 -76 -17 342 188
4492 188 160 226 246 -74 21 -97 118 44 190 14 52 248 90 26 -94 369 307 138 239 120 5 201 498
4515 498 236 119 166 -134 245 314 27 4 266 -160 84 45 -121 223 18 162 -33 90 -192 -114 127 68
$$ packed form
4352e3J74j32k66J82J74l06J30J37N3o7j31M9J23MJ52j14J60m29K33P9P4Q6l52
4375d0p6M49o9j70K7l88K83R3l2O8K32m76K26q1L14n03K04k3J27k25M3pJ30R5
4399B01j52M4K64k34j82l8J24P5n72R09k66l08J59J67j02j83m04P13R9j23k01
4420a0l53L60j66J94Q7m49L88r0p2OJ17p0j34OK69j05L0k52M16m6l75N3J78R5
4444G7j16J62j54l11N9K09R8q6k27K23k78L40o4Q4n7j24Q8K61rq1j38Q8j51K3
4468h4j62M15k46n2L21k80J8J74K36j18l90K35K10k17j6L12l59r9NK9qN9L59j54
4492A88k8O6K0l20R5j18K15p4J46j76L8J96j58o4j20M63o2j69J01j19j15J96K97
4515D98k62j17M7l00L79O9k87k3K62m26K44l9j66L44k05J44j95J23k82P8K41n9
$$ plain form
4537 68 -39 58 67 -8 53 127 49 151 -312 48 211 37 58 59 -353 88 -72 -69 67 121 71 -252 -129 -37 96
4562 96 -64 -107 -10 -176 -201 -317 -361 -213 -603 -168 -186 -237 -205 -30 -232 -259 -387 -175 -398 -112 -229 -416 -19
4585 -19 -24 -134 -292 -106 -122 -106 -225 -65 -302 -110 -190 -337 -235 -178 -49 311 -153 -138 34 2 56 -248 -36
4608 -36 -160 10 25 41 146 -180 2 188 -68 -52 204 162 87 82 271 162 378 58 -13 -83 158 -12 213
4631 213 449 -169 183 -151 254 50 93 162 127 118 -105 300 158 7 223 357 135 86 347 -108 324 82
4653 82 251 268 103 -54 85 1 130 -110 26 84 35 -94 19 -57 -54 -20 75 -154 -377 110 -136 -133 -195 267
4677 267 -147 -51 41 64 -273 -75 161 -217 -381 -70 -104 -385 -100 -372 -232 -78 -381 10 -213 39 -168
4698 -168 -36 -329 -224 -194 -236 -193 -275 -353 -26 93 -283 -260 -155 23 -252 -112 -338 -182 220 173 -304 -147
$$ packed form
4537F8j07R7Rp5O1P4p8J02m63L60J63j74K1Jm12M41j60LJ36N4n0l23J23R2J33
4562I6j60m3R7j66k5j16m4J48l90M35j8n1L2J75k02k7j28K12k23K86j17j87L97
4585a9nj10j58J86j6J6j19J60k37J92q0j47J02N7J29L60m64J5J72l2N4l04K12
4608c6j24J70J5J6J05l26J82J86k56J6K56m2p5nJ89j09K16l20p1p0K41j70K25
4631B13K36o18L52l34M05k04M3O9l5rk23M05j42j51K16J34k22m9K61m55M32k42
4653H2J69J7j65j57J39q4J29k40J36N8m9j29J13p6LL4R5k29k23M87k46Lo2M62
4677B67m14R6R2K3l37J98K36l78j64L11l4k81K85k72J40J54l03L91k23K52k07
4698a68J32k93J05L0m2M3q2p8L27J19l76K3J05J78k75J40k26J56M02m7m77J57
$$ plain form
4720 -147 -82 0 30 -185 17 85 137 -90 67 53 174 -141 -169 -50 -60 -148 28 105 -65 170 331 110 65 -29
4744 -29 351 -79 34 266 -146 287 0 65 48 197 29 4 91 46 214 151 371 206 228 -69 358 72 59
4767 59 -98 360 168 110 188 209 477 82 100 60 431 -88 44 78 215 262 74 18 -103 289 32 19 195
4790 195 -105 -101 240 352 278 -95 -3 -57 -50 208 137 -225 -180 -185 -211 -129 -254 -239 -102 198 213 -16 -125 -174 -276
4815 -276 -254 -123 -190 -85 58 -374 -241 -353 -176 -488 -125 -396 -398 -6 -351 -347 24 -74 -531 -427 -259 -301 11
4838 11 -398 -268 -210 -291 -213 -245 -52 -32 -180 -102 -57 80 -192 -332 -99 -232 5 48 -89 253 -41 -59 -63 7
4862 7 -34 -125 219 -139 18 -56 175 -56 86 236 268 167 78 260 312 219 -192 71 158 217 207 53 184 203
4886 203 152 28 10 359 21 57 295 34 204 198 137 101 324 392 36 157 194 227 500 94 328 601 243
$$ packed form
4720a47O5Q2L0k15K02O8N2k27J57j4J21l15k8J19j0q8J76P7j70K35J61k21m5r4
4744b9L80m30J13K32m12M33k87O5j7J49j68k5Q7m5J68o3K20j65K2k97M27k86j3
4767E9j57M58j92n8P8K1K68l95J8m0L71n19J32L4J37M7j88n6j21L92k57j3J76
4790A95l00ML41J12p4l73R2n4PK58p1l62M5nk6Q2j25J5J37L00J5k29j09m9j02
4815b76K2J31o7J05J43m32J33j12J77l12L63k71kL92l45ML71r8m57J04J68m2L12
4838A1m09J30N8q1P8l2J93K0j48P8M5J37k72j40K33j33K37M3j37L42k94j8mP0
4862Gm1r1L44l58J57p4K31k31J42J50L2j01q9J82N2r3m11K63Q7N9j0j54J31J9
4886B03n1j24j8L49l38L6K38k61J70oo1l6K23O8l56J21L7L3K73m06K34K73l58
$$ plain form
4909 243 435 591 127 163 284 77 250 34 157 309 40 138 331 401 221 -52 419 119 50 66 -7 70
4931 70 264 24 -207 5 93 -155 37 -55 -112 283 -85 -204 -274 -138 -84 -59 -231 104 55 -131 -164 221 -378
4954 -378 -307 -206 11 -151 91 -151 -274 24 -138 94 -69 -188 -214 -361 31 -222 -202 -299 -38 -112 -144 -285
4976 -285 -434 -201 -114 -334 -61 -151 -239 -35 -145 -74 -17 25 -61 -198 -188 206 -78 -113 -313 -367 -130 -296 -144
4999 -144 284 -98 -62 -28 -100 34 -295 131 146 -249 43 54 31 1 5 -139 -193 254 203 -18 44 321 -44 -90
5023 -90 255 19 -21 -198 40 133 -25 239 114 168 142 214 -15 4 77 -79 -187 30 -23 -134 197 23 -39
5046 -39 129 -56 74 -59 242 95 174 55 -152 12 -161 -13 65 -109 44 192 286 64 -122 36 -177
5067 -177 55 155 -180 131 -252 -53 50 83 19 -175 -44 -160 -58 -129 31 -261 316 -184 -323 -96 -217
$$ packed form
4909B43J92J56m64L6J21k07J73k16J23J52k69R8J93P0j80k73M71l00o9J6p3P7
4931G0J94k40k31K12Q8k48J92r2n7L95l68j19p0J36N4K5j72L35m9j86l3L85n99
4954c78P1J01K17j62K42k42j23K98j62K32j63j19k6j47L92k53K0r7K61p4l2j41
4976b85j49K33Q7k20K73r0q8K04j10P1N7M2q6j37J0L94k84l5k00n4K37j66J52
4999a44M28l82L6L4p2J34l29M26J5l95K92J1k3l0Mj44n4M47n1k21O2K77l65m6
5023i0L45k36m0j77K38R3j58K64j25N4k6P2k29J9P3j56j08K17n3j11L31j74o2
5046c9J68j85J30j33L01j47P9j19k07J64j73J48P8j74J53J48R4k22j86J58k13
5067a77K32J00l35L11l83J99J03L3o4j94J31j16J02p1J60k92N77n00j39K27j21
$$ plain form
5088 -217 -75 36 -128 -154 -6 -226 -29 -332 22 -46 144 -214 40 68 146 20 -107 -275 -157 228 -85
5109 -85 19 127 -119 -160 186 131 -219 227 -126 135 -5 -295 -10 102 -83 -13 222 -16 -56 127 267 623
5131 623 432 -73 418 226 331 -14 281 329 235 187 1 28 155 380 150 480 108 -122 367 178 312
5152 312 148 251 659 159 -134 313 -99 248 375 271 289 10 307 158 184 387 87 -24 453 260 5
5173 5 330 178 98 157 329 226 -76 -63 76 289 64 28 145 -121 169 35 -98 -114 -257 -393 4 -258
5195 -258 40 44 -300 -115 -208 -150 122 57 -292 -123 99 -189 -453 -392 -47 -114 -303 -108 -321 -378 -347 -193 -330
5218 -330 38 -345 -416 -334 -111 -134 -181 -322 -411 -378 -164 -292 -83 -210 -302 -170 -130 -98 -291 -155 -398 -308 -224 -229
5242 -229 -114 63 -166 -24 -73 -488 -46 -92 -87 -220 -186 -178 -246 22 26 -228 48 -40 1 -139 42 -72 236 111
$$ packed form
5088b17J42J11j64k6J48k20J97l03L54o8J90l58K54K8P8j26j27j68J18L85l13
5109h5J04J08k46m1L46n5l50M46l53K61j40k90K85J12j85P0K35k38m0J83J40L56
5131F23j91n05M91j92J05l45K95M8r4m8j86K7J27K25k30L30l72k30M89j89J34
5152C12j64J03M08n00k93M47m12L47J27j04J8k79K97j49K6K03l00j11M77j93k55
5173EL25j52q0N9J72j03l02J3J39K13k25l6J17k66K90j34j33j6j43j36L97k62
5195b58K98Ml44J85r3N8K72o5l49J69K22k88k64O1L45o7j89J95k13n7L1J54j37
5218c30L68l83p1Q2K23k3m7j41q9L3K14j28K09j27r2J32M0L2j93J36k43R0Q4n
5242b29J15J77k29J42m9m15M42m6Nj33L4Qo8K68Mk54K76q8M1j40J81j14L08j25
$$ plain form
5266 111 -222 -107 125 126 -274 -44 -150 91 58 32 -58 71 310 143 213 223 188 86 193 437 -14 125 -56
5289 -56 150 138 18 297 124 352 68 320 258 -239 -18 363 165 109 -69 67 2 73 161 -9 186 87 220
5312 220 182 62 153 54 157 -123 266 193 -180 -114 -230 161 -17 101 -68 7 56 -76 77 61 -332 -240 174
5335 174 123 185 -102 -75 15 59 -162 -170 -62 -69 -149 -156 -30 86 -169 98 -84 -290 -83 18 -185 113 3 -96
5359 -96 37 152 -93 -101 -79 -213 239 173 263 -24 82 197 -155 -80 226 248 -17 157 -32 -138 32 34 340
5382 340 5 -31 154 -163 125 120 153 67 -158 144 149 127 187 223 321 297 69 -21 244 171 -85 138 238 -196 -62
5407 -62 344 203 162 -252 120 47 10 166 -57 -44 28 163 198 208 370 4 51 145 318 -30 21 127 -36 -339
5431 -339 145 235 28 150 -21 61 237 165 244 -91 64 -231 -183 68 121 -181 57 154 -212 -134 -116 -54 234
$$ packed form
5266A11l33J15K32Jm00K30j06K41l3k6r0J29K39j67P0J0l5j02J07K44m51J39j81
5289e6K06j2j20K79j73K28k84K52o2m97K21L81j98n6j78J36o5P1Q8j70J95r9J33
5312B20l8j20R1r9J03k80L89p3l73O6j16L91j78J18j69P5M9j32J53j6l93R2M14
5335A74n1O2k87K7R0M4k21qJ08pq0pJ26J16k55K67j82k06K07J01k03K98j10r9
5359i6J33J15k45qK2j34M52o6R0k87J06J15l52P5L06K2k65J74j89j06J70KL06
5382C40l35l6J85l17K88nL3q6k25L02Nk2O0L6R8k4k28r0K65p3k56K23J00m34J34
5407f2M06j41m1m14L72p3l7J56k23J3P2J35L5J0J62l66M7R4J73l48N1J06j63l03
5431c39M84R0k07J22j71Q2J76p2P9l35J55k95M8K51N3l02K38R7l66P8J8O2K88
$$ plain form
5454 234 -138 -296 -362 -24 -308 -30 -283 -254 -170 -213 32 -139 -221 -321 -118 -219 -246 -102 -59 -204 -327 180
5476 180 -84 -187 -96 -164 -364 -174 -284 -283 -153 -72 -120 -16 -350 -208 49 127 4 -279 -175 -249 -5 80 253
5499 253 -260 -268 224 24 -21 -190 -416 -181 43 -221 -16 -320 228 55 18 62 -266 -204 199 68 -60 186
5521 186 63 6 38 53 27 352 -236 333 111 -1 338 422 193 1 289 240 -42 -36 62 49 368 222 10
5544 10 103 31 372 12 152 -63 74 219 235 13 -30 141 38 84 267 613 44 -163 172 275 -149 1
5566 1 461 36 327 256 98 72 68 -185 110 186 -218 -163 -24 119 56 -112 155 27 60 -39 -87 -10 -84 -155 67
5591 67 -64 27 -38 -84 -30 -257 -253 -138 -138 -331 -306 -208 -447 -228 -136 -32 127 -127 -372 -47 -292 -199 -47 -190
5615 -190 30 76 -177 -103 -147 -260 -6 -21 -239 -142 4 -36 -87 -223 -361 265 -260 277 -108 -349 158 -57
$$ packed form
5454B34l72j58o6L38k84K78k53K9Q4m3K45j71q2j00K03j01k7J44M3j45j23N07
5476A80k64j03R1o8k00J90j10JJ30Q1m8J04l34J42K57P8j23k83J04p4K44Q5J73
5499B53n13qM92k00m5j69k26K35K24k64K05l04N48j73l7M4l28O2M03j31j28K46
5521A86j23n7L2J5k6L25n88N69k22j12L39Q4k29j92K88m9k82OR8j3L19j46k12
5544A0R3p2L41l60J40k15J37J45J6k22m3J71j03M6J83L46n69k07L35J03m24J50
5566AM60m25K91p1j58k6mk53K95P6m04N5J39J43o3j68K67j28L3r9m8P7p4p1K22
5591F7j31R1o5m6N4k27MJ15%j93K5R8k39K19R2J04J59k54k45L25k45R3J52j43
5615a90K20M6k53P4m4j13K54j5k18R7J46m0n1j36j38O26n25N37l85k41N07k15
$$ plain form
5637 -57 -77 -66 15 11 107 -352 -68 111 102 -251 48 113 -69 -132 -142 5 249 315 154 -15 389 5 10 268 -59
5662 -59 211 -17 147 -12 359 43 -41 203 95 389 24 6 185 336 210 229 -105 -97 -61 171 106 414 38
5685 38 -242 -332 129 522 -15 133 -92 486 -138 -92 126 -114 318 28 -204 -39 32 -18 9 231 -51 -97
5707 -97 -176 45 -310 -227 -103 -17 -185 157 -196 -297 -326 -148 -183 -411 51 91 180 114 43 -103 -338 70 71 -38
5731 -38 -202 77 -374 -114 -204 -252 -50 -97 21 -57 -426 147 32 -236 47 -31 83 -485 -109 103 47 -416
5753 -416 -152 -49 -54 -42 -36 -170 -255 -343 -322 19 -4 17 -7 -115 -220 15 -61 -120 -189 63 23 271 -121 -26 23 -195
5779 -195 -147 172 282 74 139 106 -101 -47 406 243 -5 281 366 178 260 306 262 72 113 156 -73 268 109
5802 109 85 271 180 -249 164 60 181 194 139 -58 185 136 199 48 -32 -121 27 54 -64 -22 50 192 22 205
$$ packed form
5637e7k0J1Q1mR6m59K84J79rl53K99O5j82o3j0J47K44O6j61j69M04l84NK58l27
5662e9K70k28J64j59L71l16q4K44j08K94l65j8J79J51j26J9l34QL6K32o5L08l76
5685C8k80r0M61L93n37J48k25N78o24M6K18k40M32k90k32J65P1n0K7K22k82m6
5707i7p9K21l55Q3J24Q6j68L42l53j01k9J78l5k28M62M0Q9o6p1j46k35M08Jj09
5731c8j64K79m51K60r0m8K02m7J18p8l69N73j15k68K83p8J14n68L76K12n6m63
5753d16K64J03nJ2Oj34q5q8K1L41k3K1k4j08j05K35p6n9o9K52m0K48l92R5M9k18
5779a95M8L19J10k08O5l3k07N4M53j63k48K86Q5j88Q2M6m4j90M1M3k29L41j59
5802A09k4J86r1m29M13j04J21J3n5j97K43m9O3j51q0q9J48K7j18M2P2J42j70J83
$$ plain form
5826 205 189 21 89 -72 153 113 -60 83 113 192 -9 293 125 -12 143 45 122 -97 143 28 38 179 11
5849 11 -61 -108 73 -15 -50 -95 -260 65 -10 -408 43 190 -50 -449 -238 -200 -275 -202 -174 -206 -92 -634 -115 -204
5873 -204 -11 -304 -104 54 -297 -374 -165 -374 -31 -235 26 -174 -241 -358 -17 -273 -49 -181 -256 -117 27
5894 27 -80 67 -8 64 -280 -177 154 -138 -312 -329 37 111 276 90 168 13 -75 -1 16 -62 -237 -76 55
5917 55 88 143 239 133 -112 147 43 113 281 150 276 54 -26 168 185 -43 -151 -6 -178 76 252 455
5939 455 258 165 -15 108 -4 126 392 -161 599 63 67 211 239 58 140 -64 366 2 120 92 -53 58
5961 58 -39 118 147 132 -98 -106 -232 -199 -142 97 -23 -129 472 42 -72 -150 -162 -98 186 -39 -124 -101 80 -133
5985 -133 -210 129 247 -48 109 -128 -245 -38 81 -187 -193 -301 -119 154 -44 195 -77 122 -459 29 -8
$$ packed form
5826B05j6j68O8j61K25m0j73J43L0P9k01L02j68j37J55r8P7k19K40j15J0J41j68
5849A1p2m7J81q8l5m5j65L25p5l98M51J47k40l99K11L8p5P3K8l2J14n42N19q9
5873b04J93k93K00J58l51p7K09k09L43k04K61k00o7j17L41k56K24j32p5J39J44
5894B7j07J47p5P2l44J03L31k92j74j7L66P4J65j86P8j55q8P4J7p8j75J61J31
5917E5L3N5R6j06k45K59j04P0J68j31J26k22q0J94J7k28j08J45j72K54J76K03
5939D55j97r3j80J23j12J30K66n53P60n36MJ44K8j81Q2k04M30l64J18k8j45J11
5961E8r7J57K9j5k30qj26L3N7K39j20j06O01m30j14p8j2O4K84k25q5K3J81k13
5985a33p7L39J18k95J57k37j17K07J19k68oj08J82K73j98K39k72J99n81M88l7
$$ plain form
6006 -8 100 -50 149 65 -31 -120 206 110 -259 279 -271 -114 -131 139 -392 196 115 213 157 93 -82 126 239 90
6030 90 73 21 126 79 313 232 111 -64 138 110 45 139 466 157 236 236 -19 143 181 21 -81 144 304 -61
6054 -61 315 186 -38 -81 -137 188 -23 -7 41 67 384 79 -148 15 85 123 87 -117 -84 183 48 218 114
6077 114 121 -32 5 144 103 222 -191 99 309 207 4 11 16 214 153 -148 129 -89 -14 -208 -160 -119 93 86 -26
6102 -26 -10 219 -119 -218 60 -129 -239 -64 66 -28 -219 57 -178 -185 -83 -422 -292 -199 -183 11 -360 -245 -184
6125 -184 -266 -316 -126 66 64 -463 80 -331 -70 -128 -140 -112 -193 -118 -485 -415 -190 105 -214 -152 38 -389 -94 86
6149 86 10 -43 36 41 -114 -80 -53 -119 13 6 339 50 -45 110 -23 194 104 -230 -107 -109 -94 169 -105 172 -60
6174 -60 252 472 317 59 163 13 199 179 9 257 -156 112 10 14 -152 26 99 212 19 139 -66 181
$$ packed form
6006hJ08j50J99q4r6q9L26r6l69N38n50J57j7K70n31N88q1R8n6o4j75K08J13j49
6030I0j7n2J05m7K34q1j21j75K02k8o5R4L27l09P9%k55J62L8j60j02K25J60l65
6054f1L76j29k24m3n6L25k11J6M8K6L17l05k27J63P0L8l6k04L3K67j35J70j04
6077A14Pj53L7J39m1J19m13K90K10j02k03PNJ98o1l01K77k18P5j94M8M1K12pj12
6102b6J6K29l38r9K78j89j10J75J30r4j91K76k35pJ02l39J30R3J6J94l71J15O1
6125a84q2n0J90J92kn27N43m11K61n8j2K8q1P5l67P0K25K95l19O2J90m27K95J80
6149H6p6n3P9Nj55L4K7o6J32pL33k89r5J55j33K17r0l34J23kJ5K63k74K77k32
6174f0L12K20j55k58J04j50J86k0j70K48m13K68j02Mj66J78P3J13j93J20k05K47
$$ plain form
6196 181 173 329 203 140 327 63 255 330 166 -72 26 376 128 41 67 75 201 153 181 38 103 402 210 86
6220 86 -148 229 130 -225 18 -227 72 -64 25 -225 -165 50 -177 -75 137 -216 211 -142 -32 117 -99
6241 -99 -153 -41 -255 -102 -172 158 251 0 -204 -8 -11 39 -171 -23 -380 -242 128 -104 -196 -334 -13 11 -229
6264 -229 -237 -66 132 -161 -209 -161 -345 -38 -196 -320 -56 60 -301 -137 198 -136 -74 183 -198 227 -158 -218
6286 -218 -27 206 -413 -262 -175 -101 -27 -301 154 -131 -141 -56 127 191 -98 64 -107 22 384 -52 -43 -62 -50
6309 -50 79 -53 -120 -120 303 227 159 190 103 26 -206 -83 28 131 -152 -7 -84 47 67 -10 11 125 -73 -41 53
6334 53 52 201 64 87 107 381 181 2 86 -31 18 124 -48 -122 -79 89 22 42 -36 159 -175 53 -38 -156
6358 -156 -82 -88 -288 10 -69 95 40 -325 16 -166 -80 -229 16 -43 -177 -13 164 -61 -125 -237 -7 -146 18
$$ packed form
6196A81qJ56j26o3J87k64J92P5j64k38R8L50k48q7K6QJ26m8K8j43O5K99j92j24
6220H6k34L77r9l55K43k45K99j36Q9k50O0K15k27J02K12l53M27l53J10J49k16
6241i9n4J12k14J53p0L30R3k51k04J96lN0k10J48l57J38L70k32r2j38L21K4k40
6264b29qJ71J98k93m8M8j84L07j58j24K64J16l61J64L35l34O2K57l81M25l85o0
6286b18J91K33o19J51Q7P4P4k74M55k85j0Q5J83O4k89J62j71J29L62m36Rj9J2
6309e0J29j32o7%M23p6o8L1q7p7k32J23J11J03k83J45p7J31K0p7K1J14j98L2R4
6334E3jJ49j37K3K0K74k00j79Q4j17M9J06j72p4M3J68o7K0p8J95l34K28r1j18
6358a56P4ok00K98p9J64n5l65L41j82Q6j49K45n9j34J64J77k25o4j12K30j39J64
$$ plain form
6381 18 -266 -183 -294 -89 84 255 80 -116 137 173 107 64 0 -35 -155 -6 17 229 -178 -100 -179 166 -133
6404 -133 -203 55 50 -8 -173 213 -36 71 -133 -9 -94 120 221 132 -5 62 76 91 99 19 -61 -65 243 -91 -39
6429 -39 364 67 290 301 185 -17 -134 -126 -28 367 413 -113 93 -120 -27 420 175 184 138 313 558 76 352
6452 352 -20 118 294 366 110 178 209 108 415 127 39 111 164 223 115 74 -183 5 317 -167 28 -74 -74
6475 -74 -50 133 69 -7 128 159 -204 129 7 127 0 -99 226 210 195 -141 -38 -71 -266 -170 9 -58 -101 175
6499 175 -205 16 -124 -368 -312 -127 -294 -148 -357 5 -200 -61 -173 -218 59 -157 -82 -67 -27 -252 -7 -138
6521 -138 -193 -199 -94 -238 12 -326 -299 -190 -239 -149 5 -38 112 -65 -46 -232 -186 47 98 291 6 -198 15
6544 15 -203 -26 -99 70 33 -24 -126 -43 -275 99 -132 230 72 418 -10 -217 73 274 275 180 175 154 62 301
$$ packed form
6381A8k84Q3j11K05J73J71j75j96K53L6o6m3o4l5j20J49K3K12m07P8p9L45k99
6404a33p0K58nn8j65L86k49J07k04J24q5K14J01q9j37O7J4J5Qq0q0mL08l34N2
6429c9M03k97K23J1j16k02j17QR8L95M6n26K06k13R3M47k45Rm6J75K45m82K76
6452C52l72J38J76P2k56O8L1j01L07k88q8P2N3N9j08m1k57J88L12m84J95j02%
6475g4K4J83o4p6J35L1l63L33j22J20j27r9L25j6j5l36J03l3j95R6J79o7m3K76
6499A75l80K21j40k44N6J85j67J46k09L62k05J39j12m5K77k16P5J5M0k25K45j31
6521a38n5oJ05j44K50l38K7J09m9R0J54m3J50j77J9j86M6K33N1J93k85k04K13
6544A5k18J77p3J69l7n7j02Q3k32L74k31L62j58L46m28k07K90K01Jr5nk1r2K39
$$ plain form
6568 301 128 74 -230 117 160 191 -62 36 324 175 -29 209 85 318 -23 46 38 99 93 251 -58 -127 251 156
6592 156 -73 416 109 -97 -202 -86 -297 -74 -95 -86 -78 2 -61 251 279 224 -150 -141 163 -19 434 -96 -190 -94
6616 -94 -233 -6 159 87 12 -2 -73 -135 243 -182 -19 28 -191 -70 -124 43 -259 -110 27 -140 120 7 109
6639 109 -27 -64 15 64 100 -205 160 -5 -247 81 -245 -165 33 -14 -58 -68 -112 144 -96 -77 28 116 113 -8
6663 -8 93 -497 -50 -85 -65 -200 317 -21 -73 -112 -295 -110 48 91 -271 -331 -24 -94 93 87 -27 -19 -194 65
6687 65 -45 -189 324 -56 92 139 -150 -48 116 141 -88 -115 -89 104 -97 30 282 226 93 -11 -83 296
6709 296 95 -99 209 232 -178 -61 -295 182 161 87 -24 -62 5 -322 269 -39 18 216 72 -162 -202 -41
6731 -41 79 -126 -67 -105 132 -54 17 -45 -167 -127 119 155 -36 162 129 10 175 -66 -108 107 -104 30 79
$$ packed form
6568C01j73n4l04L47M3L1k53R8K88j49k04K38j24K33l41O9qO1oJ58l09o9L78r5
6592A56k29M89l07k06j05J16k11K23k1RQQ0o3L12K8n5l74RL04j82M53n30r4R6
6616i4j39K27J65p2p5j4p1o2L78m25J63M7k19J21n4J67l02J49J37j67K60j13J02
6639A09j36l7P9M9L6l05L65j65k42L28l26Q0J98m7m4j0m4K56k40J9J05Q8lj21
6663hJ01n90M47l5K0j35N17l38n2l9j83J85J58M3l62o0L07p0J87oj14Qj75K59
6687F5j10j44N13l80J48M7k89J02J64K5k29k7K6J93k01J27K52n6j33j04p2L79
6709B96k01j94L08K3m10J17k34M77k1p4j11l8O7l27N91l08N7J98j44k34m0J61
6731d1J20k05N9l8K37j86P1o2j22M0K46L6j91J98l3j19J65k41m2K15k11J34M9
$$ plain form
6754 79 12 -85 -159 -270 -72 -481 -10 -141 -164 -341 28 -39 131 -105 -13 -286 76 -146 22 -308 34 -237
6776 -237 6 -360 -23 -149 -309 -159 -65 195 -212 239 177 -279 -311 120 -256 -6 -223 -208 -37 -84 -61 -27
6798 -27 37 -29 114 -107 197 72 -19 145 104 -43 -40 -100 -159 -284 -139 -38 98 346 210 169 267 56 105 264
6822 264 85 -20 -11 36 67 506 365 87 32 28 236 -245 -58 159 -74 189 358 71 104 243 86 126 297
6845 297 171 204 230 136 446 17 486 -257 -122 -56 -137 146 46 -171 109 168 -298 -110 -202 150 -43 -249
6867 -249 26 -71 30 229 118 -146 -164 -249 -84 292 93 2 133 -64 -51 -101 -92 -206 326 39 -190 -99 -59
6890 -59 204 130 -128 -182 -17 -272 253 7 -156 -91 -51 -63 -104 -87 -230 -109 70 -9 -43 -227 53 -405 -68
6913 -68 23 -5 -385 98 -106 -25 -211 3 108 104 93 -189 -185 65 -302 -122 -221 63 -206 -24 -14 -24 -48 -169
$$ packed form
6754G9o7r7p4j11J98m09M71j31k3j77L69o7J70k36R2k73L62k22J68l30L42k71
6776b37K43l66L37j26j60J50R4K60m07M51o2m56l2M31l76K50k17J5J71m7K3L4
6798b7O4o6J43k21L04j25r1J64m1j47Lo0n9j25J45J01J36K48j36m1R8k11M9J59
6822B64j79j05RM7L1M39j41k78n5mK08m81J87K17k33K63J69k87L3J39j57M0J71
6845B97j26L3K6r4L10m29M69p43J35O6q1K83j00k17K80N9m66J88r2L52j93k06
6867b49K75r7J01J99j11k64j8q5J65L76j99r1J31j97J3n0Rj14N32k87k29R1M0
6890e9K63p4k58n4J65k55N25k46j63O5M0j2m1J7j43J21J79p9l4j84K80m58L37
6913f8R1k8l80M83k04Q1j86K14J05mj1k82MK50l67J80r9K84k69J82J0j0k4j21
$$ plain form
6937 -169 370 108 81 107 42 159 -170 58 97 -101 -166 26 -11 321 -200 -92 78 -97 66 122 288 -20
6959 -20 189 -143 216 -32 -162 -36 -237 84 -151 375 34 147 210 -201 124 177 -34 273 -71 65 82
6980 82 -34 -59 -103 -172 132 126 263 -20 -71 107 92 66 -36 -10 -46 -15 203 116 22 278 249 -46 -118 -56 -224 84
7006 84 -113 -133 21 -32 -48 -48 -69 -55 -43 -17 46 -211 -3 47 348 161 -242 167 6 26 -66 -207 18 14 -100
7031 -100 -259 -62 -133 88 91 224 -58 -283 -310 -2 -44 -134 -237 -221 -199 -53 100 136 66 -401 -105 8 -150
7054 -150 -114 105 34 -15 38 -8 -174 0 -21 -50 113 -12 35 66 -214 129 -67 105 249 -61 115 272 -3
7077 -3 -166 210 87 134 160 38 -3 -104 341 -8 154 172 -247 248 -29 -78 12 291 44 265 189 173 147 38
7101 38 8 228 -90 179 204 129 111 -128 -183 127 -132 113 246 145 306 200 73 -245 -53 215 -1 130
$$ packed form
6937a69N39k62k7K6o5J17l29K28L9j98o5J92l7L32n21J08J70j75J63N6J66l08
6959b0K09l32L59k48j30J26k01L21k35N26l41J13O3m11L25N3k11L07l44J36J7
6980H2j16k5m4o9L04oJ37k83n1J78j5k6j02K6l6L1K18q7r4K56k9k95p2O2j68L08
7006H4j97k0J54n3j6%k1J4J2K6O3k57K08N0L01j87m03M09j61K0r2j41K25mj14
7031a00j59J97p1K21LJ33k82k25k7L08m2r0j03J6K2J46J53L6p0m67K96J13j58
7054a50L6K19p1m9N3m6j66J74k1k9J63j25M7L1k80L43j96J72J44l10J76J57k75
7077cj63L76j23M7K6j22m1j01M45l49J62J8m19M95k77m9R0K79k47K21p6j6k6j09
7101C8l0K20l18K69K5p5j8k39n5L10k59K45J33j01J61j06j27l18J92K68k16J31
$$ plain form
7123 130 -23 335 190 423 -42 -82 16 157 190 -323 77 -158 26 171 103 -12 -86 -170 6 -41 -26 181 176
7146 176 191 -192 23 139 -252 -92 33 -146 -133 -116 -163 87 -127 -232 0 -242 -24 -15 -91 -199 -189 -173 -32
7169 -32 -480 -62 -160 -181 -64 -119 25 -58 -259 -112 -93 36 9 178 -38 186 -99 -25 -264 -3 -70 75 34
7192 34 510 99 160 90 76 -81 90 -81 59 190 237 88 -29 47 154 -114 370 117 -149 247 76 220
7214 220 -196 87 171 50 8 140 201 29 73 133 301 -95 -88 228 207 315 184 380 99 183 39 217 212 137
7238 137 -56 99 209 101 -119 110 14 13 67 -100 -127 201 -73 304 -77 -124 190 85 -253 -34 17 -166
7260 -166 173 -118 -79 -55 -71 60 193 -107 -264 -258 62 -8 -207 -160 -449 -134 -341 -149 -97 243 98 -60 -191
7283 -191 -22 -92 -218 -8 151 80 4 -125 -133 21 -71 -370 -49 -96 -448 60 -237 -103 82 112 -15 -161 151
$$ packed form
7123A30j53L58j45K33m65m0R8J41L3n13M00k35J84J45o8j15p4q4J76m7J5K07n
7146A76J5l83K15J16l91J60J25j79J3J7m7K50k14j05K32k42K18Rp6j08J0J6J41
7169c2m48M18r8k1J17n5J44q3k01J47J9J29k7J69k16K24k85P4k39K61o7J45m1
7192C4M76m11O1p0j4j57J71j71J40J31M7j49j17P6J07k68M84k53k66L96j71J44
7214B20m16K83Q4j21m2J32O1j72M4O0J68l96PL16k1J08j31J96k81Q4j44J78np5
7238A37j93J55J10j08k20K29r6jN4j67k7L28k74L77l81m7L14j05l38K19N1j83
7260a66L39k91L9K4j6J31J33l00j57OL20p0j99M7k89L15k07J92N2L40j45j58j31
7283a91J69p0j26K10J59p1p6j29qJ54r2k99L21m7l52N08k97J34J85L0j27j46L12
$$ plain form
7306 151 125 -268 -115 -328 -237 -163 268 -212 258 9 -257 -210 -78 -222 -91 -13 -122 48 -19 139 -67 2
7328 2 -3 123 392 237 -4 89 64 20 -115 -42 -21 22 240 150 108 132 98 380 317 79 1 -441 135 37 101 -25
7354 -25 84 278 88 227 4 -107 89 -160 -39 292 74 -19 -161 -75 -209 -106 222 -89 108 65 270
7375 270 -17 73 100 -171 28 4 -20 -285 -53 83 14 -40 139 4 -76 25 163 -58 -138 -69 -102 -28 51 140
7399 140 12 -369 -62 -369 -110 -270 49 -268 -36 126 -125 -210 -67 -1 -128 -277 182 3 -159 29 -36
7420 -36 82 309 60 -266 -99 -247 -164 -110 24 -253 70 50 -233 -16 -168 -103 -40 85 -65 -193 141 -128
7442 -128 -289 -31 0 -223 115 -270 57 -4 -88 -150 151 61 -56 -168 57 48 88 -113 -41 -250 273 -281 -58
7465 -58 74 75 -14 168 -58 -59 268 124 431 351 -5 151 -57 16 102 66 -81 -213 -46 103 162 -204 9 94
$$ packed form
7306A51k6l93J53k13R1P4M31m80M70k49k66M7J32j44J31P8j09J70o7J58k06O9
7328BnJ26K69j55k41R3k5m4j35P3K1M3K18r0m2K4l4K82o3k38p8m42N76r8O4j26
7354b5J09J94j90J39k23j11J96k49J21L31k18r3j42Q6j34J03L28l11J97m3K05
7375B70k87R0K7k71J99k4k4k65K32J36o9n4J79j35q0J01J38k21q0O9l3P4P9Q9
7399A40j28l81L07l07K59j60L19l17K32J62k51q5J43O6j27j49M59j79j62J88o5
7420c6J18K27k49l26J67j48Q3N4J34k77L23k0k83K17j52O5O3J25j50j28L34k69
7442a28j61K58L1k23L38l85L27o1q4o2L01r0j17j12K25rM0k01P2k09N23n54K23
7465e8J32Jq9J82k26jL27j44L07q0l56J56k08P3Q6l6j47j32J67J49N9l66K13Q5
$$ plain form
7489 94 219 -111 83 126 10 -92 -98 129 62 207 304 21 215 -199 145 218 162 13 -44 60 -51 -155 182
7512 182 191 80 58 101 -86 -300 103 138 -243 -58 58 71 9 58 91 -71 -109 -162 22 -159 -170 168 42 -103
7536 -103 -110 41 56 39 -124 -105 95 169 -23 -417 -130 -37 37 84 -99 -30 64 -182 16 -189 215 142 -19 -17 56
7561 56 -281 -114 -138 -117 -325 -87 14 -54 65 134 -59 -70 90 -116 -381 -259 -25 72 32 -164 -169 100 15 -146
7585 -146 15 -283 -131 -181 -110 238 -5 149 319 -245 242 -86 -128 45 413 259 -5 248 98 -95 69
7606 69 30 257 214 130 306 39 117 -125 89 57 213 16 82 109 -89 78 -133 110 96 197 -20 208 107
7629 107 -175 110 43 118 200 -101 66 78 54 -36 -199 45 233 -100 -236 116 -67 8 -213 276 74 -128
7651 -128 11 85 5 5 80 -310 -58 267 106 220 -443 -77 11 -207 149 109 199 3 105 -174 52 139 111
$$ packed form
7489I4J25l30J94M3j16j02oK27o7J45R7k83J94m14L44P3n6j49n7J04j11j04L37
7512A82Rj11k2M3j87k14M03L5l81J85J16J3o2M9L3j62l8n3J84j81j1L38j26j45
7536a03pJ51J5j7j63J9K00P4j92l94K87R3P4M7j83O9R4k46J98k05M04p3j61KP3
7561E6l37J67k4K1k08K38J01o8J19O9j93j1J60k06k65J22K34R7m0j96nK69q5j61
7585a46J61k98J52n0P1L48k43J54J70n64M87l28m2J73L68j54k64K53j50j93J64
7606F9l9K27m3q4J76k67P8k42K14l2J56j97O6K7j98J67k11K43j4J01k17K28j01
7629A07k82K85o7P5Q2l01J67J2k4r0j63K44J88l33j36L52j83P5k21M89k02k02
7651a28J39P4q0%P5l90K52L25j61J14o63L66Q8k18L56m0R0j96J02k79K26Q7k8
$$ plain form
7674 111 47 -47 -98 -315 -235 0 14 17 137 -317 157 -182 395 -113 -73 -46 -102 -24 276 -85 125 93 162 -17
7698 -17 -322 95 189 -3 -27 -81 -142 128 -249 184 89 -66 -187 123 162 307 239 225 229 119 186 -141 -73 -30 -218
7723 -218 -38 120 -140 -11 42 316 64 77 48 -214 6 -129 -115 172 271 41 256 316 51 19 -88 88
7745 88 -142 261 132 -185 29 78 -92 52 -51 164 24 317 24 172 54 45 -12 32 243 167 45 -37 23
7768 23 119 -93 -117 -57 33 -177 -147 217 32 -218 -103 -128 22 15 -138 -142 183 -102 53 98 -282 -58 -130 33
7792 33 -301 -120 -111 -18 127 -217 17 -225 58 -24 40 -13 80 48 -34 -110 -101 4 -230 -69 -94 137 -102 -27 50
7817 50 -228 157 -207 -144 104 -7 -155 -214 -167 -337 141 57 -181 14 -74 -121 27 96 -75 -144 -136 -133 -264 -190 -87
7842 -87 -7 -11 -113 116 -59 20 94 71 -86 -192 142 68 -102 174 -142 434 49 -290 56 74 -186 180 119
$$ packed form
7674A11o4r4n1k17Q0K35J4LJ20m54M74l39N77n08M0K7n6P8L00l61K10l2O9j79
7698a7l05M17R4j92k4n4o1K70l77M33r5j55j21L10L9J45o8j4Mj10O7l27O8M3j88
7723b18J80J58k60J29N3K74k52J3k9k62K20j35J4K87R9k30K15O0k65l2j07J76
7745H8k30M03j29l17K14M9j70J44j03K15j40K93k93J48j18rn7M4K11p6j22q2O0
7768B3R6k12k4O0R0k10L0L64j85k50J15k5J50pj53mL25k85J55M5l80K24p2J63
7792C3l34J81RR3J45l44K34k42K83q2O4n3R3l2q2p6RJ05k34J61k5K31k39P5P7
7817E0k78L85l64O3K48j11j48n9M7j70M78q4k38J95q8m7J48O9j71o9QLj31P4J03
7842h7Q0mj02K29j75P9P4k3j57j06L34p4j70K76l16N76l85l39L46J8k60L66o1
$$ plain form
7865 119 -3 -311 -231 146 207 61 -145 250 -392 -98 296 -30 72 -64 158 44 52 207 44 229 257 193
7887 193 -292 -129 -51 -49 190 261 -50 -69 -80 -198 -11 173 154 93 77 -170 -20 -190 -225 41 6 5 103 -130 179
7912 179 -35 -61 56 -189 124 -62 186 17 -93 169 106 28 142 125 -259 -46 -191 -68 -78 -343 21 167
7934 167 -114 292 -20 135 39 -48 2 134 -105 -157 -236 24 -69 -84 -140 -64 78 -201 -177 215 -21 -21 -295 -56
7958 -56 -176 -55 229 -92 211 87 109 -6 54 -27 13 117 163 -59 10 -33 184 56 -11 -69 113 -174 69
7981 69 137 60 -251 -51 65 -63 -76 164 296 -141 166 25 -182 334 -143 182 -102 -161 217 55 93 125
8003 125 366 15 -239 -70 226 -92 23 -218 238 351 347 105 -406 -19 283 17 6 133 57 130 -28 -55
8025 -55 -4 186 -103 2 126 105 6 250 277 -159 120 152 40 409 -50 -257 -219 -309 -97 196 249 411 99
$$ packed form
7865A19j22l08Q0L77O1j46k06L95o42K94L94l26J02j36K22j14QJ55j63J85K8o4
7887A93m85J63P8KK39P1l11j9j1j18J87J84j9o1j6k47J50j70l5K66l5jR8k33L09
7912A79k14k6J17k45L13j86K48j69j10K62o3p8J14j7l84K13j45J23j0k65L64J46
7934A67k81M06l12J55r6q7N0J32k39n2p9K60r3j5n6P6J42k79K4L92k36%k74K39
7958e6j20J21K84l21L03j24K2j15O0q1M0J04M6k22O9m3K17j28o7n8J82k87K43
7981F9O8p7l11K00J16j28j3K40J32m37L07j41k07N16m77L25k84n9L78j62L8L2
8003A25K41l51k54J69K96l18J15k41M56J13mk42n11L87L02k66j1J27p6P3j58k7
8025e5N1J90k89J05J24k1r9K44K7m36K79L2j12L69m59k07L8r0K12K93N3J62l12
$$ plain form
8048 99 12 67 59 -74 223 -8 265 121 -233 65 184 -53 -84 -25 81 100 79 204 -114 -5 -431 -303 61
8071 61 42 -104 -89 160 -243 29 179 -260 -356 128 199 256 189 -51 -26 32 -69 -10 -32 -152 -45 -175 159 -254
8095 -254 50 391 144 -248 -197 -32 263 -78 316 143 196 137 -68 257 61 259 -106 -78 424 91 138 -139
8117 -139 -115 -257 36 -39 198 107 65 -49 -140 173 7 232 -32 100 83 71 29 117 -83 1 112 394 -132
8140 -132 -27 135 -93 243 413 160 -13 -47 241 241 64 -27 269 -52 25 33 -116 -49 70 120 -263 209 -117
8163 -117 -174 83 -264 213 -238 69 -61 -242 -28 -37 -40 10 305 34 103 -36 -175 -266 -215 -14 30 4 -163 114
8187 114 52 144 -356 8
$$ packed form
8048I9q7N5qj33K97k31K73j44l54K98J19k37l1N9J06J9k1J25l18J09m26J28L64
8071F1j9j46J5K49m03K72J50m39r6M84P1N7o7k40K5N8j01N9k2j20J07j30L34m13
8095b54L04L41k47l92N1J65K95l41L94j73N3n9k05L25j96J98l65K8N02l33M7k77
8117a39K4j42K93p5K37r1m2j14r1L13j66K25k64J32j7j2m2Q8k00Q4J11K82n26
8140a32J05J62k28L36J70k53j73l4K88%j77r1K96l21P7Qj49O7J19N0l83M72l26
8163a17n7K57l47M77m51L07j30j81K14rlN0K95k71O9j39j39r1N1K01M4k6j67K77
8187A14o2R2n00L64
8191H
$$ Imaginary data points
##PAGE= N=2
##DATA TABLE= (X++(I..I)), XYDATA
$$ plain form
0 0 0 0 0 0 0 0 0 0 0 0 1 -8 8 -8 8 -8 15 -16 16 -22 24 -27 32 -38 43 -49 57 -65 73 -83 93 -103 117 -130
34 -130 146 -162 179 -201 225 -248 275 -302 335 -371 412 -456 508 -566 632 -709 800 -910 1046
53 1046 -1215 1440 -1747 2201 -2933 4330 -7975 38708 87757 52617 38450 26850 35848 39369
67 39369 45175 39332 29870 18689 25652 46302 67847 69740 55393 36679 30959 37114 49299 52843
81 52843 45810 30332 21184 25614 41750 54989 54498 39382 23970 19749 29933 43425 48045 38669
95 38669 23437 14296 17574 29952 39192 35015 19677 4874 3388 15003 29113 32734 23357 8776
109 8776 325 4183 15175 22055 16169 245 -13493 -13320 -1041 11726 14349 4937 -8843 -15922
123 -15922 -10935 1273 7214 -95 -15779 -26976 -25847 -14176 -2135 -276 -10282 -24076 -28751
$$ packed form
0@%%%%%%%%%%JrJ6j6J6j6K3l1L2l8M6n1N9p0Q1r2J06j22J38j56J76j96K20k47
34a30K76l08L41l80M26m73N23n77O37p06P83q68R64j074J198j341J509j710J956
53A046k261K655l187L948n134P263j2305M6683M9049l5140j4167j1600Q998L521
67C9369N806n843r462j1181O963K0650K1545J893j4347j8714n720O155J2185L544
81E2843p033j5478r148M430J6136J3239m91j5116j5412m221J0184J3492M620r376
95C8669j5232r141L278J2378R240m177j5338j4803j486J1615J4110L621r377j4581
109H776q451L858J0992O880n886j5924j3738J73J2279J2767K623r412j3780p079
123a5922M987J2208N941p309j5684j1197J129J1671J2041J859j0006j3794m675
$$ plain form
136 -28751 -21416 -9078 -3848 -10693 -24519 -34660 -32528 -20273 -9022 -8607 -19356 -31578 -34538
149 -34538 -25549 -13167 -8333 -14719 -27093 -35272 -31583 -18916 -9234 -9840 -20938 -31671 -32997 -23842
163 -23842 -11809 -6817 -12778 -24543 -31038 -26131 -13387 -4484 -6177 -16810 -26076 -26823 -17271 -5471
177 -5471 -937 -8168 -18759 -23514 -17111 -5350 2751 526 -9459 -18983 -18390 -8065 3141 5737
191 5737 -1731 -11429 -15305 -8679 2724 10618 7533 -3275 -11680 -9909 296 10420 11808 4452
205 4452 -5355 -8860 -1982 9275 15347 11236 698 -6609 -4361 5917 15079 15341 7168 -3313
219 -3313 -5547 1675 12449 17199 11806 1594 -4810 -2084 7807 16072 15678 7044 -2842 -4691 3096
234 3096 12652 16192 10340 599 -5655 -2240 7329 14876 12824 3524 -4921 -5671 1533 10583 12938
$$ packed form
136b8751P335J2338N230o845j3826j0141K132J2255J1251M15j0749j2222k960
149c4538Q989J2382M834o386j2374q179L689J2667R682o06j1098j0733j326R155
163b3842J2033M992n961j1765o495M907J2744Q903j693j0633r266p47R552J1800
177e471M534p231j0591m755O403J1761Q101k225r985r524N93J0325J1206K596
191E737p468r698l876O626J1403P894l085j0808q405J771J0205J0124J388p356
205D452r807l505O878J1257O072m111j0538p307K248J0278R162K62q173j0481
219c313k234P222J0774M750n393j0212o404K726R891Q265l94q634r886j849P787
234C096R556L540n852r741o254L415R569P547k052r300q445p50P204R050K355
$$ plain form
249 12938 6972 -3243 -8272 -4007 5513 11812 8903 -270 -7907 -8081 -779 8138 9831 3118 -6442
264 -6442 -10523 -5481 3940 8650 5839 -2984 -10368 -9785 -1531 6839 7505 273 -8813 -11595 -6218 2843
280 2843 7572 4094 -5327 -11691 -9988 -1319 6165 6285 -1249 -9794 -11335 -5471 3560 7606 3272
295 3272 -5679 -11452 -8346 203 7139 6387 -1161 -8947 -10142 -3492 5478 8348 3450 -5321 -9494
310 -9494 -5786 2328 8592 7148 -386 -7498 -7628 -702 7340 9477 3654 -4096 -7522 -3478 4693
325 4693 10117 8123 286 -6409 -5466 1491 8800 10196 4119 -3425 -6282 -1850 6498 10665 7860
340 7860 -184 -5663 -4198 2817 9459 9990 3749 -3700 -6262 -684 6734 10514 6257 -1145 -6285
355 -6285 -4244 2889 9594 9040 1795 -5255 -6543 -1030 6445 9201 4797 -2770 -7598 -5117 2572
$$ packed form
249A2938n966j0215n029M265R520O299k909r173p637j74P302Q917J693o713r560
264f442m081N042R421M710k811q823p384N83Q254Q370O66p232r086k782N377R061
280B843M729l478r421o364J703Q669P484J20p534q545j541N864R031M046m334
295C272q951n773L106Q549O936p52p548p786j195O650Q970K870m898q771m173
310i494L708Q114O264j444p534p112j30O926Q042K137n823p750l426M044Q171
325D693N424j994p837o695R43O957P309J396o077p544k857M432Q348M167k805
340G860q044n479J465P015O642N31o241p449k562N578P418L780m257p402n140
355f285K041P133O705n54p245p050j288N513P475K756m404p567m828K481P689
$$ plain form
370 2572 8408 6864 -364 -6849 -7356 -1515 5523 7551 3008 -5019 -8744 -5325 1950 6819 4553
385 4553 -2271 -8039 -8111 -1985 5004 6230 696 -6389 -9310 -5635 1722 5684 3278 -3890 -9061 -8240
401 -8240 -1644 4420 4980 -699 -7533 -9688 -4866 2076 5609 2505 -4798 -9429 -7743 -812 4616
416 4616 4323 -1305 -7525 -9253 -3999 2676 5967 2130 -4878 -9154 -6417 221 5391 4903 -1351 -7374
432 -7374 -8262 -2687 4370 6444 1855 -5098 -8076 -4911 1712 6354 5057 -1058 -7237 -6883 -1140 4972
448 4972 6639 1927 -4607 -7497 -4065 2921 7079 4840 -1726 -6894 -5885 -162 5862 6591 1355
463 1355 -4581 -7090 -2999 3716 7347 4385 -2157 -6669 -4945 859 6039 6372 1100 -5159 -6501
478 -6501 -1966 4113 6946 3616 -2565 -6439 -4653 1391 6589 6059 52 -5769 -6163 -1519 4834 6682
$$ packed form
370B572N836j544p228o485n07N841P038K028m543q027l725L419P275M869k266
385D553o824n768p2O126O989J226n534p085k921L675P357L962k406p168n171Q21
401h240O596O064N60n679o834k155M822O942L533l104p303m631J686O931N428
416D616k93n628o220j728N254O675L291l837p008m276K737O638N170m88o254o023
432g374q88N575P057K074m589o953k978L165O623M642j297o115o179L54N743O112
448D972J667m712o534k890L432O986M158k239o566n168J009N723O024P29n236
463A355n936k509M091O715L631k962o542m512J724N804N180L33n272o259j342
478f501M535O079K833l330o181l874J786O044N198n30o007n821l94M644O353J848
$$ plain form
494 6682 3323 -3079 -6624 -3861 2276 6964 5679 -58 -5337 -5842 -421 5693 7355 2936 -3330
509 -3330 -6188 -3093 3308 7465 5821 -413 -5291 -5062 430 6543 7580 2849 -3207 -5176 -1707
524 -1707 4558 7794 6004 -403 -4839 -3808 1924 7627 7939 2896 -2938 -4521 -804 5184 8936
539 8936 6182 -234 -4501 -2828 3246 8509 7612 2786 -2758 -3902 318 6252 9102 5931 -269
554 -269 -4122 -1816 3908 8256 7687 2285 -3129 -3953 903 6597 8499 4696 -1483 -4503 -2362 3687
570 3687 7520 6699 995 -4384 -4670 308 6012 6909 2943 -3242 -5996 -3284 2924 6005 4778 -1513
586 -1513 -6457 -6033 -1358 4040 4919 532 -5603 -8103 -4772 1368 4427 1713 -4288 -8313 -7863 -2430
602 -2430 2477 2609 -2107 -8209 -9986 -6093 -297 2568 -675 -6301 -10480 -9154 -3305 1211 1007 -4185
$$ packed form
494F682l359o402l545K763O137M688j285n737n279n05N421O114J662m419o266
509c330k858L095O401M157j644o234m878K29N492O113J037m731o056j969L469
524a707O265L236j790o407m436J031N732N703L12n043n834j583L717N988L752
539H936k754o416m267J673O074N263q97m826n544j144M220N934K850l171o200
554b69l853K306N724M348n69n402n414q24M856N694J902l803o179l020K141O049
570C687L833q21n704n379k86M978N704Q97l966o185k754K712O208L081j227o291
586a513m944M24M675N398Q79m387o135k500L331O140L059k714o001m025M50N433
602b430M907J32m716o102j777L893N796K865l243n626m179J326N849M516k04n192
$$ plain form
618 -4185 -9988 -10803 -6748 -1568 1033 -1891 -8069 -11204 -9036 -3723 329 -356 -5371 -10000 -10797 -6270
634 -6270 -904 1241 -2186 -7865 -10537 -8185 -3081 1248 486 -4852 -9318 -9570 -4722 858 2484 -1156
650 -1156 -6630 -8935 -5807 -370 3812 2102 -2669 -7380 -6587 -1447 3769 4880 914 -4325 -6251
665 -6251 -2988 3107 6523 4610 -604 -4288 -3464 2009 6637 7483 3546 -1455 -2973 585 6577 9046
681 9046 6960 1727 -1544 -109 5055 9647 9892 5309 574 -360 3313 9231 11276 8579 3418 245
697 245 2287 7405 11606 11252 6532 1672 1259 5226 10532 11993 9163 3855 1063 2807 7902 11745
713 11745 10473 5823 1465 1128 5281 9847 11250 7853 2734 -271 1933 7150 10137 8638 4007
728 4007 -1 -149 3612 7969 9169 5123 119 -2021 342 4971 7679 5857 1050 -3126 -2884 1211
$$ packed form
618d185n803q15M055N180K601k924o178l135K168N313M052o85n015m629p97M527
634f270N366K145l427n679k672K352N104M329p62n338m466k52M848N580J626l640
650a156n474k305L128N437M182j710m771m711P93N140N216J111l966n239j926
665f251L263O095L416j913n214l684Q24N473M628Q46l937n001j518L558N992K469
681I046k086n233l271J435N164M592K45m583m735r34L673N918K045k697n161l173
697B45K042N118M201l54m720m860m13L967N306J461k830n308k792J744N095L843
713A1745j272m650m358l37M153M566J403l397n119l005K204N217K987j499m631
728D007m008j48L761M357J200m046n004k140K363M629K708j822m807m176K42M095
$$ plain form
744 1211 5426 5942 1891 -3250 -4878 -2197 2530 5128 2757 -2325 -5924 -5042 -943 2852 2729 -1283
760 -1283 -5810 -7258 -4270 231 2131 -341 -5352 -8254 -6906 -3132 1073 532 -3323 -7922 -9185
775 -9185 -5486 -1209 481 -2225 -6901 -9507 -7849 -3626 136 -750 -4829 -8942 -9050 -5563 -1202 189
791 189 -2823 -7307 -9332 -7275 -2876 746 -757 -4468 -8175 -7865 -4254 -299 782 -1878 -6589 -8108
807 -8108 -5612 -959 1864 627 -3806 -6689 -5737 -2205 1524 2710 -389 -4691 -5746 -3404 1356
822 1356 3717 2075 -2060 -4857 -4148 -108 3720 4368 846 -2980 -3837 -845 3559 5469 3500 -690
838 -690 -3186 -1900 2244 5668 5770 1855 -1765 -2402 746 4593 6365 4240 94 -2147 -898 3510
854 3510 6785 5662 2128 -1176 -1776 1552 5512 6514 4134 284 -1797 79 3898 6295 5419 1714
$$ packed form
744A211M215N16m051n141j628K681M727K598k371n082l599Q82M099L795j23m012
760a283m527j448K988M501J900k472n011k902J348L774M205n41l855m599j263
775i185L699M277J690k706m676k606J658M223L762q86m079m113j08L487M361J391
791A89l012m484k025K057M399L622j503l711l707L10L611L955J081k660m711j519
807h108K496M653K823j237m433k883R52L532L729J186l099m302j055K342M760
822A356K361j642m135k797P09M040L828O48l522l826q57K992M404J910j969m190
838f90k496J286M144L424J02l915l620o37L148L847J772k125m146k241J249M408
854C510L275j123l534l304o00L328L960J002k380l850k081J876L819K397q76l705
$$ plain form
870 1714 -1511 -1541 1815 5105 5889 3051 -702 -2259 29 3387 5359 4552 515 -2400 -2139 1346
886 1346 4156 4776 1861 -2112 -3353 -1130 2283 4439 2644 -1008 -3851 -2756 470 3247 3020 231
902 231 -3059 -4419 -1513 1577 3000 1202 -2515 -4631 -3838 -262 2424 2340 -1349 -4387 -4767 -2146
918 -2146 1338 2339 244 -2904 -5059 -3998 -485 1953 1571 -1766 -4838 -4590 -2282 1183 1747 -327
934 -327 -3459 -5330 -3377 35 1958 1331 -1831 -4309 -4495 -1352 1679 2458 -289 -3334 -4418 -2839
950 -2839 748 2554 1431 -1792 -3991 -3223 -360 2542 2783 197 -2742 -3464 -1703 1953 3698 2075
966 2075 -1007 -3326 -2295 891 3483 3160 496 -2290 -2851 -375 2586 4196 2562 -799 -2930 -1517
982 -1517 1607 4166 3518 685 -2254 -2385 178 3609 4220 2360 -833 -2282 -1068 2037 4677 3787
$$ packed form
870A714l225l0L356L290P84k838l753j557K288L358J972q07m037k915K61L485
886A346K810O20k915l973j241K223L413K156j795l652k843J095L226K777k27k789
902B31l290j360K906L090J423j798l717k116P93L576K686q4l689l038l80K621
918b146L484J001k095l148k155J061L513K438l82l337l072K48K308L465N64k074
934c27l132j871J953L412J923o27l162k478j86L143L031P79k747l045j084J579
950b839L587J806j123l223k199P68K863K902K41k586k939p22J761L656J745j623
966B075l082k319J031L186K592l23k664k786n61K476K961J610j634l361k131J413
982a517L124K559o48k833k939j31K563L431O11j860l193j449J214L105K640q90
$$ plain form
998 3787 636 -1904 -1907 696 3728 4164 1941 -987 -2650 -738 2329 4256 2962 13 -2454 -1934
1014 -1934 783 3352 3719 1659 -1547 -2637 -697 2067 3803 2262 -731 -2953 -2336 538 2842
1029 2842 2937 728 -2514 -3099 -822 2198 3410 1513 -1208 -3300 -2359 432 2751 2591 -75 -3087
1045 -3087 -3410 -969 1814 2782 921 -1827 -3551 -2259 398 2613 1802 -1178 -3532 -3264 -912 1847
1061 1847 2454 878 -2653 -3878 -2158 865 2503 1703 -1327 -3616 -3314 -604 2201 2115 -165 -2695
1077 -2695 -3543 -2129 886 2640 1267 -1525 -3465 -2790 -216 2407 2229 -77 -2690 -3366 -1383 1463
1093 1463 2688 1614 -1444 -3330 -2692 112 2701 2649 88 -2633 -3168 -984 2002 3024 1276 -1544
1109 -1544 -2851 -1982 870 2913 2552 -233 -2530 -2555 -527 2086 3242 1199 -1561 -2932 -1411 1145
$$ packed form
998C787l151k540lK603L032M36k223k928j663J912L067J927j294k949k467N20
1014a934K717K569L67k060l206j090J940K764J736j541k993k222O17K874K304
1029B842R5k209l242n85K277L020J212j897k721k092R41K791K319j60k666l012
1045c087l23K441K783R68j861k748j724J292K657K215q11k980k354K68K352K759
1061A847O07j576l531j225J720L023J638q00l030k289L02K710K805q6k280k530
1077b695q48J414L015J754j373k792j940O75K574K623j78k306k613o76J983K846
1093A463J225j074l058j886O38K804K589n2k561k721n35K184K986J022j748k820
1109a544j307Q69K852K043l61k785k297k5K028K613J156k043k760j371J521K556
$$ plain form
1125 1145 3058 2217 -78 -2629 -2341 -218 2558 3153 959 -1421 -2853 -1320 1836 3112 2270 -199
1141 -199 -2421 -2020 595 2943 2846 744 -1920 -2784 -1148 2086 3370 1971 -638 -2718 -1867 687
1157 687 2888 3060 735 -1935 -2550 -750 2252 3548 1491 -1040 -2594 -1455 909 3076 2904 731
1173 731 -2009 -2196 -43 2369 3338 2069 -846 -2490 -1255 1470 3357 3075 244 -1818 -1671 398
1189 398 2834 3354 1900 -705 -2196 -1082 1926 3540 2910 436 -1811 -2132 409 3082 3559 1511
1205 1511 -1196 -2469 -795 2247 3578 2496 -165 -2138 -1678 607 3275 3231 1276 -1393 -2335 -513
1221 -513 2207 3636 2423 -416 -2508 -2057 787 2907 2945 725 -2096 -2668 -705 1807 2791 1527
1237 1527 -1106 -2835 -2063 640 2648 2213 -53 -2472 -3107 -731 1369 2500 1106 -2156 -3298 -2806
$$ packed form
1125A145J913q41k295k551K88K123K776N95k194k380j432J533L156J276q42k469
1141a99k222M01K615K348r7k102k664q64J636L234J284j399k609k080Q51K554
1157F87K201J72k325k670o15J800L002J296k057k531j554J139K364K167j72k173
1173G31k740j87K153K412R69j269k915j644J235K725J887k82k831k062J47K069
1189C98K436N20j454k605j491J114L008J614o30k474k247l21K541K673M77k048
1205A511k707j273J674L042J331j082k661j973M60K285K668m4j955k669r42J822
1221e13K720J429j213k839k092M51K844K120L8k220k821n72J963K512R84j264
1237A527k633j729P72K703K008m35k266k419o35K376K100J131j394l262j142M92
$$ plain form
1253 -2806 156 1635 1366 -848 -3356 -3648 -1458 1162 1376 -77 -2775 -4170 -3075 -423 1485 560
1269 560 -1903 -3963 -3949 -1659 642 853 -1111 -3184 -4478 -3188 -492 1005 -107 -2697 -4145 -4137 -1661
1286 -1661 675 802 -1240 -3845 -4625 -3152 -400 977 -479 -2772 -4489 -3885 -1321 632 772 -1149
1302 -1149 -3672 -4243 -2151 170 1441 287 -2395 -4010 -2899 -56 1759 1434 -807 -2940 -3416 -1354
1318 -1354 984 1937 961 -1829 -3056 -2069 585 2437 1980 -1 -2118 -2331 -57 2224 2887 1631
1334 1631 -904 -1884 -878 1570 3439 2800 777 -1324 -1262 1178 3240 3759 2295 -141 -1327 109
1350 109 2685 4693 3703 1733 -145 -422 1839 4010 4347 2718 184 -501 950 3289 4765 3650
1366 3650 1183 -394 -58 2243 4234 4551 2369 280 -606 1163 3641 4312 3351 1027 -879 -180
$$ packed form
1253b806K962J479k69k214k508k92K190K620K14j453k698j395J095K652J908r25
1269E60k463k060J4K290K301K11j964k073j294J290K696J497j112k590j448QK476
1286a661K336J27k042k605p80J473K752J377j456k293j717O04K564J953J40j921
1302a149k523n71K092K321J271j154k682j615J111K843J815l25k241k133m76K062
1318a354K338R53r76k790j227R87K654J852m57j981k117k13K274K281O63j256
1334A631k535r80J006K448J869o39k023k101O2K440K062N19j464k436j186J436
1350A09K576K008r90j970j878k77K261K171L37j629k534o85J451K339J476j115
1366C650k467j577L36K301J991L17k182k089q86J769K478O71r61k324j906O99
$$ plain form
1382 -180 2116 3825 3844 1577 -625 -761 826 3011 3575 2726 -147 -1355 -714 1605 3214 2831 395
1399 395 -1662 -1613 -66 2007 2569 1425 -1109 -2442 -1410 979 2072 1723 -645 -2483 -2468 -832 1376
1416 1376 1654 -264 -2270 -3434 -2177 -230 1252 269 -1604 -3556 -3146 -1111 584 862 -1021 -3009
1432 -3009 -3773 -2812 -519 563 -156 -2050 -4195 -3454 -1528 182 267 -1266 -3180 -4134 -2509 -493 443
1449 443 -519 -2576 -3813 -3241 -1053 343 138 -1584 -3191 -4001 -2129 23 656 -268 -2274 -3393 -2520
1466 -2520 -613 1056 1129 -666 -2794 -2908 -1264 1122 1372 54 -1470 -2679 -1764 537 2040 1452
1482 1452 -548 -1697 -2006 -27 1420 1975 1137 -1201 -1556 -538 1370 2495 2131 497 -1471 -867
1498 -867 532 2718 2909 1276 -500 -1022 126 2099 2989 2351 250 -758 -217 1101 2787 2828 1649
$$ packed form
1382a80K296J709J9k267k202j36J587K185N64q49k873j208O41K319J609l83k436
1399C95k057M9J547K073N62j144k534j333J032K389J093l49k368j838J5J636K208
1416A376K78j918k006j164J257J947J482r83j873j952M10K035J695K78j883j988
1432c009p64R61K293J082p19j894k145P41J926J710Q5j533j914r54J625K016R36
1449D43r62k057j237N72K188J396k05j722j607q10J872K152O33r24k006j119Q73
1466b520J907J669P3j795k128j14J644K386K50j318j524j209R15K301J503n88
1482A452k000j149l09J979J447N55q38k338l55J018J908J125l64j634j968O04
1498h67J399K186J91j633j776n22J148J973Q90o38k101j008N41J318J686M1j179
$$ plain form
1515 1649 -230 -928 357 2391 3095 2376 348 -937 -271 1520 2996 2392 1104 -1029 -1122 464 2246
1532 2246 2779 1715 64 -982 -186 1328 2510 2068 774 -1170 -1206 174 1896 2300 1192 -743
1548 -743 -1376 -543 1034 2203 1737 -218 -1576 -1666 -332 1363 1729 615 -932 -2099 -1080 713 1770
1565 1770 846 -788 -1559 -1704 -271 988 1443 9 -1594 -2040 -1192 428 1111 753 -920 -2082 -1824
1582 -1824 -9 1151 1094 -94 -1581 -2161 -767 662 1401 616 -1111 -2025 -1261 28 1501 1264 -181
1599 -181 -1543 -1363 -435 964 1898 662 -1093 -1781 -848 555 1440 1061 -322 -1598 -1515 -26 1513
1616 1513 1571 585 -1080 -1473 -671 1135 1951 1362 -44 -1324 -1294 342 1976 1980 579 -656 -1118 -189
1634 -189 1399 2018 1421 -150 -1196 -643 658 1935 1703 658 -794 -1055 -74 1199 2093 1373 -235
$$ packed form
1515A649j879o98J285K034P04p19k028j285O66J791J476o04j288k133r3J586J782
1532B246N33j064j651j046P96J514J182m42j294j944l6J380J722M04j108j935
1548g43o33Q33J577J169m66j955j358r0J334J695L66j114j547j167J019J793J057
1565A770r24j634p71j45J433J259M55j434j603m46Q48J620O83l58j673j162K58
1582a824J815J160n7j188j487n80J394J429P39p85j727r14P64J289J473k37j445
1599a81j362J80R28J399R34j236j755o88R33J403Q85l79j383j276Q3J489J539
1616A513N8r86j665l93Q02J806Q16n89j406j280L0J636J634Mj401j235m62R29
1634a89J588O19n97j571j046N53J301J277k32j045j452k61R81J273Q94p20j608
$$ plain form
1651 -235 -1328 -631 752 1763 1620 218 -923 -1079 -172 1575 1730 884 -914 -1341 -712 453 1811
1668 1811 1301 -118 -1666 -1464 -121 1090 1566 238 -974 -1570 -886 474 1618 1003 -298 -1872
1684 -1872 -1454 -138 1146 1003 202 -1355 -1641 -1125 518 963 737 -822 -1951 -1689 -230 1183 998
1701 998 -244 -1539 -1913 -1050 705 1268 359 -1462 -1925 -1490 99 1035 655 -498 -1524 -1825 -831 717
1719 717 1004 163 -941 -1732 -1180 -164 1094 930 -337 -1747 -1438 -736 1206 1580 65 -1033 -1632
1736 -1632 -1086 771 1314 1004 -594 -1667 -1551 -257 1116 1199 282 -1165 -1720 -734 803 1462 918 -391
1754 -391 -1522 -1320 302 1294 1377 402 -808 -1457 -382 954 1836 814 -660 -1360 -1059 171 1326
1771 1326 1393 282 -1331 -1591 -541 1177 1688 728 -785 -1580 -1127 20 1489 1036 -305 -1708 -1270
$$ packed form
1651b35j093O97J383J011j43j402j141j56R07J747J55q46j798m27O29J165J358
1668A811n10j419j548K02J343J211M76j328j212n96O84J360J144o15j301j574
1684a872M18J316J284j43q01j557k86N16J643M45k26j559j129K62J459J413j85
1701I98j242j295l74Q63J755N63r09j821m63M35J589R36l80j153j026l01R94J548
1719G17K87q41j104p91N52J016J258j64j267j410L09P02J942L74j515j098n99
1736a632N46J857N43l10j598j073J16J294J373Q3r17j447n55R86J537O59n44j309
1754c91j131K02J622R92Q3r75j210o49J075J336Q82j022j474p00L01J230J155
1771A326O7j111j613k60J050J718N11r60j513p95M53J147J469m53j341j403M38
$$ plain form
1788 -1270 -607 645 1296 614 -865 -1319 -1360 95 1001 785 -368 -1509 -1538 -204 835 1102 353 -1081
1806 -1081 -1788 -875 382 1318 814 -460 -1723 -1443 -249 949 1127 194 -1151 -1586 -645 652 1457
1823 1457 821 -640 -1548 -1416 80 1115 1200 10 -992 -1572 -347 889 1632 777 -283 -895 -746
1840 -746 520 1650 1377 299 -1130 -757 146 1203 2117 1014 -38 -1150 -627 800 1995 1836 213
1857 213 -555 -803 -151 1379 1917 1070 40 -866 -77 1017 2077 1434 268 -762 -638 652 1688
1874 1688 2032 1261 -451 -968 -393 1230 1909 1592 362 -837 -546 563 1582 1927 664 -489 -951
1891 -951 -381 927 1985 1358 -188 -1227 -1192 210 1102 1163 381 -914 -1406 -688 323 1283 622 -399
1909 -399 -1534 -1267 45 1086 1353 -461 -1617 -1480 -721 459 906 46 -1330 -1970 -1562 -158 631
$$ packed form
1788a270O63J252O51o82j479m54m1J455R06k16j153j141k9J334J039K67p49j434
1806a081p07R13J257R36n04j274j263K80J194J198J78r33j345m35R41J297Q05
1823A457o36j461r08J32J496J035Q5j190j002n80J225J236P43q55j060o12J49
1840g46J266J130k73j078j429L73R03J057R14j103j052j112N23J427J195j59j623
1857B13p68k48O52J530N38q47j030r06P89J094J060o43j166j030J24J290J036
1874A688L44p71j712n17N75J623O79l17j230j199K91J109J019L45j263j153m62
1891i51N70J308J058o27j546j039L5J402Q92O1p82j295m92P18J011R60o61j021
1909c99j135K67J312J041K67j814j156J37P59J180M47q60j376o40M08J404P89
$$ plain form
1926 631 507 -900 -1672 -1866 -832 431 522 -137 -1593 -1942 -1214 -427 527 281 -859 -2160 -1804 -759
1944 -759 217 250 -609 -1413 -2282 -1609 -70 499 263 -876 -1877 -1600 -986 293 727 133 -1435 -1644 -881
1963 -881 52 547 519 -724 -1706 -1249 -421 683 701 198 -1174 -922 -409 644 1282 949 -541 -1276 -837
1982 -837 632 1224 1085 405 -705 -958 -27 1101 1913 981 145 -791 -219 959 1783 1885 645 -604
2000 -604 -200 638 1945 1976 1139 -8 -583 -97 1082 1931 1664 244 -354 -332 304 1716 1904 1026 -180
2019 -180 -844 -333 964 1851 1452 277 -449 -511 329 1489 1578 620 -462 -826 -504 680 1362 1097 -140
2038 -140 -994 -844 -95 979 868 -20 -935 -1034 -558 149 892 503 -580 -1563 -1489 -190 577 469 -471 -1597
2058 -1597 -1791 -842 248 596 -373 -1472 -1773 -1755 -503 110 35 -785 -2082 -1806 -1092 -129 462 -449 -1241
$$ packed form
1926F31j24j407p72j94J034J263R1o59j456l49P28P87R54k46j140j301L56J045
1944g59R76L3q59q04q69O73J539N69k36j139j001K77O14J279M34n94j568k09P63
1963h81R33M95k8j243r82M57Q28J104J8n03j372K52N13J053O38l33j490p35M39
1982h37J469N92j39o80j110k53R31J128Q12r32q36r36N72J178Q24J02j240j249
2000f04M04Q38J307L1q37j147n75M86J179Q49k67j420n98K2O36J412J88q78j206
2019a80o64N11J297Q87l99j175p26o2Q40J160Q9r58j082l64L22J184O82k65j237
2038a40q54J50P49J074j11q88r15r9M76P07P43l89j083r83P4J299P67j08r40j126
2058a597j94R49J090L48r69j099l01J8J252O13p5q20j297K76P14R63N91r11p92
$$ plain form
2077 -1241 -1835 -1530 -573 533 153 -584 -1935 -1478 -755 193 471 -303 -1228 -1673 -1119 -101 544 262 -630
2096 -630 -1156 -1399 -562 390 893 67 -992 -1144 -537 466 954 941 -350 -757 -643 302 1394 1121 134
2115 134 -206 -595 -113 898 1598 1081 426 -157 -31 759 1584 1381 972 256 -287 622 1519 1828 1154 704
2135 704 -110 350 739 1660 1974 956 165 53 802 1958 1692 1390 553 38 704 1391 1704 1659 930 46
2155 46 57 965 1257 1756 1178 408 -44 563 1293 1535 1189 466 -338 -47 771 1156 1449 689 -221 -468 -220
2176 -220 912 1258 606 -26 -988 -534 -3 832 1003 136 -616 -870 -311 432 437 141 -514 -1054 -909 -284
2196 -284 348 247 -332 -1090 -1466 -942 -247 125 -243 -995 -1189 -1234 -187 93 -48 -585 -1337 -1474 -961 -7
2216 -7 244 -246 -1180 -1510 -908 -267 193 -249 -678 -1383 -904 -624 -215 158 -380 -639 -1136 -840 -60 119 -30
$$ packed form
2077a241n94L05R57J106l80p37j351M57P23R48K78p74r25m45N54J018O45k82q92
2096f30n26k43Q37R52N03q26j059j52O07J003M88j3j291m07J14R45J092k73r87
2115A34l40l89M82J011P00n17o55n83J26P90Q25k03m09p16n43R09Q97L09o74m50
2135G04q14M60L89R21L14j018p91j12P49J156k66l02q37n15O66O87L13m5p29q84
2155D6J1R08K92M99n78p70m52O07P30K42l46p23q04K91Q18L85K93p60r10k47K48
2176b20J132L46o52o32r62M54N31Q35J71q67p52k54N59P43Nk96o55n40J45O25
2196b84O32j01n79p58l76N24O95L72l68p52j94m5J047K80j41n37p52j37N13R54
2216gK51m90r34l30O02O41M60m42m29p05M79K80M09L73n38k59m97K96P80J79j49
$$ plain form
2237 -30 -483 -1172 -846 -443 351 414 -87 -1106 -659 -350 330 1054 459 -132 -1091 -517 355 514 956 130
2257 130 -388 -487 -59 569 847 549 75 7 -79 653 1234 873 346 -300 -520 163 979 1081 598 -277 -417
2278 -417 63 925 1333 946 -11 59 -400 514 1118 988 444 113 -284 11 964 1091 1023 121 -210 -234 185
2299 185 1094 827 221 -350 -609 -192 416 730 550 -100 -804 -514 -145 682 264 -131 -507 -877 -436 457
2319 457 482 -29 -538 -991 -574 -260 406 217 -354 -931 -887 -586 -52 141 -164 -898 -1476 -978 -180 11 -55
2340 -55 -784 -1387 -983 -616 -341 -180 -427 -929 -1290 -1005 -422 -106 -297 -913 -1097 -945 -803 170 120 -740 -992
2361 -992 -1603 -721 -294 24 214 -894 -1225 -1032 -318 460 14 -345 -794 -872 -711 104 376 -179 -417 -953
2381 -953 -607 44 289 303 -292 -878 -1083 -292 408 524 395 -238 -733 -318 377 465 391 -52 -297 -429 370
$$ packed form
2237c0m53o89L26M03P94O3n01j019M47L09O80P24n95n91r59N74Q72J59M42q26
2257A30n18r9M28O28K78k98m74o8q6P32N81l61n27o46k20O83Q16J02m83q75j40
2278d17M80Q62M08l87r57P0m59R14O04j30n44l31l97K95R53J27o8r02l31k4M19
2299A85R09k67o06n71k59M17O08L14j80o50p04K90L69Q27m18l95l76l70M41Q93
2319D57K5n11n09m53M17L14O66j89n71n77M4L01N34J93l05p34n78M98P98J91o6
2340e5p29o03M04L67K75J61k47n02l61K85N83L16j91o16j84J52J42R73n0q60k52
2361i92o11Q82M27L18J90j108l31J93P14P78m46l59m49p8J61Q15K72n55k38n36
2381i53L46O51K45J4n95n86k05P91P00J16j29o33m95M15O95Q8p4m43k45j32P99
$$ plain form
2402 370 687 803 444 183 -254 -252 476 1044 647 353 -337 -100 30 916 814 907 -266 -271 -28 473 1056
2423 1056 1005 357 9 -11 393 1022 1013 412 13 -147 60 694 864 544 148 -212 -142 318 1147 814 -211
2444 -211 -138 -270 199 864 1203 595 -79 -336 -80 617 932 718 131 -247 -219 245 483 1133 577 -213 -428
2465 -428 -211 400 554 656 -258 -343 -143 125 847 494 116 -367 -507 -365 657 852 568 88 -539 -512
2485 -512 274 508 549 242 -375 -755 -230 21 562 446 -65 -396 -391 144 738 819 175 -534 -575 -267 350 491
2507 491 546 -409 -660 -476 360 427 785 -97 -385 -623 -279 585 770 334 -557 -729 -459 152 480 304 -189
2528 -189 -725 -476 -89 122 350 -4 -455 -950 -361 144 368 159 -296 -780 -647 -202 70 432 -38 -515
2548 -515 -967 -570 -211 218 218 -658 -929 -726 -295 -54 169 -403 -701 -1156 -787 -127 -155 47 -499 -1063 -1118
$$ packed form
2402C70L17J16l59k61m37KP28N68l97k94o90K37J30Q86j02R3j173nK43N01N83
2423A056n1o48l48k0M04O29ro01l99j60K07O34J70l20l96l60P0M60Q29l33j025
2444b11P3j32M69O65L39o08o74k57K56O97L15k14n87l78K8M64K38O50n56p90k15
2465d28K17O11J54J02r14q5K00K68P22l53l78m83j40J42J022J95k84m80o27K7
2485e12P86K34M1l07o17l80N25K51N41j16n11l31NN35N94Q1o44p09m1L08O17J41
2507D91N5r55k51J84Q36O7L58q82k88k38L44Q64J85m36q91j72K70O11L28j76m93
2528a89n36K49L87K11K28l54m51m95N89N05K24k09m55m84J33M45K72L62m70m77
2548e15m52L97L59M29%q76k71K03M31K41K23n72k98m55L69O60k8K02n46n64n5
$$ plain form
2569 -1118 -402 40 136 -3 -827 -977 -430 -6 -185 -57 -734 -917 -941 -416 315 -263 -360 -1225 -882 -632 -101
2590 -101 -86 -189 -799 -1184 -500 -81 51 106 -127 -551 -812 -591 40 271 -186 -499 -956 -864 328 413 237
2611 237 -59 -602 -538 -57 499 641 404 -217 -534 -119 620 895 676 337 -437 -394 275 834 1023 695 284
2632 284 -137 236 854 804 755 172 51 -77 620 805 1068 687 272 282 550 942 1254 1098 322 537 190
2653 190 613 1194 1078 688 256 338 643 807 1255 984 413 78 351 618 1111 780 609 679 224 658 1037
2674 1037 1054 711 480 -48 64 468 908 810 476 6 124 493 696 612 301 57 -514 -41 432 794 546
2695 546 279 -189 -341 -219 660 564 119 -130 -447 -352 53 310 336 -280 -566 -424 -241 333 339 -235 -842 -749
2717 -749 -501 -219 133 171 -503 -774 -268 -408 167 -42 -392 -597 -760 -430 0 141 -181 -376 -1127 -896
$$ packed form
2569a118P16M42R6j39q24j50N47M24j79J28o77j83k4N25P31n78r7q65L43K50N31
2590a01J5j03o10l85O84M19J32N5k33m24k61K21O31K31m57l13m57R2J192Q5j76
2611B37k96n43O4M81N56J42k37o21l17M15P39K75k19l39p74M3O69N59J89l28m11
2632B84m21L73O18n0m9n83j21j28O97J85K63l81m15J0K68L92L12j56p76K15l47
2653A90M23N81j16l90m32Q2L05J64M48k71n71l35K73K67M93l31j71P0m55M34L79
2674A037J7l43k31n28J12M04M40r8l34m70J18L69K03q4l11k44n71M73M73L62k48
2695E46k67m68j52J22Q79r6m45k49l17R5M05K57K6o16k86J42J83N74On74o07R3
2717g49K48K82L52L8o74k71N06j40N75k09l50k05j63L30M30J41l22j95p51K31
$$ plain form
2737 -896 -311 245 -89 -459 -875 -1004 -710 -103 100 -308 -597 -789 -505 -277 87 -68 -196 -657 -587 -165
2757 -165 -49 16 4 -608 -565 -353 -117 85 445 -231 -544 -526 120 530 336 -107 -313 -380 -366 275 420 284
2779 284 -6 -454 -274 130 98 653 156 -310 -16 -202 182 258 226 -146 -517 -239 239 559 654 148 -205
2800 -205 107 10 129 490 431 83 -99 130 100 441 527 99 -408 -115 125 170 707 319 -169 -366 -63 -118
2822 -118 502 585 -190 -135 -611 175 210 337 59 -318 -360 -317 152 362 150 -54 -648 -372 -296 210 -2 257
2844 257 -588 -764 -272 -327 371 131 -518 -491 -529 -28 -63 -78 90 -333 -724 -578 -25 -71 329 -410 -850 -336
2866 -336 -266 128 -13 -184 -477 -575 -126 37 158 79 -299 -317 -365 -36 161 360 -191 -152 -174 89 82 134 -137
2889 -137 -218 -363 -62 134 376 189 29 -162 4 210 489 501 108 -49 -290 -207 205 190 401 119 -136
$$ packed form
2737h96N85N56l34l70m16j29K94O07K03m08k89j92K84K28L64j55j28m61P0M22
2757a65J16O5j2o12M3K12K36K02L60o76l13J8O46M10j94m43k06o7J4O41J45j36
2779B84k90m48J80M04l2N55m97m66K94j86L84P6l2l72l71K78M78L20R5n06l53
2800b05L12r7J19L61n9l48j82K29l0L41Q6m28n07K93K40M5N37l88m88j97L03n5
2822a18O20Q3p75N5m76P86L5J27k78l77m2M3M69K10k12k04n94K76P6N06k12K59
2844B57q45j76M92n5O98k40o49K7l8N01l5j5J68m23l91J46N53m6M00p39m40N14
2866c36P0L94j41j71k93r8M49J63J21p9l78j8m8L29J97J99n51L9k2K63pN2k71
2889a37q1j45L01J96K42j87j60j91J66K06K79J2l93j57k41Q3M12j5K11k82k55
$$ plain form
2910 -136 -169 454 527 471 163 -156 -318 -170 464 563 228 168 -163 -66 256 375 334 79 -17 -138 240 442 535
2933 535 331 32 -210 62 29 362 535 239 -111 -461 -98 390 268 9 -146 -34 -295 294 -42 85
2953 85 -1 -42 -115 -342 101 157 -340 -391 -522 -351 -281 356 -160 -390 -520 -410 -174 -29 200 -125 -643 -655 -499
2976 -499 -206 -33 -236 -133 -624 -534 -138 -26 -124 -331 -703 -291 -454 -267 136 249 -133 -575 -498 -160 122
2997 122 63 -211 -594 -586 -86 48 134 81 -105 -490 -20 147 251 83 0 -149 -182 39 109 355 -239 154 12
3020 12 298 426 502 222 228 108 -7 462 558 227 326 371 -248 257 690 632 797 437 238 348 672 621 879
3043 879 420 261 85 511 831 736 680 605 177 293 623 390 892 226 250 199 297 701 594 262 -8 42
3065 42 269 295 602 655 126 391 -106 199 566 627 168 -187 -227 51 160 484 296 197 -165 -348 -127 447
$$ packed form
2910a36l3O23P3n6l08l19j62J48O34R9l35o0l31R7L22J19m1k55r6j21L78K02R3
2933E35k04k99k42K72l3L33J73k96l50l50L63M88j22k59j55J12k61N89l36J27
2953H5q6m1p3k27M43N6m97n1j31J71P0O37n16k30j30J10K36J45K29l25n18j2J56
2976d99K93J73k03J03m91R0L96J12r8k07l72M12j63J87M03J13l82m42P7L38K82
2997A22n9k74l83QN00J34Q6n3j86l85M70J67J04j68q3j49l3K21P0K46n94L93j42
3020A2K86J28P6k80Oj20j15M69R6l31R9M5o19N05M33n8J65l60j99J10L24n1K58
3043H79m59j59j76M26L20r5n6p5m28J16L30k33N02o66K4n1R8M04j07l32k70N0
3065D2K27K6L07N3n29K65m97L05L67O1m59l55m0K78J09L24j88r9l62j83K21N74
$$ plain form
3087 447 172 -83 -132 -264 -376 -141 174 67 -357 -561 -712 -198 45 -67 -295 -867 -528 -615 -262 57 -188
3108 -188 -607 -626 -607 -484 -282 -352 -371 -211 -495 -657 -446 -256 -484 -562 -618 -808 -425 -146 -241 -502 -658 -609 -681
3131 -681 -90 -142 -116 -554 -642 -579 -360 -337 -51 -415 -765 -611 -286 62 -208 -479 -553 -659 -466 -74 -250 -115
3153 -115 -321 -552 -47 -27 127 62 -16 -59 -593 14 47 174 65 -108 -57 67 -104 67 355 247 -32 49
3175 49 4 331 278 275 34 5 22 257 559 313 388 385 16 12 609 717 351 317 272 416 481 329 623 394 -43
3200 -43 210 194 488 627 432 11 157 167 446 589 114 349 142 -18 31 370 416 257 -127 57 352 447
3222 447 574 176 133 -416 10 10 227 216 15 -160 -249 -180 106 -1 -125 263 -324 -266 207 111 206 217 -176
3245 -176 -374 -156 33 204 171 -347 -354 -46 -59 -19 83 -24 -193 -225 -227 19 74 271 94 -470 0 145 59
$$ packed form
3087D47k75k55m9j32j12K35L15j07m24k04j51N14K43j12k28n72L39q7L53L19k45
3108a88m19j9J9J23K02p0j9J60k84j62K11J90k28p8n6j90L83K79r5k61j56M9p2
3131f81N91n2K6m38q8O3K19K3K86l64l50J54L25L48k70k71p4j06J93L92j76J35
3153a15k06k31N05K0J54o5p8m3n34O07L3J27j09j73N1J24j71J71K88j08k79Q1
3175D9m5L27n3lk41k9J7K35L02k46P5ll69mN97J08l66l4m5J44O5j52K94k29m37
3200d3K53j6K94J39j95m21J46J0K79J43m75K35k07j60M9L39M6j59l84J84K95R5
3222D47J27l98m3n49M26%K17j1k01j75q9O9K86j07j24L88n87N8M73r6R5J1l93
3245a76j98K18J89J71l3n18pL08j3M0J02j07j69l2kK46N5J97j77n64M70J45q6
$$ plain form
3268 59 43 -177 -395 -248 94 111 171 -96 1 -205 -181 -189 151 265 54 135 -106 49 15 318 77 37 -216 66
3292 66 526 200 289 71 -53 204 68 228 102 93 239 121 97 259 300 249 130 -41 -180 291 371 151 37
3315 37 -340 -149 -61 11 134 234 44 -89 -125 78 226 217 -94 -268 -347 -162 -5 -9 -102 -115 -268 -277 -94 -23 -139
3340 -139 9 -521 -744 -286 -106 136 -98 -143 -611 -483 -344 -57 -160 -439 -522 -592 -507 -196 -399 -128 -610
3361 -610 -655 -606 -478 -12 -501 -489 -516 -423 -709 -447 -440 -563 -326 -805 -538 42 -438 -152 -858 -739 -369 -251
3383 -251 -145 -252 -374 -518 -684 -323 -173 -233 -50 98 -410 -138 -300 -242 -240 -83 -299 -295 -35 51 142 -79 23
3406 23 -372 -354 -95 519 435 118 53 -77 -83 149 310 344 414 217 8 482 423 523 329 195 95 286 572
3429 572 755 808 292 477 311 308 453 250 551 460 502 483 627 724 754 590 354 511 481 676 741 517 323
$$ packed form
3268E9j6k20k18J47L42J7O0k67R7k06K4qL40J14k11Q1k41J55l4L03k41m0k53K82
3292F6M60l26Q9k18j24K57j36J60j26rJ46j18k4J62M1n1j19j71j39M71Q0k20j14
3315C7l77J91Q8P2J23J00j90j33l6K03J48rl11j74p9J85J57mr3j3j53rJ83P1j16
3340a39J48n30k23M58J80K42k34m5m68J28J39K87j03k79q3p0Q5L11k03K71m82
3361f10m5M9J28M66m89J2k7R3k86K62Pj23K37m79K67N80m80K86p06J19L70J18
3383b51J06j07j22j44j66L61J50o0J83J48n08K72j62N8KJ57k16MK60Q6R1k21J02
3406B3l95J8K59O14q4l17o5j30oK32J61L4P0j97k09M74n9J00j94j34j00J91K86
3429E72J83N3n16J85j66lJ45k03L01r1M2j9J44R7L0j64k36J57l0J95O5k24j94
$$ plain form
3452 323 307 576 361 732 287 359 -130 280 524 540 561 150 196 180 93 318 299 424 392 -33 161 54 278
3475 278 214 155 270 -150 -29 103 149 -10 -68 -116 -298 -22 268 -49 -194 -227 -259 -198 59 85 -348 -396 -393 -467
3499 -467 -442 -53 -310 -581 -398 -472 -262 -134 -238 -276 -266 -663 -312 -419 -548 -224 -329 -560 -306 -347 -453 -555
3521 -555 -445 -397 -345 -304 -294 -112 -330 -262 -336 -54 -93 -162 -150 -1 -318 -357 140 100 196 -219 160 -270 -276 148 -74
3546 -74 123 -215 -62 -35 -51 155 181 32 -55 97 32 294 395 282 130 29 93 526 270 345 257 -35 183
3569 183 268 279 244 224 154 295 340 182 645 360 226 111 212 262 547 519 377 257 25 278 259 434 410
3592 410 384 -67 60 211 228 119 -37 406 82 170 140 61 204 254 -202 113 -53 270 92 -24 -141 128
3614 128 -231 271 -86 204 31 -201 -244 -79 50 1 76 -119 -285 -32 -120 -183 -382 -318 -439 -454 -100 -286
$$ packed form
3452C23j6K69k15L71m45P2m89M10K44J6K1m11M6j6q7K25j9J25l2m25J94j07K24
3475B78o4n9J15m20J21J32M6j59n8m8j82K76K90l17j45l3l2O1K57K6m33m8Lp4
3499d67K5L89k57k71J83p4K10J28j04l8J0l97L51j07j29L24j05k31K54m1j06j02
3521e55J10M8N2M1J0J82k18O8p4K82l9o9J2J49l17l9M97m0R6m15L79m30oM24k22
3546g4J97l38J53K7j6K06K6j49q7J52o5K62J01j13j52j01O4M33k56P5q8k92K18
3569A83Q5J1l5k0p0J41M5j58M63k85j34j15J01N0K85k8j42j20k32K53j9J75k4
3592D10k6m51J27J51J7j09j56M43l24Q8l0p9J43N0m56L15j66L23j78j16j17K69
3614A28l59N02l57K90j73k32m3J65J29m9P5j95j66K53q8o3j99O4j21j5L54j86
$$ plain form
3636 -286 -99 -95 -242 -567 -220 222 -295 -246 -459 -201 -309 -88 -79 -290 -368 -290 -115 -138 295 -108 -145 -150 -52 -50 1
3661 1 -51 29 -63 -224 -356 -316 21 -87 -59 -191 -257 -97 308 -158 -52 0 -248 -89 230 241 -52 -136 -219 120
3685 120 -47 179 265 42 251 62 -77 253 261 247 -12 -153 157 226 266 329 360 127 182 92 202 306 398 21
3709 21 159 212 225 101 277 0 -339 134 97 6 186 251 -46 88 127 -210 316 107 285 -51 1 25 -160
3732 -160 240 315 -9 -291 1 -21 -238 -288 4 -129 -374 56 164 20 -160 14 -138 -70 -169 -324 -91 -111
3754 -111 -534 -390 -107 75 66 -98 -435 -241 -182 -77 -82 -82 -128 -707 -408 108 -425 -75 -2 -260 -460 -250 -176
3777 -176 -364 104 -101 -6 -600 -256 -122 142 -15 -70 -217 -399 229 246 37 -122 -170 -13 6 -314 -100 138
3799 138 -132 128 -213 -20 156 77 10 -26 -164 -30 175 21 -40 245 124 -89 108 128 100 122 291 23
$$ packed form
3636b86J87Mj47l25L47M42n17M9k13K58j08K21Rk11p8P8J75k3M33m03l7nR8KN1
3661An2Q0r2j61j32M0L37j08K8j32o6J60M05m66J06N2k48J59L19J1k93q4q3L39
3685A20j67K26Q6k23K09j89j39L30Qj4k59j41L10O9M0O3L1k33N5r0J10J04R2l77
3709B1J38N3J3j24J76k77l39M73l7r1J80O5k97J34L9l37N26k09J78l36N2K4j85
3732a60M00P5l24k82K92k2k17n0K92j33k45M30J08j44j80J74j52O8r9j55K33k0
3754a11m23J44K83J82rj64l37J94N9J05n%m6n79K99N16n33L50P3k58k00K10P4
3777a76j88M68k05R5n94L44J34K64j57n5j47j82O28J7k09j59m8J57J9l20K14K38
3799A38k70K60l41J93J76p9o7l6j38J34K05j54o1K85j21k13J97K0k8K2J69k68
$$ plain form
3821 23 97 6 162 300 119 8 132 188 335 -106 45 31 102 110 73 273 -230 79 48 86 342 442 297 -1
3845 -1 84 115 -227 -36 183 55 114 -248 209 427 340 38 96 115 -92 17 309 178 20 -102 -179 20 -37
3868 -37 88 -223 -37 -365 39 122 -208 354 -185 -32 0 -148 -135 -142 -89 -286 -422 -291 73 -76 -198 -382
3890 -382 -525 -282 -188 9 -139 -149 -520 -346 -128 -262 -203 -162 -244 -54 -148 -313 -378 -118 -270 -320 -154 -224 -259
3913 -259 -244 237 -313 -255 -172 73 -109 -88 36 201 -233 -145 -161 243 234 5 -30 -120 199 113 390 135 57 366
3937 366 162 433 329 336 269 -38 351 327 530 393 440 321 -15 427 510 353 535 138 305 275 247 128 409
3960 409 226 110 600 181 406 491 85 209 203 224 323 264 229 315 255 90 -202 406 96 72 -132 105 187 345
3984 345 288 -71 298 25 180 -18 157 78 -292 -81 -3 135 -124 -317 -77 -36 -359 110 -28 -238 -297 -197
$$ packed form
3821B3P4r1J56J38j81j11J24N6J47m41J51j4P1Ql7K00n03L09l1L8K56J00j45k98
3845aQ5L1l42J91K19j28N9l62M57K18q7l02N8J9k07J09K92j31j58j22p7J99n7
3868c7J25l11J86l28M04Q3l30N62n39J53L2j48J3pN3j97j36J31L64j49j22j84
3890c82j43K43R4J97j48j0l71J74K18j34N9M1q2J90r4j65o5K60j52n0J66p0l5
3913b59J5M81n50N8Q3K45j82K1J24J65m34Q8j6M04rk29l5r0L19q6K77k55p8L09
3937C66k04K71j04Po7l07L89k4K03j37M7j19l36M42Q3j57J82l97J67l0k8j19K81
3960D09j83j16M90m19K25Q5m06J24oK1R9n9l5Q6o0j65k92O08l10k4k04K37Q2J58
3984C45n7l59L69k73J55j98J75p9l70K11P8J38k59j93K40M1l23M69j38k10n9J00
$$ plain form
4006 -197 52 -49 -166 -359 -223 -2 -271 -153 -322 -204 -113 -153 -224 -269 -176 -190 29 -391 -352 -391 -309 -454 -312
4029 -312 -110 -416 -458 -269 -387 -96 -247 -39 -417 -327 -334 -325 -103 -259 -177 -99 -230 -349 -471 -60 -171 -95 -148
4052 -148 -416 -89 129 -116 6 -44 -113 -235 -108 -70 -138 52 12 -121 -141 249 280 5 230 -189 -67 -253
4074 -253 33 93 275 -141 206 -8 288 73 123 54 20 -48 58 -19 -139 25 78 59 273 71 -53 139 365
4097 365 326 23 300 48 272 84 81 246 42 371 93 109 -60 490 -11 167 116 108 293 115 -128 75
4119 75 -32 246 85 134 -315 -283 2 -42 -66 -142 -216 -232 161 148 -114 -231 -35 70 -47 -103 -28 -50 16 46 -346
4144 -346 -51 -384 140 -244 86 -76 -549 128 -32 89 11 -204 -113 -76 3 -2 -62 -153 -306 -207 -126 -16 -258
4167 -258 335 -225 -85 -143 171 -17 96 -192 -233 57 108 1 -9 406 84 -27 198 252 8 51 -55 79
$$ packed form
4006a97K49j01j17j93J36K21k69J18j69J18R1m0p1m5R3j4K19m20L9l9Q2j45J42
4029c12K02l06m2J89j18K91j51K08l78R0pRK22j56Q2P8j31j19j22M11j11P6n3
4052a48k68L27K18k45J22n0o9j22J27L8o8J90m0j33k0L90L1k75K25m19J22j86
4074b53K86O0J82m16L47k14K96k15N0o9l4o8J06p7j20J64N3j9K14k02j24J92K26
4097C65l9l03K77k52K24j88lJ65k04L29k78J6j69N50n01J78n1qJ85j78k43K03
4119G5j07K78j61M9m49L2K85m4k4p6p4j6L93j3k62j17J96J05j17n6P5k2O6L0l92
4144c46K95l33N24l84L30j62m73O77j60J21p8k15R1L7P9no0r1j53R9Q1J10k42
4167b58N93n60J40n8L14j88J13k88m1K90N1j07j0M15l22j11K25N4k44M3j06J34
$$ plain form
4189 79 54 104 559 300 -171 203 364 -159 129 194 -55 152 275 326 120 213 302 373 354 129 110 413 461 405
4213 405 212 154 191 172 252 219 141 310 342 348 582 312 266 260 398 211 410 298 176 151 165 185 138 266 124
4238 124 360 -168 130 196 143 236 266 -65 140 -124 186 197 -10 -117 -139 191 -157 -202 -131 -73 -423 -398 28
4261 28 142 -224 -72 -188 -197 -216 -114 -123 -254 -203 -503 -526 -545 -368 -407 -293 -121 -403 -422 -272 -71 -231 -351 -395
4285 -395 -469 -185 -281 -168 -338 -442 -454 -545 -146 -320 -327 -461 -304 -399 -238 -344 -48 -339 -397 -367 -386 103 -253
4308 -253 -223 -252 -295 5 -342 -216 -216 -217 -35 73 -96 26 -150 -72 -83 -144 -241 43 202 149 -48 105 160 87 193
4333 193 36 -169 220 61 144 157 79 13 160 194 -15 274 253 199 -8 412 351 152 196 62 172 250 436
4356 436 118 219 414 64 26 -9 296 224 230 236 67 163 114 -117 73 100 265 -5 151 7 369 11 52 244
$$ packed form
4189G9k5N0M55k59m71L74J61n23K88O5k49K07J23N1k06R3Q9P1j9k25j9L03M8n6
4213D05j93n8L7j9Q0l3p8J69L2OK34k70m6oJ38j87J99j12j22k5J4K0m7J28j42
4238A24K36n28K98O6n3R3L0l31K05k64L10J1k07j07k2L30l48m5P1N8l50K5M26
4261B8J14l66J52j16rj9J02rj31N1l00k3j9J77l9J14J72k82j9J50K01j60j20m4
4285c95p4K84r6J13j70j04j2r1L99j74pj34J57r5J61j06K96k91n8L0j9M89l56
4308b53L0k9m3L00l47J26%jJ82J08j69J22j76P8j1o1r7K84J59n3j97J53N5p3J06
4333A93j57k05L89j59Q3J3p8o6J47L4k09K89k1n4k07M20o1j99M4j34J10P8J86
4356D36l18J01J95l50l8l5L05p2OOj69R6m9k31J90K7J65k70J56j44L62l58M1J92
$$ plain form
4380 244 197 181 -139 86 207 -67 23 -1 106 246 5 25 138 131 -407 -252 -77 79 -291 -43 26 217 88
4403 88 78 10 -194 -219 -34 -96 210 105 -337 -150 -315 -68 7 68 -135 52 -239 144 -297 -170 -87 48 57
4426 57 -171 253 -296 -10 -322 69 -132 -58 -221 25 8 205 114 225 100 5 133 7 124 -155 117 93
4448 93 -41 219 69 31 28 -32 155 213 421 62 -37 7 57 -12 195 95 141 271 259 203 319 354 116 108 301
4473 301 155 322 259 134 42 20 98 3 13 -44 545 178 230 350 519 61 -6 287 14 94 207 -395 -240
4496 -240 -17 260 99 -29 286 41 -79 -70 -227 -28 214 -213 95 -241 -311 -301 -34 -267 99 -87 21
4517 21 166 -14 -123 43 15 -68 -106 -115 -53 -181 17 -31 -294 -46 -205 -56 -309 -328 -260 -442 -181 -233 -489 -155
4541 -155 -212 -91 -163 -297 27 -443 -73 -245 -183 -322 -164 -237 -347 -219 -174 -167 -66 -41 -229 -224 -282 -319 -308 136
$$ packed form
4380B44m7j6l20K25J21k74R0k4J07J40k41K0J13pn38J55J75J56l70K48O9J91j29
4403H8j0o8k04k5J85o2L06j05m42J87j65K47P5O1k03J87k91L83m41J27Q3J35R
4426E7k28M24n49K86l12L91k01P4j63K46j7J97r1J11j25r5J28j26J17k79K72k4
4448I3j34K60j50l8lo0J87N8K08l59r9M4N0o9K07j00M6J30j2n6J16L5k38qJ93
4473C01j46J67o3j25r2k2P8r5J0n7N89l67N2J20J69m58o7K93k73Q0J13o02J55
4496b40K23K77j61j28L15k45j20Rj57J99K42m27L08l36p0J0K67k33L66j86J08
4517B1J45j80j09J66k8q3l8rO2j28J98m8k63K48j59J49k53j9O8j82K61n2k56L34
4541a55n7J21p2j34L24m70L70j72O2j39J58p3j10J28M5PJ01K5j88Nn8l7J1M44
$$ plain form
4565 136 -389 152 79 55 42 -99 -121 -72 -256 43 116 -5 -107 -78 -114 -211 22 -198 -163 -137 -2 185 117 177
4589 177 115 215 109 -20 75 -153 -114 147 45 -53 393 177 68 -291 172 -211 417 411 -54 247 161 472
4611 472 282 145 73 -194 365 -40 162 359 234 202 -44 -17 10 -57 317 45 207 -128 217 428 -68 43
4633 43 -48 413 0 -267 77 -82 108 -15 208 -42 31 49 -134 -37 57 -160 -121 59 -104 -227 -227 57 -392
4656 -392 -36 -304 -222 -37 -317 -177 -96 41 -45 -135 -35 -134 -92 89 -2 -94 57 -141 -256 -211 -28 -29 -135 26
4680 26 41 -259 -197 -67 -108 58 -374 -100 145 -20 227 67 208 -161 -49 -50 -165 -268 -67 161 182 -35
4702 -35 45 136 -139 48 -247 243 82 -286 42 54 -18 93 390 -7 384 157 278 11 83 81 -56 242 -47
4725 -47 -58 3 586 147 162 -176 -80 286 176 245 161 286 241 265 397 236 41 191 90 119 73 316 116 36
$$ packed form
4565A36n25N41p3k4j3j41k2M9j84K99P3j21j02K9l6r7K33k20L5K6J35J87o8O0
4589A77o2J00j06j29R5k28L9K61j02r8M46k16j09l59M63l83O28om65L01q6L11
4611D72j90j37p2k67N59m05K02J97j25l2k46K7K7o7L74k72J62l35L45K11m96J11
4633D3r1M61m13k67L44j59J90j23K23k50P3J8j83R7R4k17L9J80j63j23%K84m49
4656c92L56k68Q2J85k80J40Q1J37q6r0J00r9M2J81r1r2J51j98j15M5J83jj06J61
4680B6J5l00O2J30m1J66m32K74K45j65K47j60J41l69J12jj15j03K01K28K1k17
4702c5Q0R1k75J87k95M90j61l68L28J2p2J11K97l97L91k27J21k67P2kj37K98k89
4725d7j1O1N83m39J5l38R6L66j10O9q4J25m5K4J32j61j95J50j01K9m6K43k00q0
$$ plain form
4749 36 -40 -62 -77 184 161 218 18 137 154 -65 -103 -43 97 272 106 -83 -269 161 -312 -115 -7 -19 -63 -39
4773 -39 -254 96 -114 -187 -166 -215 -248 -124 -265 180 -221 -205 -248 -194 -174 -444 -155 -294 -49 -60 -28 -171 -133 -276
4797 -276 -150 -339 -24 -253 -200 53 -221 -173 -466 -304 61 26 30 -210 -321 -108 -320 -153 -221 -265 -511 -295
4819 -295 -174 -160 -43 -75 31 -114 -168 -131 261 -333 35 159 300 239 -279 9 83 173 149 242 430 62 298
4842 298 -7 348 231 -12 124 146 71 42 24 -175 35 -260 123 260 283 196 355 398 35 88 434 272 37
4865 37 403 441 98 99 451 280 250 60 140 -10 414 236 -42 297 252 400 193 314 478 288 389 280
4887 280 160 159 -52 -69 -40 -8 140 123 -217 -111 -257 190 45 -39 -51 27 45 -171 -63 56 -186 118 -291
4910 -291 -239 -498 -23 -266 -236 -66 -163 -297 -406 15 -360 -233 -830 -481 -336 -147 -107 -241 -227 -425 -368 -144
$$ packed form
4749C6p6k2j5K61k3N7k00J19J7k19l8O0J40J75j66j89j86M30m73J97J08j2m4K4
4773c9k15L50k10p3K1m9l3J24j41M45m01J6m3N4K0k70K89j39K45j1L2j43L8j43
4797b76J26j89L15k29N3K53k74M8k93J62L65l5Mk40j11K13k12J67o8m4k46K16
4819b95J21J4J17l2J06j45n4L7L92n94L68J24J41o1n18K88P4R0k4R3J88l68K36
4842B98l05L55j17k43J36K2p5k9j8j99K10k95L83J37K3q7J59M3l63N3L46j62k35
4865C7L66L8l43JL52j71l0j90Q0j50M24j78k78L39m5J48k07J21J64j90J01j09
4887B80j20jk11j7K9L2J48j7l40J06j46M47j45q4j2P8J8k16J08J19k42L04m09
4910b91N2k59M75k43L0J70r7j34j09M21l75J27n97L49J45J89M0j34J4j98N7K24
$$ plain form
4932 -144 -230 -276 -128 -360 -54 -332 -325 -157 -62 -165 -97 -242 -211 -309 -252 50 -456 112 -59 -125 -85 57 -131 -167
4956 -167 -29 -265 -169 -247 -328 -200 -448 -259 -194 -6 -179 70 -70 -278 -303 -177 -80 83 -68 -373 -62 113
4978 113 219 205 1 136 -53 233 181 39 241 -87 348 -59 -17 334 414 81 205 276 428 542 35 162
5000 162 433 248 173 291 320 250 84 266 53 164 170 71 35 122 32 262 -248 205 224 -218 126 94 285 185
5024 185 158 99 72 33 8 -250 51 55 173 223 -5 206 47 -117 44 -43 202 6 135 11 138 318 -183
5047 -183 -232 54 -65 65 196 283 114 144 -225 -227 -29 -167 -257 -135 -150 -36 253 -148 34 -321 61 31 -131
5070 -131 12 22 58 221 -103 -4 64 2 -253 -21 94 -161 69 223 110 204 95 26 -104 -97 102 70 -88
5093 -88 51 197 187 147 245 256 171 432 443 -124 71 194 361 212 -53 215 45 369 74 172 183 221 -33
$$ packed form
4932a44q6m6J48k32L06k78PJ68R5j03O8j45L1r8N7L02n06N68j71o6M0J42j88l6
4956a67J38k36R6p8q1J28k48J89O5J88j73K49j40k08k5J26R7J63j51l05L11J75
4978A13J06j4k04J35j89K86n2j42K02l28M35m07M2L51Q0l33J24P1J52J14n07J27
5000A62K71j85p5J18K9p0j66J82k13J11Or9l6Q7r0K30n10M53J9m42L44l2J91j00
5024A85k7n9k7l9k5k58L01MJ18N0k28K11j59j64J61q7K45j96J29j24J27J80n01
5047a83m9K86j19J30J31Q7j69L0l69kJ98j38r0J22j5J14K89m01J82l55L82l0j62
5070a31J43J0L6J63l24R9O8o2k55K32J15k55K30J54j13R4j09o9j30PJ99l2j58
5093h8J39J46j0m0R8J1q5K61J1n67J95J23J67j49k65K68j70L24k95R8J1L8k54
$$ plain form
5116 -33 40 378 50 88 227 158 38 107 155 -129 56 170 274 115 183 183 113 415 223 183 -64 254 132 171
5140 171 174 -57 243 143 48 -185 -110 -188 -110 7 -85 6 -41 78 56 -113 -2 -182 -164 -341 66 83 -67 -166
5164 -166 81 -168 77 -210 -141 101 -88 -109 -315 -404 -84 -481 -416 -247 -435 -219 -180 -201 -317 -239 -220 -80 -300
5187 -300 -423 -228 -349 -208 -124 -190 -104 -515 -310 -131 -266 -179 -126 -159 -208 -344 -336 -189 -195 -268 -120 -360 -333 -144
5211 -144 -296 -143 -104 -5 19 -273 -119 -136 -42 -38 -119 -13 -92 140 227 -103 237 137 120 -178 -385 138 -17 252
5235 252 170 72 252 223 165 98 154 83 -109 179 78 261 186 190 248 401 237 208 21 298 205 274 94 64 191
5260 191 60 22 53 161 305 -14 162 -114 300 395 148 99 2 191 -94 182 81 34 190 204 170 -62 388
5283 388 156 475 77 -11 111 -130 28 -122 -302 -91 371 -14 94 -157 93 89 -88 -91 -47 -28 -150 -95 -187
$$ packed form
5116c3P3L38l28L8J39o9j20O9M8k84J85J14J04j59O8%p0L02j92m0k47L18j22L9
5140A71Lk31L00j00r5k33P5p8P8J17r2R1m7J19k2j69J11j80J8j77M07J7j50r9
5164a66K47k49K45k87O9K42j89k1k06q9L20l97O5J69j88K16L9k1j16P8J9J40k20
5187c00j23J95j21J41Q4o6Q6m11K05J79j35Q7N3l3m9j36QJ47op3J48k40K7J89
5211a44j52J53L9R9K4k92J54j7R4Mq1J06p9K32Q7l30L40j00j7k98k07N23j55K69
5235B52q2r8J80k9n8o7N6p1j92K88j01J83p5MN8J53j64k9j87K77r3O9j80l0J27
5260A91j31l8L1J08J44l19J76k76M14R5k47m9r7J89k85K76j01m7J56J4l4k32M50
5283C88k32L19l98q8J22k41J58j50j80K11M62l85J08k51K50mj77lM4J9j22N5r2
$$ plain form
5306 -187 85 108 -63 -232 90 -73 -252 12 -231 -107 -22 94 -229 42 -352 -77 9 -269 -60 97 199
5327 199 -231 -1 45 -95 -184 -73 69 -169 -396 -176 -131 301 131 60 -164 -211 114 -239 -36 -64 -126 62
5349 62 -94 76 -161 -41 -1 34 29 -99 -29 184 -46 -228 -110 176 -168 45 182 136 355 -119 -98 24 30
5372 30 -260 -168 86 24 54 -132 66 40 65 361 141 72 17 99 -16 22 124 71 126 108 -29 171 91 38 -80
5397 -80 14 192 126 104 81 199 184 218 172 -116 -75 -332 -313 -237 4 82 94 -51 -261 -146 -131 5 -122 139 -39
5422 -39 -289 -153 -494 -246 -180 -202 -218 -273 54 -191 41 -98 -217 -363 76 -200 -112 -232 -204 -312 -43 -313
5444 -313 -347 -57 -292 -253 -279 -306 -69 -193 116 -209 -28 90 -425 -243 -50 148 -216 -74 -252 -173 -198 104
5466 104 55 -61 -164 -218 -14 50 -213 -234 -19 -63 136 151 -126 9 -170 174 212 131 130 193 101 -183 29 -5
$$ packed form
5306a87K72K3j71j69L22j63j79K64k43J24Q5J16l23K71l94K75Q6k78K09J57J02
5327A99m30K30M6j40q9J11J42k38k27K20M5M32j70p1k24m7L25l53K03k8o2J88
5349F2j56J70k37J20M0L5nj28P0K13k30j82J18K86l44K13J37m6K19m74K1J22O
5372C0k90R2K54o2L0j86J98k6K5K96k20o9n5Q2j15L8J02n3N5j8j37K00q0n3j18
5397h0R4J78o6k2k3J18j5L4m6k88M1k57J9P6K41P8J2j45k10J15J5J36j27K61j78
5422c9k50J36l41K48O6k2j6n5L27k45K32j39j19j46M39k76Q8j20K8j08K69k70
5444c13l4K90k35L9k6k7K37j24L09l25J81J18n15J82J93J98l64J42j78P9k5L02
5466A04m9j16j03n4K04O4k63k1K15m4J99J5k77J35j79L44L8q1jO3r2k84K12l4
$$ plain form
5490 -5 312 -67 315 -203 125 176 210 97 -62 68 179 -20 109 132 97 106 110 -305 91 155 100 179 138 475 316
5515 316 274 261 54 233 147 104 275 75 333 275 156 -11 25 18 204 59 -52 31 -62 208 187 -68 138 -288
5539 -288 -159 93 200 -152 59 31 119 -394 -12 -30 -5 181 -113 66 162 -146 320 12 194 -106 -73 -104
5561 -104 -246 15 -248 -64 -184 -9 -262 -238 -129 116 -103 -20 128 -141 -208 15 -164 -185 -188 -246 -47 110
5583 110 -400 -76 -178 -141 13 -224 108 -136 -223 -227 -114 51 -248 37 -57 67 31 -105 -301 11 -77 137
$$ packed form
5490eL17l79L82n18L28N1L4j13j59J30J11j99J29K3l5RMm15L96O4n5P9m1L37j59
5515C16m2j3k07J79q6m3J71k00K58n8j19j67L6pJ86j45j11Q3r3K70k1k55K06m26
5539b88J29K52J07l52K11k8Q8n13L82j8K5J86k94J79R6l08M66l08J82l00L3l1
5561a04j42K61k63J84j20J75k53K4J09K45k19Q3J48k69o7K23j79k1ln8J99J57
5583A10n10L24j02L7J54k37L32k44q7mJ13J65k99K85r4J24l6j36j96L12q8K14
$$ [...]
8191G6
##END NTUPLES=NMR FID
##END=
