##TITLE=1H_LR-698-R2-1-CR10
 CDCl3, 8 sc, 
 3.2.2020
##JCAMPDX= 6.0         $$ Bruker NMR JCAMP-DX V2.0
##DATA TYPE= NMR FID
##DATA CLASS= NTUPLES
##ORIGIN= UXNMR, Bruker Analytische Messtechnik GmbH
##OWNER= root
$$ XWIN-NMR		Version 3.5
$$ Mon Feb  3 14:16:42 2020 Russian Standard Time (UT+4h)  she@DPX200
##.OBSERVE FREQUENCY= 200.1315
##.OBSERVE NUCLEUS= ^1H
##.DELAY= (6, 6)
##.ACQUISITION MODE= SIMULTANEOUS
##.ACQUISITION SCHEME= undefined
##.AVERAGES= 8
##.DIGITISER RES= 18
##SPECTROMETER/DATA SYSTEM= spect
##.PULSE SEQUENCE= zg30
##.SOLVENT NAME= CDCl3
##.SHIFT REFERENCE= (INTERNAL, CDCl3, 0, 15.7039)
##AUDIT TRAIL= $$ (NUMBER, WHEN, WHO, WHERE, WHAT)
$$ ##TITLE= Audit trail, XWIN-NMR		Version 3.5
$$ ##JCAMPDX= 5.01
$$ ##ORIGIN= Bruker BioSpin GmbH
$$ ##OWNER= she
$$ F:/spectra/data/she/nmr/H-F/1/audita.txt
$$ ##AUDIT TRAIL=  $$ (NUMBER, WHEN, WHO, WHERE, WHAT)
(   1,<2020-02-03 14:15:40.96 +0400>,<she>,<DPX200>,
      <created by zg, POWCHK disabled, PULCHK disabled
       configuration hash MD5:
       00 E9 B6 7A A2 85 ED C7 34 08 36 98 17 FE 4E 26
       data hash MD5: 16K
       9D 00 31 3F 15 28 E5 B0 72 A2 BE 82 A3 84 B9 B0>)
$$ ##END=
$$ 
$$ hash MD5
$$ 93 BF E4 B2 50 62 6B 7E 6B B2 23 70 F4 D2 13 BC
##$RELAX= 
##$RELAX= 
##$RELAX= 
##$RELAX= 
##$RELAX= 
##$RELAX= 
$$ Bruker specific parameters
$$ --------------------------
##$DU= <F:/spectra>
##$EXPNO= 1
##$NAME= <H-F>
##$PROCNO= 1
##$TYPE= <nmr>
##$USER= <she>
##$AMP= (0..31)
100 100 100 100 100 100 100 100 100 100 100 100 100 100 100 100 100 100 
100 100 100 100 100 100 100 100 100 100 100 100 100 100 
##$AQSEQ= 0
##$AQ_mod= 1
##$AUNM= <au_zg>
##$AUTOPOS= <>
##$BF1= 200.13
##$BF2= 200.13
##$BF3= 200.13
##$BF4= 200.13
##$BF5= 200.13
##$BF6= 200.13
##$BF7= 200.13
##$BF8= 200.13
##$BYTORDA= 1
##$CFDGTYP= 0
##$CFRGTYP= 5
##$CHEMSTR= <none>
##$CNST= (0..31)
1 1 145 1 1 1 1 1 1 1 1 1 1 1 1 1 1 1 1 1 1 1 1 1 1 1 1 1 1 1 1 1 
##$CPDPRG= <>
##$CPDPRG1= <>
##$CPDPRG2= <>
##$CPDPRG3= <>
##$CPDPRG4= <mlev>
##$CPDPRG5= <mlev>
##$CPDPRG6= <mlev>
##$CPDPRG7= <mlev>
##$CPDPRG8= <mlev>
##$CPDPRGB= <>
##$CPDPRGT= <>
##$D= (0..31)
0 1.2 0 0 0 0 0 0 0 0.06 0 0.03 0 0 0 0 0.0002 0 0 0 0 0 0 0 0 0 0 0 0 
0 0 0 
##$DATE= 1580724940
##$DBL= (0..7)
120 120 120 120 120 120 120 120 
##$DBP= (0..7)
150 150 150 150 150 150 150 150 
##$DBP07= 0
##$DBPNAM0= <>
##$DBPNAM1= <>
##$DBPNAM2= <>
##$DBPNAM3= <>
##$DBPNAM4= <>
##$DBPNAM5= <>
##$DBPNAM6= <>
##$DBPNAM7= <>
##$DBPOAL= (0..7)
0.5 0.5 0.5 0.5 0.5 0.5 0.5 0.5 
##$DBPOFFS= (0..7)
0 0 0 0 0 0 0 0 
##$DE= 6
##$DECBNUC= <off>
##$DECIM= 24
##$DECNUC= <off>
##$DECSTAT= 4
##$DIGMOD= 1
##$DIGTYP= 9
##$DL= (0..7)
0 120 120 120 120 120 120 120 
##$DP= (0..7)
150 150 150 150 150 150 150 150 
##$DP07= 0
##$DPNAME0= <>
##$DPNAME1= <>
##$DPNAME2= <>
##$DPNAME3= <>
##$DPNAME4= <>
##$DPNAME5= <>
##$DPNAME6= <>
##$DPNAME7= <>
##$DPOAL= (0..7)
0.5 0.5 0.5 0.5 0.5 0.5 0.5 0.5 
##$DPOFFS= (0..7)
0 0 0 0 0 0 0 0 
##$DQDMODE= 0
##$DR= 18
##$DS= 0
##$DSLIST= <SSSSSSSSSSSSSSS>
$$ [...]
##$SUBNAM2= <"">
##$SUBNAM3= <"">
##$SUBNAM4= <"">
##$SUBNAM5= <"">
##$SUBNAM6= <"">
##$SUBNAM7= <"">
##$SUBNAM8= <"">
##$SUBNAM9= <"">
##$SW= 24.9337058887773
##$SWIBOX= (0..15)
0 0 2 0 0 0 0 0 0 0 0 0 0 0 0 0 
##$SW_h= 4990.01996007984
##$TD= 16384
##$TD0= 1
##$TE= 0
##$TE2= 300
##$TE3= 300
##$TEG= 300
##$TL= (0..7)
0 120 120 120 120 120 120 120 
##$TP= (0..7)
150 150 150 150 150 150 150 150 
##$TP07= 0
##$TPNAME0= <>
##$TPNAME1= <>
##$TPNAME2= <>
##$TPNAME3= <>
##$TPNAME4= <>
##$TPNAME5= <>
##$TPNAME6= <>
##$TPNAME7= <>
##$TPOAL= (0..7)
0.5 0.5 0.5 0.5 0.5 0.5 0.5 0.5 
##$TPOFFS= (0..7)
0 0 0 0 0 0 0 0 
##$TUNHIN= 0
##$TUNHOUT= 0
##$TUNXOUT= 0
##$USERA1= <user>
##$USERA2= <user>
##$USERA3= <user>
##$USERA4= <user>
##$USERA5= <user>
##$V9= 5
##$VALIST= <valist>
##$VCLIST= <CCCCCCCCCCCCCCC>
##$VD= 0
##$VDLIST= <DDDDDDDDDDDDDDD>
##$VPLIST= <PPPPPPPPPPPPPPP>
##$VTLIST= <TTTTTTTTTTTTTTT>
##$WBST= 1024
##$WBSW= 4
##$XGAIN= (0..3)
0 0 0 0 
##$XL= 0
##$YL= 0
##$YMAX_a= 252710
##$YMIN_a= -138930
##$ZGOPTNS= <>
##$ZL1= 120
##$ZL2= 120
##$ZL3= 120
##$ZL4= 120
##$ABSF1= 10
##$ABSF2= 0
##$ABSG= 5
##$ABSL= 3
##$ALPHA= 0
##$AQORDER= 0
##$ASSFAC= 0
##$ASSFACI= 0
##$ASSFACX= 0
##$ASSWID= 0
##$AUNMP= <proc_1d>
##$AZFE= 0.1
##$AZFW= 0.1
##$BCFW= 1
##$BC_mod= 2
##$BYTORDP= 1
##$COROFFS= 0
##$CY= 11.3945322036743
##$DATMOD= 1
##$DC= 2
##$DFILT= <>
##$DTYPP= 0
##$F1P= 16.9975609425685
##$F2P= -3.02152046262296
##$FCOR= 0.5
##$FTSIZE= 0
##$FT_mod= 4
##$GAMMA= 1
##$GB= 0.15
##$INTBC= 1
##$INTSCL= 1
##$ISEN= 128
##$LB= 0.24
##$LEV0= 0
##$LPBIN= 0
##$MAXI= 10000
##$MC2= 0
##$MEAN= 0
##$ME_mod= 0
##$MI= 1.114404
##$NCOEF= 0
##$NC_proc= 0
##$NLEV= 6
##$NOISF1= 3.799351
##$NOISF2= 2.8
##$NSP= 1
##$NTH_PI= 0
##$NZP= 0
##$OFFSET= 15.70392
##$PC= 1
##$PHC0= -9791.609
##$PHC1= 19.20081
##$PH_mod= 1
##$PKNL= yes
##$PPARMOD= 0
##$PSCAL= 0
##$PSIGN= 0
##$REVERSE= no
##$SF= 200.130013532006
##$SI= 16384
##$SIGF1= 3
##$SIGF2= 2
##$SINO= 400
##$SIOLD= 16384
##$SREGLST= <1H.CDCl3>
##$SSB= 0
##$STSI= 0
##$STSR= 0
##$SW_p= 3612.71676300578
##$SYMM= 0
##$S_DEV= 0
##$TDeff= 0
##$TDoff= 0
##$TI= <>
##$TILT= no
##$TM1= 0
##$TM2= 0
##$TOPLEV= 0
##$USERP1= <user>
##$USERP2= <user>
##$USERP3= <user>
##$USERP4= <user>
##$USERP5= <user>
##$WDW= 1
##$XDIM= 8192
##$YMAX_p= 0
##$YMIN_p= 0
$$ End of Bruker specific parameters
$$ ---------------------------------
##NTUPLES= NMR FID
##VAR_NAME=  TIME,          FID/REAL,        FID/IMAG
##SYMBOL=    X,             R,               I
##VAR_TYPE=  INDEPENDENT,   DEPENDENT,       DEPENDENT
##VAR_FORM=  AFFN,          ASDF,            ASDF
##VAR_DIM=   8192,          8192,            8192
##UNITS=     SECONDS,       ARBITRARY UNITS, ARBITRARY UNITS
##FACTOR=    0.0002004,     1,               1
##FIRST=     0,             0,               0
##LAST=      1.6414764,     0,               0
##MIN=       0,             -138930,         0
##MAX=       1.6414764,     252710,          0
$$ Real data points
##PAGE= N=1
##DATA TABLE= (X++(R..R)), XYDATA
0 0 0 0 0 0 0 0 0 0 -8 8 -8 8 -16 16 -23 24 -32 38 -42 48 -58 71 -80 94 -106 122 -141 160 -181 205 -232
31 -232 261 -291 327 -366 408 -454 503 -558 621 -687 760 -841 933 -1032 1145 -1270 1415
48 1415 -1577 1766 -1989 2252 -2573 2971 -3482 4168 -5139 6626 -9215 15001 -56483 93951
62 93951 138557 -138930 -135271 58098 59621 -101892 -47983 88753 43583 -60368 11097 66304
74 66304 -28849 -69715 52910 84901 -29751 -53896 50582 50403 -37528 -11132 80101 41570
86 41570 -36917 12897 88001 34168 -31259 12641 61791 32939 20987 49406 24888 -18616
98 -18616 25500 86339 44358 -11856 34862 82460 24973 -24631 30988 82825 46035 13220
110 13220 33825 29985 -1190 22568 67397 39226 -9334 15369 54312 22587 -9396 31534
122 31534 61004 15480 -16587 21896 41749 63 -14119 29833 40962 -4422 -18637 19667
134 19667 29283 -5840 -15483 13594 20081 -3523 -9110 3717 -4586 -23622 -12786 13479 8481
147 8481 -20647 -27036 -8249 -4085 -20756 -22422 -1763 3110 -20993 -38089 -24247 -7817 -13713
160 -13713 -22161 -14804 -13416 -28984 -32686 -14040 -5330 -22024 -29544 -17727 -15394 -28953 -30031 -14434
174 -14434 -11755 -23844 -23446 -13700 -16280 -25543 -21890 -13042 -15580 -20303 -15728 -11193 -15369 -19155 -17462
189 -17462 -13895 -9303 -3119 -4375 -14084 -16025 -7807 -4483 -6855 -2474 2383 -4642 -11590 -4137 3600
204 3600 -536 -978 9554 7441 -8143 -6265 13428 14400 -1911 1170 17074 10037 -6568 4202
218 4202 24631 14540 -3992 8710 25727 13067 -1957 12249 24791 10112 1272 18294
230 18294 25606 8524 3033 18573 21073 6853 8952 24184 19550 2852 5825 19861 17353
243 17353 7373 11911 18145 10298 2715 10117 17188 11676 7303 10099 8821 4195 6396 11694 7998
258 7998 3031 5798 6702 1416 753 7210 7160 -886 -1642 4109 2343 -3944 -2140 2068 -2479 -7603
274 -7603 -2190 1762 -4074 -8906 -4496 -1986 -8062 -9769 -3217 -3360 -11527 -13079 -5921 -5001 -10603 -10652
290 -10652 -5958 -8212 -14532 -13019 -5761 -6632 -12921 -12642 -9050 -10223 -13241 -10484 -6874 -9197 -13667
305 -13667 -11992 -7969 -8654 -11100 -9421 -7207 -8952 -11262 -8766 -5131 -6173 -9339 -8691 -5534 -5168 -6722
321 -6722 -5539 -3069 -4597 -6584 -4555 -671 -629 -3610 -2923 -901 -1079 -1932 442 2786 1277 -427
337 -427 1336 3238 3047 3285 4866 4295 2792 3296 5870 7102 6267 5672 6483 6035 6104 7857 8969 7997
355 7997 7075 7819 7885 8435 9408 9914 8686 7476 8466 9272 8501 8392 9708 9128 6776 6949 9301 9815 7378
374 7378 6748 8044 7300 5443 6732 8578 6871 4101 4900 6567 5851 3775 4693 5125 2686 1025 2881
391 2881 4003 2325 587 1173 1193 -623 -696 427 59 -2028 -2988 -1834 -1197 -2732 -3726 -2887 -3239 -4800
409 -4800 -4933 -4186 -4002 -5400 -6088 -5749 -5953 -6495 -6251 -5971 -6467 -7447 -7690 -7088 -6705 -7334 -7631 -7452 -7897 -7699
429 -7699 -7647 -7011 -6786 -7580 -8056 -7759 -7094 -6483 -6781 -6838 -6219 -6063 -6587 -5920 -4846 -4638 -5645 -5278 -4474 -3943
449 -3943 -4196 -3382 -2717 -3047 -3500 -2626 -1168 -1174 -1888 -1298 -79 -189 -747 732 2086 985 202 1771 2485
468 2485 2489 1929 3276 4047 3479 3040 4104 5464 5066 4533 4921 5630 5430 5496 5952 6578 6161 5659 6135 6846
488 6846 6982 6209 6573 6991 6595 6042 6555 7534 6968 5707 6129 6655 6269 5368 5826 6118 5806 4887 5060 5670
508 5670 5054 3928 3642 4247 3889 3203 3178 3473 2908 1731 1532 2059 1939 962 390 584 602 -345 -618 -486
528 -486 -196 -1520 -2746 -2347 -1352 -2407 -3440 -3302 -2684 -4035 -4679 -3475 -2926 -4576 -5861 -4577 -3643
545 -3643 -5517 -6560 -4782 -3972 -6014 -7184 -4892 -4230 -6350 -7428 -5449 -4927 -6857 -7035 -4934 -4746
561 -4746 -6636 -6908 -4403 -4163 -5735 -6148 -4497 -4278 -5430 -4911 -3277 -3251 -4823 -4830 -3020 -2624 -3627 -3211
579 -3211 -1505 -1787 -2714 -3133 -1440 -515 -954 -1686 -428 350 -447 -591 908 2007 767 309 2256 3099
597 3099 1588 1192 3036 3954 2759 1961 4097 4921 3347 2892 4985 5535 4243 4018 5391 5332 3810
614 3810 3804 6225 6181 4980 4510 5664 5643 4599 4773 5984 6269 4966 4565 5231 5384 4543 4645 5039 5213
633 5213 4091 3164 3544 4638 4197 2959 3276 3864 3339 2138 1856 2934 2239 1138 1426 2180 1376 -522
651 -522 261 1246 680 -1157 -591 711 -1004 -2799 -2007 -416 -1431 -2768 -2539 -1624 -2973 -4370 -3657
668 -3657 -2074 -3020 -4331 -4671 -3202 -3904 -5626 -4812 -3155 -3734 -5795 -5383 -3924 -4388 -5919 -5566 -3655
685 -3655 -4194 -6367 -5940 -3757 -4299 -5877 -5328 -3166 -3383 -5927 -5127 -3264 -3667 -4997 -3691 -1844 -2904
702 -2904 -5241 -3718 -1884 -2315 -3557 -2399 -514 -1699 -3581 -2143 -31 -586 -1141 -368 856 -310
718 -310 -1036 -8 1591 1454 528 1401 2077 2008 1418 1643 3076 3292 2929 2642 3439 3638 2689 2906 4460
737 4460 5031 3647 3249 4783 4979 3336 3568 5298 6332 4154 2957 4712 5423 3720 3778 6222 6073
754 6073 3905 2967 4755 4950 3728 3706 5284 5161 2792 2118 3745 4046 2760 2843 3613 3249 1420 1381
772 1381 2382 2687 1353 1353 2259 1965 331 -598 724 869 -71 -432 -93 -350 -1744 -2156 -1184 -182 -1470
791 -1470 -2363 -1972 -2023 -3102 -3702 -2059 -1315 -2825 -4197 -3272 -2988 -4291 -4407 -3125 -2887 -4440 -4812 -4286
809 -4286 -3686 -4677 -4958 -4098 -3329 -4299 -5276 -4698 -4270 -4570 -4486 -3752 -3303 -4057 -4881 -4449 -3589 -3342 -4423 -3722
829 -3722 -2782 -2806 -4595 -3671 -1815 -1713 -2737 -2470 -1089 -2089 -2921 -2172 -79 -560 -1888 -741 669
846 669 -656 -1561 102 1905 729 -184 1049 2252 679 194 2401 3347 1682 1424 3222 3232 1926
863 1926 2074 3765 3999 2776 3166 4038 3950 2935 3488 4689 3957 3789 4235 3816 3655 4211 4635 4486 4306
882 4306 4582 4210 3273 3739 4864 4237 3335 3932 4504 3164 2276 3687 4668 2913 1944 3053 3398 1715
900 1715 1083 2865 3278 1012 421 2425 1805 -552 241 1860 998 -875 -259 880 -432 -1791 -1064
917 -1064 565 -917 -1862 -1241 -981 -2389 -2981 -1867 -1467 -2652 -3198 -2527 -2479 -3505 -3519 -2598 -3219 -3695 -3511
936 -3511 -3507 -3999 -4018 -3589 -3475 -4282 -3896 -3743 -4051 -3963 -3349 -3658 -3933 -3830 -3200 -3527 -4365 -3443 -2825 -3412 -3839
957 -3839 -3300 -2735 -3069 -3691 -2818 -1915 -2556 -2291 -1934 -1681 -2113 -1761 -893 -1007 -1409 -935 -446 -232 -641 -354
977 -354 332 301 45 442 359 745 1118 1088 1162 1617 1758 1809 1839 2156 2411 2201 2648 3187 2843 2784 2710 3601 3368
1000 3368 3202 3525 3969 3777 2926 3779 4176 3556 3369 3686 4538 3761 3250 3882 4126 3398 3290 3683 3748 3057
1020 3057 2614 3504 3099 2903 2611 3102 2355 2145 2225 2426 2149 1787 1824 1804 1317 1001 1019 867 789 649 641 169
1042 169 -264 -56 -214 -477 -732 -653 -751 -1419 -1196 -1190 -1383 -2147 -2055 -2003 -2566 -2640 -2375 -2668 -2888 -2947 -2550 -3230 -3524
1065 -3524 -3452 -2877 -3272 -3667 -3391 -2813 -3620 -3776 -3853 -3270 -3541 -4024 -3451 -3183 -3349 -3607 -3191 -3029 -3357 -3692
1085 -3692 -2869 -2848 -3018 -3099 -2490 -2173 -2894 -2527 -2454 -1928 -1853 -2066 -1710 -1566 -1308 -1179 -740 -570 -472 -521 -372 278
1107 278 200 464 245 833 776 589 1337 1350 1582 1190 1821 1568 1835 2148 2076 2547 2631 2545 2512 2980 2990 2778 2665
1130 2665 2985 3208 3086 3180 3060 3370 3198 3504 3489 3326 3201 3175 3227 3226 3085 3025 3205 3189 2911 2934 3005 2897 2679
1153 2679 2526 2242 2369 2247 2044 1954 1853 1649 1237 1600 1394 1061 1043 1002 584 116 248 40 316 -255 -446
1174 -446 -416 -625 -878 -1045 -950 -1142 -1059 -1429 -1727 -1301 -1948 -1814 -1888 -1962 -2523 -2570 -2710 -2278 -2950 -2809 -2425 -2775
1196 -2775 -2966 -3200 -2639 -3018 -3327 -3344 -3031 -2773 -3062 -3339 -3209 -3134 -3361 -3310 -2873 -2773 -3127 -2871 -2672 -2525 -2638
1217 -2638 -2628 -2402 -2261 -2202 -2311 -1957 -1908 -1609 -1788 -1626 -997 -1147 -1214 -1236 -456 -588 -899 -263 -160 486 115
1238 115 367 705 652 500 951 1225 1216 1408 1440 1701 1825 1875 2221 2273 2155 1960 2453 2432 2020 2731 2577 3000
1260 3000 2713 2804 2776 3247 2886 2702 2830 3003 3119 2805 2805 3049 3031 2840 3060 2526 2824 2285 2600 2682 2744 2293
1282 2293 2140 2363 2166 1645 1615 2124 1595 1380 1245 1499 1059 434 676 923 531 181 169 591 224 -232
1302 -232 -109 -290 -245 -442 -550 -675 -1040 -1394 -983 -1232 -1217 -1448 -1830 -1583 -1627 -2117 -1967 -2092 -2249 -2444 -2500
1323 -2500 -2471 -2343 -2823 -2675 -2700 -2547 -2824 -3323 -2607 -2717 -2818 -2949 -2890 -2318 -2722 -2746 -2476 -2250 -2469 -2845 -2779
1344 -2779 -2176 -2337 -2569 -2006 -2106 -1834 -1992 -1467 -1500 -1645 -1859 -1290 -764 -1151 -1224 -815 -266 -606 -590 -86 220
1365 220 -8 -142 398 453 305 412 777 1175 1027 899 1143 1377 1562 1312 1880 1733 1960 2061 2197 2193 2263
1386 2263 1853 2554 2501 2399 2462 2515 2698 2435 2604 2745 2601 2760 2527 2663 2896 2526 2661 2629 2486 2484 2210 2644
1408 2644 2447 2036 2046 2038 2157 1967 1706 1381 1682 1592 935 1163 1214 1134 805 850 1111 753 339 204 494 453
1430 453 -257 -220 -128 -545 -811 -724 -396 -755 -1337 -1371 -1243 -1211 -1902 -1825 -1035 -1347 -1789 -2030 -1754 -1940 -2279 -2221
1452 -2221 -2039 -2032 -2563 -2228 -2252 -2352 -2571 -2316 -2285 -2533 -2756 -2589 -2391 -2317 -2380 -2665 -1974 -2358 -2217 -2651 -1994 -2254
1474 -2254 -1988 -2388 -1797 -1782 -2093 -1868 -1235 -1436 -1608 -1584 -1383 -721 -1051 -1021 -753 -203 -785 -624 -393 -54 -516
1495 -516 123 326 509 397 264 849 785 707 793 1211 1374 1146 1249 1836 1284 1650 1746 1625 2242 1847 1940 2084
1517 2084 2315 2047 2329 2138 2498 2125 1952 2210 2211 2563 2383 2371 2459 2134 2352 2337 2370 2060 2034 2002 2132 1983
1539 1983 1957 1780 2111 1628 1775 1910 1622 1208 1208 1232 1337 787 491 627 895 532 280 591 498 335 -114
1560 -114 -224 -140 -461 -621 -484 -431 -1324 -804 -702 -930 -1063 -1394 -1499 -1199 -1351 -1753 -1414 -1552 -1794 -1816 -1684
1581 -1684 -2152 -2247 -2000 -1981 -1923 -2153 -2441 -2012 -1914 -2348 -2421 -2239 -2060 -2461 -2323 -2382 -2325 -1990 -2223 -1808 -1955 -1793
1603 -1793 -2077 -1614 -1586 -1765 -1919 -1403 -1216 -1289 -1361 -1172 -969 -1081 -1088 -864 -759 -379 -686 -744 -243 -478 -311 -4
1625 -4 155 323 254 480 875 607 570 890 947 963 1165 1431 1392 1435 1413 1536 1902 1412 1675 1749 2003 1818 1979
1648 1979 1958 2023 1890 1976 1926 2200 2269 1921 2283 2117 2153 1903 2313 2201 1598 1870 1892 2073 1833 1649 1791 1481
1670 1481 1615 1777 1613 1561 1289 1146 1211 1214 1251 903 826 835 621 468 582 466 38 145 -132 -251 -126 -410
1692 -410 -385 -480 -227 -743 -844 -764 -775 -1334 -1250 -1142 -1140 -1292 -1414 -1235 -1554 -1723 -1581 -1713 -1949 -1833 -1576 -2027
1714 -2027 -1891 -1848 -1890 -2017 -2083 -1920 -1845 -1958 -2064 -2094 -1783 -1916 -2156 -1894 -1566 -1680 -1680 -1766 -1825 -1477 -1409 -1770 -1812
1737 -1812 -1545 -1534 -1589 -1308 -931 -1104 -837 -890 -603 -446 -836 -549 -418 -381 -281 -278 -23 -92 118 312 494 495 161
1760 161 615 710 987 885 868 1244 1137 1254 1373 1461 1679 1328 1722 1924 1791 1646 1643 1867 1827 1901 1899 1895 1772 2114
1784 2114 1659 2050 1994 1672 1949 2008 2054 1620 1855 1826 1699 1527 1556 1409 1417 1359 1414 1500 1535 1468 1249 1174 1254 992
1808 992 774 855 904 487 278 535 472 89 -119 62 190 -147 88 26 -524 -792 -392 -392 -784 -1134 -591 -877
1830 -877 -933 -1297 -1065 -994 -1568 -1366 -1183 -1385 -1330 -1809 -1431 -1469 -1760 -1796 -1973 -1498 -1764 -1928 -1784 -1809 -1832 -2065
1852 -2065 -1546 -1891 -1572 -1929 -1850 -1638 -1855 -1633 -1668 -1646 -1722 -1431 -1953 -1416 -1209 -1341 -1215 -1029 -770 -1062 -929
1873 -929 -682 -735 -619 -310 -539 -236 -146 -111 97 -201 65 -47 291 354 453 771 574 534 679 734 691 971 890
1896 890 1073 1334 1500 1320 1328 1398 1698 1711 1613 1608 1658 1410 1531 1832 1846 1907 1765 1536 1898 1514 1745 1660 1891 1546
1920 1546 1593 1737 1852 1498 1413 1361 1472 1414 1534 1306 1336 854 1235 1101 1158 882 848 996 771 745 404 913
1942 913 528 449 311 -48 245 -164 -475 -18 -408 -408 -324 -683 -617 -738 -796 -639 -893 -912 -1113 -1075 -977 -1316 -1510
1965 -1510 -1195 -1189 -1393 -1260 -1562 -1882 -1784 -1583 -1574 -1678 -1836 -1682 -1886 -1498 -1558 -1890 -1734 -1474 -1621 -1449 -1908 -1617
1987 -1617 -1619 -1461 -1309 -1610 -1292 -1367 -1373 -1292 -1396 -967 -1031 -856 -798 -904 -863 -868 -479 -357 -387 -500 -470 -83 -251 108
2011 108 1 0 230 128 310 450 506 428 724 793 798 830 999 1099 1082 955 1136 1312 1151 1331 1525 1549 1397
2034 1397 1404 1301 1252 1902 1291 1405 1585 1349 1498 1489 1538 1627 1417 1439 1612 2111 1364 1635 1714 1466 1214 1179 1222
2057 1222 1262 1191 1047 1039 1230 965 1132 805 760 829 597 772 640 411 445 190 55 168 215 -48 -345 -55
2079 -55 -266 -334 -472 -474 -370 -826 -640 -606 -695 -667 -735 -1083 -839 -1026 -1093 -1099 -1379 -893 -1149 -1538 -1426 -1599 -1434 -1481
2103 -1481 -1452 -1506 -1402 -1731 -1683 -1143 -1430 -1668 -1339 -1671 -1324 -1514 -1479 -1238 -1238 -1557 -1255 -1000 -1537 -1139 -1122 -757
2125 -757 -891 -781 -789 -529 -862 -812 -390 -607 -521 -233 -634 -138 -170 -140 24 153 -89 216 400 514 261 499
2147 499 330 541 604 428 880 666 864 1023 1123 994 1180 1160 1241 1389 1442 1315 1508 1412 1337 1197 1248 1654
2169 1654 1503 1107 1413 1577 1486 1306 1333 1384 1346 1271 1497 1583 1051 1309 1081 1469 1107 1109 999 1163 1504 1110
2191 1110 828 868 473 759 474 196 757 592 223 226 202 199 235 23 194 -87 -166 -214 -30 -189 -326 -606 -417
2214 -417 -755 -774 -635 -692 -836 -878 -1205 -887 -1186 -1282 -1323 -1130 -1265 -1159 -1140 -1332 -1495 -1651 -1182 -1140 -1274 -1318 -1355
2237 -1355 -1204 -1491 -1232 -1791 -1104 -1495 -1592 -1306 -1402 -1149 -1065 -1400 -1314 -1196 -1276 -1104 -1263 -728 -823 -975 -761 -459
2259 -459 -793 -447 -389 -394 -654 -625 -153 -168 -200 -12 -12 -222 201 185 200 113 291 499 480 755 533 685 590 847
2283 847 780 783 846 788 781 894 1128 1333 1166 1364 1417 1156 1205 1183 927 1293 1237 1380 1179 1553 1231 1313 1089 1254
2307 1254 1411 1438 997 1572 1537 1211 1492 1415 1130 1311 843 723 833 884 804 815 980 434 838 721 538 338
2329 338 204 386 -149 -60 135 184 -89 -63 -468 -226 -239 -324 -444 -490 -483 -735 -692 -738 -656 -645 -805 -866 -888 -782 -949
2354 -949 -1135 -941 -1018 -865 -680 -1090 -1266 -1399 -1222 -1187 -1005 -1219 -1063 -1058 -1243 -1294 -1134 -1208 -1211 -1139 -1115 -918 -1000 -1327
2378 -1327 -956 -1197 -863 -1192 -957 -1026 -618 -982 -739 -866 -509 -655 -419 -217 -246 -297 -237 -396 -58 76 13
2399 13 -37 -9 286 127 171 254 399 141 530 468 709 691 563 1083 941 964 706 811 1017 855 1023 940 1069
2422 1069 1168 1192 1133 1293 1287 1022 1274 1045 810 1301 1184 1302 1454 957 1327 1198 1236 1129 910 895 993 1056 945
2445 945 1047 899 511 1097 888 594 685 673 766 533 350 393 208 191 305 -90 237 67 -63 129 -176 -135
2467 -135 -269 -238 -368 -373 -434 -590 -794 -855 -488 -884 -929 -810 -737 -647 -915 -743 -972 -1072 -1091 -829 -920 -1058 -901
2490 -901 -924 -964 -1230 -1380 -1213 -1446 -882 -920 -1125 -1265 -1056 -891 -1199 -857 -885 -943 -1032 -892 -979 -999 -749 -760 -624
2513 -624 -712 -620 -594 -473 -716 -480 -351 -460 -487 -153 -208 -268 -332 147 -158 -187 170 155 165 120 226 485 427 568
2537 568 570 440 729 808 985 541 794 1013 1034 936 918 985 992 789 1024 879 1038 1200 1293 1205 1041 1158 1091 856
2561 856 1261 1068 1079 951 1121 1213 930 868 1062 978 1035 539 1029 817 726 564 869 512 906 581 432 587
2583 587 259 304 187 245 289 -312 -47 -1 -77 257 -202 -314 -231 -588 -106 -295 -504 -287 -325 -654 -526 -483 -800
2606 -800 -272 -791 -816 -784 -777 -804 -965 -812 -1052 -978 -947 -954 -1109 -665 -893 -835 -934 -961 -1006 -868 -1155 -1147 -1049 -1041 -1201 -821
2632 -821 -1010 -834 -876 -853 -862 -1034 -710 -608 -633 -722 -802 -635 -433 -532 -490 -579 -287 -330 -176 -371 -217 -94 39 -114
2656 -114 173 167 -143 112 163 487 462 233 551 569 458 724 416 730 717 877 627 828 851 663 853 577
2678 577 1033 974 757 902 792 1044 1035 1241 932 860 980 924 1173 1052 1009 1004 1134 992 1141 618 902 962 993
2701 993 846 672 900 806 809 558 693 535 468 568 494 -15 35 281 306 235 295 234 126 -149 174 40 143
2724 143 -277 -217 -250 -500 -227 -291 -450 -513 -367 -456 -728 -739 -532 -707 -526 -676 -458 -1232 -1234 -817 -1070 -1130 -793
2747 -793 -1109 -1170 -1013 -1046 -984 -704 -1125 -776 -1116 -1035 -1231 -878 -996 -1022 -805 -1154 -867 -744 -763 -939 -864 -602
2769 -602 -729 -724 -339 -396 -398 -659 -467 -344 -505 -310 -54 -170 17 62 -79 -176 -76 77 264 95 465 462 343
2792 343 318 243 462 332 597 500 531 709 875 631 542 849 945 849 1060 827 898 849 815 537 1007 660 1042
2815 1042 926 1192 835 999 874 898 716 1072 1166 574 1112 551 620 964 765 463 767 784 300 740 449
2836 449 726 479 706 318 229 633 439 354 299 191 141 105 -21 -250 109 147 -59 -95 -38 -457 -430 -216 -376
2859 -376 -409 -459 -716 -894 -464 -521 -539 -819 -317 -896 -819 -1045 -893 -874 -847 -719 -721 -861 -847 -702 -1082 -721 -817 -937
2883 -937 -1117 -812 -685 -918 -985 -844 -788 -896 -651 -957 -922 -743 -515 -730 -661 -364 -905 -565 -652 -475 -477 -289
2905 -289 -293 -539 -418 -90 -84 -162 -160 -105 306 111 183 111 69 198 177 491 374 212 288 760 402 661 406 466 376
2930 376 507 625 1090 574 471 1059 661 471 842 591 642 1100 812 1156 1052 1145 678 551 961 903 1075
2951 1075 1176 563 682 935 762 990 872 762 470 895 452 505 492 648 488 272 138 574 645 30 428
2972 428 420 89 489 40 78 112 -147 -69 -124 -466 -177 -325 -154 67 -464 -294 -416 -371 -574 -300 -239 -320 -847
2995 -847 -958 -428 -875 -864 -826 -639 -634 -727 -654 -739 -793 -645 -1284 -861 -942 -611 -790 -994 -790 -1030 -644 -1079 -973
3018 -973 -789 -811 -559 -663 -859 -741 -770 -809 -598 -330 -306 -479 -494 -372 -462 -248 -443 -285 -400 -58 -457 36
3040 36 -1 -280 -61 -12 6 181 126 224 258 200 320 473 684 281 350 457 516 657 542 564 553 796 593 653
3064 653 871 521 622 711 464 923 993 698 502 992 916 821 491 911 940 902 1090 877 822 781 828 957 876
3087 876 744 620 657 558 303 535 676 616 403 433 455 376 180 134 210 181 -12 576 28 221 32 -103 139
3110 139 -84 -504 75 9 -494 -277 -498 -287 -450 -547 -678 -625 -653 -663 -549 -574 -581 -674 -879 -681 -465 -822 -744
3133 -744 -827 -761 -549 -986 -760 -685 -635 -902 -788 -854 -619 -693 -555 -624 -925 -390 -719 -469 -555 -637 -401 -519 -420
3156 -420 -337 -715 -413 -393 -401 -297 -264 -245 -263 -23 -201 -177 36 80 -202 -93 -103 117 64 404 319 416 259 585
3180 585 536 166 238 354 521 404 491 509 597 598 648 557 606 567 366 588 922 693 781 789 551 977 692 703 776
3205 776 775 606 782 925 843 599 811 699 782 786 700 594 426 506 521 628 680 440 359 522 146 371 312 636
3229 636 166 469 365 245 107 -101 23 116 257 71 -77 -212 -222 -379 -291 -161 -291 -382 -55 -602 -394
3250 -394 -328 -669 -599 -515 -505 -648 -521 -705 -750 -505 -934 -685 -703 -894 -569 -667 -674 -795 -591 -849 -572 -765 -798
3273 -798 -738 -693 -868 -908 -621 -442 -871 -869 -703 -969 -772 -560 -452 -743 -496 -305 -306 -557 -277 -408 -159 -242 -172
3296 -172 -52 221 -180 -159 166 180 234 24 -238 -9 149 246 368 374 431 707 417 386 535 388 425 474 587
3319 587 536 514 516 704 523 631 941 971 493 810 525 844 770 603 421 761 315 623 658 759 977 625
3341 625 826 579 843 620 692 674 611 496 239 276 508 399 308 240 276 32 189 172 91 111 163 128 147 370
3365 370 -157 -79 240 -223 -24 28 -368 -249 -450 -379 -595 -424 -603 95 -566 -341 -342 -534 -635 -383 -671 -731
3387 -731 -802 -829 -685 -822 -987 -575 -789 -580 -614 -696 -545 -768 -852 -677 -829 -475 -389 -764 -401 -298 -366 -697
3409 -697 -424 -324 -384 -459 -567 -543 -367 -648 83 -459 -234 -57 -409 -80 122 53 -147 227 -64 -161 -187 38
3431 38 31 -98 -38 -99 480 115 451 363 300 348 317 357 491 766 562 372 447 570 614 582 568 614 505 1026 742
3456 742 460 610 491 548 951 548 503 815 882 592 782 580 464 562 431 567 484 362 458 448 509 499 362
3479 362 595 657 271 156 213 294 15 315 301 193 55 340 30 62 234 -182 -13 -131 -263 -273 61 -434
3501 -434 -341 -317 -332 -319 -419 -585 -562 -117 -537 -463 -534 -896 -536 -294 -356 -819 -486 -921 -638 -589 -664 -263 -442
3524 -442 -769 -889 -605 -728 -507 -564 -455 -343 -402 -531 -488 -879 -448 -548 -537 -515 -415 -483 -551 -436 -487 -616 -322
3547 -322 -309 -421 -431 -158 -213 104 -251 221 -236 91 -31 -232 445 83 78 244 69 486 188 287 422 354
3569 354 287 234 414 325 555 441 552 527 530 907 572 465 380 115 863 415 692 476 446 766 502 516 208
3592 208 744 575 684 817 543 643 620 469 775 698 311 678 456 283 425 527 313 330 450 373 266
3613 266 273 236 -66 -21 233 197 -85 -138 55 -19 294 -206 -120 -206 102 -258 -159 -215 -292 -175 -121 -220 -476 -373 -364
3638 -364 -684 -625 -483 -609 -299 -391 -511 -358 -324 -731 -343 -460 -411 -377 -494 -500 -626 -724 -438 -606 -466 -893 -453
3661 -453 -524 -552 -369 -405 -354 -617 -263 -826 -757 -434 -241 -318 -225 -392 -417 -36 -121 -305 -418 -64 36 -162 111
3684 111 -9 -142 89 83 20 254 178 116 517 42 152 88 318 510 324 293 788 470 459 735 462 464 395 405
3708 405 399 565 592 575 610 599 817 501 457 383 380 350 703 703 453 661 365 490 374 601 579 586 416 534 725
3733 725 323 288 215 290 323 311 144 298 341 254 235 124 -84 45 90 -11 201 -44 -225 96 -242 -102 -168
3756 -168 -235 -192 -326 -103 -311 -199 -411 -522 -155 -223 -496 -287 -385 -341 -260 -88 -575 -532 -439 -449 -432 -696 -566
3779 -566 -448 -632 -419 -332 -575 -596 -644 -440 -437 -283 -535 -555 -583 -187 -549 -143 -538 -510 -536 -393 -33 -297 -356
3802 -356 -445 -199 -431 -38 -394 -356 -242 -174 -36 -96 48 0 -83 -118 -102 179 328 168 245 -9 628 147 380
3825 380 162 241 272 185 521 399 381 261 521 56 437 555 553 678 521 548 407 260 756 572 513 443 679
3848 679 664 613 493 464 618 648 520 342 580 431 581 359 503 386 341 413 426 224 212 403 335 371 307 38
3872 38 133 271 14 -77 118 199 -47 -76 -148 -42 129 -112 12 -217 -351 -397 -95 -285 -160 -306 -93 -668
3894 -668 -316 -493 -383 -484 -683 -113 -650 -614 -416 -563 -708 -300 -480 -534 -548 -500 -486 -107 -580 -302 -311 -771
3916 -771 -693 -580 -491 -427 -609 -468 -554 -295 -355 -301 -666 -318 -55 -165 -358 -326 -184 -120 -351 -535 -190 164 72
3939 72 -24 -123 88 5 -153 95 -147 141 5 251 194 123 154 461 207 379 380 92 109 287 338 440 478 262
3963 262 424 414 547 273 581 255 629 460 323 340 517 399 765 600 534 459 565 351 444 604 375 484
3985 484 590 795 488 609 510 318 484 324 355 534 454 253 482 219 280 274 103 -186 181 22 -17 13 -198
4008 -198 -149 84 202 -88 -304 26 -121 -164 -75 -42 -108 -263 -537 -464 -342 -410 -267 -162 -436 -262 -592 -278
4030 -278 -530 -503 -308 -687 -479 -369 -565 -679 -476 -461 -654 -887 -433 -608 -431 -309 -559 -575 -418 -378 -693
4051 -693 -293 -330 -296 -489 -425 -392 -334 -72 -389 -372 -269 -182 -331 166 -136 -248 105 -46 8 192 -18 155 -293
4074 -293 83 14 74 23 320 40 -129 93 316 -117 228 305 188 255 322 219 527 391 293 343 522 494 108
4097 108 342 321 353 332 293 411 282 574 362 485 341 455 370 223 485 596 384 242 435 667 612 237
4119 237 144 264 338 236 490 228 -73 199 160 329 314 222 239 -13 450 121 56 37 -75 -116 34 129 -153
4142 -153 -20 -119 -266 -138 -343 -307 -98 -263 -258 -458 -245 -397 -544 -415 -512 -466 -699 -312 -618 -127 -196 -300
4164 -300 -431 -376 -674 -772 -483 -700 -689 -720 -505 -563 -351 -531 -531 -283 -393 -381 -552 -315 -336 -365 -388 -266 -344 -308
4188 -308 -458 -242 -139 -271 -348 -226 172 230 32 17 -262 -71 270 158 156 368 292 72 149 432 176 145 314
4211 314 410 97 340 301 211 419 386 422 624 440 532 238 112 306 187 372 570 518 499 344 686 554 519
4234 519 533 435 544 346 188 520 216 300 242 468 378 524 540 297 427 19 324 8 44 370 42 -1 477
4257 477 382 184 29 18 -133 -3 -43 94 164 -42 44 -102 -18 -14 -223 -64 -218 -108 -254 -323 -253 -317 -281 -449
4281 -449 -357 -233 -430 -464 -379 -121 -443 -121 -431 -328 -108 -610 -411 -550 -323 -637 -628 -419 -318 -332 -206 -438
4303 -438 -500 -441 -710 -328 -118 -625 -456 -279 -146 -377 -273 -190 -342 -126 -342 -252 -388 -302 -424 172 -1 102
4325 102 -11 -67 202 13 169 2 -28 161 40 329 -10 184 177 233 62 96 191 348 114 332 220 113
4347 113 216 159 358 378 246 377 334 179 577 277 199 538 752 387 150 41 413 401 424 447 256 39
4369 39 276 292 385 407 601 440 245 404 610 424 95 13 139 211 208 309 -153 123 265 169 -378 -24 59
4392 59 121 -207 -239 -233 -6 -99 -332 108 -23 -555 -364 -315 4 -4 -167 -324 -471 -305 -344 -152 -247 -553 -216 -379
4416 -379 -475 -415 -178 -242 -356 -303 -561 -16 -720 -634 -437 -403 -516 -490 -392 -443 -239 -213 -382 -555 -394 -210 -243 -188
4440 -188 -388 -366 -159 -588 -278 -305 -151 -414 -276 -391 -384 38 -270 -215 -72 223 -58 -181 -152 140 -309 77
4462 77 128 -154 -190 298 121 186 74 165 168 147 167 243 236 409 166 557 179 555 254 394 607 482 539 282
4486 282 514 331 366 279 64 394 438 450 363 264 357 263 399 338 566 149 91 421 288 323 267 211 262 143 112
4511 112 250 281 69 158 -71 -70 42 -44 131 176 -133 136 -78 -57 -67 154 -246 -61 -127 -222 -130 -142 -383 -88
4535 -88 -206 -164 -167 -267 -54 -617 -448 -328 -534 -226 -259 -491 -178 -128 -325 -524 -197 -325 -252 -554 -330 -194
4557 -194 -323 -295 -111 -210 -192 -265 -232 -298 -375 -189 -469 -463 -158 -19 81 -97 -206 -180 -441 -175 -281 -182 -71 9
4581 9 -236 -153 83 -258 -52 -26 20 29 387 -46 18 -119 246 -67 469 206 -156 -170 -37 404 359 144 282
4604 282 513 365 475 417 273 149 323 352 294 390 242 714 255 341 284 108 241 311 293 379 106 350 465
4627 465 214 312 543 115 221 291 430 198 23 515 431 134 373 205 17 174 42 96 374 98 3 -121
4649 -121 -11 66 236 -195 -17 -108 -269 226 -362 -257 -149 -335 -82 -156 -165 -365 -319 112 -262 -330 -108 -398
4671 -398 -518 -431 -309 -175 -480 -531 -270 -532 -459 -429 -417 -239 -300 -411 -430 -136 -442 -60 -277 -382 -218 -356
4693 -356 -114 -264 -450 -8 -238 -137 -388 -198 -286 -311 -362 -110 -120 57 -357 -159 -103 50 -130 -196 170 61
4715 61 -129 187 208 -7 237 122 370 107 514 212 215 -81 78 210 218 462 134 256 273 356 412 -45 283
4738 283 279 629 352 464 418 250 303 722 228 168 528 435 672 244 284 303 168 273 6 287 435 423 367
4761 367 260 287 348 95 24 155 42 -8 109 62 242 -51 464 -135 -164 310 69 186 244 335 -135 -147 -38
4784 -38 -21 -64 -223 -32 -102 -149 -368 -93 -157 -46 -192 -305 -347 53 -212 -149 -149 -248 -291 -215 -164 -416 -291 -385 -507
4809 -507 -604 -338 -376 -281 -317 -104 -486 -610 -402 -202 -331 -252 -78 -168 -151 -354 -529 -331 -150 -8 78 -20 -367
4832 -367 -530 -86 -51 -221 -1 -132 -124 -355 150 225 -224 109 -194 -10 111 -66 278 67 134 40 361 155
4854 155 91 427 95 359 265 84 307 313 114 323 293 264 201 116 485 403 194 266 507 184 574 236 189 611
4878 611 368 346 397 311 141 469 131 276 158 265 211 5 432 185 416 319 300 185 75 -61 77 441
4900 441 167 92 -43 -87 81 112 51 10 10 -131 58 71 -204 -184 8 -182 102 -207 -224 178 -238 -218 -113 -75
4924 -75 -183 -60 -208 -67 -258 -439 -66 -204 -115 -390 -374 -281 -106 -155 -459 -126 -121 -162 -265 -237 -295 -454 -118
4947 -118 -448 -307 38 -375 -340 -81 -403 -11 -21 -85 -229 15 -90 -277 15 123 -26 -91 -396 -65 215
4968 215 -83 -84 9 -20 130 7 -97 -85 -123 58 22 75 295 258 -108 16 364 -36 -61 254 55 134 259 241
4992 241 335 308 251 66 332 279 513 345 338 261 224 124 197 455 313 360 478 326 381 355 275 210 618 319 280
5017 280 379 295 125 221 387 279 101 -21 33 290 127 121 401 163 114 63 -9 209 115 -114 207 -54 38 -42
5041 -42 46 32 32 -354 -305 -144 -67 -135 -286 -236 -24 -429 -208 20 -390 -430 -512 -234 -8 -417 -37 -331 -185 -320
5065 -320 50 -536 -143 -42 -155 -385 -422 -227 -205 -84 -284 -514 -202 2 -435 -296 -542 197 -67 -170 -45
5086 -45 -220 -445 -95 -287 12 -178 191 118 -218 -19 132 49 130 65 -72 -1 131 -272 -16 196 22 134
5108 134 151 71 -72 -66 223 96 -72 371 111 146 250 414 288 192 391 609 215 319 236 51 234 441
5130 441 553 192 174 272 179 255 420 262 484 76 433 250 207 259 267 308 242 301 330 427 357 66 46 200 119
5155 119 84 148 -50 95 -60 128 58 -33 281 -61 -135 -101 -198 -43 2 -226 -356 -180 27 -23 -133 80 -263
5178 -263 -62 -246 -289 -177 -182 -90 13 -108 -208 22 -132 -384 -128 -260 -313 -429 -229 -214 -256 -255 -493 -368 -131
5201 -131 -291 -328 -161 -106 -423 -496 69 -322 -30 -264 -5 -228 -300 -204 -306 -31 -118 130 37 -286 74 -109
5223 -109 2 103 -127 -220 -118 358 29 121 -168 144 125 100 10 105 338 349 244 330 289 95 227 -55 199
5246 199 280 130 -31 285 127 183 310 157 203 221 303 270 299 489 -62 512 503 31 437 374 32 549 15
5269 15 308 -47 440 179 422 214 198 -73 381 425 13 235 5 145 -26 89 74 8 69 -86 -290 -41
5291 -41 -329 -59 -136 -282 -28 20 -74 -31 158 34 -235 -308 3 -215 -167 59 -74 -114 -351 -427 -309 -233 -253 40
5315 40 -464 -390 -634 -162 -257 -253 -511 -141 -133 -250 -222 -453 -390 -126 -563 -44 -210 73 -599 -112 -270 -258 -382
5338 -382 -540 -449 100 -377 -290 -21 -20 -191 -201 -106 -102 -167 -84 43 -21 141 -255 -120 -260 79 -126 -30 149 -86
5362 -86 139 7 216 -16 133 42 164 158 375 207 304 13 524 -188 223 178 -74 321 148 274 325 286 304
5385 304 298 411 219 491 270 177 35 116 67 160 387 90 227 132 364 218 170 172 2 210 85 304 9
5408 9 175 85 211 -54 -130 348 284 -117 249 300 -126 -206 -65 -95 99 108 83 -153 -203 -212 3 216 -16 17 -216
5433 -216 -145 -198 -75 -261 -220 -198 -329 -173 -224 -223 -200 -221 -140 -435 -307 -112 -278 -175 -534 -285 -20 -445 -245
5456 -245 -223 -328 44 -148 -188 -106 -351 -271 -459 -264 -392 -4 -189 -331 -143 -21 -264 -151 -132 -241 -163 -249
5478 -249 -21 -430 88 -202 -21 10 214 -192 -79 3 -36 19 -14 236 -252 -73 71 266 63 276 223 104
5500 104 -10 125 283 138 66 105 414 130 93 233 209 254 22 142 212 236 149 314 234 167 286 419 222
5523 222 426 82 171 212 5 243 164 168 -61 410 87 136 -104 114 29 -115 222 226 154 69 41 126 -60 -157 -6
5548 -6 245 46 -42 -53 89 170 -218 -142 -121 -94 109 -101 -207 -123 -156 138 -292 194 -57 9 -189 73 -371 -291
5572 -291 -62 -344 -149 -47 -476 167 -364 -34 -73 -291 -152 -50 -708 14 -428 -175 -215 -284 -233 -461 -279
5593 -279 -582 -231 -203 200 -272 -221 -297 -525 -100 -59 -239 -122 32 12 -155 59 -52 -47 233 74 82 -37 -284
5616 -284 -21 171 88 48 30 162 -193 126 155 82 158 67 41 -16 -140 187 98 98 407 321 224 258 8 34 124 426
5642 426 50 -2 12 2 -18 126 160 195 166 190 67 198 433 25 91 144 -98 387 28 299 62 83 187 -10
5666 -10 216 161 49 379 -22 39 147 278 25 12 195 101 7 -54 -61 -199 259 75 -88 -6 -137 -81 200 -146
5690 -146 -175 -237 -282 -198 -91 99 -43 3 -196 -491 -62 -258 -490 -134 -279 23 -157 -78 -257 -542 -146 -38
5712 -38 -363 87 -132 -432 -337 85 -128 -219 -491 -273 -62 -308 -174 -270 104 -366 68 -9 -81 71 -223 -46
5734 -46 44 -86 23 -34 -182 -16 56 170 -82 -268 -225 6 138 73 142 -180 -88 -35 46 -84 -153 14 259 53
5758 53 226 347 11 278 166 173 477 96 148 218 177 183 226 173 286 239 358 282 207 456 -10 217 120 47 -9
5783 -9 230 172 316 110 187 412 299 63 319 465 -99 301 486 118 110 238 98 33 -132 425 336 -60 -78
5806 -78 -48 104 168 70 154 -157 -309 -223 -110 -223 177 -231 -345 -100 -113 -191 -281 -372 -139 -123 -235 -260 -109 -1
5830 -1 -134 20 -307 -162 -197 -199 -395 -116 -81 -129 -228 61 -96 -197 -265 -273 -260 -249 -148 -276 -174 -76 -290 -49 -350
5855 -350 -26 -253 89 -84 33 -323 172 -192 -35 -84 -164 -184 7 -196 278 -87 -78 55 118 186 -87 113
5877 113 -33 428 185 91 -101 -33 98 368 336 -96 57 81 338 250 198 72 544 41 232 270 229 68 47
5900 47 120 421 263 368 238 110 105 243 317 211 77 82 88 491 220 -13 -156 44 -66 -96 320 137 44 189
5924 189 222 234 202 -81 -160 213 79 247 -11 124 -111 81 61 25 -54 -216 -188 -46 -166 -116 -96 -133 2 -231
5948 -231 98 -293 -210 -294 -466 -299 -452 -313 8 -83 -380 -54 -163 -39 -167 -16 -113 -139 -282 -34 -168 -183
5970 -183 -66 18 -3 -169 -351 20 -325 -77 -9 -188 -224 -199 110 -296 -138 -80 -245 -36 -54 -148 -326 -306 -49
5993 -49 95 -109 -77 -302 8 259 21 -107 122 -137 391 -70 -42 -200 125 50 76 12 -143 84 11 21 114
6016 114 -75 268 472 200 70 268 233 98 98 104 430 320 299 -30 77 87 435 -176 135 137 170 -17 243
6039 243 242 105 136 251 120 -100 251 64 391 404 229 312 272 16 -138 15 184 19 0 63 147 31 178
6062 178 106 -31 4 -126 -317 -95 1 -124 -262 -89 102 300 300 52 -31 -198 -17 208 -130 -481 -103 188
6084 188 -151 -519 -458 -379 -307 -189 -482 -186 -13 -101 -190 -37 -341 -234 -281 -226 -75 -569 -233 -16 -427 -282
6106 -282 -84 -135 -187 -99 -275 -205 112 -239 -114 -125 -193 9 -126 -15 -40 -324 -232 -130 57 160 76 81 127 -22
6130 -22 18 174 166 -24 -57 80 33 331 137 288 122 105 151 200 202 249 -47 337 -311 147 13 127 407 428
6154 428 143 357 409 34 225 373 174 63 263 393 106 182 -19 86 -200 153 -6 78 196 289 168
6175 168 216 105 -51 3 -59 244 77 167 183 -130 161 382 -89 99 -101 234 6 -205 -156 128 -45 -403
6197 -403 -118 -51 -196 -149 -438 -117 -41 104 28 -249 -594 -186 46 -204 -65 -201 153 -318 -332 -460 -321 -318
6219 -318 -305 -218 -24 -335 -127 -238 -357 -141 -183 -70 -239 -173 -89 -224 -536 108 -47 -235 -300 -320 -53 -170
6241 -170 -162 -200 -537 -111 38 -138 -176 -169 -248 -214 84 224 -46 -160 219 -291 -147 -169 92 -46 235 -158 -103
6264 -103 233 428 104 178 -92 175 148 264 225 -66 251 143 443 461 188 -103 282 162 295 367 160 191
6286 191 462 -45 581 252 -209 123 314 -90 200 164 328 601 170 246 71 477 32 49 41 104 123 -34
6308 -34 -291 140 401 272 226 -109 258 -162 -58 289 -7 33 -86 -84 115 -76 102 -139 70 -131 -62 -28
6330 -28 -87 248 -125 -72 -44 43 -213 125 -515 -1 -105 -314 53 -118 -145 -171 -392 51 -58 -234 -121 -322
6352 -322 -18 -395 36 -529 -408 -209 -422 19 -300 -105 -171 74 -336 -92 -368 -64 -91 -184 -60 -248 -4
6373 -4 -472 59 -108 125 -59 -284 191 110 187 -200 -51 166 -17 41 -224 -237 36 266 -106 85 25 -89
6395 -89 63 102 -53 261 265 125 65 218 330 147 256 9 492 428 309 164 146 2 114 126 -171 -87 349
6418 349 212 83 123 196 254 -233 351 149 82 261 -218 21 238 -138 23 9 248 -151 47 -41 182 110
6440 110 -273 216 -88 -91 -1 295 -26 -11 -80 -84 35 -124 -14 36 -142 175 -70 35 -181 -2 42 -10 -244
6463 -244 -87 9 -196 -36 -154 -212 -413 -165 372 -168 -281 -324 -343 -39 -136 64 -424 159 22 135 -182 -310
6485 -310 -224 -50 0 -148 -420 -337 -328 -397 -177 -146 -150 -275 4 -191 -285 -54 -95 165 -15 -111 -144 145 -13 -350
6509 -350 155 -271 33 -218 145 -84 -372 -55 -58 300 70 71 114 229 146 53 23 -232 -48 124 -89 247 129
6532 129 546 84 -132 130 41 118 368 471 366 371 35 240 252 270 83 87 -29 251 -2 14 234 96 309
6555 309 97 256 104 283 202 198 18 -176 237 164 -57 49 -176 45 393 259 4 141 194 123 91 402
6577 402 74 214 189 20 -205 -168 63 -157 161 -121 -41 92 -128 81 326 -13 -126 -56 47 -452 -4
6598 -4 -73 -117 61 -277 -316 13 -344 77 -227 -501 -44 -168 -160 -259 -169 -402 -314 -86 -365 -217 -341 -240 -205 -240
6622 -240 206 -224 60 35 -126 -266 100 -92 1 -205 -180 214 -237 300 -283 -24 -58 -139 35 28 -61 -70 61
6645 61 79 190 138 -45 251 347 7 98 195 -58 282 174 193 9 161 167 122 96 188 183 40 104 192 -2 125
6670 125 -90 322 294 -106 34 40 194 202 80 275 138 61 211 90 108 262 -58 217 47 -75 -94 242 153
6693 153 -95 -97 257 52 43 87 5 170 380 84 185 3 -9 -120 -98 31 -266 -97 153 40 238 136 -157
6716 -157 -301 26 -138 -127 -297 251 -171 -181 -128 21 -253 -311 -215 -367 -197 63 -28 -288 -193 -259 -453 -62 -62
6739 -62 -206 -331 -72 -166 -62 23 -197 -74 -218 -82 -15 -194 -85 -54 -173 48 -10 -175 131 -160 -83 -74 -115
6762 -115 -107 -28 6 166 -136 -127 -189 108 -87 106 299 177 -169 -176 94 85 175 146 303 304 98 212 -141 -1 59
6787 59 -240 -62 202 130 209 254 66 -29 -37 298 100 251 371 366 216 164 -125 207 -151 -25 346 226 56
6810 56 374 -22 -178 210 -25 -200 -6 6 186 -8 33 -113 241 -7 -290 81 -3 -44 270 242 -133 -31
6832 -31 134 331 -189 -187 -70 -184 150 90 237 87 -175 -349 -319 150 -139 -148 -315 -292 -244 -33 -466 -36 -205
6855 -205 -180 -307 98 -37 -142 -44 -298 104 -231 -112 -104 -120 -155 -232 -221 -87 -100 0 -265 -353 54 -272 -89
6878 -89 -129 -167 -250 -81 -40 -144 -109 -66 216 -144 -157 -38 -276 -197 -9 -110 98 -9 296 60 315 207 7
6901 7 -50 335 -12 -93 139 52 25 324 -80 -146 -339 173 278 127 11 25 349 128 -15 414 -165 235 30
6924 30 241 144 432 260 -171 -15 -29 -21 15 33 -18 96 -16 -24 100 -142 168 285 72 282 127 6 -6 417
6948 417 116 219 139 -30 -15 99 -268 99 75 -51 224 182 -175 10 136 -317 43 -359 -174 -59 40 -208
6970 -208 -5 145 -260 6 75 -132 13 -99 -205 -314 -144 -69 39 -247 72 -35 -273 -339 -340 33 -128 -427
6992 -427 -285 198 -443 -402 -433 -122 -180 -302 -132 -183 14 -138 -46 -357 -2 33 -250 -165 103 -134 -22 -90 -165
7015 -165 98 -153 -233 -186 -319 -222 -106 132 -257 121 35 54 -160 25 62 144 103 -80 -60 -147 -80 -116 206 17
7039 17 142 -264 -142 30 257 168 -62 238 62 314 -101 135 244 170 253 248 194 227 -67 6 233 388 345
7062 345 60 32 103 208 260 19 144 284 51 65 169 2 -50 193 -270 272 198 115 -162 -28 346 149
7084 149 171 -168 -327 168 251 23 23 84 -10 39 -186 2 -81 106 6 -20 77 -171 42 140 -197 -6 92 -174
7108 -174 -23 -84 109 -456 -71 0 -157 -65 7 138 81 5 137 41 -128 134 -207 -245 52 -91 -32 -140 109
7131 109 136 -168 13 -73 -120 -165 -268 95 80 -6 -3 -154 -34 -27 -41 -5 -280 -103 -67 -11 -281 221 -116 -326 57
7156 57 161 36 20 103 6 200 -157 -58 -171 100 11 101 218 -53 17 203 85 -69 -253 231 163 242 210 153
7180 153 261 292 403 281 175 -8 149 119 215 68 177 216 -21 107 205 57 235 -108 -231 74 320 231
7202 231 32 176 -40 15 104 88 267 16 44 -9 75 214 -195 53 262 111 1 364 121 48 -30 87 -169
7225 -169 -3 186 13 -141 43 13 161 -90 -209 179 -167 78 -195 -152 -313 11 127 57 -195 192 -163
7246 -163 -292 -119 44 -31 -159 -11 -206 -69 -395 -120 -124 -239 45 -52 75 -80 -21 -4 -397 -88 34 140
7268 140 14 -78 219 112 -9 -85 168 -162 100 -73 -73 37 23 -122 28 -169 -89 220 23 132 -152 101
7290 101 147 163 -69 -154 -133 56 -9 200 17 243 173 -187 102 200 41 -9 209 150 30 330 -30 152 12
7313 12 -35 247 214 348 249 -26 28 -123 -51 194 -112 150 -69 417 -67 169 179 227 402 68 37 -48 -104 179
7337 179 257 42 65 -155 276 140 -47 -144 -187 13 45 -226 173 4 110 -218 -32 53 -252 -274 -66 -1 -46
7360 -46 -114 -136 -117 -297 -175 -59 81 -84 40 -250 -147 -183 -28 -497 -119 -144 222 -166 42 292 62 -118
7382 -118 -125 25 -94 -221 -418 -85 -165 -129 -286 -18 23 -63 -116 -328 106 -325 -14 -252 -133 238 -338 231
7404 231 -147 281 -42 -125 -269 -191 -455 105 54 102 21 -32 95 162 54 233 214 -39 -180 331 16 20 63 70
7428 70 301 -11 199 -44 185 21 364 -3 228 89 374 102 170 -26 305 -28 160 249 17 22 136 -37
7450 -37 177 138 -34 344 34 -63 261 213 -129 45 347 -6 -127 81 245 -28 224 -13 15 45 59 213
7472 213 84 288 -53 -15 96 81 -46 -132 153 -35 -101 -73 -120 152 57 -110 42 -119 216 26 125 -105 12
7495 12 139 -150 -36 142 -53 -303 -15 -223 -391 -142 92 73 30 -277 109 119 -196 -150 -142 87 -114 -425
7517 -425 -152 -33 -303 -135 -50 -327 -19 159 -32 -422 68 158 225 -49 -48 -256 57 -247 -125 128 162 50
7539 50 -106 427 38 -80 -393 190 221 -95 -36 163 -43 171 78 292 296 44 -1 -64 158 -24 103 80 171
7562 171 -123 172 218 -96 174 228 -67 37 224 333 34 229 -182 147 97 149 283 256 -106 38 -35 -114
7584 -114 -90 381 34 82 68 184 48 110 15 81 368 421 58 85 77 14 190 -70 248 -39 5 -272 -24 98
7608 98 174 -102 134 -26 -242 -102 -92 -184 -162 -163 -89 147 16 133 -55 -290 -218 0 97 -2 -313 25 53 -198
7632 -198 -295 -129 -220 -130 -315 -377 -78 78 41 -192 -446 -182 -255 -277 -149 -136 -239 145 95 52 150 -328 235 170
7656 170 64 -212 -406 11 20 -294 282 174 37 51 -18 -90 -284 -138 281 199 -244 -276 78 14 -37 322 309
7679 309 -129 93 119 -33 319 115 -20 187 -380 332 228 -36 181 -77 61 365 47 -91 182 5
7699 5 191 196 -38 237 223 127 1 36 153 390 95 37 145 48 72 85 274 -262 3 -41 74 84 30 -34 -156
7724 -156 122 121 -45 -201 -67 204 147 -42 75 45 60 -31 107 -179 -48 152 -176 97 148 -188 208 -316
7746 -316 -140 -98 -276 -363 -195 7 49 -181 -233 -35 -10 -71 69 -139 -71 -34 -141 -28 66 -208 -123 56 -200
7769 -200 -166 -83 -177 -118 -59 -55 -493 -286 39 -296 -129 -271 -15 189 2 19 -38 -391 -125 -17 75 -28 -47 412
7793 412 -436 154 140 -341 123 74 -348 -74 165 -64 -84 105 38 -136 314 -263 241 194 -354 -179 129 59
7815 59 409 222 -151 54 131 104 16 -89 66 -10 64 72 61 -10 332 361 -55 -49 124 -83 -143 72 125 98 80 -28
7841 -28 137 15 467 251 592 7 13 459 -95 252 205 -102 123 -65 109 -90 -5 81 -137 52 -88 343
7863 343 98 -218 94 -204 -115 -278 -92 11 166 -10 -164 -154 56 -23 -61 -197 -60 -12 148 -140 -62 -140
7885 -140 -2 -225 -549 -135 -114 -136 -199 117 83 47 -10 -112 26 55 -251 -222 -284 -246 -14 -235 -239 -134 -86 -226
7909 -226 -211 -228 -42 322 -160 -85 -49 -12 283 491 -230 70 289 -61 219 7 117 96 -49 -70 -49 261 -106
7932 -106 188 79 234 -175 -130 110 -73 124 -13 -299 -50 6 47 140 127 -36 121 184 112 15 103 150 92 223
7956 223 33 -3 -175 -53 482 -180 237 141 -2 -25 277 -258 189 229 49 95 263 -154 -233 165 -66 -38
7978 -38 57 132 82 193 172 -167 66 -124 16 -7 -115 86 -141 94 114 -174 -219 22 -178 -72 -89 -214 -78
8001 -78 -111 215 43 -167 -224 -349 -26 -133 -78 35 -121 122 101 139 -66 -5 12 -171 -96 -177 16 -260 137
8024 137 230 142 -21 -126 43 -80 -234 -28 32 -40 140 23 -94 -20 -189 -210 -206 93 -53 -234 6 69 -448
8047 -448 151 -402 -166 32 15 106 -52 -241 -163 145 55 47 -180 -49 121 -11 -76 -29 254 11 -299 -120 -15
8070 -15 -104 169 10 15 269 21 308 59 313 87 141 133 -62 87 294 -67 4 387 22 -45 57 197 340
8093 340 -118 -165 201 23 179 133 86 -117 -156 203 -65 215 -81 -125 46 -26 249 261 -72 125 -108 -84 69
8116 69 62 -156 103 29 -192 101 310 55 -120 -172 28 -110 -35 -12 148 -25 -28 -10 129 2 288 30 -280
8139 -280 -271 84 122 -175 -16 96 -122 49 -261 175 117 -200 -14 -110 32 -284 -5 44 67 4 28 5 -47 -24
8163 -24 -21 -92 95 -116 133 -157 85 -204 -268 18 -70 18 90 -197 24 -114 61 6 248 -208 -70 131 283
8186 283 371 95 188 13 -63
8191f3
$$ Imaginary data points
##PAGE= N=2
##DATA TABLE= (X++(I..I)), XYDATA
0 0 0 0 0 0 0 0 8 -8 8 -8 16 -16 24 -24 32 -40 48 -56 64 -72 88 -104 120 -136 159 -179 204 -233 264 -297
30 -297 336 -376 420 -472 524 -586 650 -722 802 -888 983 -1088 1205 -1333 1478 -1640 1823
47 1823 -2031 2272 -2552 2883 -3282 3774 -4400 5219 -6353 8023 -10742 15920 -29296 133743
61 133743 252710 -86265 -90881 111513 122886 -66208 -26244 118567 80999 -41763 26183
72 26183 103886 29163 -18870 94539 123801 661 -36852 70190 77850 -17842 -6996 83823
84 83823 49538 -32954 12087 90361 37149 -32535 16640 75441 36696 2066 24799 15268
96 15268 -22154 13424 65436 20214 -41354 425 50813 -2198 -50450 7809 58577 9220
108 9220 -38394 -14538 -1932 -26920 -11353 25400 -3136 -52811 -27557 16638 -11451 -46959
120 -46959 -10986 17964 -27699 -60140 -18877 6884 -32687 -49552 -6738 4475 -40899 -54219
132 -54219 -12416 -319 -37012 -45928 -14124 -6588 -33486 -40566 -23240 -24317 -38294 -26575 -2694
145 -2694 -11771 -40732 -41446 -16558 -9551 -25040 -26759 -8240 -5177 -28088 -39138 -18310 1252
158 1252 -6650 -18749 -12207 -7488 -17871 -18650 453 7270 -9811 -17918 -3454 2922 -8556 -8585
172 -8585 7950 10749 -2817 -3192 7640 7040 -1453 2956 13224 10957 4839 9208 13851 10142 6413
187 6413 11100 15735 18075 19931 16083 7828 7544 17523 21381 16736 16791 19834 13904 7866 15543 23865
203 23865 18378 14233 21085 18885 5305 7861 25787 25814 6921 6733 22730 17405 570 9660
217 9660 28174 16843 -3030 7482 24615 11315 -5729 7137 20459 5733 -5111 10010
229 10010 16874 -800 -8388 7482 11250 -4079 -4600 8769 4361 -12413 -9155 5917 3021 -9613
243 -9613 -6934 277 -6756 -13750 -5962 1060 -6405 -12634 -9079 -8163 -12013 -10430 -5505 -8783 -14086
258 -14086 -11579 -8556 -12860 -13749 -7848 -7408 -15443 -15726 -8856 -9337 -15791 -13689 -8021 -10976 -15953 -10607
274 -10607 -5470 -11584 -15882 -10065 -6515 -11578 -12664 -6108 -5540 -12862 -13253 -4335 -2545 -8412 -8772 -3141
290 -3141 -4135 -9058 -6280 745 -102 -5975 -5341 -188 -332 -2706 -217 3339 1043 -2431 354 4819
306 4819 4462 1563 3237 5325 4386 2438 5072 8607 7057 3588 5205 8763 8503 6596 7478 9526
322 9526 8466 5986 8467 11502 10567 7274 7220 10041 9971 8549 10260 11426 9308 7015 8529 10820
338 10820 9938 8751 9529 8897 6969 6942 9544 9730 7306 6165 6548 6450 5856 5986 6561 4638 3627 3591
356 3591 4132 3819 3886 3562 1615 442 963 1818 673 -389 126 -681 -2573 -2473 -494 -882 -3644 -4542
374 -4542 -3099 -3395 -5126 -4674 -3053 -4946 -7806 -6787 -4617 -5951 -7976 -7219 -6475 -7793 -9182 -7167
390 -7167 -6244 -7625 -9475 -8184 -7495 -8512 -8723 -7149 -7297 -9105 -9510 -7381 -6128 -7867 -8350 -7242 -6726
407 -6726 -7534 -7383 -5691 -5509 -6458 -6540 -5381 -4884 -4718 -4786 -4024 -4016 -4237 -3831 -2426 -1752 -2255 -2043 -1943 -1277
427 -1277 -492 34 486 909 833 683 1150 2360 2504 2487 2499 3611 3740 3714 4001 4928 4837 4517 4771 5623 6306
448 6306 5935 6145 6546 6039 5659 6581 7461 7091 6447 6605 7251 6862 6346 6948 7524 6770 5978 6815 7473 6792
468 6792 6045 6270 6758 5572 5175 6079 6190 5346 4374 4497 4491 4088 3710 3816 3555 3143 2211 2686 2953 1929
488 1929 997 948 1164 362 -505 -204 265 -417 -1672 -1915 -1463 -1959 -2580 -2663 -2618 -3187 -3911 -4191 -3263 -3868 -5184
509 -5184 -5389 -4377 -4581 -5506 -5654 -5410 -5653 -6202 -5921 -5702 -5577 -6383 -6521 -5972 -5651 -6623 -6971 -6114 -5741 -6409
529 -6409 -7078 -5770 -5039 -5787 -6328 -5739 -4715 -5354 -5741 -4212 -3201 -4794 -5495 -3725 -2793 -4251 -4736 -2411
547 -2411 -1123 -3096 -3261 -1502 -212 -1955 -2611 -581 589 -701 -652 1344 1872 -135 472 2532 2806
564 2806 1332 1456 2889 3449 2424 2755 4413 4562 2967 3356 5023 5159 4279 4348 5671 5496 4619 4264
582 4264 5790 6644 5209 4721 5696 6341 5373 5092 6041 6695 5161 4441 5993 6344 4841 3723 5607 6165
600 6165 4178 3192 5061 5677 3495 2823 4232 4517 2852 1769 3251 3208 1232 1513 3234 2657 589
617 589 80 1363 832 -548 -447 829 204 -1490 -1372 -862 -1149 -2083 -2102 -1867 -1552 -2754 -3875 -3553 -2701
636 -2701 -3125 -4274 -4212 -3452 -3672 -5091 -4704 -3957 -4536 -5230 -4860 -4275 -4783 -6280 -5575 -3823 -4592 -6082 -5258
655 -5258 -3935 -4886 -6374 -5413 -3469 -4027 -5320 -4972 -3874 -4731 -5510 -4122 -2354 -3225 -4785 -4007 -2442
672 -2442 -2639 -3729 -2820 -1054 -1455 -3186 -2585 -682 -422 -1802 -1439 624 438 -1222 -588 1326 1386 -330
690 -330 754 3126 2567 330 1078 3462 2927 1517 2703 4693 3420 1668 2857 5294 4483 2688
706 2688 3907 5429 4497 2718 4343 5845 5166 4053 4610 5110 4600 3968 4578 5758 5441 4047 4490
723 4490 5168 4554 4057 3962 5089 4780 3613 3376 3830 4273 2725 2751 3370 4108 2751 1627 2312 2847 1351
742 1351 772 2638 2818 219 -913 820 1264 -364 -908 794 723 -1870 -2856 -775 -305 -2082 -2474
759 -2474 -886 -1385 -3768 -4024 -2308 -2106 -3674 -3832 -2694 -2926 -4867 -4594 -3203 -3049 -4557 -4904 -3854
776 -3854 -4234 -5378 -5626 -4092 -3526 -4552 -5252 -4475 -3939 -5005 -5102 -3874 -3053 -4436 -4997 -4150 -3813 -4277
794 -4277 -4867 -3112 -2272 -3489 -4383 -3310 -2327 -2884 -2766 -1872 -1301 -2563 -2792 -1646 -1069 -1708 -1296 -36
812 -36 250 -952 -1136 -1 866 801 432 1167 2141 1058 793 1328 2662 2488 1889 2153 3219 2925 1780
831 1780 2560 4253 4364 2919 3312 4411 4148 2688 3596 5480 4882 3239 3779 5300 4275 2744 4690
848 4690 5948 4396 2889 4313 5577 3866 2886 4796 5020 3135 2594 4162 4345 2665 2603 4208 3796
865 3796 2265 2262 2900 2266 1698 1952 2543 1762 1087 1348 944 189 886 1078 150 -124 -170 -554 -1730 -868
885 -868 7 -526 -1942 -2009 -1239 -2218 -2942 -1783 -1185 -3153 -3852 -2568 -1968 -3927 -4504 -2291 -2095 -4193
903 -4193 -4551 -2990 -2946 -5089 -4705 -2491 -3400 -5067 -4643 -2814 -4179 -5084 -3913 -3042 -3821 -5079 -3952
920 -3952 -3050 -3879 -4412 -3073 -2629 -3647 -3925 -2696 -2849 -3212 -2801 -1762 -2004 -2420 -1898 -1466 -1756 -1715 -888
939 -888 -866 -1494 -580 -429 -522 -338 361 649 136 576 1071 1119 810 1188 1948 1749 1039 2065 2493 2353 2049
960 2049 2784 3345 3034 2550 3336 3221 3114 3220 4195 4051 3360 3511 3977 3924 3282 3609 4184 4136 3765 3473 3990
981 3990 3725 3570 3679 3710 3402 3200 3235 3270 3219 3504 2755 2848 3075 3014 2057 2374 2422 2002 1497 1730 2079 1570
1003 1570 573 625 1502 953 -24 114 821 -302 -849 -562 11 -1147 -1206 -931 -898 -1661 -1974 -1665 -1484 -2562
1023 -2562 -2510 -1945 -2374 -3054 -2768 -2862 -3084 -3487 -3321 -2957 -3289 -3461 -3285 -3279 -3755 -3447 -3366 -3616 -3618 -3791 -3419 -3568
1045 -3568 -3424 -3425 -3439 -3334 -3170 -3071 -3330 -3204 -2978 -2773 -3066 -2771 -2466 -2294 -2531 -2236 -1965 -1431 -2107 -2071 -982
1066 -982 -1680 -1865 -1107 -803 -565 -1176 -481 72 101 -347 212 611 581 423 728 1446 1065 1080 1525 2029 1811
1087 1811 1828 2208 2380 2079 2109 2654 2977 2451 2803 2705 3334 2971 3149 3309 3232 3752 3085 3352 3388 3485 3471 3110
1109 3110 3365 3495 3321 3440 3502 3274 3084 2913 3239 2983 2545 2615 2773 2674 2216 2294 2314 1758 1696 1639 1728 1501
1131 1501 1037 1083 1132 846 392 670 517 193 -143 -159 -209 -595 -538 -877 -823 -776 -1611 -1373 -1354 -1629 -1894 -2229
1153 -2229 -2110 -2126 -2445 -2762 -2617 -2263 -2555 -2884 -2472 -2887 -2999 -3401 -3011 -3200 -3524 -3290 -2851 -3080 -3485 -3437
1173 -3437 -3321 -3035 -3293 -3207 -2859 -3188 -3191 -3043 -2563 -2476 -2738 -2633 -2381 -2591 -2219 -2226 -2138 -1985 -1752 -1640 -1361 -1130
1195 -1130 -1011 -1158 -1025 -667 -844 -465 -295 -228 -95 302 300 208 606 672 838 888 817 1190 1621 1606 1630 1497 1998
1218 1998 2064 1972 2112 2533 2349 2527 2310 2773 2882 2859 2827 2882 2967 2992 2769 3057 3398 2862 2723 3038 3245 3218
1240 3218 2760 2959 3143 2836 2442 2913 2788 2727 2330 2448 2446 2084 2174 2042 2256 2180 1575 1577 1507 1243 788 1052
1262 1052 1110 956 450 312 707 518 10 -80 27 -205 -577 -720 -774 -877 -1437 -1189 -1209 -1463 -1811 -1651 -1797
1283 -1797 -1941 -2109 -2295 -1921 -2359 -2530 -2586 -2292 -2413 -2776 -2769 -2541 -2727 -2938 -3014 -2674 -2621 -3037 -3093 -2794 -2668 -3149
1305 -3149 -3082 -2322 -2912 -2557 -2675 -2484 -2662 -2690 -2476 -2005 -2243 -2252 -1990 -1810 -1490 -1735 -1656 -1614 -1061 -1294 -1190 -910
1327 -910 -601 -512 -678 -275 83 -106 -94 27 343 106 601 871 1118 1036 902 1420 1724 1233 1283 1665 1816
1348 1816 1777 1823 2199 2537 2183 1662 2437 2489 2472 2256 2694 2692 2608 2336 2801 2808 2598 2438 2717 3059 2594 2518 2827
1371 2827 3106 2380 2280 2733 2202 2083 2239 2427 2281 1920 1672 1757 1674 1481 1510 1595 1401 1135 976 1096 944
1392 944 264 654 264 712 259 -127 -27 -228 -549 -612 -383 -445 -832 -954 -1010 -1246 -1260 -1471 -1410 -1391 -1529 -1845
1414 -1845 -1750 -2003 -2029 -1902 -2603 -1779 -2128 -2488 -2505 -2351 -2276 -2686 -2589 -2291 -2228 -2629 -2961 -2411 -2406 -2655 -2529 -2365
1436 -2365 -2397 -2821 -2477 -1787 -2200 -2579 -2305 -1740 -2146 -2192 -2057 -1314 -1592 -1682 -1627 -1148 -1122 -1391 -868 -572 -588 -746
1458 -746 -536 -449 -395 -633 -167 329 259 69 165 863 915 556 809 1264 1366 1144 1282 1593 1517 1444 1345 1669 2113
1481 2113 1902 1717 2410 2472 1993 2284 2540 2731 2183 2625 2344 2606 2357 2431 2383 2792 2297 2223 2715 2670 2123
1502 2123 2172 2135 2294 1964 1801 2027 2029 1811 1589 1779 1705 1360 1633 1355 1386 1101 843 1198 880 712 318 363
1524 363 504 419 -169 -1 -82 -401 -319 -257 -316 -480 -1043 -799 -729 -1110 -1354 -1080 -1190 -1367 -1850 -1599 -1476 -1822
1546 -1822 -2304 -2172 -1855 -2459 -2391 -2054 -1790 -2042 -2410 -2192 -1998 -2458 -2569 -2036 -2209 -2412 -2453 -2363 -1986 -2056 -2384
1567 -2384 -2055 -1652 -2216 -2233 -2111 -1846 -1949 -1785 -1530 -1365 -1225 -1429 -1147 -1197 -1278 -1102 -906 -635 -620 -878 -437
1588 -437 -200 -202 -230 -218 187 -40 41 480 392 444 768 906 1027 906 970 970 1373 1629 1345 1446 1719 1855 1466
1611 1466 1580 2236 1859 1543 1962 2219 2322 1814 2123 2225 1931 2105 2126 2343 2105 1885 1993 2203 2064 1993
1631 1993 1823 2127 1644 1783 1891 1937 1640 1209 1541 1485 1519 979 1019 1399 1070 997 872 708 519 415 362 862
1653 862 108 248 275 -36 -285 -326 -156 -268 -745 -606 -632 -614 -946 -1378 -827 -1310 -1193 -1398 -1631 -1554 -1734 -1610
1675 -1610 -1960 -1948 -1741 -2025 -1691 -1978 -2090 -1866 -2089 -1988 -1920 -2278 -2036 -2324 -1960 -2211 -2062 -1784 -1992 -1971 -1868
1696 -1868 -1950 -1770 -2059 -1650 -1722 -1770 -1648 -1539 -1446 -1469 -1233 -1394 -1238 -1267 -1104 -1027 -700 -826 -645 -468 -590 -140
1718 -140 -226 -211 -34 0 59 383 219 165 480 625 795 521 990 1010 1086 1160 1177 1385 1442 1342 1180 1882 1639
1741 1639 1817 1626 1684 1905 1642 1540 1669 1991 2131 1906 1958 1966 1928 2030 1809 2175 1779 1923 2057 1915 1860 1566
1763 1566 1424 1629 1739 1414 1307 1474 1281 1124 1135 1164 1112 1149 1086 993 780 761 534 524 411 -14 173 69
1785 69 26 -66 -295 -157 -387 -581 -575 -129 -540 -731 -1027 -1054 -985 -981 -1104 -1268 -1211 -1321 -1494 -1724 -1348 -1622 -1696 -1578
1809 -1578 -1859 -1702 -1807 -1975 -1189 -1831 -2094 -1757 -1731 -2035 -1847 -1809 -1746 -1996 -1869 -1575 -1898 -1858 -1568 -1393 -1671
1830 -1671 -1543 -1493 -1551 -1319 -1164 -1109 -932 -1318 -895 -1135 -929 -722 -915 -763 -236 -416 -216 98 -199 130 -38
1851 -38 130 12 387 308 289 451 594 1081 850 926 889 994 915 1410 1089 1310 1472 1658 1413 1366 1831 1567
1873 1567 1739 1497 1774 1665 1644 1560 1962 1991 1938 2044 1942 1606 1736 1791 1467 1639 1780 1745 1493 1444 1767 1564
1895 1564 1465 1428 1351 1243 1203 1149 1207 864 868 927 924 727 490 702 712 -31 371 -12 62 230 -163 -56 -303 -412
1919 -412 -435 -453 -207 -707 -838 -1079 -915 -1053 -891 -1030 -1322 -669 -1473 -1296 -1326 -1403 -1328 -1666 -1373 -1572 -1512 -1236
1941 -1236 -1680 -1386 -1970 -2122 -1653 -1673 -1909 -1432 -1645 -1519 -1655 -1707 -1350 -1653 -1567 -1420 -1508 -1217 -1276 -1277 -1086 -1134
1963 -1134 -946 -794 -1262 -715 -1001 -598 -572 -431 -687 -593 -513 -503 -211 -483 -2 -69 -51 80 489 174 220 150
1985 150 436 599 684 528 475 678 807 956 951 1103 1245 1156 1337 1369 1549 1286 1299 1570 1596 1588 1450 1862 1375
2008 1375 1718 1606 1687 1535 1801 1794 1901 1685 1649 1602 1582 1414 1373 1448 1232 1307 1504 1692 1184 1242 986 918 987 738
2032 738 824 668 769 430 560 533 547 395 181 63 451 247 171 -58 -47 37 -637 -705 -521 -692 -671 -454 -691
2055 -691 -978 -982 -1213 -1122 -974 -1046 -1236 -1243 -1248 -1193 -1275 -1176 -1495 -1628 -1480 -1695 -1324 -1749 -1619 -1419 -1611 -1547 -1526 -1576 -1872
2080 -1872 -1646 -1677 -1405 -1574 -1489 -1154 -1355 -1216 -1216 -1362 -1200 -864 -993 -925 -829 -660 -657 -636 -794 -813 -485 -484 -829 -704
2104 -704 -267 -84 -182 173 -362 156 -58 126 314 133 379 564 429 785 721 1019 726 1040 737 1080 1186
2125 1186 1148 1242 1217 1341 1134 1698 1480 1581 1254 1485 1469 1420 1558 1427 1511 1594 1296 1155 1694 1761 1095 1691
2147 1691 1171 1220 1367 1126 1467 1166 1465 806 1248 1304 681 1050 802 777 440 598 682 573 449 419 312
2168 312 381 155 158 -7 -151 11 -270 21 -170 -591 -407 -295 -274 -398 -657 -648 -610 -1053 -848 -705 -990 -1024 -1182
2191 -1182 -1241 -1058 -1206 -1600 -1325 -1188 -1353 -1226 -1224 -1117 -1467 -1425 -1279 -1125 -1322 -1321 -1310 -1509 -1244 -1428 -1409 -1520
2213 -1520 -1470 -1246 -1184 -1071 -1021 -1235 -1053 -803 -756 -1037 -877 -869 -847 -786 -390 -627 -446 -280 -743 -401 -430 -136 -188
2236 -188 264 248 -94 176 223 512 503 422 424 714 669 366 795 736 937 1108 989 867 887 1093 1054 1150 1274 1218
2260 1218 1061 1088 1195 1157 1520 1584 1239 1316 1641 1404 1340 1195 1484 855 1438 1315 1131 1151 943 1148 1013 1054
2282 1054 1039 1266 1072 942 881 1006 761 610 775 734 665 783 543 17 292 260 101 421 -53 -540 -280
2303 -280 -45 -119 -358 -543 -212 -359 -427 -575 -695 -584 -719 -889 -1078 -712 -682 -818 -1030 -951 -833 -1146 -1205 -1183
2325 -1183 -967 -1544 -1482 -1195 -1173 -1114 -1443 -1143 -1218 -1221 -1317 -992 -1319 -1369 -1412 -1181 -1068 -1330 -1294 -773 -1065 -1073 -998 -1129
2349 -1129 -720 -817 -1067 -679 -816 -565 -346 -582 -496 -411 -447 -465 -363 -638 -180 -201 -17 -19 -48 447 545 0 97
2372 97 275 436 481 455 812 559 883 488 547 717 717 874 1042 898 1030 1310 1192 1374 1076 938 1069 1118
2394 1118 1202 1241 1292 1203 1385 1154 923 1167 984 1533 1457 1136 1163 1378 813 954 987 1206 1043 1125 761 1041
2416 1041 879 852 667 716 444 473 703 430 501 410 186 42 163 201 2 -170 -4 -214 -174 109 -267 -336
2438 -336 -494 -590 -411 -385 -554 -690 -387 -706 -832 -894 -866 -1092 -923 -951 -1037 -1010 -1087 -1116 -1109 -867 -1015 -1246 -1447 -1082
2462 -1082 -1022 -1153 -1319 -1151 -1102 -969 -1303 -1182 -1072 -931 -830 -1230 -1006 -946 -961 -810 -885 -879 -720 -529 -841 -723
2484 -723 -975 -594 -409 -559 -320 -452 -174 -144 -46 -102 229 -124 167 153 96 271 65 -70 404 535 325 467
2506 467 450 670 572 471 788 695 914 600 957 910 908 711 1154 979 1136 814 1126 1210 1203 1234 962 1031 1253 1070
2530 1070 944 1139 1077 905 1341 1033 932 1176 841 1060 685 845 774 657 643 860 450 700 734 448 513
2551 513 280 422 242 541 591 126 368 46 265 127 -20 -248 -247 -135 -250 -631 -287 -352 -585 -418 -791
2572 -791 -668 -704 -321 -882 -900 -1067 -867 -857 -1016 -750 -858 -944 -901 -1198 -1164 -906 -1347 -1130 -1166 -954 -1107 -1239
2594 -1239 -1226 -1114 -776 -1213 -1176 -1124 -1060 -937 -1060 -967 -918 -739 -652 -949 -567 -514 -478 -621 -528 -631 -822 -485 -477 -310
2618 -310 -266 -139 -200 -177 -215 -224 -264 -38 228 214 54 161 247 505 279 711 500 668 641 541 367 676 863
2641 863 765 792 594 1089 936 1263 924 1278 1100 1054 957 1015 1010 1178 1096 861 1184 1202 1209 931 1066 1180 645 1067
2665 1067 746 718 696 803 509 737 945 763 758 874 606 552 682 503 599 299 372 301 -91 347 373 275 -79
2688 -79 -159 -56 -335 92 -201 -444 -206 -200 -539 -505 -607 -681 -413 -994 -511 -565 -684 -745 -733 -697 -817 -817 -807 -1006
2712 -1006 -943 -1005 -744 -905 -758 -994 -1046 -997 -664 -1145 -879 -1016 -1252 -1252 -969 -1089 -941 -797 -590 -968 -778 -890
2734 -890 -643 -580 -685 -550 -509 -571 -479 -477 -486 -261 -250 -494 -326 -75 71 -82 -40 -90 -132 79 7 185 64 160 136
2759 136 341 258 50 442 353 285 644 791 946 686 661 819 758 799 933 1164 812 803 715 846 757 845 1042 1072
2783 1072 1163 990 939 809 1176 890 1026 746 1128 840 816 878 852 945 664 880 585 861 623 866 432 451
2805 451 696 398 580 382 119 389 405 394 167 93 -94 -126 9 -143 -214 213 -213 -195 -157 -530 -190 -351
2827 -351 -361 -307 -562 -649 -560 -597 -663 -577 -949 -861 -825 -1206 -688 -705 -1035 -647 -561 -1002 -1113 -817 -698 -727 -727 -569 -749
2852 -749 -835 -918 -922 -949 -705 -1061 -1113 -450 -958 -958 -622 -410 -649 -440 -472 -581 -424 -741 -677 -350 -153 -257 -295 -390
2876 -390 10 -79 -149 -108 44 122 -88 102 271 236 -52 219 265 418 272 647 425 170 518 724 722 486 718
2899 718 653 603 712 595 779 864 644 878 1003 706 698 921 1220 1204 810 884 920 1004 822 947 992 773 713 595
2923 595 676 754 754 638 735 1075 791 534 753 756 602 565 555 242 264 389 250 -35 -12 564 -186 239 -82 -109
2947 -109 292 -177 70 -126 -208 -3 -154 -431 -239 -509 -628 -589 -379 -435 -330 -753 -892 -340 -787 -577 -504
2968 -504 -701 -640 -825 -816 -848 -1081 -893 -789 -913 -801 -1024 -711 -903 -943 -1054 -787 -829 -816 -561 -621 -650 -799 -654
2991 -654 -671 -352 -634 -832 -493 -435 -653 -532 -90 -344 55 -320 -247 -111 -149 -127 7 -158 141 -99 73 435
3013 435 55 60 252 282 107 -70 182 50 502 212 474 618 358 531 536 678 734 510 624 783 810 571
3035 571 657 1060 783 956 999 934 705 766 1116 933 676 742 885 907 773 610 808 481 809 583 583 393 601
3058 601 341 793 667 277 373 467 339 369 117 420 106 211 153 -174 42 49 -277 41 -65 -180 -117 -146 -125
3081 -125 -247 -437 -118 -498 -489 -507 -285 -466 -245 -379 -489 -579 -600 -690 -500 -695 -572 -693 -722 -889 -679 -661 -718
3104 -718 -406 -807 -814 -816 -706 -957 -687 -844 -728 -697 -859 -751 -801 -693 -726 -531 -788 -779 -672 -959 -354 -191 -718
3127 -718 -710 -110 -287 -321 -172 -285 -277 -475 -173 -87 217 -57 -59 241 307 0 -52 176 69 262 142 164 144 279
3151 279 618 314 365 531 406 601 627 639 610 688 441 528 686 601 838 1101 877 679 974 694 907 769
3173 769 539 639 825 716 911 813 637 674 678 690 657 525 663 680 420 278 329 557 655 469 323 381 344 227
3197 227 293 170 421 269 83 -24 239 -162 -277 66 -85 -171 -217 50 -423 -194 -318 -498 -401 -827 -507
3218 -507 -395 -327 -412 -420 -730 -713 -516 -936 -665 -450 -652 -681 -761 -358 -572 -859 -912 -665 -767 -888 -686 -866 -757
3241 -757 -868 -646 -761 -799 -649 -425 -615 -417 -902 -664 -855 -575 -329 -553 -383 -432 -479 -454 -298 -416 -379 -115
3263 -115 -206 -325 168 137 -185 -73 -150 60 295 47 126 154 199 489 506 168 321 574 542 701 314 498 443
3286 443 657 720 218 672 332 396 343 495 607 713 585 769 984 404 590 655 675 967 453 686 402 635
3308 635 748 749 531 666 440 508 254 674 436 599 390 302 383 321 293 390 247 181 374 251 164 -236 -289 -189
3332 -189 -125 -224 -154 -77 -31 -26 -12 -294 -294 -134 -227 -470 -461 -463 -375 -464 -394 -343 -400 -611 -580 -675 -862 -515 -1058 -869 -479
3359 -479 -643 -844 -747 -751 -849 -742 -816 -1033 -493 -450 -603 -752 -981 -613 -730 -736 -674 -500 -464 -632 -460 -440 -646 -684
3383 -684 -435 -63 -350 -152 -65 -434 46 -342 -261 -284 -117 279 217 -26 69 183 3 364 90 31 -2 117
3405 117 269 423 418 451 363 274 532 451 370 373 359 533 375 496 704 587 690 510 315 494 684 522 576 723
3429 723 578 733 486 582 586 884 570 819 570 509 665 271 411 242 470 266 537 478 522 235 287 534
3451 534 213 74 122 142 -156 197 279 67 259 -19 -24 166 -168 30 -384 -147 -260 -273 -102 -225 -341 -448
3473 -448 -80 -426 -469 -534 -319 -655 -682 -395 -518 -421 -840 -612 -872 -430 -747 -914 -630 -558 -687 -701 -806 -492
3495 -492 -605 -829 -731 -573 -511 -662 -718 -652 -518 -510 -535 -602 -559 -336 -544 -276 -416 -520 -405 -518 -550 -48 -533
3518 -533 -224 -255 -383 -82 -172 64 -301 59 77 231 -233 220 163 -23 97 -22 97 457 495 161 417 439
3540 439 62 516 615 336 407 359 634 590 519 534 623 753 590 552 638 437 351 329 810 763 487 599 521 561 668
3565 668 736 730 677 569 325 495 518 288 441 576 291 129 434 197 479 133 403 -6 49 40 306 -20 56
3588 56 200 -287 38 -214 167 -29 -242 -102 -156 -10 -160 -255 -698 -605 -44 -118 -455 -369 -653 -214 -358 -531
3610 -531 -590 -416 -654 -539 -620 -387 -683 -442 -683 -830 -439 -663 -874 -534 -735 -942 -637 -814 -650 -595 -359
3631 -359 -675 -605 -420 -839 -777 -440 -490 -454 -529 -260 -498 -284 -211 -229 -239 -226 -127 -48 -107 -222 -159 120 -161 -140 -179
3656 -179 154 323 35 221 244 115 -35 127 286 423 357 474 24 430 634 348 340 483 471 777 809 619
3678 619 465 898 635 831 482 700 488 805 652 783 560 252 667 651 481 663 662 555 545 835 626
3699 626 371 348 180 241 449 671 371 351 322 98 272 390 76 165 224 107 29 -21 -40 121 -266 -207 -22
3722 -22 -112 -201 -201 -378 -440 0 -106 22 -402 -217 -157 -538 -603 60 -418 -146 -169 -550 -571 -539 -587 -411 -394 -645
3746 -645 -711 -730 -375 -615 -620 -307 -738 -689 -549 -801 -415 -387 -435 -521 -341 -615 -560 -781 -322 -126 -540 -351 -435
3769 -435 -409 -233 -398 -348 -147 -276 -277 -409 -76 -412 -191 -181 -143 90 -148 105 200 -7 154 89 16 -141 75
3792 75 109 521 332 336 303 136 187 365 494 202 297 486 452 390 301 348 374 515 361 644 311 431 310 447
3816 447 614 467 669 553 447 307 634 606 723 455 477 513 752 445 678 340 75 514 463 126 249
3837 249 339 144 485 178 221 200 58 397 -20 -22 -35 -139 -50 -224 -47 -147 -295 -511 -28 -288 -333 -289 -291 -175
3861 -175 -276 -228 -45 -366 -412 -288 -277 -140 -549 -539 -634 -451 -466 -524 -210 -395 -543 -560 -599 -520 -481 -546 -333 -628
3885 -628 -398 -440 -473 -568 -335 -533 -595 -169 -550 -497 -189 -401 -391 -170 -543 -503 -186 95 -308 -195 67 -278
3907 -278 19 59 57 -31 37 13 -8 -11 -83 354 104 -157 100 221 418 297 305 332 252 590 284 257 588 482 282
3932 282 316 415 467 462 516 395 604 543 461 120 639 333 238 373 366 639 622 438 338 457 626 508 518 484 479
3957 479 336 287 316 474 481 239 -74 211 647 362 85 295 198 275 267 279 398 -28 237 -31 -335 -221 -266
3980 -266 50 -232 -71 -239 -150 -147 -4 77 84 -354 -217 6 -608 -590 -272 -400 -516 -544 -466 -448 -448 -400 -661 -476
4004 -476 -534 -254 -621 -445 -411 -467 -659 -638 -597 -204 -658 -470 -232 -471 -718 -495 -265 -590 -201 -387 -515 -803
4026 -803 -202 -383 -427 -38 -274 -324 -170 -324 -277 -205 -50 -146 -221 -351 31 115 134 -207 74 446 -37 12 81
4049 81 203 174 254 214 209 344 400 526 250 92 493 342 128 430 106 361 614 162 582 613 609 255 592
4072 592 520 567 678 736 538 94 433 323 464 504 451 355 335 385 237 225 234 484 243 517 -5 396 -121 315
4096 315 355 128 -61 110 12 103 240 -25 -73 -165 -120 -118 -374 -194 20 -382 -227 -384 -300 -287 -151 -185 -274 -425
4120 -425 -60 -220 -341 -435 -345 -307 -4 -514 -354 -469 -698 -609 -357 -624 -565 -689 -234 -535 -482 -563 -382 -321 -467
4143 -467 -386 -413 -399 -508 -324 -383 -363 -500 -330 -572 -189 -288 -181 107 -127 -284 -404 -248 -142 106 -12 -196
4165 -196 -157 -208 123 -123 78 219 -69 73 123 160 259 182 185 460 -195 178 174 228 91 100 259 83 417 95
4189 95 302 148 5 665 84 457 538 596 499 366 367 565 301 819 342 36 386 470 328 340 292 624 501
4212 501 514 200 356 504 -28 56 98 476 459 -71 304 328 210 107 162 1 287 -52 34 -103 86 -82
4234 -82 56 358 -209 -202 -136 -137 -92 -336 -241 -245 -122 -125 -535 -352 -63 -418 -354 -277 -296 -304 -684 -446 -107 -260 -584 -439
4260 -439 -348 -544 -330 -218 -549 -556 -495 -513 -546 -368 -369 -243 -268 -482 -395 -482 -219 -674 -68 -242 -248 -284 -511 -294 -384
4285 -384 -203 -313 -69 107 -148 -119 -134 -106 -365 -3 76 286 140 215 425 293 190 -110 184 272 82 19
4307 19 387 329 439 152 443 166 312 52 398 192 369 436 417 526 258 509 808 597 551 531 521 533 473
4330 473 457 714 182 578 519 379 329 216 234 400 845 341 376 387 403 321 245 142 333 345 336 330 146 -16 -73
4355 -73 -211 49 87 133 -46 -147 17 -126 104 -55 -164 61 -238 -329 -294 -211 -134 -258 1 -346 -211 -306 -286
4378 -286 -218 -346 -592 -369 -644 -305 -381 -578 -545 -429 -481 -310 -136 -452 -595 -481 -217 -321 -304 -352 -335 -632
4400 -632 -259 -486 -279 -362 -263 -563 -224 -449 139 -147 -433 -526 -61 -178 -70 -144 -223 -25 -247 -24 50 96
4422 96 -73 -164 -45 -221 -93 97 53 -78 56 350 520 390 117 152 360 290 491 219 6 151 252 412
4444 412 399 324 69 657 180 313 261 372 601 291 311 715 674 269 375 420 563 473 346 355 364 414 484 364
4468 364 221 303 256 87 299 247 187 284 320 491 140 152 138 246 54 -245 338 318 216 61 -2 -426 181
4491 181 -120 140 156 77 -52 -144 -46 -13 -48 -181 -223 -138 -238 -485 -413 -352 -396 -462 -463 -75 -519 -478 -487 -267 -159 -323
4517 -323 -212 -368 -336 -476 -221 -282 -271 -447 -167 -400 -397 -340 -439 95 -316 -397 -94 -218 -129 -409 -240 72 -30
4540 -30 -247 -292 -109 -367 -74 -88 -67 150 -118 -355 -51 -257 41 -13 -62 322 168 87 145 235 12 98 311
4563 311 76 -6 265 448 373 296 179 282 105 244 308 391 211 91 323 318 510 230 466 482 11 695 348
4586 348 491 436 328 547 323 453 469 711 291 415 61 187 321 455 482 296 181 221 329 303 216 142
4608 142 346 321 223 275 -58 -35 266 343 102 0 94 102 -52 -284 -52 -197 87 -72 -310 -261 -99 -247 -222
4631 -222 -20 -226 -250 -409 -139 279 -189 -50 -63 -305 -52 -372 -232 -614 -355 -208 -385 -106 -199 -467 -474 -496
4653 -496 -530 -112 -230 -348 -127 -318 -411 -470 -540 -361 -301 -130 -249 -67 -328 -395 -69 -129 -23 -440 -244 106
4675 106 -147 -83 -77 262 -174 -348 -160 -340 -27 80 -104 80 -70 231 133 365 -97 242 283 130 191 247
4697 247 138 133 257 283 402 260 320 80 266 285 258 171 278 255 311 414 492 262 270 401 297 652 304 494
4721 494 392 702 289 336 321 384 207 141 349 365 112 444 225 256 313 274 177 192 424 85 83 53 25 141 49
4746 49 20 342 224 136 -80 136 -99 -288 -94 -102 -162 -61 11 -235 -236 -117 -81 -368 -288 -159 -303 -242 -208 -146 -262
4771 -262 -308 -266 -310 -351 -249 -574 -529 -426 -528 -385 -259 -512 -168 -28 -25 -242 -638 -326 -333 -234 -422 -407 -394 -341
4795 -341 -307 -263 35 -196 -135 -100 131 -409 -312 -351 -164 -62 -61 -1 -36 267 -77 -39 -112 -64 342 86 -124 278
4819 278 136 48 387 255 288 202 -135 61 279 134 193 544 -142 76 384 388 140 610 273 353 190 611
4841 611 455 334 -65 622 139 180 307 359 608 212 207 36 124 -92 104 118 171 368 -77 348 466 454 144
4864 144 260 116 -123 173 150 -65 254 401 148 54 -98 -207 -256 -33 -230 55 -550 100 104 -154 -96 -105 -96
4887 -96 -295 -164 -160 -333 -453 -272 -253 -267 -190 -303 -220 -174 -257 -263 -298 -445 -261 -273 -251 -320 -452 -191 -123 -525 -611 -330
4913 -330 -247 -550 -249 -14 -129 -267 -264 -33 -133 -191 29 -454 -435 -166 -338 -72 -34 20 -100 -7 -93 -173 -97 30
4937 30 89 -149 -230 -55 306 -104 47 106 216 69 264 -45 86 78 -13 316 33 465 240 189 215 193 218 188
4961 188 569 150 362 376 367 252 415 516 517 649 424 278 315 241 240 174 444 422 398 389 338 122 259 201 -158
4986 -158 265 437 -6 249 350 86 177 138 90 192 367 194 158 87 171 -39 158 149 8 209 -383 -77 -31
5009 -31 -107 -100 -112 -113 -49 13 -362 -328 -142 -145 -24 -397 -196 -156 -134 -591 -315 -134 -376 -118 -387 -222 -323 -234 -452
5034 -452 -185 -228 -316 -212 -266 -384 -357 -292 -231 -415 -361 -231 -333 -181 -236 -163 45 -200 -222 -552 -205 -142 -439 299
5058 299 -146 -363 -25 -127 53 -204 -175 -219 45 -79 -25 -58 -192 94 -25 -116 -109 291 131 450 137 262
5080 262 416 386 175 213 71 230 332 194 273 479 207 36 367 165 556 426 449 328 103 343 419 280
5102 280 176 400 472 193 521 333 200 321 131 287 275 79 94 315 50 407 -37 279 303 -20 300
5123 300 140 96 -129 111 176 363 73 172 63 -67 81 -274 -25 25 -301 -265 -75 -108 90 -146 -272 -241
5145 -241 -253 -310 9 -174 -364 -218 -403 -96 -45 -301 -386 -189 -231 -302 -125 -93 -285 -326 -300 -272 -182 -542 -224 -90
5169 -90 -440 -280 -138 -117 -463 -177 -186 -168 -247 -124 -301 -172 -10 -549 -248 -182 -331 32 330 -23 -100 -136 -334
5192 -334 -139 130 -320 -10 143 -41 33 -104 -28 3 -142 12 -27 210 51 36 -138 52 162 -76 -31 105
5214 105 -143 63 206 103 217 431 171 361 384 209 345 260 469 263 597 290 435 -19 10 426 143
5235 143 41 63 158 86 275 365 298 359 245 190 -136 178 287 88 -125 569 90 170 141 93 126 -169 -68 40
5259 40 -27 -283 -181 247 -103 -93 82 49 -240 -47 -177 -237 -338 3 -318 -196 -126 -357 -375 -297 -180 -254 -288
5282 -288 -410 -236 -367 -290 -124 -228 -188 -172 -101 -336 -547 -215 -216 -221 -355 -330 -254 -265 -279 -104 -348 -88 -182 -170 -396
5307 -396 -183 -114 -249 -183 -211 -159 4 -60 -173 50 82 -48 13 -82 26 44 -100 -68 -126 -24 40 62 -130 188
5331 188 -55 207 137 300 141 38 242 159 115 30 95 145 151 236 329 0 125 70 -46 391 51 364 237 287
5355 287 453 177 562 317 209 131 84 31 420 89 437 273 41 482 301 158 281 282 306 151 32 338
5377 338 396 67 187 65 -16 -106 57 145 140 -39 115 73 -275 128 75 109 -197 -371 -269 213 -168 97 -10
5400 -10 -269 -71 -223 -137 -176 -324 -250 -169 -160 -52 -136 -498 -306 -214 -41 -403 -333 -496 -505 -195 -158 -213 -357 -606 -149
5425 -149 -279 -242 -37 -432 -226 -35 -199 -208 -56 -469 -161 -9 -21 -258 136 -395 -231 -144 -216 -347 -118 41
5447 41 -193 24 -255 181 -254 -29 59 267 48 69 18 207 315 230 123 384 176 38 195 405 159 197
5469 197 436 22 123 201 16 28 204 114 348 377 103 236 361 190 264 186 149 112 275 377 279 429 160
5492 160 158 469 159 182 210 221 532 44 0 299 240 230 134 378 36 139 342 -152 2 432 416 378 94 -56
5516 -56 -63 -8 -273 20 110 13 63 112 -97 58 -438 40 -108 16 146 -317 63 68 -343 -80 -6 -381 -127 -287
5540 -287 -79 -88 -206 -373 -200 -79 -103 -451 14 -194 -251 -93 -219 -287 -271 -41 -181 8 -198 -399 -256 -306
5562 -306 -337 -151 -107 -181 30 -246 -215 -66 -22 -226 -539 -306 -254 -40 -38 -387 10 -64 135 300 -164 -59 237
5585 237 -42 19 181 263 -72 29 -5 356 11 38 217 148 201 256 230 216 218 186 325 271 176 109 277 641 150
5610 150 -92 448 158 306 132 238 296 44 400 620 282 328 45 265 414 91 30 269 367 309 318 348 200
5633 200 -66 183 288 -152 -114 197 256 317 162 -33 -82 23 152 132 -22 -158 3 -143 102 -236 -93 -115
5655 -115 -48 6 -149 -76 -262 -68 -149 -146 -245 -380 -195 -216 -102 -127 -86 -264 -313 40 -111 -217 -275 -142 -306 -115
5679 -115 -28 -466 -104 -153 -164 -381 -319 -81 -160 -212 -170 -471 7 60 -277 -140 -543 -8 -674 176 -98 -348 137
5702 137 -22 -45 -83 18 -17 -156 202 45 -164 66 241 66 84 163 -14 -108 245 132 126 256 110 2 -20
5725 -20 277 378 314 -71 140 352 362 79 101 136 236 163 -23 341 106 241 278 206 172 249 170 327 242 20
5749 20 47 309 257 33 -22 324 175 58 9 244 180 340 265 219 14 43 8 6 -14 -53 78 -108 56 -80 120
5774 120 -14 -192 -51 60 -169 -149 -80 -176 -316 -114 38 -31 279 -356 -25 -37 -425 -478 108 -107 -299 -36
5796 -36 7 -409 -252 -134 -299 -130 -403 -160 -197 -492 -220 -389 -361 -247 -542 -152 -85 -124 -104 -245 -278 0 -152
5819 -152 -267 -210 -84 47 -306 -296 -257 -173 -302 -205 -35 -43 -87 -198 215 -270 65 -4 137 7 66 -111 -92 69
5843 69 19 182 26 51 479 144 183 324 -72 126 510 181 37 54 249 51 198 -66 62 30 -57 253
5865 253 -120 192 92 190 81 61 80 235 390 209 -268 325 97 -34 296 -52 291 269 106 69 141 -10
5887 -10 -165 81 142 238 199 159 226 84 180 -8 66 120 -44 22 -87 56 211 -145 -199 -179 75 290 80 115
5911 115 13 -235 36 110 -17 -174 -185 -28 -118 -374 -159 -466 -48 82 -32 -112 -196 -279 -181 -239 -108 -303 -403
5934 -403 98 -122 -168 -240 -30 143 -133 -122 -213 -352 -515 29 -230 143 -113 -197 -264 -102 -106 -212 -222 -170 -45
5957 -45 -483 35 -101 -171 -147 299 11 20 138 22 -215 106 25 153 -173 135 351 -112 150 104 96 -123 291
5980 291 -35 211 71 393 289 244 136 212 237 150 174 180 91 193 258 204 227 130 232 292 278 226 317 295 248 -19
6006 -19 247 171 455 71 100 179 232 -14 307 253 225 287 -186 231 88 74 62 214 -278 -131 189 129 89 117
6030 117 -104 284 4 84 -6 152 -90 -188 36 -243 53 209 -116 -70 -319 -272 -413 -75 -117 -229 -247 -229 -331
6053 -331 -353 -123 -108 -437 -156 98 -294 56 -400 -157 -87 26 -183 -484 -85 2 -154 -22 -70 -451 -138 57
6075 57 -123 -175 96 -249 -140 -119 53 -212 -171 -231 -98 -206 -3 -66 32 -121 -143 58 -71 184 -287 41 299
6098 299 -57 -176 32 -14 -7 171 -89 179 134 -44 223 21 216 150 93 34 481 70 -10 207 142 117 104 109
6122 109 -53 249 335 142 410 197 202 23 65 183 123 404 208 197 60 294 292 56 56 73 -20 482 106 245
6146 245 62 -73 42 61 9 -153 153 133 142 55 79 372 190 -92 -22 202 -295 -159 -16 -12 -150 -146 -78 -84 -6
6171 -6 -116 -274 -272 -129 -18 -192 -183 60 -473 -369 -170 -294 3 -392 102 -223 26 -87 -68 -301 -234 -85 -121
6194 -121 -240 -63 -202 41 -72 -586 -50 -381 -271 -13 -116 -197 -202 -412 -233 -187 -276 -424 -34 7 -102 -17
6216 -17 -232 -33 -168 169 -362 -183 -38 -153 493 -13 189 -240 262 -51 81 121 56 163 22 79 -10 427
6238 427 173 69 -17 248 -26 -9 256 -42 8 193 312 273 -28 118 88 94 246 189 43 177 239 139 152
6261 152 138 173 126 142 39 168 89 350 304 109 355 89 251 39 -17 271 318 211 4 74 130 321 -9
6284 -9 313 -57 -14 20 71 -6 -60 -95 112 101 -25 -317 -181 10 -152 -173 -3 105 -125 -95 -97 -33 -11 -57 -113 22
6310 22 -314 -277 -300 -193 -129 -277 -218 -151 -89 37 -199 -331 -259 -501 -128 -301 -343 -139 -66 -41 -270 -222 -175 120
6334 120 -169 -5 -234 -115 -396 -161 -139 -5 -179 -324 108 -58 26 -186 -102 -408 -39 5 344 -127 -3
6355 -3 94 -143 71 3 219 308 9 71 -35 163 133 45 113 162 77 99 53 273 74 422 60 397 -2 208
6379 208 112 271 44 183 358 -28 114 200 168 -103 192 163 33 145 13 306 182 244 -74 119 -55 159
6401 159 64 324 101 134 -55 -96 -41 51 -62 54 197 -6 157 -84 -222 214 -153 37 -29 250 38 -272
6423 -272 -75 -44 133 -137 -1 -67 120 97 -230 123 -190 -300 -232 42 -332 -196 -30 -264 -23 -163 -265
6444 -265 -234 -138 -321 49 -129 -236 -324 -154 -279 -488 -247 -417 -371 -66 -332 -52 270 -229 -172 57 -103 -85
6466 -85 -346 -63 -307 -40 -82 9 -123 -81 -71 60 107 -365 33 60 -165 -31 -55 -226 -82 25 102 -211 99
6489 99 70 119 161 40 151 -153 192 -118 330 159 -105 7 122 69 406 103 202 182 206 36 283 103 -133
6512 -133 47 214 -124 25 179 -257 53 37 139 476 308 462 296 130 261 360 461 297 272 -44 91
6533 91 96 157 61 341 -174 242 -26 24 -19 -84 41 -27 -78 204 71 -108 4 10 -96 -120 -131 171 -59 84 -223
6558 -223 -71 -150 -134 -3 -62 -74 -266 -455 -205 -176 -32 -307 -482 -273 -48 -83 -51 -89 -26 -383 208 39 -179
6581 -179 -232 -260 -311 -3 -330 -90 -15 -308 -103 -269 -362 -15 -231 46 -205 -286 114 196 -53 232 -164 4
6603 4 -213 -456 51 243 167 -30 -53 9 115 139 240 -231 0 306 130 70 104 -122 100 -253 159 172 317
6626 317 198 -123 318 231 36 21 14 9 -366 335 425 267 55 196 396 229 -78 203 199 379 216 215 155 -183
6650 -183 322 -47 -10 -69 283 438 181 377 57 72 -48 113 -38 -7 -120 -7 87 -182 216 -52 68 34
6672 34 161 65 145 -16 97 -76 -84 29 144 -90 -152 -109 -160 88 25 -82 -110 63 -157 -119 63 -66 -158 58
6696 58 -52 17 -21 -307 -20 -200 -51 -136 102 -225 -15 -265 -508 -127 -24 -281 -255 -106 102 -358 -142 -302
6718 -302 -25 -306 26 -190 293 21 -161 -245 -299 285 129 44 110 -4 87 -51 91 -101 177 37 -15 -12 -46
6741 -46 -90 51 161 -131 -291 70 67 -72 258 85 261 111 189 247 31 100 30 477 -2 76 -50 -148 371
6764 371 -3 -23 134 320 143 104 36 -10 305 98 462 329 1 366 354 144 -215 33 184 46 315 318
6786 318 -47 87 77 180 -119 114 329 -27 206 -38 -17 -43 50 195 -131 -111 156 -96 -255 -97 26 1
6808 1 -230 -116 -386 -17 168 -341 281 167 -294 16 -198 -7 -238 -195 -68 -33 126 101 -254 -34 -385 -181
6830 -181 55 -76 308 -86 -102 -67 -284 -35 -259 -226 -202 -207 -319 115 -35 -61 76 -217 178 -121 58 -42
6852 -42 -38 -151 13 -122 -272 -93 169 -145 9 86 43 -114 54 250 -21 -133 -94 40 -221 -22 -23 -16 -72 -187
6876 -187 30 -198 10 -29 50 73 316 -34 351 -5 225 307 355 215 82 384 54 131 449 192 203 131 -23
6899 -23 -42 78 104 67 -224 208 340 225 -19 -78 -81 203 195 215 -5 -38 402 425 201 261 175 -319 38 44 -51 -303
6925 -303 38 32 48 71 251 21 -387 -35 81 235 -415 67 -290 113 -185 -356 84 45 -2 -132 75 88
6947 88 -103 4 126 129 -18 -379 60 -77 -75 68 -211 -28 -369 -167 -203 61 -222 -532 -107 -125 85 -125
6969 -125 -230 -251 -109 92 -163 -64 -131 -211 -111 -36 114 -148 118 -39 2 -43 141 159 -68 -272 51 -269 -4
6992 -4 -33 54 -3 20 126 66 -135 -51 206 269 187 -139 -71 42 83 -98 312 -25 93 -91 103 275 -221 -218 183
7017 183 226 -15 165 213 100 161 264 -86 107 -81 217 -23 193 24 118 -95 -75 99 242 419 -60 321
7039 321 -40 6 -52 75 83 42 381 162 29 419 -23 -65 -296 137 362 17 -183 129 -239 -120 -50 257
7061 257 42 -141 160 34 -150 -265 5 -142 -145 -13 88 -186 -114 -220 -266 130 -277 115 -169 -19 -207
7082 -207 -75 -364 37 -252 -292 -134 73 -105 -93 -87 19 -158 -390 -69 -234 -3 -272 -127 42 -209 -198 -265
7104 -265 -11 -53 -131 -331 -115 -7 -279 -210 -214 72 -154 94 -74 71 -121 -206 70 -189 -230 43 26 38 194
7127 194 -193 59 -201 -136 228 -241 34 270 162 21 160 -16 -15 57 356 192 -77 47 -22 95 336 101
7149 101 325 408 19 178 -113 162 -8 54 -132 65 -51 62 212 0 39 -54 -173 245 -71 23 123 184
7171 184 110 228 141 189 -80 259 64 212 -185 -33 89 -335 364 -96 229 47 -36 33 -100 -226 370 44
7193 44 -24 105 -225 34 19 -51 -66 10 -79 -103 -80 24 -30 -67 -283 -205 -37 41 -165 -88 -283 -228 15 -202 -27
7218 -27 -138 -192 111 -168 24 -400 136 -212 -259 -47 -177 -18 -277 -99 -86 -15 -224 -128 -86 -100 -165 -127 -112 162
7242 162 -288 265 530 179 -316 -98 46 57 177 185 7 -1 -193 -94 -67 84 325 130 -18 44 160 61 -62
7265 -62 29 -69 222 388 364 344 -232 211 240 108 -77 81 191 -103 -66 53 -100 279 234 114 149 142 231 88
7289 88 -55 -260 139 53 431 123 104 264 92 -61 49 131 100 -333 427 -4 378 59 161 60 219 -71
7311 -71 86 -136 -43 420 -48 71 29 159 -111 107 59 116 38 -107 -112 27 57 88 133 134 -128 -265 -96 -276
7335 -276 -451 51 -112 -171 -86 129 -346 -158 -154 -228 -538 -144 -225 -390 -247 -77 44 -228 -47 -173 131 -227
7357 -227 -107 -4 -113 -139 -92 149 -104 -39 340 -480 185 239 120 127 52 -46 219 282 -198 236 33 102 64 -76
7381 -76 50 105 -20 14 -90 52 287 34 60 121 132 51 136 365 15 54 -161 -54 186 74 -51 173 76
7404 76 169 -47 85 -29 94 -126 155 -71 109 82 38 144 212 -3 -47 -143 -196 163 14 180 69 -204 145
7427 145 -144 178 175 243 235 13 54 -68 30 55 -235 -180 303 369 -56 82 77 -16 110 -37 -44 -116 152 -27 -65 -174
7453 -174 38 -75 88 -254 -293 -209 -145 4 -172 -227 155 121 -91 14 -283 -207 257 87 3 -7 -63 -337 -54
7476 -54 -360 -64 11 -356 109 72 -99 -151 -146 -216 -7 -196 198 -90 161 -65 -51 92 -268 -142 -49 -54 21 -83
7500 -83 -144 -180 16 -152 -178 -20 130 -25 129 -18 -280 41 94 421 -57 199 361 -21 157 135 0 192
7522 192 -7 169 43 -102 253 179 151 -263 -8 409 143 14 362 131 111 3 281 -158 132 -174 148
7543 148 -23 -29 -139 85 124 172 111 55 -421 74 150 11 157 -4 76 -298 266 179 49 27 189 85 234
7566 234 -35 -103 257 -125 261 -191 106 -211 155 98 -31 7 209 -192 23 -153 140 325 88 -114 -184
7587 -184 -59 296 -206 -44 41 66 -29 -497 -159 -335 -92 -98 54 -237 -256 60 -252 72 -285 -182 -284 -66
7609 -66 -86 -235 -93 15 36 64 80 -220 115 -159 -108 99 25 75 161 -105 -168 -96 -23 0 -402 -357 -21 -143 133
7634 133 -174 198 -282 192 75 86 251 119 -74 171 -7 35 263 33 134 -14 -69 179 -76 71 103
7655 103 186 305 82 164 147 -18 -5 154 290 406 112 -125 279 -65 190 290 -68 276 254 109 20 -112
7677 -112 -57 -146 -183 -29 17 26 115 356 108 146 -122 65 162 86 180 -149 162 6 178 96 -188 -58 158 261
7701 261 -45 89 -63 -326 81 184 166 -193 -238 -27 -2 126 111 -51 -124 -78 -21 -147 -65 -277 -13 -94 -152
7724 -152 -164 -132 178 -153 -81 390 87 -179 -135 -142 -203 204 -22 -199 -181 62 -141 -117 -57 -1 -17 -39 -442 -177
7748 -177 169 -179 -240 -120 -179 226 101 243 -41 83 54 -111 -91 -19 59 187 -183 297 281 46 30 -96 190
7771 190 -134 -121 -115 -386 15 -75 -69 67 219 36 268 40 247 162 -89 106 190 249 -61 16 -19 122 71 -54
7795 -54 -468 67 20 294 -32 203 122 27 -108 -11 226 -11 416 11 251 74 -76 -149 -169 292 301 224 -12
7818 -12 -198 -29 -26 126 -26 -33 109 115 -73 -155 34 123 -213 -90 15 -273 -288 112 -5 -52 261 -193 -25 -100
7842 -100 -23 -80 -60 -252 -188 -58 -6 -32 -67 -39 20 -138 76 -240 -59 91 -252 97 -229 -514 53 -144 -392
7865 -392 -88 -293 -65 26 72 -51 -100 -151 129 3 -36 -251 -99 -356 -324 -94 -45 -21 -116 -242 -40 -265 -409
7888 -409 48 -1 -42 -151 -142 78 119 63 -104 29 110 6 -20 -21 195 293 27 -201 49 95 17 178 -68 -329
7912 -329 89 49 287 165 115 31 519 -39 149 280 96 409 151 141 -80 112 -98 42 62 -74 153 269
7934 269 -14 102 -102 -332 164 45 17 -284 -34 268 -341 -47 136 63 -286 -52 34 68 192 216 -121 54
7956 54 -158 -171 -151 -239 372 -195 207 -346 -184 -73 92 53 45 -36 38 78 -17 -116 -161 29 -65 -303 -179 -122 115
7981 115 -148 199 -152 27 -177 -121 -10 -29 -206 -346 -489 -181 63 -302 90 178 203 -99 -117 -150 122 -69
8003 -69 -112 -348 -26 -162 151 -149 196 -6 -33 -155 359 297 -332 -112 -92 0 -44 -107 -98 -85 109 -22 -124 -138
8027 -138 28 -111 138 145 34 -60 -112 41 -46 334 228 196 132 -208 362 -61 -372 27 86 333 -175 241 154
8050 154 61 340 140 -71 -94 52 269 -48 21 -33 351 86 -99 -18 15 -69 19 -40 -83 -39 -11 -22 119 48 -27
8075 -27 -122 -427 85 -125 337 -47 33 164 -141 111 -169 -347 -76 29 -18 76 -204 1 119 -78 -241 75
8097 75 -11 314 82 -39 -1 -31 266 60 -110 0 100 -170 -178 -102 36 -195 -4 110 50 -161 -56 -49 -335
8120 -335 -56 -56 -133 -226 -40 100 -135 -103 -300 -421 -8 129 143 -114 -124 -152 -129 159 -40 129 29 -60 -38 -49
8144 -49 14 -379 -137 37 -68 -150 -260 126 -73 -203 -239 -204 148 138 -26 -56 66 -154 104 -61 23 -30 -78
8167 -78 -211 13 -322 169 62 -89 88 -265 -380 -257 118 305 102 139 116 180 -46 -290 -102 76 475
8188 475 132 172 -81
8191h1
##END NTUPLES=NMR FID
##END=
