##TITLE=1H_LR-698-CM-Et20
 CDCl3, 8 sc, 
 11.11.2019
##JCAMPDX= 6.0         $$ Bruker NMR JCAMP-DX V2.0
##DATA TYPE= NMR FID
##DATA CLASS= NTUPLES
##ORIGIN= UXNMR, Bruker Analytische Messtechnik GmbH
##OWNER= root
$$ XWIN-NMR		Version 3.5
$$ Mon Nov 11 16:19:48 2019 Russian Standard Time (UT+4h)  she@DPX200
##.OBSERVE FREQUENCY= 200.1315
##.OBSERVE NUCLEUS= ^1H
##.DELAY= (6, 6)
##.ACQUISITION MODE= SIMULTANEOUS
##.ACQUISITION SCHEME= undefined
##.AVERAGES= 8
##.DIGITISER RES= 18
##SPECTROMETER/DATA SYSTEM= spect
##.PULSE SEQUENCE= zg30
##.SOLVENT NAME= CDCl3
##.SHIFT REFERENCE= (INTERNAL, CDCl3, 0, 15.7039)
##AUDIT TRAIL= $$ (NUMBER, WHEN, WHO, WHERE, WHAT)
$$ ##TITLE= Audit trail, XWIN-NMR		Version 3.5
$$ ##JCAMPDX= 5.01
$$ ##ORIGIN= Bruker BioSpin GmbH
$$ ##OWNER= she
$$ F:/spectra/data/she/nmr/H-F/1/audita.txt
$$ ##AUDIT TRAIL=  $$ (NUMBER, WHEN, WHO, WHERE, WHAT)
(   1,<2019-11-11 16:18:51.96 +0400>,<she>,<DPX200>,
      <created by zg, POWCHK disabled, PULCHK disabled
       configuration hash MD5:
       00 E9 B6 7A A2 85 ED C7 34 08 36 98 17 FE 4E 26
       data hash MD5: 16K
       2E 02 48 30 AA 4D 2D A2 80 5D BB 53 0B A8 F6 10>)
$$ ##END=
$$ 
$$ hash MD5
$$ E1 B5 EE C1 9C 36 2B 11 3B C7 16 3E 0D 23 5F 80
##$RELAX= 
##$RELAX= 
##$RELAX= 
##$RELAX= 
##$RELAX= 
##$RELAX= 
$$ Bruker specific parameters
$$ --------------------------
##$DU= <F:/spectra>
##$EXPNO= 1
##$NAME= <H-F>
##$PROCNO= 1
##$TYPE= <nmr>
##$USER= <she>
##$AMP= (0..31)
100 100 100 100 100 100 100 100 100 100 100 100 100 100 100 100 100 100 
100 100 100 100 100 100 100 100 100 100 100 100 100 100 
##$AQSEQ= 0
##$AQ_mod= 1
##$AUNM= <au_zg>
##$AUTOPOS= <>
##$BF1= 200.13
##$BF2= 200.13
##$BF3= 200.13
##$BF4= 200.13
##$BF5= 200.13
##$BF6= 200.13
##$BF7= 200.13
##$BF8= 200.13
##$BYTORDA= 1
##$CFDGTYP= 0
##$CFRGTYP= 5
##$CHEMSTR= <none>
##$CNST= (0..31)
1 1 145 1 1 1 1 1 1 1 1 1 1 1 1 1 1 1 1 1 1 1 1 1 1 1 1 1 1 1 1 1 
##$CPDPRG= <>
##$CPDPRG1= <>
##$CPDPRG2= <>
##$CPDPRG3= <>
##$CPDPRG4= <mlev>
##$CPDPRG5= <mlev>
##$CPDPRG6= <mlev>
##$CPDPRG7= <mlev>
##$CPDPRG8= <mlev>
##$CPDPRGB= <>
##$CPDPRGT= <>
##$D= (0..31)
0 1.2 0 0 0 0 0 0 0 0.06 0 0.03 0 0 0 0 0.0002 0 0 0 0 0 0 0 0 0 0 0 0 
0 0 0 
##$DATE= 1573474731
##$DBL= (0..7)
120 120 120 120 120 120 120 120 
##$DBP= (0..7)
150 150 150 150 150 150 150 150 
##$DBP07= 0
##$DBPNAM0= <>
##$DBPNAM1= <>
##$DBPNAM2= <>
##$DBPNAM3= <>
##$DBPNAM4= <>
##$DBPNAM5= <>
##$DBPNAM6= <>
##$DBPNAM7= <>
##$DBPOAL= (0..7)
0.5 0.5 0.5 0.5 0.5 0.5 0.5 0.5 
##$DBPOFFS= (0..7)
0 0 0 0 0 0 0 0 
##$DE= 6
##$DECBNUC= <off>
##$DECIM= 24
##$DECNUC= <off>
##$DECSTAT= 4
##$DIGMOD= 1
##$DIGTYP= 9
##$DL= (0..7)
0 120 120 120 120 120 120 120 
##$DP= (0..7)
150 150 150 150 150 150 150 150 
##$DP07= 0
##$DPNAME0= <>
##$DPNAME1= <>
##$DPNAME2= <>
##$DPNAME3= <>
##$DPNAME4= <>
##$DPNAME5= <>
##$DPNAME6= <>
##$DPNAME7= <>
##$DPOAL= (0..7)
0.5 0.5 0.5 0.5 0.5 0.5 0.5 0.5 
##$DPOFFS= (0..7)
0 0 0 0 0 0 0 0 
##$DQDMODE= 0
##$DR= 18
##$DS= 0
##$DSLIST= <SSSSSSSSSSSSSSS>
$$ [...]
##$SUBNAM2= <"">
##$SUBNAM3= <"">
##$SUBNAM4= <"">
##$SUBNAM5= <"">
##$SUBNAM6= <"">
##$SUBNAM7= <"">
##$SUBNAM8= <"">
##$SUBNAM9= <"">
##$SW= 24.0689530833862
##$SWIBOX= (0..15)
0 0 2 0 0 0 0 0 0 0 0 0 0 0 0 0 
##$SW_h= 4816.95568400771
##$TD= 16384
##$TD0= 1
##$TE= 0
##$TE2= 300
##$TE3= 300
##$TEG= 300
##$TL= (0..7)
0 120 120 120 120 120 120 120 
##$TP= (0..7)
150 150 150 150 150 150 150 150 
##$TP07= 0
##$TPNAME0= <>
##$TPNAME1= <>
##$TPNAME2= <>
##$TPNAME3= <>
##$TPNAME4= <>
##$TPNAME5= <>
##$TPNAME6= <>
##$TPNAME7= <>
##$TPOAL= (0..7)
0.5 0.5 0.5 0.5 0.5 0.5 0.5 0.5 
##$TPOFFS= (0..7)
0 0 0 0 0 0 0 0 
##$TUNHIN= 0
##$TUNHOUT= 0
##$TUNXOUT= 0
##$USERA1= <user>
##$USERA2= <user>
##$USERA3= <user>
##$USERA4= <user>
##$USERA5= <user>
##$V9= 5
##$VALIST= <valist>
##$VCLIST= <CCCCCCCCCCCCCCC>
##$VD= 0
##$VDLIST= <DDDDDDDDDDDDDDD>
##$VPLIST= <PPPPPPPPPPPPPPP>
##$VTLIST= <TTTTTTTTTTTTTTT>
##$WBST= 1024
##$WBSW= 4
##$XGAIN= (0..3)
0 0 0 0 
##$XL= 0
##$YL= 0
##$YMAX_a= 626878
##$YMIN_a= -382277
##$ZGOPTNS= <>
##$ZL1= 120
##$ZL2= 120
##$ZL3= 120
##$ZL4= 120
##$ABSF1= 10
##$ABSF2= 0
##$ABSG= 5
##$ABSL= 3
##$ALPHA= 0
##$AQORDER= 0
##$ASSFAC= 0
##$ASSFACI= 0
##$ASSFACX= 0
##$ASSWID= 0
##$AUNMP= <proc_1d>
##$AZFE= 0.1
##$AZFW= 0.1
##$BCFW= 1
##$BC_mod= 2
##$BYTORDP= 1
##$COROFFS= 0
##$CY= 11.3945322036743
##$DATMOD= 1
##$DC= 2
##$DFILT= <>
##$DTYPP= 0
##$F1P= 19.5091578491511
##$F2P= -0.509923556040331
##$FCOR= 0.5
##$FTSIZE= 0
##$FT_mod= 4
##$GAMMA= 1
##$GB= 0.15
##$INTBC= 1
##$INTSCL= 1
##$ISEN= 128
##$LB= 0.24
##$LEV0= 0
##$LPBIN= 0
##$MAXI= 10000
##$MC2= 0
##$MEAN= 0
##$ME_mod= 0
##$MI= 1.114404
##$NCOEF= 0
##$NC_proc= 0
##$NLEV= 6
##$NOISF1= 3.799351
##$NOISF2= 2.8
##$NSP= 1
##$NTH_PI= 0
##$NZP= 0
##$OFFSET= 15.70392
##$PC= 1
##$PHC0= -9453.026
##$PHC1= 13.40088
##$PH_mod= 1
##$PKNL= yes
##$PPARMOD= 0
##$PSCAL= 0
##$PSIGN= 0
##$REVERSE= no
##$SF= 200.130013532006
##$SI= 16384
##$SIGF1= 3
##$SIGF2= 2
##$SINO= 400
##$SIOLD= 16384
##$SREGLST= <1H.CDCl3>
##$SSB= 0
##$STSI= 0
##$STSR= 0
##$SW_p= 3612.71676300578
##$SYMM= 0
##$S_DEV= 0
##$TDeff= 0
##$TDoff= 0
##$TI= <>
##$TILT= no
##$TM1= 0
##$TM2= 0
##$TOPLEV= 0
##$USERP1= <user>
##$USERP2= <user>
##$USERP3= <user>
##$USERP4= <user>
##$USERP5= <user>
##$WDW= 1
##$XDIM= 8192
##$YMAX_p= 0
##$YMIN_p= 0
$$ End of Bruker specific parameters
$$ ---------------------------------
##NTUPLES= NMR FID
##VAR_NAME=  TIME,          FID/REAL,        FID/IMAG
##SYMBOL=    X,             R,               I
##VAR_TYPE=  INDEPENDENT,   DEPENDENT,       DEPENDENT
##VAR_FORM=  AFFN,          ASDF,            ASDF
##VAR_DIM=   8192,          8192,            8192
##UNITS=     SECONDS,       ARBITRARY UNITS, ARBITRARY UNITS
##FACTOR=    0.0002076,     1,               1
##FIRST=     0,             0,               0
##LAST=      1.7004516,     0,               0
##MIN=       0,             -382277,         0
##MAX=       1.7004516,     626878,          0
$$ Real data points
##PAGE= N=1
##DATA TABLE= (X++(R..R)), XYDATA
$$ [...]
2511e62k272k903o50J586K152J533r38k831k081J086K471K005n19j957k399L16
2527e963J628K842N90j939l047l52K204K067J132o28j941k566J174L297J726j026
2543h02j780j742j42K512K515Q46j827l133l33K159K678J96n49j410k075L74L420
2560I07K610k058j784r47K98Q97K795J045j890k744m69K507K467J81j298j203
2576A314j385j47L012K916j479l292r86J070J029J844J728j762l713p06K780K766
2592D989M21k171j726q09m53K710L076n25m174k012K426J407P81P76n71l897j762
2609a514L388L626l74k532j844p12M24J579L023m27m540k350K175L380R5n49o49
2626B199k752k146K880M378n29l914j783M97O15J574K293k62m071l209K368M386
$$ y = [-562, -2834, -5737, -6387, -4801, -2649, -1116, -2054, -4885, -6966, -5880, -3409, -1404, -1923, -3880, -6279, -5963, -4335, -1493, -903, -2842, -5889, -6241, -4037, -1970, -838, -1466, -3407, -5973, -4799, -1502, 224, -802, -2582, -4324, -4466, -1954, 561, 1407, -420, -3553, -3886, -1727, 951, 1147, 598, -812, -2887, -2513, 907, 3517, 1459, -325, -1272, -974, -77, 2718, 3763, 1873, -871, -1340, 1167, 3634, 3815, 2517, 1314, -71, -218, 2794, 5710, 4231, 939, -47, 1023, 2052, 3896, 5624, 3862, 149, -557, 2223, 4989, 5410, 3239, 1513, 704, 251, 2961, 6037, 5512, 1338, -674, 1752, 3159, 3940, 4716, 4145, 248, -1514, 1874, 5500, 5126, 2594, 750, 38, 462, 2041, 5064, 4637, 97, -2253, -78, 3302, 3397, 2848, 2199, -553, -2699, 181, 4559, 4030, 116, -1667, -1170, -555, 1019, 3312, 3050, -1021, -4230, -1862, 2524]
2642B524P5k309m44j667j903K643M410k38m661k747K104J891N40J060m82k898
2658b102k985K335M799K50l803j234K31k69N42L902M92m666k924K709L145l04
2674A18o99L9k003k095J544M342O07m352j929K257P08o55J642K022l449l853K714
2691c042L912l44k456M92o4j782P1L624J578l687k586K115J922j038m20K271p18
2708a52l743N77M105L94l360J50J899j417j433K442K378k079l345J529K608j186
2724f33j408K125R16l114j729L511K327k841j309K729n61k702R05M193m69l938
2740a998l69K465p5j486J603K424k858l724K378L989j251k355J494L19k883K97
2756b030M651J155m603k693L181J821j282P39J633k115l982J573N643O26m181
$$ y = [2524, 2599, 290, -154, -1821, -3724, -1081, 3329, 3091, -1570, -4317, -2213, -322, 218, 1278, 796, -2102, -5087, -2752, 2047, 2297, -1506, -2740, -2509, -2778, -2236, 1666, 2158, -2508, -5432, -2723, 422, 118, -581, -542, -2545, -4640, -3096, 1246, 1853, -2499, -4428, -2171, -1463, -2118, -476, 1546, -1903, -5756, -3042, 870, 526, -1930, -1438, -1502, -3284, -3213, 411, 1989, -1698, -4284, -2169, -247, -1285, -1705, 566, -152, -3895, -3318, 787, 1181, -2179, -2029, -130, -1547, -2980, -538, 1840, -239, -3584, -2055, 553, -633, -2041, 84, 1000, -2114, -3843, -332, 1995, -846, -2155, 574, 13, -2689, -1784, 2409, 1940, -1998, -2367, 98, 23, -1463, 140, 2564, -294, -4018, -1640, 2349, 1098, -1257, 237, 556, -2327, -2030, 2621, 3776, -827, -3520, -339, 1482, 200, 939, 2572, 457, -3525, -1952, 3691, 4317, 136]
2771A36j255J522j045n10M214K595n032m166K608M190J09j664N32j093l540J133
2787a266N652K210m964l665K281J760n17J920K259m326m733K626N919N81l568
2802B169j079K52j592N51M831K185n303m969K674M488n25m78R15k470m056J871
2818e36O518J005n462k240J326O97N87K337J492l997n272K281N771P06l481r00
2834H32J04k274N9N521J801n373m332K924L011q10J08J052k659l820J540N070
2850B754O74m094k032J347r5m32K492K076m012m256K276M123n97k332M06k79k528
2867d509J7M216J254l610k586J557J877j508K38K228j432l997J097L767k3k454
2883c868l20J933j457j782K402K324k385k408J588K163j318j197K295O44l495
$$ y = [136, -1119, 403, -642, -1152, 3062, 5657, 625, -3541, -933, 3257, 3366, 1702, 2234, 1141, -2399, -1266, 4386, 6596, 1632, -2033, 248, 2008, 1491, 3411, 5670, 1344, -3389, -763, 5156, 5737, 2169, 1090, 1342, -250, 301, 5132, 7317, 2014, -2955, -281, 4207, 3682, 3204, 4119, 1649, -2407, -536, 5982, 6987, 1525, -715, 611, 1308, 1895, 4232, 5724, 1727, -3545, -1264, 4507, 5213, 1732, 832, 936, -1338, -1279, 4242, 6043, 670, -3662, -738, 2273, 1463, 1571, 2623, -36, -3856, -2316, 2754, 3428, -666, -2698, -1351, -1446, -1878, 614, 2690, -1322, -5578, -3302, 821, 224, -2108, -1702, -1981, -4509, -4492, -276, 978, -2632, -5218, -3661, -1784, -3292, -3054, -826, -2258, -6255, -5158, -1391, -1414, -3868, -4188, -2255, -3712, -5494, -3092, -768, -3153, -5561, -3973, -1810, -3128, -4325, -2030, -1386, -4881]
2898d881l55L244R59k504n43K362l11k078R59K867n65k294j49K146j21j439J617
2915a086K002j915k799K117L461j593j612J576P31k684M99L144J141k542j630
2930a190J516J336r35R36J677r86l228Q65L883L92k309j34R34j498L0L360J144
2947E793l053k022J060K049K29j8J97r58k290M90L359J412k532k126J117J14j12
2964B709J522J808k316l439P40K886J010j376j49j074j172O1K783J327k021l237
2980F2L15J822J38L77J063j910l199N29L150J059j921j360l38l79R1J850J069
2997B418j802k797k48K123R63l67n07p37j971l02K499K268k131k071j97L30M08
3014b121R86P47j229k361k12J684J863n80p26r48l75o38J714J923j475k068o8
$$ y = [-4881, -5236, -1992, -1033, -3537, -4080, -1718, -2029, -4107, -3148, -281, -846, -3140, -3289, -1143, -1264, -2703, -1086, 916, -999, -3798, -1681, 1780, 187, -1425, 151, 882, -1802, -1303, 1841, 2982, 440, -1190, 326, 1662, 727, 1663, 3340, 2354, -874, -9, 3874, 4266, 1957, 1823, 2757, 1259, 1289, 4649, 5793, 2740, 718, 1778, 3827, 4056, 4038, 4235, 3277, 987, 1477, 4836, 6248, 3716, 1590, 2707, 2821, 2709, 4231, 6039, 3723, 284, 1024, 3910, 4920, 3544, 3395, 2321, 1149, 1210, 3993, 5320, 3299, 62, 377, 2199, 2337, 2714, 3777, 1867, -1332, -803, 2347, 3406, 1485, 125, -213, -592, -501, 1349, 2418, 616, -2181, -2429, -306, 657, 290, -217, -954, -2925, -3227, -728, 1540, -591, -2662, -2859, -2529, -2121, -1135, -388, -1617, -3978, -4190, -2506, -643, -1223, -1949, -2897, -3272, -3910, -2196, -273, -1748, -3816, -3884]
3031c884Q95N07R75O39j225j405m62J377J702j54j344k23j50k71J189J805o71
3048g00k058k22R04O49Q57M81j187j343M9J103J804m6q65q14l32O20Q69Q89K71
3067I29j766j225J156J439J59Q6k60j144n63J265J352L52p82q92m90R85Q21J85
3085A607k1j182q70L19J875M37n79o36o54m38J069J164L15j233r87l79Q90J166
3103A863L70n21j109o30J18J185J129o13j110m04k27P70J082K20j153j497J0Q08
3121B91J127P13j073r94p28M60J106R43l65j169o13j84P81J109M45j286j169j62
3139g68R77P16P19q45j202l60L66J290Q28n65j248n56K21J060P42J17j137j078
3157g23j96J051J038M02r05j140L5L42O52Q52k51j260p37Q27O40P84N7j056r53
$$ y = [-3884, -2989, -2482, -1507, -868, -2093, -3498, -3960, -2583, -881, -1035, -2379, -2602, -2752, -3023, -1834, -29, -700, -2758, -2980, -2076, -1427, -570, -89, -1276, -2619, -2570, -1467, 337, 291, -574, -1388, -1720, -1100, -231, 658, 929, -837, -2062, -906, 533, 692, 778, 518, -626, -1189, 76, 1428, 1780, 998, 106, -384, 601, 1422, 1607, 1586, 404, -466, -147, 1728, 2165, 1586, 950, 296, -142, 927, 2091, 2406, 1173, 186, -193, 697, 1863, 2233, 1712, 603, -27, 91, 1276, 2405, 1792, 682, 278, 51, 821, 1903, 2123, 970, -527, -517, 291, 1418, 2131, 1058, 64, -664, -204, 902, 1845, 1480, 311, -302, -486, 295, 1404, 1849, 563, -606, -768, 209, 925, 1644, 799, -403, -763, -397, 893, 1721, 1156, -92, -648, -427, 633, 1375, 1492, 355, -723, -919, 132, 1170, 1572, 667, -473, -438, -96, 556, 1408, 1157, -103, -840, -13, 627, 1411, 1468, 412, -541]
3176e41k74J068J085j77o78o84n84N07R63N35n76p73j124O91J040N96n07l11j006
3195g50l61R01R64J1p27o86k66M70M40Q44o81j243m57M75J186M21m87q05m13p52
3215a916J025J397k98j179l71l47O58N31O26m07j593l55M49J316M05n88o46m28
3233a721n74Q45J143O02j395j078L61Q8R61L92j2j345q99Q62J335M35j022o87
3251a709l21K18M38J520M38j188j642N60J199M95q9k12j057n90K95J699R21j296
3269c21p87J03P7P29J082O75j560j639R59J561N53n62j87o24o41N2K158Q60j584
3288I04j480M34R46P67M2O21r21j774K23K019J385j389q13Q7k91r4J698J020j385
3307A999k062N85J232P08n76L08l69r35n98J808J302j496j322N29L91q54J069
$$ y = [-541, -815, 253, 1338, 1161, 483, -201, -785, -278, 685, 1220, 644, -129, -1253, -562, 478, 1074, 567, 256, -750, -1111, -210, 754, 765, 38, -648, -914, -444, -4, 840, 159, -1084, -1541, -1066, 120, 541, 54, -751, -1164, -1916, -891, 506, 208, -971, -1342, -1689, -1031, -500, 126, -281, -1874, -2229, -1780, -464, -59, -647, -1293, -1721, -2295, -1450, -307, 295, -1100, -2178, -1817, -1729, -768, -376, -388, -1733, -2632, -1770, -435, 0, -1022, -1709, -2030, -1812, -1374, 146, 584, -604, -2246, -1686, -487, 8, -81, -293, -1350, -1940, -1645, 54, 975, -321, -1108, -1005, -928, -199, 883, 1558, -2, -1641, -682, 879, 1432, 870, 683, 59, -582, -530, 1628, 2488, 904, -576, -142, 804, 1571, 1613, 2234, 1313, -461, -238, 1781, 3166, 1777, 964, 1051, 760, 666, 2364, 3384, 1999, -63, 522, 1754, 2462, 1886, 2194, 1825, 890, 292, 2100, 3402, 1906, 584, 1113, 1504, 650, 1719]
3324A719J152j156k190M60K120l43o40Pr2q37l18J073J068q90j952N87J205l68
3342F05j019J189M17k119o81K379N33k049l98J129l65r98N01J403q12j417K45
3359a457J121n78j452J190J189j258j706J389J189j145j058J739Qj891q1J669
3375a132P61j700n20P96M10j251L87J844n16k460M54K018P8j685O85J254k102
3392b679o90K100J724j381k122J099Q85p67K40J867l96k615n08L220J067j623
3408e79q13J172o21j668K378K749j844k952M78K393K66p98P43Lj928j098L041
3425I22K345j840k299J159R42j232J074J989o36l366j05L222J194j438j012P87
3441A706q13j319K637K427j846l220M43K698j60q18J449l2l220p63L739K083k493
$$ y = [1719, 2871, 1715, -475, -15, 2105, 1762, 1122, 1129, 1037, 200, -118, 955, 2023, 1133, -819, -232, 973, 605, -414, 775, 1192, -927, -1608, 771, 1304, -745, -1143, -14, -379, -1377, -876, 527, -285, -1702, -1457, -336, -914, -2366, -1176, 13, -1245, -2951, -1562, -373, -1518, -2576, -837, -829, -2720, -2801, -1132, -371, -2071, -2591, -1795, -1385, -2636, -2249, -405, -921, -3381, -2927, -909, -831, -2516, -1831, -577, -2679, -3369, -1269, 455, -926, -3048, -1949, -1064, -1831, -1591, 276, -120, -2735, -3243, -23, 1044, -579, -1392, -220, -841, -2509, -131, 2618, 774, -2178, -1700, 693, 959, 161, 904, 907, -1021, -2119, 922, 3267, 1427, -872, 287, 1229, -3, 1071, 3060, 2424, -942, -1047, 2175, 3369, 1931, 919, 1706, 893, -426, 2211, 4638, 2792, -428, 15, 2713, 2553, 1735, 3184, 3152, -68, -831, 2908, 4991, 2498]
3458B498k008O19M42p02R34K109p53l544m34L454J203j997q63R40j397j336K858
3475B023K212k380l276J420J482r1o54J409o15l176l59L420J372k527j518J009
3491b49L28j170J072K225j417l811Q44L068K21k006L5Q35j475j431K908J613k469
3508h79k192J467J681j465n91J770j13k423k41K688Q01k680n73J629K66j617P84
3525a688K150j161k553R85K380q20k160J017J775j514r07J796J285k260r30J935
3541f70R58j983m22J762M44j754Q0J875k64k109P60K315n05k098N98J706o55j804
3559a766K017J348j831j545J459J947j241r91J040L47j234n1J688Q96k320r34
3575a171K276O51j319Q3J174j274j648J632K399r24k208J30J119q5m29J344P03
$$ y = [2498, 490, 1109, 1551, 849, 1783, 3892, 3139, -405, -839, 2615, 3818, 1821, 958, 1898, 501, -835, 2023, 4235, 1855, -1421, -1, 1481, 1390, 736, 2145, 1530, -1646, -2005, 1415, 2787, 260, -1258, -249, 79, -1091, -19, 2206, 789, -3022, -2178, 890, 1111, -895, -860, -25, -1500, -2931, -23, 1590, -879, -3071, -1604, 77, -1388, -1979, -209, -322, -2745, -2986, -298, 503, -2177, -2750, -1121, -855, -2472, -1688, 462, -699, -3252, -2267, 113, -707, -2867, -1850, -75, -1589, -2496, -700, 585, -1675, -2605, -670, 288, -1695, -2117, -355, 89, -1665, -1585, 290, 26, -2083, -1323, 992, 487, -1611, -1013, 693, 38, -1766, 251, 1599, -232, -1777, -318, 1629, 388, -603, 437, 784, -450, -501, 1187, 2083, -237, -1171, 1105, 1756, 437, 520, 1694, 420, -1228, 404, 2803, 1879, -329, -199, 920, 835, 406, 1750, 2453]
3592B453k240j563J996K127j470j423Q32K48j823J364J897l03k752n32J759R63
3608A533q53j88Q30j243j051J139K009r04j962J65J049m0p28J502K05k519q00
3625a856J899J250m83j137K99n46p29R47J865o04k205l92J606M89o65J92P56j535
3643h49j356J718J630p82j246l76N53l0L37J094m8j587n71J201J114o45p86O37
3661Hm22r04M89J980m86j629j01N56K65j52P20K21j037j049J045J617n56j149
3679e84K10M49q45K44J431n1j402l61Q09J88j44P9N95p82n70K90O34N75o11o71
3699e17M68J61k78P00O21j146n84N03P14n55k5N19n55n76K37O16J64j61o82j39
3719e15L46k14L79N19k44q90j31O72J1m9K56k03r94M69Q43j26k60l82j81n3K44
$$ y = [2453, 213, -1350, 646, 2773, 1303, -120, 712, 960, -863, 501, 2398, 2095, -657, -1189, 570, 1533, 680, 492, 1322, 79, -972, 167, 2176, 1272, -690, -525, 524, 484, -244, 1258, 1463, -1056, -1856, 43, 1293, 810, -327, -28, -574, -1303, -356, 1509, 905, -1300, -1692, -86, 403, -262, -70, 686, -849, -2205, -487, 1143, 361, -885, -1261, -708, -738, -401, 693, 645, -942, -1513, -312, 802, 157, -629, 8, -414, -1318, -829, 1151, 665, -964, -1065, -509, -244, -396, 324, 545, -492, -1541, -496, 1121, 565, -584, -374, 75, -770, -526, 905, 854, -548, -909, -100, 88, -56, 23, 618, -164, -734, -444, 190, 765, 154, -517, -49, 112, -166, 534, 1155, 9, -575, -72, 642, 87, 62, 581, 26, -550, -313, 303, 467, 306, -376, -515, -169, -383, -4, 515, 271, -619, -750, -78, -67, -116, 140, -63, -1057, -588, 255, 129, -131, -513, -694, -747, -503]
3740e03K92L78l43n73m76R26M21n97Q2Q2p12R6Q42J29q3n67m02L61M47M1L01l18
3762a76n95k63J112K07j11m75k36R5L2M91O31l74l98l68l7M89J39K30j8n58OM31
3784B54N69L72r69l40J70J98K13O97k38r37K49q9R61n1J71k03l56k48K44N69L83
3805A619o97p67O99J19k6L26K26l55o94M61M41q6M0m20k10k35P11jJ10l37n50
3826C74M9O17L61m11k55k67n22K21O28Q6l85j82k87k03L33M04j02l94n87j07O91
3847F2Q8j7jm87m78JO06K20n01l26k42K51K56N3j84j14m62L1J5L95L07k89o20
3870a436j52L80J43M55k53l82m56M01K7N98L9q12q7k2K15L47L09n20P9o11L90
3891a348N31K61l96o09K10L53K84n8K64p1m94O7N69J44L12n98k44L63K26K34L3
$$ y = [-503, -211, 167, -176, -749, -1225, -299, 122, -475, -393, -311, -1023, -927, -85, 44, -39, -606, -1008, -647, -200, -159, 142, -176, -771, -1034, 78, 285, 174, -301, -537, -442, -410, 81, 712, 338, -60, -428, -465, 24, 163, 393, 375, -183, -177, 254, 823, 1195, 226, -114, 56, 254, 467, 1164, 926, -11, 238, 149, 1110, 1059, 1230, 1027, 671, 423, 667, 1236, 1619, 922, 155, 854, 973, 947, 1273, 1499, 1144, 450, 911, 1352, 1266, 1306, 886, 676, 441, 1152, 1151, 1261, 924, 374, 423, 1040, 1401, 990, 735, 468, -54, 167, 795, 881, 496, 314, 27, -176, 157, 561, 459, 65, -522, -629, 62, 150, 133, 132, -355, -833, -832, -226, -6, -507, -833, -1075, -824, -568, -515, -699, -813, -1275, -1244, -1229, -834, -527, -816, -1436, -1588, -1208, -1065, -610, -863, -1245, -1701, -1300, -1273, -675, -636, -1448, -1535, -1557, -1342, -995, -686, -1206, -1127, -1738, -1348, -817, -556, -952, -1561, -1351, -998, -714, -772, -508, -579, -1073, -1006, -437, -293, 19, -579, -823, -460, -234, 0, 33]
3912C3j45l70j53P73K34j15K88m20m60J75M35N89j01n50j90K41L73L13M10k29
3932A131p78o4M40O60r2o1k47j04k58N40N58j53o43j66M96j3n0O1L48m47q06O83
3954A035O75j97o00j97O84o83K02Q04o7j045n15P57M24o85M09J4l66o50K66J165
3974A430l63r16J14J48j89m76O25K66o16n12M53L97m31m28L91L07p37j13O74j44
3994a20n19m58Q81l43o33J60Q74m19j027J53J205m19m44J34M34m17q25R80M88
4013c15k53q70M44K98p10k57J332J34j303j02R51k90k01K38O74p41q51P48J002
4032g2k29j110L36Q29o50k24J035O96j156j090J185J041p06p11R01l24r36N34
4050f51J594k3j480k16J090M93p53J32J077q05j445J065J343o01r44L54M62r29
$$ y = [33, -112, -482, -635, 138, 372, 257, 545, 125, -335, -160, 275, 864, 763, 213, 23, 264, 637, 950, 1360, 1131, 353, 289, 729, 1389, 1297, 1236, 989, 885, 627, 1167, 1725, 1572, 929, 763, 1259, 1246, 1196, 1257, 1605, 1158, 352, 1035, 1710, 1513, 913, 716, 1400, 717, 919, 1723, 1656, 611, 96, 853, 1277, 592, 1001, 1015, 649, -1, 265, 1430, 1067, 151, 265, 413, 224, -252, 373, 639, 23, -489, -36, 361, -70, -498, -107, 200, -537, -650, 24, -120, -639, -1097, -216, -559, -1192, -1032, -158, -577, -1604, -1451, -246, -665, -1109, -975, -541, -958, -1783, -803, -315, -568, -1438, -994, -696, -1406, -1663, -331, -197, -1500, -1602, -651, -941, -1142, -904, -230, -971, -1822, -1074, -72, -301, -1411, -1075, -246, -896, -1120, -85, 611, -545, -1635, -450, 591, -115, -826, 75, -249, -1185, -651, 943, 920, -560, -776, 314, 807, 54, 186, 1263, 458, -987, 78, 1421, 820, -124, 230, 692, -237]
4068b37L8J808L45k151n72J003J320o72m26L59j05j364Q78J577o9j864l27J415
4086I56M8p53Q70P13k018r71J762J347q10j218K50M38o41j4J653l3k107p25J784
4105E31R29p46o35P62o35j377J241J811r07k082L60R90J15p15Q60M89j518r59
4123a486J198J833j212j355O19P96j279K76J537j77k179R2J762O18j413m14R31
4140A47n63r32J056J724j468j525O82J477m54j090P12Q11j639n17J521J289j572
4157c41q64R26O54p07l73J544l16j988R5K266J29k091K51J087m37m83N95Q54r30
4176a29j362J333J191p53j148Q94O55q94n26J602N13j925m56J154O65j404J50
4193d40J092k53j693R31J644o76j734M51J494l57q91N25P86j383p51J509J340
$$ y = [-237, -199, 1609, 1954, -197, -769, 234, 1554, 882, 456, 815, 710, -654, 224, 1801, 1732, -132, -459, 956, 1004, 251, 1121, 1834, -184, -1155, 607, 1954, 1144, -74, 176, 614, -27, -41, 1612, 1579, -528, -1253, 531, 1460, 714, 79, 841, 206, -1171, 70, 1881, 974, -1108, -748, 242, 357, -358, 502, 991, -527, -1486, -288, 1545, 333, -1022, -403, 393, -886, -610, 927, 750, -1429, -1337, 425, 1043, -370, -784, 147, -416, -1348, -292, 1432, -36, -1561, -879, 598, 144, -946, -234, 577, -1062, -1579, -58, 1231, -341, -1205, -279, 375, -332, -705, 839, 523, -1465, -1370, 896, 1025, -1066, -815, 272, -165, -648, -53, 801, -129, -1491, -158, 1033, 280, -868, 26, 681, -213, -739, 863, 1376, -549, -1005, 149, 814, -590, -440, 652, 399, -1294, -363, 1281, 605, -1129, -678, 816, 459, -432, 93, 879, -504, -1255, 254, 1594]
4210A594j434j353Q94P90j062M01P81K97k232j72K328M40j848PL90j53m38P83
4228A3J066q86j720M56J916n00j306R34M24j596j77J730R69j810r18P69P37o13
4246e12Q5J042p70j396L90J933J87j689k55P91k16n45R96J012j144j668J257J274
4264G72m38n14J09J29j019J78J546J97j103q90P70P07m28J69P84p54j058O83J029
4283H69J44j192j24O67k3m96O54P51q63j164J185R52m47p91N06J09j182N38J294
4302A387L27j578o45J064N35p02j32R06m88q92N53J140o19j018M53P85p60m02
4320h6O65N51j050l18P03L34m52k75O83Mr44J45M32L0o31k50R87j91p64M02O76
4341F51n12r44P87N30l58p58N23M34o61j76M48K80o70j47K22j01m51n3Q75m10
$$ y = [1594, 160, -1193, -299, 491, -571, -170, 611, 908, -1324, -1496, 832, 1272, -576, -569, -179, -332, -770, 13, 1079, 193, -1527, -1071, 845, 345, -961, -27, 397, -1199, -1376, 354, 1323, -487, -1405, -636, 101, -512, -427, 615, -155, -1551, -1161, 772, 959, -730, -985, -194, -410, -955, 41, 1053, -91, -1759, -502, 772, 334, -180, -71, 58, -961, -783, 763, 960, -143, -1033, -263, 444, 16, 185, 969, 215, -843, -160, 869, 1013, -179, -303, 364, 341, -155, 499, 1250, 387, -777, 408, 1360, 913, 122, 628, 737, -445, 93, 1387, 1714, 136, -509, 555, 1090, 388, 256, 1162, 674, -218, 335, 1475, 856, -162, 291, 1076, 316, -86, 579, 1130, 80, -238, 465, 799, 347, 72, 755, 759, -185, -40, 392, 422, -209, -459, 528, 337, -427, -25, 651, 139, -805, -18, 512, 154, -604, -81, 353, -308, -484, -36, 244, -426, -573, -351, -452, -903, -956, -81, -491]
4361d91o84L62N60k49l38L10K22m08l10R3Q53l39m61P3M69l29l93K09P09q67q3
4382a092N58k06R4j24O04m77m23K16M76L85n29l34M49J2l60L19L65jn89J17P23
4403A83l73l00M82k36P0k69P56J18m31P9l07K24K49j9K95q2l94k86R06J73o3o48
4425A27M43n11M4M80O87q70K3J54j97L95q4N6r7k09k57N76L32j08n14N6J79l5
4447F70K8N74m32o52J4L98M29J9m59N1k23P8J48J64j18n40NN03k10j67K43J52
4469F75o51j16J08L57km57J63n4L73n46j02M23n38l88L95K40J69j87j12j98l04
4490g52L15j0K11m71J05r3J4J69J55l43j2k06J97L36k72J14k32K3k90L89K80J2
4512c61n55M66j29J4K0J21j75J4l76M63k42N52n5m18K46m8j44K19Q5j52O2r3K64
$$ y = [-491, -1175, -813, -253, -502, -840, -530, -308, -716, -1026, -933, -80, -419, -880, -807, -338, -667, -1060, -851, -142, -1009, -1092, -534, -740, -646, -770, -166, -643, -1066, -850, -374, 11, -518, -852, -403, -391, -751, -432, -67, -68, -657, -540, 183, -190, -490, -8, -244, -174, -443, 313, 431, 0, 79, -228, -4, 245, 226, 521, 439, 45, -241, 665, 838, 775, 127, 570, 59, 103, 583, 1270, 400, 423, 577, 380, 775, 691, 747, 650, 441, 184, 760, 1092, 984, 470, 526, 705, 670, 698, 1272, 840, 188, 202, 600, 1029, 1048, 589, 640, 417, 495, 643, 807, 689, 149, 154, 657, 447, 280, 523, 675, 24, -92, 16, 373, 371, -86, 77, 23, 396, -150, -252, 171, -367, -755, -360, -120, 49, -138, -250, -448, -752, -437, -447, -236, -707, -602, -695, -681, -512, -357, -700, -712, -918, -721, -385, -657, -543, -775, -752, -1042, -653, -373, -361, -916, -450, -579, -565, -545, -424, -599, -585, -961, -498, -740, -188, -243, -661, -415, -463, -607, -388, -303, -455, -393, -486, -222]
4535b22j56M02q1k19K96m56K25L43l5k69K5j69L37L0J58L32o53L48j79L18l33
4556D2J87J89k18j03L43j77J03p7j06M86l02K63R2m40j53M61j61J47k06L05J79
4577H54p11K03M24k00n8q7J19k63L46k3Oj00j75k02L57R2l33j11K42m46R6L21
4599C51k2p0l22L39J59k27J39l32J08k25n4M81k10k67J49L9K73q46K81L13r6k96
4621c35j57N36j91l28M55K14m42k76O42k79j39j67J13L78l59L1K97K03o65R8L12
4642e9J42l88Q9M02k32m34J33N37j62l70J7L32j05n16N58O92p80j73J72J63m1
4663b3Q0R0r1m90K59M55K99m90k40O16p1l88K10M97k90r21P07M16m19k8J03L43
4685F24p74K04J33N28k34n37L71J77l50N2N92m50q85N43Q54lq90j32M11j85n18
$$ y = [-222, -378, 24, -57, -276, 20, -436, -211, 132, 97, -172, -147, -316, 21, 51, 209, 541, -112, 236, 57, 375, 42, 229, 418, 200, 97, 440, 263, 366, 289, 183, 669, 367, 630, 722, 282, 129, 590, 429, 576, 370, 675, 854, 143, 346, 770, 570, 512, 425, 544, 281, 627, 604, 610, 510, 335, 133, 490, 582, 249, 138, 380, -66, 30, 351, 329, 259, -63, 276, 435, 208, 347, 15, 123, -102, -156, 325, 115, -152, -3, 36, 309, -537, -256, 57, -39, -335, -492, 44, -147, -475, -20, 194, -248, -524, 118, -161, -300, -467, -354, 24, -335, -304, -7, 196, -469, -371, -59, 83, -305, -216, 186, -46, -480, -347, 190, 28, -342, -325, 7, -98, -614, -56, 636, -144, -317, -145, 18, -23, 57, 147, 56, -434, -175, 280, 579, 89, -151, 465, 394, 6, 216, 713, 423, -498, 209, 625, 206, 178, 281, 624, -150, 54, 187, 715, 481, -56, 315, 492, 142, 194, 786, 336, -549, -6, 848, 845, -45, -177, 234, 49, -469]
4706d69J088l2n19n13J73M82k3r2O1k3r47L67O52K42q97n37Q74o2m14J16P41n21
4728b53p99M64R87n10l21k71K65j45l05P17M83q40q93O04O62l11p0L30k84r48
4748a438N69J298l29r14k34R71m4p79L80O74l21j033N61R30n93o15M32M39p31
4767g77J29P14K13j299k2Q05Q57q45j30L47K51p17m81J739j03j570M80Q15j18
4786B88n88L71P32o20r75J141N09n64o99N54N78m45k81Q91J31j198k41J219O07
4805A410j154o32J178j07p14M59J048o78j185O50J084o45n09J06O89o58n03J041
4823H80O86r85j149J492K61q79l87J171k58p35L4R98k45j322M52K77L11p71L67
4842A98P18n00j131P25J403p10j225M82M51o71l9Q83M52j624n78J385N31p73n39
$$ y = [-469, 619, 587, 68, -445, -272, 210, 187, 95, 156, 133, -814, -447, 205, 447, -450, -987, -113, -175, -589, -473, 268, -253, -1052, -588, 399, -111, -432, -703, -438, -583, -888, -171, 312, -528, -1421, -817, -155, -466, -536, -206, -490, -1438, -869, 429, 100, -814, -1048, -77, -121, -900, -520, 154, -167, -1200, -639, 291, -302, -917, -485, -46, -777, -648, 66, 279, -1020, -1042, -237, 620, -225, -355, -8, 243, -474, -955, 784, 681, -889, -409, 406, 288, -300, 71, 803, 183, -792, 349, 858, 294, -405, 149, 727, 282, 1, 892, 1023, -175, -416, 803, 1410, 256, -376, 802, 695, -19, 440, 1488, 810, -375, 275, 1359, 714, 205, 311, 1000, 342, -161, 880, 1566, 581, -568, 924, 1185, 306, -81, 1090, 832, 97, 131, 1129, 884, -438, 14, 291, 602, -169, 198, 916, 416, -715, 10, 1413, 703, -522, -40, 411, -260, -299, 584, 1036, -588, -1166, 219, 750, -23, -562]
4861e62M35p3o08K25R98k79j247pJ081K19q19L10L52r42l92Q13R34p46q31N79
4881e60J25k09k12J029N5j301l81J304N56q85o5M53k69r75P22J227k74j509L77
4900g92R10K7o66M44L26r21m98J077Q72p32q63L38L75j07j24J070m65j110j13
4919i52J292N41j030j48N16j95n26O08R48p01r81K29J167n0r29O89Po53k81Q26
4939C77O68q90n57P49J88l97J45N31j29q84K61Q69k68p82lN67j91o10Q02L10n11
4960B45o70M86O56m88n03N29J2n62K4P39J98p97m59Q61M24o46n05Q27l11o08L30
4981b18Q96l41j069L13P50o5q13M1P06m07l79K33P38m18o13N32K68o20J3M65j30
5002a18l42p4P81l28m01K93J43n5k49J47P04m96m03J48O74l88l52J40M61l53k77
$$ y = [-562, -127, -200, -808, -583, 415, 136, -1111, -1118, -37, 182, -637, -327, 25, -917, -1309, -496, 438, -308, -1139, -560, -435, -644, -856, 173, 228, -1073, -1454, -150, 406, -479, -544, -91, -360, -1335, -613, 614, 340, -1169, -792, 118, 145, -521, -77, 249, -672, -1170, -93, 779, 47, -816, -478, -103, -210, -334, 736, 271, -839, -952, 340, 881, -149, -297, 219, 24, -502, 106, 1054, 353, -628, -399, 768, 718, -211, 478, 485, -168, -449, 377, 1045, 155, -402, 347, 535, 138, 283, 814, 685, -199, 62, 931, 663, -119, -122, 445, 254, -356, 446, 756, 245, -425, 61, 717, 229, -274, 255, 267, -295, -271, 468, 666, -131, -590, 271, 695, 49, -456, 371, 60, -548, -218, 678, 337, -732, -419, 331, 266, -547, -506, 200, -207, -586, -353, 385, -33, -646, -114, 154, -466, -453, 12, -118, -460, -534, 247, -81, -482, -189, -46, -101, -350, -203, 501, 5, -398, -250, 424, 36, -316, -176, 285, -68, -345]
5023c45N74M73p93l54P71j64k34K00L72k82k66k27N92j58p6J66J5j5j35P8K90
5044D82k88j86M92n0j57o7k34M77q9k70N78K39p93j07K33N28m65o4L8Jj50K72
5066D20J39%r30J70N46j26j99L40J4j47m19K37L56j89m32L90j52j22l77O31R4
5087B44p23K51L26k3j90j40lj53q6M96j33J0j91k35K47K36m43J30L28l80J14j98
5109e16M11j83m8J22k91J0J25k84K90k00j9J66j37O1L25P4k57k30Q9M71k36m04
5131f61J38K17m31L01M94n11M2j55J19J10k2O2KK13j94k33M32R3Q5k81R1r6O2
5154a23PJ93K4l34K12K5Q1r5L2K53k40n6M89o0j18k6N0J64P8k47RQ6q6k85K71
5179C04P2J51M2k54L0J1K21K1k31pN3L00k03K23j19q7M8k20K52q8m5k62jK66l00
$$ y = [-345, 229, 702, -91, -445, 326, 162, -72, 128, 500, 218, -48, -275, 317, 159, 83, 249, 264, 249, 114, 192, 482, 194, 8, 500, 450, 293, 226, -8, 469, 380, 110, 688, 927, 134, 27, 260, 788, 323, 259, 297, 298, 148, 420, 559, 559, -371, -201, 345, 219, 20, 360, 374, 227, -192, 45, 401, 212, -220, 170, 18, -104, -481, 150, 244, -479, -228, 98, 75, -115, -255, -258, -411, -497, -1, -134, -124, -315, -550, -303, -67, -510, -380, -52, -432, -318, -516, -105, -288, -336, -214, -505, -495, -370, -654, -364, -564, -583, -417, -554, -493, -168, -94, -351, -581, -492, -21, -257, -661, -523, -306, -737, -436, 58, -453, -411, -566, -447, -337, -359, -297, -295, -82, -276, -509, -77, 16, 101, -180, -89, -185, -123, -116, 77, 101, -233, -21, 4, 85, -10, 22, 275, 35, -21, 468, 408, 290, 264, 314, 478, 556, 309, 318, 404, 318, 33, 304, 376, 527, 569, 315, 345, 356, 577, 598, 367, 360, 413, 713, 510, 733, 614, 527, 575, 355, 607, 519, 474, 212, 211, 477, 177]
5204A77L24l7J73m94L60k06K34l75L2ll41M48j98Q4j5j28j44J74k56N57l53J40
5226A53l17k88J19K99j65K65j26p7l97N3P08q63J95K61j20J24Q7m65J32K0n6p9
5248e37M23j50l26N40n8k52%L51k77J26l49K12j01N5k25L03P1k06M75l32M46l09
5270a20m0J02k83j36N70K12m88rJ48m1p6L31L7m5j47K50r1J26k80J78qq6j24l7
5294e7N38k83k16J05L64k38p6L30k39mJ3R7L37l34l17K22M09o41M11K79j30n43
5316B7L51J35M7l86R6J60j58j63K52J91l75L60l03K31j79l11J77J94j85M9N4L29
5338E93n86q7K96L3l82M13Qk33j57j52M80r3l87L00k7n06RL41K36l16j41L69k25
5361b14J08r1K76j34o13jP29k85l12K95j42J97l68J27M38j97l55J9L25k8k99K18
$$ y = [177, 501, 464, 637, 143, 503, 297, 531, 156, 188, 185, -156, 292, 94, 178, 163, 35, -109, 65, -191, 366, 13, 153, -164, -452, -333, -34, -199, 66, -60, -137, -534, -481, 227, -636, -441, -180, -300, -176, -89, -554, -422, -402, -458, -537, -114, -264, -590, -50, -108, -360, -360, -9, -286, -160, -509, -297, -398, -343, -568, -265, -194, -400, 75, -257, 189, -120, -160, -58, -341, -477, 93, 305, -183, -192, -44, -85, -161, 170, 207, 162, 15, 265, 174, 300, 20, 198, 190, 104, -20, -57, 481, 198, -18, 87, 451, 213, 137, 467, 228, 224, 237, 334, 671, 337, 20, 242, 651, 10, 421, 700, 570, 27, 378, 513, 560, 174, 270, 430, 272, 109, 361, 552, 177, 537, 234, 465, 286, -25, 152, 346, 161, 210, 264, 593, 7, -80, 216, 249, -133, 280, 288, 55, -102, -254, 226, 133, -254, 46, 19, -487, -478, -137, 99, -217, -358, 11, -214, -106, -197, 79, -55, -668, -669, 60, -225, -537, -242, -384, -187, -555, -428, 10, -187, -542, -523, -198, -226, -525, -307]
5383c07L29n40j99N48R7m47n0J78K11j58m3L31J34o65P6P95m19l79M56j99m7J7
5405b81N03J72p38j65M56L43m44j0J91J52k86l41O66J52k40o18P23j68Mm46R60
5426E85l27l78O5N41J6o81L43K37j81m08P00l11nk66M47K52m45l48M52J81l09
5447A60j13O32j83o51j26N58J76m63M84k47r4p04L69Q09m23n43K11J050o12l39
5467d9N08m4p83m3N68K62l80o76M12N38l40M8O20l94j023Q07K86q3n88K53J75
5488G4m90K9L34L53n99j84Q2M56n1m00K63K68l64m49R95J62o72n16M82L41l21
5509b07NN87l04p61M64O31J22r69J05L98l44P2O35J38q67o32J070M77o68m1J79
5530I0Q3n70L28O40N5r97k2N26m5k16J69N85l73q92P25R01q61o10J20P65k21k82
$$ y = [-307, 22, -518, -717, -169, -72, -519, -569, -391, -180, -338, -381, -50, 84, -581, -505, 290, -129, -508, -52, -251, -298, -281, 222, 394, -344, -509, -53, 290, -154, -164, 27, 179, -107, -448, 218, 370, 130, -488, 235, 67, 71, -375, 585, 258, -120, -55, 486, 502, -179, 164, 401, 220, -188, 512, 201, 196, -70, 377, 629, 184, -164, 288, 469, 160, 47, 679, 496, -155, -281, 277, 453, -10, 474, 227, 133, -571, -202, 607, 184, -359, -148, 902, 290, -49, 459, 415, -368, -411, 157, 419, 39, -637, -225, 313, -27, 21, 641, 247, -776, 31, 317, 234, -354, -101, 74, -416, -387, -53, 300, -299, -483, -401, 55, 4, -396, -133, 135, -229, -678, 317, 479, -193, -709, -227, 114, -207, -202, 385, 81, -680, -216, 415, 537, -432, -327, 71, -273, -201, 434, 572, -295, -927, 143, 620, -48, -89, 90, 173, -397, -69, 571, 626, -371, -393, 133, 88, -128, 41, 626, 253, -639, 86, 987, 126, -484, -364, 401, 180, -102]
5552a02R40l61o31%Q62J41m83k87N7K12l65J45O56k38j027K19O87r2m18J03L88
5573D06o39k61O80O57q87k22K74J88j41K05j39K83j021K39N71K19o10l03M58k0
5593f3o45P05K21j66p82L60N88k77j69l6L53l73K62k40N91o30n74N91L18l66j22
5614d54M02r0q77L59J091j44o53k11N64p8l26J51L58q1l50QP93k99p01J72N72
5635B06q35J03P87No11l04P78J14l76o2L46j36l60L46M11k76m99N66J88m7j00
5656B44j8K68k44l88L08L69j87l61K29L74l16l49M30j74j02k06O03L05n03l08
5676b6J71J99k4P2J65l05o59N84M72k45j75j98M68p0l54L17M90l62n75L88O9m17
5698a5M90Ol64j02J92M25l61k24l10K03K57k15Q3K07M6m93jO61m18k84L48j1m05
$$ y = [-102, 838, 477, -154, -154, 708, 849, 366, 79, 136, 348, -17, 128, 784, 546, -481, -262, 425, 333, -85, 18, 406, -233, -494, 186, 843, -44, -266, 8, 196, 55, 260, 121, 404, -617, -378, 193, 412, -198, -501, -43, -63, -708, -3, 218, 52, -730, -370, 218, -59, -228, -264, 89, -284, -22, -262, 329, -301, -875, -284, 34, -332, -454, -52, -142, -1019, -660, 431, 287, -366, -577, -13, -91, -417, -266, 92, 11, -339, -331, 462, 163, -538, -366, 206, -629, -526, 261, 266, -345, -649, 129, 243, -133, -195, 151, 15, -345, 1, 412, 136, -363, 203, 391, 344, 244, 226, 494, 250, -138, 170, 539, 352, -9, 220, 594, 278, -71, 359, 185, 83, -123, 480, 785, 282, -26, 145, 344, 320, 392, 557, 252, -407, 177, 649, 404, 229, 31, 499, 429, 75, 392, 882, 520, -55, 333, 402, -15, 475, 481, 117, 15, 207, 632, 271, 47, -263, -60, 197, -18, 65, 272, 318, -175, -176, 485, 67, -217, 131, 120, -285]
5721b85j79L20J24l10j54N58k95L13l86K12j04r8p2L42No27J97M0J02j20M3K87
5743h7k57k27K90M09j82l69L57k66l05M52J16k4q8l00N03j03j16j53J81Q5k56
5764c40O6pJ22k76R2K71k91K58k0J67j85j95M72j47k83N6M60l5k66J13J60O9k06
5787E5l1L43q0j27J27k38J90o6J92m05K30k43K08J97J05l20K42j61j13j61L15
5808B59M36m44k93J49L0n8N4R7J38j85j21L75j19m34j73P14J09m06O5j81Q9J99
5830C00J26j93j19J0l42L96O1M9k09P2j23m6L8p3j5j4K6J88k06j09K03j34q3N6
5854a41N8O0q9m26L48K27j99J69r6Q4j37N7p3j41J81nQ9l3N0l9J50l78M3K9J74
5879c8J22o07L56j65P8j51R1K69q2J14M2l80J55K17j59R6o3K67N5k47j71J59j90
$$ y = [-285, -464, -144, -20, -330, -484, 74, -221, 92, -294, -82, -186, -284, -356, -14, -9, -636, -439, -399, -297, -417, -374, -87, -344, -571, -281, 128, -54, -423, -66, -332, -637, -185, -69, -93, -181, -481, 22, -81, -197, -350, -169, -84, -340, -274, -281, -159, -435, -343, -72, -363, -105, -125, 42, -143, -338, 134, -13, -296, -240, 220, 185, -81, 32, 192, 261, 55, 24, 367, 287, 160, 287, 49, 239, 173, 365, -40, 190, -53, 155, 352, 457, 137, 379, 218, 105, -56, 259, 695, 251, -42, 107, 137, 79, 133, 230, 368, 183, 62, 437, 318, -116, -289, 425, 534, 128, 193, 12, 101, 300, 426, 233, 114, 124, -218, 178, 239, 288, 79, 151, 28, -18, 20, -53, -68, -82, -56, 132, -74, -183, 20, -114, -197, -141, -83, -23, -112, -538, -190, 37, -162, 7, -89, -5, -142, -85, -158, -299, -118, -123, -34, -67, -17, -56, 94, -284, -241, -212, -38, 84, -523, -167, -332, -254, -405, -314, -45, -127, -13, 29, -351, -196, 21, -138, -42, -105, 162, 217, -30, -201, -42, -232]
5902b32K86m08M09qk64J27K38l90K68J16j10J24M0j18j94J44L60k95K37l10L51
5923C71J44m30J82k9K15j7m12R6k78N19j66k8K49k27j29K6L9n5L21n30M89j59
5945A91j85K59J92m26l70O03k59O5k14L45J6l13R1O8k35L09m57O4L09k48R2o9
5967a72K1o2j11M0K28k54J33NRm01N79k68J25r0K50k65k8j36M87k69o1k7j71j4
5991d52L1m8M33m71L00j51M3J43k13N48l41k07O1O8K29n4l5L1J6m7j44N87j70
6014A57n35L33K82l58m2Q4o3J17m2J83L8j13K1k46L8K18j40j77M78j95J44L04
6036D86l94k38M76L9l1j31K25q8j40k60R4K51K43l02Jn3j75P2K23N08m12J08n3
6059D49R5k94j50L09j99j35p2N50m0m71q6K67j02q9K64J84l69l27Q4N09k47j58
$$ y = [-232, 54, -354, 55, 47, -217, -90, 148, -242, 26, 142, 32, 156, 196, 78, -116, 28, 388, 93, 330, 20, 371, 515, 85, 267, 238, 453, 436, 24, 120, -158, 361, 195, 167, 416, 189, 60, 86, 125, 70, 391, -139, 350, 191, 6, 265, 457, 31, -339, 264, 5, 70, -144, 201, 217, -96, -5, 63, -172, 137, -320, -256, 53, -195, -103, -172, -151, -213, -324, -284, -56, -310, -177, -172, -163, -564, 15, -253, -128, -218, 32, -233, -261, -397, 90, -179, -240, -267, -438, -452, -421, -469, -36, -507, -207, -358, -315, -172, -385, 163, -178, -385, -324, -256, -27, -81, -116, -85, -69, -116, -260, 327, 157, -378, -45, 237, -121, -163, -79, -142, -25, -67, 116, 154, 41, 62, -184, -146, 72, -68, -245, 233, 38, 182, 486, 92, -146, 330, 369, 338, 207, 432, 344, 204, -56, 38, 289, 532, 230, 231, 178, 3, 75, 298, 806, 394, 502, 449, 544, 250, 100, 409, 210, 75, 3, 553, 513, 42, -44, 223, 121, 32, 296, 480, 111, -216, -132, 377, 130, -28]
6081b8L94j86j60l18M33J73o09L7M87J64n67M2M24k8p77M00M87l92l96j06L66
6102a60P5j35Qmk16O5P0J35N6Pj49N7o6k38O43N3p85K36L01N9j6k95o9L06l99
6127d61L06N00o67j28R4J21K47j44L4m7k05l69M33N43k89m93L60J20k27J07R4
6148g1K59n70J10M64L62o65j55K80o2j59L29K62J0r12M92O16o47K72J44j99o57
6169d97N51M85p7l17l52M46J08j74J3M69l68l28J04N88j73n97L7M13m4l16L49
6190C20J34n62r3M67N06p06J1m5L28o46J62L83J9l98m73R56j00k11k10J00k05
6211b63j87M39K64k08m90L55K24K0m01K16L92q27j31M64N54m03o19K07K48k43
6231c89K27N92p34l38L67R8L68m83l47L41J38K6J38K55l99n05Q45M8k70r7O2K01
$$ y = [-28, 366, 180, 20, -298, 135, 308, -301, -264, 223, 387, -180, -138, 286, 258, -519, -119, 368, -24, -420, -526, -160, -85, -220, -212, -216, -432, -367, -297, -162, -106, -99, -248, -191, -257, -495, 148, 201, -584, -348, -47, 12, -4, -299, -368, -62, -461, -155, 345, -322, -450, -356, -235, 12, -132, -98, -145, -350, -719, -286, 257, -32, -525, -165, -45, -272, -165, -71, 188, -382, -272, 192, 554, -111, -266, 14, -48, -207, 122, 384, 394, -518, -26, 590, -57, 215, 359, 160, -497, 54, 539, 462, 145, -207, 239, 347, 173, 186, 655, 287, -41, 63, 651, 478, -119, -82, 331, 287, -29, 320, 454, -108, -201, 266, 772, 66, 77, 32, 360, -286, -124, 259, 278, -120, -593, 363, 263, 52, -158, -58, -263, -450, -11, 253, 45, -445, -90, 134, 154, -247, -31, 361, -466, -597, -133, 421, 18, -601, -394, -146, -389, -162, 430, -304, -642, -275, -177, 191, -292, -639, -298, -160, -134, 4, 259, -140, -645, 200, 248, -22, -119, -57, 144]
6253A44n00m3O88R9o01J89m7l8K4nL66k01m96K05l4L32j72J78J09j71k71M81K54
6276D90l65m18L06P4j23j8K28J30j14k97O34n5o21L2M20k3j55O9K68J28o56J87
6298A21L62j08l66J53J76kj96j55O56o74j31O30L1m53m6K97j3l24Q3M86m39o0
6320B8J9J56N3l63L51q3m16K44J07J22j87j56J51K66m87J81K65J1n74j48M45J03
6342H8n5l68J55J50j90J12j17j77n9K08M13l55n01N67Q2l55O3K99K96l56m24K63
6364b61Q2j02N8k1L11j81k30L28K06m60j59Q9K78m66J98N57j62k68j82K81L6n76
6386f44P98l47K46k81N9J28j1m77O37ol59L23J2j49p6K71Q3O0j57k00K36M1j04
6409H3j24O8L18m41L28L41k53k48N5N90n64k3L21k29J36k63Q1L4L5k26J50j51
$$ y = [144, -356, -399, 289, 388, -213, -24, -71, -109, -85, -90, 276, 75, -421, -216, -250, 82, -90, 88, 197, 26, -245, 236, 490, 125, -293, 13, 87, -36, -54, 174, 304, 190, -107, 527, 472, -149, -117, 303, 280, 125, 194, 462, 590, -66, 121, 483, 375, 9, 162, 338, 336, 140, -15, 641, -33, -164, 466, 497, 44, -2, 295, 282, -42, 41, 527, 88, 28, 47, 203, 256, -107, 244, 161, -255, -11, 96, 218, 31, -125, 26, 292, -195, -14, 251, 262, -312, -460, -15, 88, 33, -335, -180, -30, -220, -108, -225, -402, -461, -253, 160, -195, -696, -129, -47, -402, -339, -40, 256, -100, -524, -261, -179, -281, -223, -244, 67, -114, -344, -16, 190, -270, -429, -340, -62, -528, -330, 227, 65, -203, -385, -104, -68, -644, 154, -193, 53, -228, -169, -41, -52, -529, 108, 102, -257, 66, 78, -71, -147, 124, 207, 267, 110, -90, 146, 187, 83, -41, 27, 345, -96, 232, 573, 320, 72, 127, 717, 153, 130, 451, 222, 358, 95, 176, 210, 245, 19, 169, 18]
6431A8Q8K04P8P5j86l60M56M0k49k03L49r4J64m75M16k17k50L29q5J20k90K25
6453A53J66l17K1J5J8j32m5K99O9j32p2O8P8n18K98j62L21n01L90J28m83L45j73
6476a66KL36n09Q0j16J17J23j71L72l50l3P0r1k5L4K51k19j5O8m4K02j20L3m5
6500b16j4j20K03P1k19R7j01K83j75L4n3J16k48J61q0J52J61k41M25m32M0j47
6522c03L14p6K09j08J83l26L16n66M39P2m07N22M5k72K4M2J50j57k00J90R1qj13
6545F1R7J53k83J89k52M61m78J13j62M29j79j11M47k30j71O0L44j14j04k10J30
6566A90j58L00m45L88K39l56j87L62j37m3K12j95j32j09L5K73l67N5K16n3o9j63
6588a44P3K60l01L09l09J51l12j6P0M5Q7Q8KL08l11k52M50n98J24K64K7k03k4
$$ y = [18, 106, 310, 388, 463, 277, -83, 373, 413, 164, -39, 310, 216, 380, -95, 321, 104, -146, 183, 98, 218, -72, 153, 319, 2, 23, 38, 56, -76, -121, 178, 247, 115, 43, 111, 189, -329, -31, -193, 128, -373, 17, 145, -338, 7, -166, -164, 172, -337, -257, -373, -256, -133, -304, 68, -282, -315, -245, -336, -361, -327, -76, -295, -310, -242, -286, -84, -204, -171, -216, -230, -350, -147, -76, -295, -198, -299, -16, -191, -157, -210, -94, -342, -181, -261, -109, 52, -189, 236, -196, -156, -303, 11, -65, 144, 36, 219, -107, 209, -357, 82, 154, -253, 269, 314, 42, 66, 108, 258, 101, -99, 91, 182, 174, 61, 158, 311, 28, 217, -35, 426, -52, 61, -101, 328, 149, 38, 485, 255, 84, 144, 488, 374, 270, 60, 190, 32, 332, -113, 275, 514, 158, -29, 333, 196, 153, 365, 170, 38, -71, -36, 237, -130, -75, 141, 88, 19, -144, -71, 189, -112, 197, -112, 39, -273, -289, -219, -174, -87, 1, 3, 311, 0, -252, 198, -400, -276, -12, 15, -188, -212]
6611b12J00k74L91k50L9k68J34L09o8j12M25m58J37k42K4K5L98j89K03k50l1O1
6633a08j71L4J94J61k36P2k62J33J57m9J2l5J30k31K14J43q7pk18K08J10R9k09
6656E4K23k30L16m01K98K1j15l68J81K00j01k1K75o9l52J17N05m50J82j38p8Q1
6678A30k09P0M17j48o7r4j07K24q5k08J03O8K2l9J62k77o7q0J37J06K39l26O40
6701F11q04J92N8K53m71P0k56N35l20k22N64l30k98J87L11nn74M52k35n8Q2K35
6723b3lK32m67P4M91l33O1p1j03MnJ69k15r0k14M69j78m3J03K00m12P5J29nM1
6748a14P6j95j15kJ82n9J23m1o6L89l24Qk3M7J29L1k50L30K05j42l03J46k9j91
6772a88j33L74j96j01N17J14o2n25K10J14J4j77J38K59l68R1J22o4J89n6l78M09
$$ y = [-212, -112, -386, 5, -245, -206, -474, -340, -31, -99, -211, 214, -244, -107, -349, -325, -300, 98, -91, 112, -138, -169, -108, -279, -245, -51, 110, -126, -54, -316, -183, -26, -75, -63, -98, 32, -199, 15, 158, 71, 64, -154, 54, 164, 263, 54, 277, 47, 363, -38, 260, 281, 166, -202, -21, 179, 78, 57, 332, 263, -89, 28, 533, 83, 265, 127, 49, 130, -79, -9, 408, 260, 193, 99, -8, 216, 131, -77, 26, 94, 116, 77, 239, -38, -105, -185, -48, 58, 297, -29, 611, -193, -1, 57, 310, -161, -91, -347, 188, -132, -354, 210, -120, -418, -231, 80, 75, -499, -47, -282, -340, -258, -23, -26, 206, -261, -187, 304, -29, 32, -39, -142, -138, -143, 26, -189, -279, -493, -24, -202, -245, -142, 58, -354, -279, -150, -155, -114, -38, -233, -348, -350, -168, -227, -104, -145, -211, 178, -146, -138, -161, -114, 15, 46, -204, 126, 331, 189, -114, 32, 3, -188, -321, 53, -143, -244, 273, 387, 325, -200, 10, 124, 138, -39, 99, 358, -10, 81, 203, 139, 328, 272, -106, 303]
6794C03l24N0K53j26l50O7K52P6j58J39K00k66k50M07J05j54m05L13L60l35J9
6815A76o1j7j72J78K30P0l93j89K32p1k44p0N82j22j65lK56j94j35K42k20k5K18
6838A03P3r9l16k82L77J64l87j9M06J64o85K60M3L18l32K1J59j31j71L72k29m45
6860f36L75Q1L6J81n37K42K77k83j07L60Q7o82J53K75J81r8Q7N8k19qk2J46k9
6883h2j40j38N53n7l21M4J22j72K7K91Q8n6o74M47K42k08J31j62M93l36k53K65
6905A04p7K41l10L64k38J47p6K0O3l98P1L90j63j5J61L4o9m61N15R4l70l05j4
6928b92M04q8M3K98m9l77j2M94L6m80j26L47O7m13K82K26q5n18K36M01k14J58
6950C38q4j65J54%r3J54n62n1P1K94q1p5K81l17j40kK04j1j02J20R2l05p9N1L82
$$ y = [303, -21, 29, 282, 156, -194, -127, 125, 201, 43, 182, 382, 116, -134, 273, 378, 224, -181, 132, 492, 157, 176, 115, 98, -74, 104, 334, 404, 11, -178, 54, -17, -261, -331, 251, 129, -36, -39, 217, 23, -112, 130, -90, -115, 103, 176, 77, -239, -521, -144, 20, -367, -386, 20, 184, -501, -241, -198, 120, -212, -191, -32, -163, -334, 38, -191, -636, -261, -180, -144, 37, -500, -258, 19, -264, -371, -11, 76, -606, -453, -178, 3, -95, -8, 50, -169, -177, -199, -53, -82, -222, -360, 193, 136, -185, -141, -19, -191, -164, 127, 215, 159, -515, -68, 174, -34, 97, -65, 428, 92, -161, 104, 27, 268, -42, 322, 84, 231, 155, 175, 238, -160, -89, 301, 138, 123, 284, 318, 249, -212, 303, 397, 27, -278, -292, 112, 24, 67, 365, 316, -61, -73, 421, 457, -23, -149, 198, 265, -148, 134, 360, 275, -243, -7, 394, 180, 338, 254, 89, 243, 243, 150, 304, -258, -309, -238, 56, -25, -100, 181, -136, -276, -278, -74, -85, -187, -67, 25, -280, -359, -308, 74]
6975G4m26j23L47J14l01j6j38O7L26k6J26o1j84l40N22k8j58K90k91J00l80O12
6997A06l10J27l06K73J00J08j35k75J78J36r0J79J07k80N0Q6J7k79pN51l95j69
7019b28J84N01k21k01j16J36j82QJ04K32Q3l50K42m00K67j95L90k61K52k79J62
7040A28L03j87K8R3k53P5K66l45k29M5n0O40k50M3J1j55M1kR3J23j50j60m0nP7
7065A40Jj99J88l18l7K55K30m35m9N01m10J78l95N15K3j09k67J62J83k06j34K37
7087E4J93l74J11R9q2k20RN09n69K38m4m5O1N0j81j8l46K24M9P8J21O5j31j66
7111c15J20L88k27j68l57M96j22jj62J60L89j90k38R7j35k4K44k66J42J21J41
7132I3j23n2l0j57R3O2J58j95J10m1j41k8K45PJ21P8j41L61k27k6N9J0n37M29
$$ y = [74, -352, -475, -128, -14, -315, -331, -469, -402, -76, -102, 24, -37, -221, -561, -39, -67, -225, 65, -226, -126, -506, 106, -204, -77, -383, -110, -10, 98, -37, -312, -134, 2, -88, 91, 198, -82, -32, 54, 71, -208, -215, 336, -59, -228, -44, 457, 236, 35, -81, 55, -127, -119, -15, 217, 300, -50, 192, -208, 59, -136, 254, -7, 245, -34, 128, 431, 244, 272, 365, 112, 187, 453, 108, -121, -76, -126, 514, 264, 307, 318, 163, 204, 202, 295, 418, 268, 108, 68, 63, 140, 141, -58, 130, -188, -225, 30, 260, -175, -224, 277, -133, 45, -350, 165, 188, 79, -188, -26, 157, -49, -183, 54, 247, -127, -16, 83, 1, -219, -210, 299, -270, -32, -76, -121, -60, -10, -191, -209, -555, -331, -282, -204, -83, -18, -149, -315, -195, 193, -34, -202, -559, -63, -185, -186, -348, -188, 201, 11, -227, -130, -265, -289, -45, -311, -169, -48, 93, -30, -82, -112, -269, -176, -114, 44, -151, -41, -82, -223, -251, -6, 1, 122, 200, 59, 420, 193, 167, 226, 236, -301, 128]
7156A28j3n8j29M06k30J30l8o6J65m6J76k81O5r2j08L00J9m20J21J64n6MK2r7
7180F6R0r7L45m85j7K25q6M5j5J14J78m85L06j95M9J10J08o5K4k01o2Q9L29l66
7204Dj3K46k77O2k7K61mo1l82P6J80j45k1K75k68j38N28m33J46m94L61R9k22K14
7228c3N7k05n5J36k71K74M1j61J3K04k53j6M76j74M0j41jJ86l43mJ54K17k82K4
7252a17j41Q0K96j59N9j59k55N16j55o0J51J77j47l41J44j11N61m07o5K77k58
7273a14M31l38J58J61m91K43ql9l3j98L63K4M3J23j78k4K7K54l96M19m72M45l41
7296E9o6J2K94L5j82m50M50j20J57O5k40P7J03K8Q8j33m77Q0O17l24Pl4R6K14
7320C56k65l27N85k91j72N8J10P3j82O4j70o6K24p5j25Q5J79k58M11j76p4K2J73
$$ y = [128, 115, 57, -72, 334, 104, 234, 196, 130, 295, 249, 425, 144, 209, 117, 9, 309, 328, -92, 29, 193, 137, 141, 163, 66, 156, 59, 404, -81, -98, 127, 41, 86, 71, 185, 363, -122, 184, -11, 38, 148, 256, 191, 215, 14, -48, 41, 370, 4, -9, 237, -40, 22, -5, 256, 252, 191, -191, -115, 65, -80, -101, 174, -94, -232, 296, -137, 9, -485, -124, -25, -247, -33, 24, -181, -236, -100, -371, -97, -56, -217, -204, 0, -253, -269, 207, 33, 73, -68, -69, 117, -226, -230, -76, 141, -141, -117, -258, -178, 118, -41, 18, -141, -396, 120, -35, -95, 56, 233, 86, -255, -111, -222, 339, -68, -133, 144, -114, 317, -21, 137, 298, -193, 50, 42, 3, -30, -228, 135, 159, 202, 325, 147, 123, 150, 404, 8, 427, -45, 400, 59, -7, 5, 299, 334, 152, -298, 152, 32, 189, 254, 14, 91, 194, 222, 310, 177, -300, -220, 397, 73, 80, 46, 142, 356, 91, -236, 349, 58, -114, -56, 54, 127, -55, 9, -161, -227, -3, -78, -203, -118, 61, -197, 214, 38, -36, -14, 159]
7343A59l5k88L88j28j22R0L7j81j83K30q3k7l2J34q1k48N71k06Lj69M9N9k4j73
7367b60o0L03L5k96J99J77k82N4J48j98k4K33l89K22p4J96k19J55k45N4L60k14
7389a25q0R0P0K33L9k33K81j49R2Nn90P45n92M50m2k16j01K61j15P2J15qj36l6
7413C0m3K00J0j36q0L75j75l74L29j47O9L6K7J15j66j15Q2l2j72L76M0o5M2j48
7437G8K01ol8j18J07l22R9j99N21m57j78M61k29l1M8o2R4R7j17J74R1l28j71K37
7461d8J66n53L07L58k74K54m80M87j25j55k41K19K49m78M30j18l4n07N79M0j75
7482i9K17k64K46j29k39J27l0l92M35j59L39k68j99M17o8l20J84N53k94l3k41
7503b17R9J46J29J02l11J38l39K57K41k42J9j9J37k15J57K06qj25m65M29j28Q9
$$ y = [159, 124, -164, 224, 96, -26, 64, 101, -80, -263, -33, -116, -143, -175, -41, -122, -370, 201, -5, -2, -171, -122, -63, -87, -260, -320, -17, 18, -278, -79, 98, -184, -130, 18, -180, -204, 29, -360, -138, -212, -16, -235, -80, -325, -271, 89, -125, -205, -115, -45, 188, 227, -6, 275, 126, 218, 223, -367, 378, -214, 236, 194, -22, -123, 138, 23, 95, 210, 202, 66, 30, -13, 187, 197, 61, -19, 356, 181, -193, 136, -11, 58, 94, 121, 236, 70, -45, 37, 5, -167, 209, 249, 184, 226, 78, 279, 273, 235, 117, 224, -98, 1, -198, 323, -134, -312, 149, -80, -111, -63, -125, -31, 66, -51, 123, 214, -114, -285, -48, 118, -435, -128, 230, -44, 210, -270, 217, 92, -63, -304, -85, 164, -314, 116, -2, -36, -543, 36, 76, -99, 118, -146, 100, -29, -268, -141, -171, -563, -128, -287, 52, -216, -415, 2, -66, -386, -202, 351, 57, 24, -217, -118, 28, 157, 259, -52, 86, -253, 4, 245, 3, 22, 3, 140, -75, 82, 288, 280, 155, -310, 119, -9, 80]
7525H0P4K96l12l24J52K98Q0k73l79O79l40K20O0O8n33J83J63J76k23k67J66K0
7547F4l24K18L13j15j31K5J88k08o0R4L02m22l3k1M37k21k53m1M63k95Q6k72K30
7570B4M0j06J89P2j1k53k6J11j78M40j71q7l38p6P54l73m2L25m62k03P5J61l8
7593a73J18l38K73J59L86p36L09M5k98j46L67J67n53L36Q6p8l75L09J89K21n30
7614b62l2M19m48k43N99o5k50j49M62K30m03K25j37P0k3k74L49l19r6K45M26k10
7636A14l44L11j42R0k07K59K44j52m73O46l98J87m21J75L98m19J34M6O9j16l9
7657c8L32k10j34j02j44M93k43l34M63P2k86k21M01J18k52p9N53j57j89J76K54
7678D73m17j04j64L38k08K34M2j87O5P4J91j18j49R1J22j18k16K08K51m95j01
$$ y = [80, 154, 450, 138, -186, -34, 264, 344, 71, -308, 371, 31, 251, 311, 379, -154, 29, 192, 368, 145, -122, 44, 64, -260, -42, 271, 156, 25, 50, 238, 30, -30, 64, 366, -56, -89, -110, 327, 106, -147, -188, 275, -20, 66, -206, 24, 64, -42, 147, 219, 208, -45, -71, 40, -138, 302, 131, 44, -294, -370, 384, 11, -31, 294, -168, -371, -296, -135, -173, -55, -393, -120, 39, 425, -311, -2, 43, -255, -401, -34, 133, -420, -84, 2, -76, -451, -142, 47, 268, -262, -294, 125, -323, -566, 33, -32, -282, -431, 31, 261, -142, 83, -54, 16, -7, -281, 68, -251, -347, -102, 324, 114, -230, 81, -61, 29, -178, 81, 325, 173, -300, 346, -52, 135, -286, -111, 287, -132, 2, 48, 117, 1, -38, 294, 84, -50, -152, -296, 197, -46, -380, 83, 155, -131, -352, 49, 167, -85, -164, 389, 232, 43, 219, 473, 56, -48, -212, 126, -82, 152, 194, 7, 72, 146, 337, 219, 70, 161, 283, 165, -51, 157, 408, -87, -188]
7699a88L77j66M1p9j15K84m93L96M0K59q06M68k5j38L25j75J26k64k46J99K91
7720A11j07j1o4K2m8P8L8r5l97K14K87Q0l8o1k60J3j01K44J48Q2m12J08M8J50
7744B9k36J83K22Qn03K57j10L8L23m08M93k58K01l20K4p0j8j14L65k28%M3J54
7767G5j3j71M71j75m20J72K56L3k84J44j22M2J42J24l6k62L7O4Rj41K40j95J43
7790A33j72l5K33J58P8j60j36J5m7j20L88j04k69M20p1l46J54k7k07M29m30L39
7812B23l1j22k17M19k99J53m8J0J67k67J6K4m03L95K32m06k04M23k74k5K77k06
7834a63K21K5j43N1q0L0j61k4L21j79P7k91Q2K69J15l92j26M33M0k28P6j85J95
7857c7k10N02m35L3lL36k96Q8p5Kl24J77J68L6J69k37o4N5j52j35K81L39p9l96
$$ y = [-188, 189, 23, 64, -15, -130, 154, -339, 57, 97, 356, -450, 18, -7, -145, 180, 5, 131, -133, -379, -180, 111, 4, -7, -71, -49, -97, -19, 19, -76, -473, -259, 28, 108, 70, 9, -251, -238, -339, -95, 53, 135, -277, -169, -121, 29, -207, -24, 198, 206, -297, -40, -150, -112, 211, -197, 296, 38, 239, -81, -57, -127, -145, -259, 106, -122, -122, -79, 75, 62, -109, 362, 187, -233, -61, 195, 228, -56, 88, -34, 8, 150, 274, 238, -24, 13, 77, 86, -55, 185, -10, 133, -39, -74, 159, 317, 395, 235, 99, 114, 67, -53, 335, 231, -38, 382, 311, -35, 119, 92, -115, 314, -116, 223, 192, 70, -147, 272, -27, 126, 78, 88, 255, -12, 4, 28, -375, 20, 252, -154, -358, 65, -209, -234, 43, -163, 58, 83, -60, -9, -89, -59, -220, -244, 77, -102, -25, -316, -234, 35, 150, -242, -368, 65, 105, -123, -47, -232, -37, -247, 255, -180, -147, -150, 186, -110, -22, -97, -95, -419, -242, -74, -38, 131, -106, -170, -115, -267, -402, -121, 218, 139, -257]
7881b57R8R2r2J11L36n99M80j98P4K9K94k11o1o2K13K4r6j58q1M49k05n4k17L4
7905e7L56k79J4j98N10n63Q9L56j2P2l53L56n55L23j5n4K00j42M49n56M10k97
7927E4K36k21l4J9L0J28J13r7k83K15l17J39J24r9J03j82k2J21Q3p9q2R3k01K23
7951F4k2l1k24J58K6J80k34j32K50j02j58m1J16J76k64j51L68J4m67K48J60J62
7973I6m67K60K73O4l34J06k30K48l47K47K81k31j75J65K61l94o4K51j04K1J80
7994A07l11J77j84N1J5J78j02Q0n6j5k66J57j6N8L56k65J47M3k35J85k15q9j35
8017c35J74K97j22O6j19p4K90k27K53k14K99o6k39M8K46j91k73M01k46K95k76
8038a3M42k85k46L33j03k8j97J2L66p9j91oJ33l7K26j29j17rr5K49k71J83KL6
$$ y = [-257, -159, -67, -159, -48, 288, -311, 169, -29, 45, 74, 368, 157, 96, 34, 247, 271, 175, 17, -64, 385, 180, 126, -91, -57, 299, 20, 34, -164, 346, -217, -128, 228, 216, 288, -65, 291, -264, 59, 44, -10, 190, 48, 497, -59, 351, 54, 290, 69, 35, 54, 84, 212, 325, 228, -55, 160, -157, -18, 106, 7, 110, -72, -94, 27, 110, 31, -51, 42, -159, 64, 42, 11, -213, -55, -29, 151, -83, -215, 35, -67, -225, -266, -150, 26, -238, -389, -21, -7, -474, -226, -66, 96, -371, -111, 162, 226, -108, -2, -232, 16, -331, -84, 197, -34, -209, -44, 217, -177, -241, 10, -94, -73, 107, -204, -27, -211, -160, -145, 33, -69, 11, -45, -60, -326, -169, -185, -127, 229, -36, 111, 154, -81, 104, -111, -200, -335, -161, 136, 14, 80, -39, -113, 177, -50, 203, -11, 288, 222, -17, 31, 277, 86, -187, 214, -32, 263, -13, 429, 144, -102, 231, 128, 100, -97, -85, 281, 202, 11, 5, 138, 101, 327, 198, 81, 72, -23, 226, -45, 138, 140, 176]
8062A76n8j52J87M8q0j11j38L24r5k20K42r1J2j4J64l86L3L63j88Q0j54K11j2
8085A41j22q3J7k3R8q9k6j03K12R6l41O5L8j5k58L28K71j65N2m36K92K97m56L9
8109a71K63m68J79J35K44j35k11K25K9j31P0k66M26p1j30K89k11p3l37L62k88
8130b70J10p5J14L29n89L21j19L88j98m3J85r0N3n1j36R7m5K37Lk15j33M71l75
8153c1K86J3l45K09L2K3j29j02J7J79J45j76O0k28K28k70L4L03o1j79J92k21K92
8176B71j65k1J71k56j69K63k56J55j36m5L97k4p1R1N5
$$ y = [176, 118, -34, 153, 201, 121, 10, -128, 196, 101, -119, 123, 32, 44, 30, 194, -192, -159, 204, 16, 96, -58, 153, 141, 19, -64, -47, -70, 28, -61, -87, -190, 22, 118, -223, -158, -120, -135, -393, -65, 206, 41, 93, -343, -51, 246, -210, -171, 92, -376, -197, -62, 182, 47, -164, 61, 90, -41, 29, -237, 189, 118, -12, 277, 66, -7, -344, 18, -270, -160, -235, -121, 208, -381, -60, -179, 209, 11, -32, 153, 63, 116, 65, -71, 26, -19, 218, 221, 6, -127, 344, -31, 255, 268, -77, 132, 164, 187, 58, -44, -27, 152, 297, 121, 181, -47, 181, -89, -55, 248, 187, 8, 200, -21, 271, 106, 85, 256, 0, -169, 94, -162, -7, -143, -188, 209, 185, 114, 205, 260]
8191B60
$$ Imaginary data points
##PAGE= N=2
##DATA TABLE= (X++(I..I)), XYDATA
0@%%%qJ6j6J9k7M0m8N8p4R6j20J44j76K16k57L05l61M20m92N73o63P63q74R98
27E32j137J291j457J643j851K076k325K597k894L222l582L976m409M884n407N987
43C146o630P344q144R043j0061J1228j2577J4157j6044J8337k1196K4884k9842
56a6355L6911m7891O7447j12899M07073K92592m74375J25847J52803j1387n7811
67C61955J66158n7970k13707m4413J87844L7851n4296l1739n1897j21412M1769
78B20143J49289K8824j26676q5633n1812j4081R7429J20759r4369j92720l0614
89B0539Q4420J6570K3013L5729j14996j75801M0423J43135j9355o2732M6303n3670
101a6422j94085P4K14951M5129j67905q2041K9449j2248J8540Q2042l9397j45184
$$ y = [0, 0, 0, 0, -8, 8, -8, 11, -16, 24, -24, 34, -40, 56, -64, 80, -96, 120, -137, 168, -193, 227, -265, 308, -355, 408, -466, 532, -605, 686, -771, 872, -979, 1097, -1228, 1369, -1525, 1697, -1885, 2091, -2318, 2566, -2841, 3146, -3484, 3860, -4284, 4759, -5302, 5926, -6651, 7506, -8538, 9799, -11397, 13487, -16355, 20556, -27335, 40112, -72787, 334286, 626878, 152503, 278350, 431153, 419766, 361955, 528113, 470143, 256436, 212023, 399867, 437718, 383422, 351683, 299786, 178374, 220143, 369432, 398256, 271580, 185947, 134135, 120054, 217483, 338242, 243873, 51153, 20539, 104959, 121529, 144542, 180271, 65275, -110526, -70103, 73032, 53677, -9055, 37248, -16422, -210507, -210433, 4518, 49647, -118258, -200299, -170850, -183098, -164558, -82516, -121913, -267097]
113b67097j1562Q9084j1049k5458P5997j5869j74550l6697J69189N7343j08045
124b58714j0486N3725q9953p6849J42066J24875j13162j23128N1667N8592k0125
135b61492K9310N3706m7263o9164K6531M7227M626K5070K7437m0273m4359L6283
147b12361N3443J2528M906j3812m8891J0717R6526L3976o3019p051N1681l5212
159a16569m8968R7009J03819p1045q7075N8616M7485n2061K3665J08714j9927
170D3663j18431J0265J05135J7025l0735K4461N11o1296K452Q5636L4034l6772
182G5948j3100J200k9008Q845P6980L3357n9623m9253J5145K7723K9214L8792
194A56220j1813p2560l2910M4629M7720K0128Q837l6043p1380q767P1132M8419
$$ y = [-267097, -278659, -189575, -200624, -226082, -150085, -165954, -340504, -377201, -208012, -150669, -258714, -269200, -215475, -305428, -382277, -240211, -115336, -228498, -351626, -299959, -241367, -261492, -232182, -178476, -225739, -294903, -268372, -221145, -216519, -191449, -164012, -204285, -248644, -212361, -158918, -146390, -141484, -155296, -204187, -193470, -96944, -62968, -125987, -133038, -81357, -116569, -165537, -68528, 35291, -35754, -122829, -64213, -16728, -68789, -45124, 63590, 43663, -74768, -64503, 40632, 57657, 26922, 51383, 51894, -9402, -6950, 78686, 112720, 75948, 62848, 64048, 35040, 43885, 120865, 154222, 94599, 45346, 60491, 88214, 117428, 156220, 144407, 71847, 38937, 83566, 131286, 151414, 160251, 124208, 52828, 44061, 115193, 163612]
206A63612j0995k6851m0616m1135K8449Q2099K1730n8596m9685j3027L664M6017
218A04666O7320j2845r6407m8971M3493M6332J3819J3161j9803q0030m1433P2962
230F2264Q3381j7110o5584l4073j5992M080N9283O1245l4022r5876l8523L9541
242H614N2683K7958n276m8921o2002r029N7808N9958j393o0493o2072r035M6727
255d473N3811J5231l4009o3768m4196K5818P4171L7175l7994o4021l3705Q863
267f7097M5731N1680j74o5530o2486L832N5460M8994M355m3078n9781k5566L5187
280g8473O2180K7831l5339o3005l1398K2854N1948L6983j2446n6652m8694Q931
292a15280N4360M5608k674m6042n0241j1900L9993N6032J8041l7318n3793j7418
$$ y = [163612, 152617, 125766, 85150, 44015, 72464, 154563, 176293, 117697, 68012, 54985, 58649, 104666, 171986, 159141, 62734, 13763, 57256, 103588, 117407, 130568, 110765, 30735, -10698, 62264, 145645, 128535, 62951, 28878, 12886, 16966, 76249, 137494, 103472, 7596, -30927, 8614, 61297, 89255, 83979, 35058, -26944, -35973, 21835, 81793, 80400, 19907, -42165, -51200, -4473, 49338, 64569, 30560, -33208, -77404, -51586, 22585, 59760, 21766, -42255, -75960, -67097, -21366, 30314, 30140, -35390, -97876, -94044, -38584, 10410, 14765, -28313, -88094, -113660, -78473, -16293, 11538, -23801, -86806, -118204, -95350, -43402, -6419, -18865, -75517, -124211, -115280, -60920, -15312, -17986, -64028, -114269, -126169, -86176, -30144, -12103, -49421, -103214, -120632]
304a20632K8137M3638K9293q179n0749m5165J9139O1693L1304j5265l0981l3304
316i1071j4362L8685N9927J0361m3645l7517m032K1216M0031L2286j4800m8368
328e1289k4434K4062M2679K8245k320l3327l6734K220M3945L9550L661k4539l1129
341a9410j6460K4378N0739K0686k7567l1670q655P694K9665M0888J498m7060l1390
354f664J7616L1825K2421J3956j5235m3040j7674L4289L9562O915j4373k3162
366D6436k5174K558M1435L3581j5484l5845j6667j097J6053L6896J8260l3971
378F6981m3553j254K3881J8543J7734j03m0357l6735J7777M0198J2208r365j8682
391D7273l1887j5857L0058M1211j3l3702k8706j1567Q745L2309K6024j7074m5984
$$ y = [-120632, -92495, -48857, -19564, -27743, -78492, -123657, -104518, -42825, -11521, -26786, -57767, -91071, -105433, -66748, -6821, 3540, -40105, -77622, -81654, -60438, -20407, 11879, -2921, -51289, -75723, -51661, -8982, 19263, 16943, -16384, -53118, -50898, -6953, 32597, 36258, 11719, -19410, -35870, -11492, 39247, 59933, 32366, 696, -7959, -265, 29400, 70288, 71786, 24726, -6664, 10952, 42777, 65198, 79154, 63919, 20879, 3205, 37494, 77056, 83971, 69598, 46436, 21262, 23820, 65255, 98836, 83352, 47507, 30840, 29743, 45796, 82692, 100952, 66981, 23428, 22174, 46055, 64598, 82332, 82229, 41872, 5137, 22914, 63112, 75320, 65955, 47273, 15386, -471, 29587, 70798, 70785, 37083, 8377, -3190, 5555, 37864, 63888, 46814, 830]
404H30k2287J5027K5371K0095L575l1380m5535k056M1058K6730n212j8209l1249
417b3242k9594J8668N2538J4495l3540l1936j5069m11L1545M0255p380m9796l0483
430f3950J0130K7998K8498J0914k7864m6712j3710L4334M0275R131k1504l3536
442d5996k5205J0191M5875L1329j9377m1924k1405O224K8758L9067P343m3374
454b8494m1419O523L2181K8239J6321j6636m7916k3026L1945M3931J2951j3947
466F53l1712l1043O459M6472L4220j2927l6805k5778K55K6749L8750J4025l2709
479c391m4738n622L3074L2250J1933j1969l5805k9870J6898M8718K3672j8641
491A6509l2275k3963l77L4031M0827N44l8481l3263j078K7110L4022J4022k1256
$$ y = [830, -21457, -6430, 18941, 39036, 42611, 11231, -34304, -36360, 4698, 31428, 26216, 8007, -23242, -52836, -34168, 18370, 32865, -675, -32611, -47680, -48091, -16546, 23709, 16329, -33467, -63950, -53820, -25822, 2676, 13590, -14274, -60986, -74696, -40362, -87, 9044, -12460, -45996, -71201, -61010, -15135, 16194, -3183, -45107, -66512, -60288, -31530, 7537, 14880, -28494, -69913, -63390, -31209, -2970, 13351, -3285, -51201, -74227, -42282, 1649, 14600, 653, -31059, -62102, -55643, -9171, 25049, 12122, -24683, -50461, -50206, -23457, 15293, 29318, -3391, -48129, -53751, -20677, 11573, 23506, 11537, -24268, -54138, -37240, 11478, 35150, 16509, -15766, -39729, -40106, -6075, 34752, 35296, -3185, -36448, -37526, -10416, 23606, 37628, 16372]
504A6372l7556j7720J9772L8193K3343j4345l8528k4057J3185L5301K4116l406
516C4670k6258l0995o492L2073L9973K489l1989k6929m215J4151L0652K5201j4507
529C7824m2808j8834K2103L0887J6580k341k3851l1269l450L4727L5271l762k9807
542B1270k1415j231J3040K4952K1563j3138l9198j6596K2655K9429J1245p575
554D5001k1489k4595l73K9372K8991k999k8710k4014J80J8243K1526J1167j1878
567D0422l2566j8926J8468L1801P892j4502j7845j6886n563K0886K9821L11l2137
580A1176k5892M274J9115J3474L883o835k4219k2435J0441L3457J0843k1330k0832
593a4880p313l318R973K6078P722l0407l1145M931K2122R673J697k865j9873k5633
$$ y = [16372, -21184, -38904, -19132, 19061, 42404, 28059, -10469, -34526, -21341, 13960, 38076, 34670, 8412, -22583, -29075, 2998, 42971, 45460, 13471, -13458, -17673, -3522, 27130, 52331, 37824, -4984, -23818, -1715, 29172, 45752, 43411, 19560, -11709, -15159, 19568, 54839, 51077, 21270, -145, -1376, 11664, 36616, 58179, 45041, 5843, -10753, 11902, 41331, 52576, 45001, 23512, -1083, -1456, 27916, 56907, 53908, 25198, 1184, 1364, 19607, 41133, 52300, 40422, 7856, -11070, 7398, 39199, 47091, 32589, 14744, -2142, -7705, 13181, 43002, 43313, 11176, -14716, -10442, 8673, 22147, 26030, 19195, -5024, -27459, -17018, 16439, 27282, 5952, -14880, -22193, -25511, -15538, 10540, 18262, -12145, -43290, -38359, -16237, -6564, -4867, -7732, -27605, -53238]
607e3238N271L4018J5291j9996k1795n241j450N151K2712J4776k3569l4257J40
620f2187K5716J3497L5k817j4915k3401J841L3419K3029j5862k6663q622N059
633e1871J0801K0620J5612j7167l5367p866K9219K8093J013j2533j2329j5960
645d7735k628L1342L4827r375l8753j3516J6438J7119J5141J5407j0955l8820
657c1508j3951L6349L8974j705k2831j3922p758Q8K9015L7064o877m6777k0409
670b4248K4675K8911J1180N019j2550l5861j4448L7549M3319k158l2029k1505
682G854k584J0583K7457K7157r769m5019k5368K6505L9168Q615j2814j6524k3844
695A1417j1958L0755M4554k194m5115k7559R845K0657J8209J3705j0973m1360
$$ y = [-53238, -47967, -13949, 1342, -18654, -40449, -45690, -47140, -41989, -19277, -4501, -28070, -62327, -62187, -36471, -22974, -22939, -25756, -40671, -64072, -62231, -28812, -5783, -21645, -48308, -56930, -51871, -41070, -20450, -4838, -22005, -57372, -65238, -36019, -7926, -6913, -19446, -31775, -47735, -50363, -19021, 15806, 6431, -32322, -45838, -29400, -12281, 2860, 18267, 7312, -31508, -45459, -9110, 29864, 28159, 5328, -8594, -16352, -16264, 12751, 49815, 42938, -3839, -24248, 427, 29338, 40518, 45537, 32987, -2874, -17322, 20227, 63546, 61388, 29359, 7854, 5270, 15853, 43310, 70467, 60698, 15679, -9689, 16816, 55984, 64599, 51785, 35261, 11417, -541, 30214, 74768, 72574, 27459, -100, 9745, 30402, 48611, 62316, 51343, 9983]
707I983k5280K7203M4437N313k8292k2402j1160k698K3426L6997l194m9377k9400
720b4444J9292K8308J0171m51j1121l2465k1766K5644M3921K643l6893k5270K092
733b0339Q376J3587K2315K45l9718l1172J9238L6521O194j4789j2088j5425j3307
746d0362J6145L6020O151l5506k6580J0339J7037N812Q950L783k6804k8318J6095
759c7238L7152N048k0996j0411k642p667P852K7011R350k5933k5104P258K0308
772a6012O175Q47K113j1931k1153M069K9380J2284j6486j2927M81j700J276J8207
786e377J3606j4743k4351M12J9261R656l001J027j884j7388q439K4669K3082j2846
800C684k0994K083M729n075J1472K2431q085l0424n652K0618J2008j438J880k945
$$ y = [9983, -15297, 11906, 56343, 61656, 33364, 10962, -198, -2896, 20530, 57527, 54333, 4956, -24444, -5152, 23156, 33327, 32876, 21755, -10710, -32476, -6832, 37089, 39732, 2839, -22431, -20339, -11963, 1624, 23939, 24184, -15534, -46706, -27468, 9053, 15247, 458, -11630, -27055, -40362, -24217, 11803, 17954, -17552, -44132, -33793, -16756, -10944, -1994, 1789, -25015, -53333, -37238, -86, 4962, -16034, -26445, -29087, -36754, -28902, -1891, 7459, -18474, -43578, -36320, -16012, -9837, -8990, -6877, -18808, -39961, -35892, -6512, 5772, -10714, -23641, -23160, -24860, -23584, -5377, 8229, -6514, -30865, -30453, -11192, -1536, -4537, -3510, -5394, -22782, -31221, -6552, 16530, 3684, -17310, -15227, -10498, -15573, -4101, 18330, 10245, -20179, -25831, -5213, 6795, 5357, 7237, 4292]
814D292j9429r484K1875K6395n611k3099o628L726J97J1177K0873l541l0655j3985
828b3897J8445K0389L758m399q752j5490o101J5986K6114M105k4639k1335M874
841a0942J6511R939P781q14k3041k2480J4917L3422P463j8391j3561o493m342
854a0031J4152K8602M532l1170k6053J0655K3765R928J852m307k3172k0472J7426
867d293L6238O161k3331j7874m545K062J7296K4272k431l1411k1005J0436K3708
880A5283J4144j571j4816k1207q427J7576K8136O311k1504k4068l919J3550J8096
893A7584J0937n864k2244j9744N958K7757J7271j1740k1473j0479j37R799K2688
906B0313J0433k2941k9160J692K1575J1743K664l264j8100k0549P354K9772J2748
$$ y = [4292, -15137, -24621, -2746, 23649, 18038, -5061, -11689, -7963, -7766, 3411, 24284, 20743, -9912, -23897, -5452, 14937, 18695, 14296, 5544, -9946, -16047, -61, 26053, 30158, 5519, -15816, -10942, 5569, 15508, 23289, 22475, -566, -23046, -8129, 25293, 32756, 14365, 804, -5689, -10031, 4121, 32723, 37255, 6085, -19968, -9313, 14452, 24380, 26232, 21925, -1247, -21719, -4293, 31945, 38106, 14775, -3099, -7644, -5582, 11714, 35986, 33555, 2144, -18861, -8425, 15283, 29427, 27856, 13040, -8167, -16594, 982, 29118, 35429, 13925, -10143, -14062, -512, 17584, 28521, 22657, 413, -19331, -13373, 14384, 31655, 19915, -1558, -12037, -12174, -2375, 20313, 30746, 7805, -21355, -19663, 1912, 13655, 16319, 13055, -5045, -25594, -18240, 11532, 24280]
919B4280j5856j8812o690M13R844K0045O918k2383k3982K941J9344J1571J994
932I627o445j7721j3863J0038K2958R116j0963j6790j1474L938J6559J3260j038
945G202j4490j6625l930J6369J9162J028j4851j3402m320N100J5962J4174o758
958D621k1968j0875R857J5074Q081J17r566j7369n533J7577J9979j508j4823r461
972a5797m345L014J6446J5281q477k1669p237R548J2068R094K906j2607j7786
985a9561o30J6862J4730O48r959j3465o708Q598J7562Q651q071j5465q955M755
999a1008J5583J3333l076j5157j2201N88J1634J5396M741j2592j7182l332J2206
1012a067J3678O771n412j5815j2069N859J8875J1356o574j3643j0608o86J1727
$$ y = [24280, 8424, -10388, -17078, -16665, -6821, 13224, 20142, -2241, -26223, -23282, -3938, 7633, 9627, 3182, -14539, -28402, -18364, 4594, 13710, 2747, -14043, -25517, -21579, -5020, 8240, 7202, -7288, -23913, -27843, -11474, 7688, 8716, -6135, -19537, -23857, -18757, -2795, 11379, 4621, -17347, -28222, -18365, -3291, 4790, 4907, -4659, -22028, -27561, -9984, 9995, 8487, -6336, -15797, -20142, -17128, -682, 14599, 6122, -15547, -22784, -13236, -1168, 7926, 10832, -1775, -19561, -20191, -3329, 11401, 12049, 2090, -11375, -18083, -9485, 8077, 16728, 8657, -6808, -15763, -11008, 4575, 17908, 14832, -325, -12526, -11938, -304, 15092, 19833, 7241, -9941, -13273, -1067, 12611, 19382, 13970, -1845, -13914, -8055, 10820, 22176, 15602, 1959, -8649, -9335, 2392]
1025B392J7382L685j6097j6754m39J0991J2671P946o097j8941j0616R561J7279
1038A2963P964m549j3293j4109Q24J6414J4208r90j3422j4248l741J1539J6221
1051A5781N715j1068j6126p580P828J5877R601n381j5918j2864L552J6018J2335
1064A7770k209j2566j3925l994J2653J7853K203j2731j4000n688O417J6371J0510
1077A8664q211j7970r149N649J3406J2385j433j5235j4235K91J3404J4318K518
1090A4402j2090j5832m806R913J6250P128r049j6425q090N998J4693J1126k953
1103A0265j6401j2564K381J3894J2754J431j1918j5879l368J2154J4744N089q501
1116D081j5656q191P872J5344R275m897j4449j0851K592J4208J2381l61j2806
$$ y = [2392, 19774, 23459, 7362, -9392, -9831, 1160, 13831, 21777, 15680, -3261, -13877, -4316, 12963, 20927, 16378, 3085, -11024, -10200, 6214, 20422, 19432, 6010, -8238, -11979, -440, 15781, 21496, 10428, -5698, -13278, -5450, 10427, 20028, 14647, -1271, -14135, -10583, 5435, 17770, 15561, 2995, -10930, -14924, -2271, 15582, 17785, 5054, -8946, -14634, -8217, 8154, 18664, 10453, -7517, -16666, -11017, 2389, 14774, 13341, -1894, -16129, -15838, -2434, 11884, 14402, 2312, -13520, -18326, -8413, 7837, 14965, 5916, -10509, -18599, -12601, 2092, 13218, 10265, -6136, -18700, -16319, -2425, 10329, 11760, -158, -16037, -19405, -7251, 7493, 12582, 4081, -11575, -19766, -11894, 3450, 12725, 7828, -6621, -17472, -14880, -672, 11709, 11348, -1458]
1129a458j3552j570J1968J3629L987q819j4980o992R363J5539O341n289j2693
1142d526j0327K827J4616J1915k136j3101j1794o11J1970J3522K622r294j4029
1155h346n654Q994J5751N987q076j2384p717K925J3474J2788l321j4673j0577
1168a0829R43J1435J2337K298j0389j3025m806Q240J5500O444r654j4039n016
1181a0561M434J1044J1180j823j5569j1869L887J2496Q890J207r681j3340l728
1194a3433R303J3806N370q961j5132m985P283J0375P136q66j3355j3369L336J5320
1208A828Q071k943q288j0217m795Q437J4537M887j0342j4333l930Q348J0307N282
1222F849j977j0844j2363J770J5923J0045o059r614o630k509O220J3751N691j1139
$$ y = [-1458, -15010, -16580, -4612, 9017, 13004, 4185, -10795, -17787, -8424, 7115, 13456, 8167, -4526, -14853, -12026, 2590, 14505, 12369, -732, -12526, -13137, -1167, 12355, 14977, 5683, -8346, -14000, -5006, 10745, 16732, 8656, -3728, -11445, -8520, 4954, 17742, 14421, -252, -10829, -9886, 1549, 13886, 16184, 5795, -7230, -12036, -3796, 11704, 18148, 8494, -5545, -10561, -6127, 4917, 16097, 14274, -1295, -13164, -9277, 3219, 12109, 13316, 3635, -9705, -13433, -4130, 9676, 15046, 6085, -9047, -14032, -6749, 3626, 10762, 9896, -3459, -16828, -13492, 1828, 9899, 6956, -1332, -11549, -16344, -7907, 6630, 11517, 1175, -13158, -17088, -8740, 1567, 6849, 4872, -5972, -18335, -16565, -642, 9403, 3344, -6270, -12900, -15409, -9189, 4562, 10253, -886]
1236h86j3829k174R287R867M109k842r162j0489Q03J5325J1821n646j2666n177
1250a1659R42N852J0266O875p902j5833l417J1772J0723K280m000p035q355q01
1264a0292J3488J3518m165j4288n902L914N144P303Q088n559j5763n835J1765
1277A416J3169R99n662o026o417j992J0803J5079j585j7000q742O189P931M822
1291A2984N499k669j5896r098J1832J6448J381r019q323m501q76R313J4829N28
1305B2432j8141j3388O404J2926M724J159l196j3560j1782J0683K0308K521j4200
1318F890j0756k215K070Q200J2680N20j7723j5606N985J7371O477n042o688r508
1332g345r221Q177K1003M904j7996j5469J686P960O781Q250k07j6688j6426P047
$$ y = [-886, -14715, -16889, -7602, 2265, 6374, 3532, -5630, -16119, -15316, 9, 11830, 6184, -6482, -11659, -10717, -4865, 5401, 12276, 4374, -11459, -14876, -3104, 7619, 9899, 5899, -1136, -9491, -10292, 3196, 16714, 12549, -1739, -7641, -3727, 1417, 8720, 16808, 11249, -4514, -10349, 1416, 14585, 15584, 9922, 3896, -2521, -4513, 6290, 21369, 19784, 2784, -5958, 231, 8162, 12984, 18483, 15814, -82, -9180, 2652, 19100, 20481, 11462, 3139, -1362, -2238, 7075, 21904, 22432, 4291, -9097, -2693, 10233, 14957, 16116, 12920, -640, -12422, -1739, 18569, 21090, 6890, -3866, -6081, -4011, 4189, 16869, 17389, -334, -15940, -9955, 7416, 13893, 8851, 2163, -7345, -16566, -8389, 12614, 17518, -478, -15947, -14261, -6301, 480, 8730, 8523, -8165, -24591, -17544]
1346a7544K0959P287r920j1043n572l204O394J8225O424j8308j9449M682J4414
1359f655O253J369r05j2544j4880O479K2450P905j3571j3302j123K159N786J2552
1373A973N541j5691j8065M630J8123P104m610m883o297q841M174J9052R211j3723
1387b302j6034J349R126N070N076M295r961j6305K546J9304Q694q139p611j697
1401f589k947J135J3132J0409j0448j6341Q09J2915M250j397L448l002j3067j939
1415i632J6734J0293r316q882K202K22k064P935J0478n808j4639j674J1183O054
1429A3086l965R34J219q742o655J1337J2791n068j1311Q6L219l029K998J0429
1443A7329l28j3706o648Q652P807j050k044P51n219r031N043J5032J440j3282
$$ y = [-17544, 3415, 10702, 782, -10261, -15833, -19037, -12643, 5582, 12006, -6302, -25751, -21069, -6655, -402, 967, 62, -12482, -27362, -20883, 1567, 9472, -4099, -17401, -18524, -16365, -10579, 1973, 7514, -8177, -26242, -21612, -3489, 3615, -995, -5878, -12175, -21016, -16842, 2210, 11421, -2302, -18336, -16987, -7861, -2791, 2285, 6580, -3381, -19686, -17140, 2164, 10858, 2719, -4892, -6589, -9536, -8401, 4731, 15140, 4692, -11649, -10840, 2075, 6325, 4928, 8376, 5374, -7693, -9632, 7102, 17395, 8079, -803, 1399, 1621, -443, 7492, 17970, 12162, -2477, -4151, 7032, 13086, 9121, 10055, 11274, 2532, -4123, 7214, 20005, 14937, 3626, 3712, 6931, 3902, 6900, 17329, 17001, 3295, -3353, 5299, 13106, 12056, 10012, 10763, 5544, -3487, 1556, 16588, 18028, 4746]
1457D746n892M421kJ00R116M236j3770j2199P038J1965Q78m246j383n165p979
1472h136K758J5814N167j4026j1472L217M914J778N899L962j2051j5096N100J6303
1486D131M708p464o092m168n211M145J4214O541j3259j5671J664J0674N348J830
1500A390M75r723j3042L334J8062P798r696j1512k390J204M631J0859N934j1717
1514d393j6835J165J5319Q466l171l941o346r203K498J7832R735j1685j4278p47
1528a5584O085O064P197L031j0125j4383R07J6746J0124n457q761l962l121K745
1542h494J3904R594j1164j5735N1R875P306L037J17q555j0468J616J4130J0520
1556A5734n467j1539m313K325M431Q418O600p063j5419j706J2224Q329r78k346
$$ y = [4746, -1146, 3275, 3273, 3373, 12489, 16725, 2955, -9244, -2206, 9759, 10637, 6391, 5008, -157, -8136, -5378, 10436, 15603, 1577, -9895, -6678, -1764, 14, 5913, 9875, -2176, -17272, -12172, 4131, 8839, 1375, -4717, -8885, -14096, -9951, 4263, 10804, -2455, -18126, -16462, -5788, -440, 1390, 1865, -7858, -20900, -17566, 496, 8294, -1402, -12914, -15304, -14100, -9469, 1390, 7324, -4393, -21228, -20063, -4744, 3722, 551, -3390, -9736, -18939, -16441, 1391, 11126, -559, -14837, -15584, -9499, -3435, 3762, 6793, -3332, -17715, -16808, -62, 10062, 4605, -4156, -8118, -11239, -8494, 5410, 15004, 3840, -11895, -11844, -1969, 5337, 8374, 8491, -64, -10532, -8916, 5214, 15734, 10267, -1272, -5585, -3260, 1171, 9589, 16189, 9126, -6293, -7999, 4225, 12554, 11576, 9230]
1570I230n578p909P42J2112R145n274j0960m584L564N286M895L906l963j2377
1584a765m042J0388R463k087n120l270m674j230R375Q680m009j0865m487L533
1598a10N349L848J684l799q921m519P121J0309j63p129m680j929q16O131Q485
1613A0861j696j1162n794L772O298L399R84m018p561m564N856R650K104p003o642
1628e516j821J787M866P039j40r958p461K658Q315M469m23m632o459l529M166
1643f639R806L672p094q269j621L276N688N278k31q552p746J992R023N537j314
1658B806n744o002k287N024Q803L771o388r225k095N149O400M251j185q112p247
1673a2081K400R614N675k135o466o534q99O321Q069J934n615q722k388N441Q318
$$ y = [9230, 3652, -4257, -3515, 8597, 17742, 12468, 1508, -3076, 488, 5774, 10669, 14575, 10612, -1765, -5807, 4581, 14044, 11957, 6837, 3567, -1107, -2337, 7038, 15718, 11709, 844, -3643, -110, 5239, 9087, 10771, 6972, -1949, -6468, 653, 10962, 10799, 3670, -1010, -2939, -3755, 2376, 10861, 9165, -1997, -7791, -4019, 2279, 5678, 6662, 2644, -4917, -9481, -3625, 6025, 8129, 1126, -5516, -7337, -5550, -684, 6355, 6215, -3743, -11204, -8546, -231, 4238, 3815, -817, -7276, -10805, -6639, 3167, 6839, -255, -8524, -10145, -6869, -1181, 4097, 3866, -4686, -12432, -10440, -1417, 4120, 2806, -2938, -8940, -11227, -6203, 2600, 6371, -17, -9242, -11337, -6188, 212, 4463, 3278, -4834, -12081, -9681, -67, 5608, 3473, -2993, -9527, -10426, -4105, 3964, 5898, 283, -8439, -10827, -5386, 2932]
1688B932K852l408p037n383J992Q731O504k425p924n359M63O023P730P02n725
1703F68p888k452O060Q505K446n100o846l405K322P793O529l055q275m640J729
1718e609O000O359J402o529p852j021O411P454J701m189p358l314L748P566M450
1733I219k546p401n207K036O920O032j53o524o806j1N584O747K303m980p516k538
1749d841M613P258L314k751p471m615K252P428N576j617o474n427m83N674P035
1764I471J435n645p154j730M443O722L469l420p570m760L562O903M221j407o544
1779A996n813J06O455O003Pn602o313j972M391O946K752m562o637m075K823P035
1795C540L933k368o206n390p5O492N570k39n684n940k140M658P079J731m767n978
$$ y = [2932, 5784, 2376, -4661, -10044, -8052, 679, 7183, 4758, -3166, -8525, -8062, -2039, 5691, 6393, 668, -7220, -9672, -3612, 4893, 7339, 2239, -4607, -8012, -5690, 2103, 8632, 5577, -2698, -7338, -5609, 391, 6750, 8152, 1623, -6229, -7250, -839, 6615, 8316, 4127, -3231, -6545, -2797, 4769, 9219, 6673, -728, -5935, -3899, 3021, 9053, 8900, 2376, -4430, -4441, 1143, 7890, 10193, 5213, -2303, -4841, -228, 7030, 10344, 7593, 122, -4493, -2241, 5187, 10763, 9146, 2672, -2755, -3238, 2436, 9471, 10906, 5261, -1893, -3623, 820, 7542, 11011, 7591, 21, -4739, -1177, 5726, 9947, 8540, 1996, -3817, -3711, 2744, 8747, 8754, 3152, -3161, -5133, -742, 6204, 8956, 4394, -2243, -6318, -3495, 3540, 7473, 5105, -1101, -6491, -6566, -74, 5496, 5257, -427, -6367, -8507, -3849, 3230, 4961, 194, -5784]
1811e784l368J996O875M479l050p078m064J030N164N719K56o365o777N4N151N413
1827c49J969m364o637l090L649O564M005l299o653l901K307N065M948O73o373
1842e486o663M73O234N376P69m070n952k657M066O940L252l134o804l354L445
1857g565N706M061o73m678o049J82O930N892j14m634m438j688L759N982L964l190
1873C447p083l142M417O253K313o42l741n375n07O916O946j381n413l767j62K936
1889B015N318L791k964o945k694M516O294J714j977l254m174n95N586O764o17
1904A2778o576l833P85K801M321L636k945p030l005L590O783K112l074m157k665
1919C521p06L443P411P33q096n322K011L742K406K628j473o875n007L762P319
$$ y = [-5784, -9152, -7156, -281, 4198, 1148, -5930, -9994, -8964, -3800, 1919, 2175, -4190, -10967, -10913, -5762, -349, 1620, -2744, -9381, -12471, -8822, -2258, 1747, -1552, -8205, -12106, -9799, -4734, 214, 887, -5486, -12149, -11676, -5442, -66, 703, -3367, -9319, -11976, -7910, -970, 2282, -852, -7656, -11010, -7565, -1859, 2202, 1529, -3149, -9198, -9016, -2086, 3806, 3692, -942, -5380, -7068, -3309, 2673, 6637, 3447, -3636, -6778, -2361, 3892, 6205, 5563, 1822, -3553, -4060, 2856, 9802, 8421, 3008, -759, -921, 2015, 7333, 11124, 8160, 1215, -1479, 3037, 9331, 11045, 9068, 5814, 1640, 1045, 6631, 13395, 12778, 6202, 2369, 3154, 5955, 10276, 13912, 10967, 3937, 932, 4522, 11305, 13417, 10343, 6186, 3521, 2815, 6258, 13669, 14402, 6306, 984, 2995, 6737, 9143, 11771, 10298, 3423, -1584, 2178, 9497]
1934I497K291m028m660k347l47K791O193J800p236p767J531O165K025J22p05n882
1950e57o176K932R201K517n822n249k118L51L103N268J757o936q828P19P955M153
1966B270k054k743l700n734J610R569M755p019q233p42K731L201L817J744o607
1981g135q617K67R223N721l365n199k353k564P99Q388N731o951j0303j06O818
1996i646L769J107Q67n013p820N32J0235O509m552p740j447J172J862O313M809
2011I57n306j0744l65R325N539j601k370k213m725K0R064P181m990q956n86M829
2027d941K267K365M002k979r102j057R712O392l674m231L5j587m09O149O683l775
2043E850q636q39O669K951o46J393j31o497k382Q359O733m012n728R26J337j189
$$ y = [9497, 11788, 7760, 3100, 753, 406, 3197, 9390, 11190, 3954, -3813, -2282, 3883, 5908, 6030, 5325, -557, -6733, -3801, 5400, 7917, 2095, -3154, -5272, -4921, -1818, 3450, 5207, -1729, -10557, -9838, -1883, 2270, 216, -2527, -6227, -11961, -10351, -782, 3973, -3046, -11279, -12021, -9290, -6089, -2272, -528, -7135, -15752, -15485, -6262, -541, -3906, -9105, -11458, -14022, -13223, -4835, 896, -6055, -16358, -16464, -9646, -5877, -4770, -3903, -8916, -16736, -16204, -5969, 540, -4012, -11752, -13199, -12027, -10165, -3852, 957, -4349, -15093, -15458, -6133, -594, -2195, -4565, -6778, -11503, -11483, -2419, 4762, -228, -9184, -9770, -4941, -2674, -309, 3693, 714, -8388, -9445, 267, 6659, 2985, -1246, -1211, -2798, -3207, 2942, 9625, 5850, -2786, -3625, 3044, 5995, 5349, 6742, 6611, 114, -2268, 6091, 12824, 8812, 3084, 4010, 5347, 4158]
2059D158K707O045j482q044j948O266L856k425p53J830l084m770M167P574j454
2074A2643p033j93L558j676r10N192J949o792m552M400M337j942k009J904o71
2089H205n731L14P712J639o586l294L555l43k517L486M398m798p964J923O686
2104F685j02k652N12p32n728j532P723M769n858o602J477J922j004K115N158l923
2120B228r577p37Q091L992m149k127n42l944j800P183O407m970r271o03N565J295
2136b959K88K893k486q951j882R563O390m469n946j161k99P7N328O237l862j1154
2152a2393j653Q250M867j524r47j912o359j789R381P749m470q715j727L472K058
2167e712L536M031l196r560l077R246P742k943m890r23k290j221P048P754m060
$$ y = [4158, 6865, 12910, 11428, 3384, 1436, 7702, 11558, 9133, 8380, 10210, 7126, 2356, 6523, 14097, 12643, 5610, 5417, 8975, 7299, 6389, 11581, 13530, 6738, 2186, 6586, 10923, 8981, 6972, 8876, 8205, 2474, 2788, 10500, 12139, 5553, 2259, 5814, 5471, 2954, 6440, 10838, 6040, -1924, -1, 6685, 6583, 3931, 4443, 3711, -2017, -3549, 4174, 8943, 3085, -3517, -2040, -118, -1122, 993, 6151, 2228, -7349, -8086, 5, 3997, -152, -2279, -2821, -6765, -8565, -1382, 5025, 55, -9216, -9819, -4254, -2959, -2671, 222, -2264, -11215, -13097, -3534, 2856, -1613, -7559, -8720, -9019, -8942, -3614, 2623, -1239, -12393, -14046, -5796, -929, -2453, -3400, -5312, -11671, -13460, -4079, 3670, -800, -9515, -11242, -7770, -5712, -2176, 1855, -1341, -10901, -13978, -4732, 3010, 67, -4823, -5746, -8036, -9257, -2209, 5545, 1485]
2182A485j0025j747O138M179O43J191k417o892j626P595Q221l057p364j330J745
2197c261O44L337O159k313r840k605P782M929j333j431j356l685j939O164O836
2212H088j964p759j642L617K037O06L190m46p116l446O671O095k573l081m48j171
2228F58j604L659N629q98o687k527L600K976k01Q97N19m103l583L380O669q65
2244G519m389p67M60j136Q42M891J057n653l755K579L853L0m88N31j944m247J485
2261H68O122J196m154k390J014l73n92M006K633m345n046J170L949J159j089K27
2277D355j593l573j79N482L235l803m275K90P29M62K663K320l800n274L37L857
2293A233K757p84j659k293k439M03M032L523k343n613j375K687J403R41J774k410
$$ y = [1485, -8540, -10287, -4149, 30, 673, 1864, -553, -7445, -9071, -1476, 6745, 3688, -3676, -5006, -3261, -2617, 720, 6879, 4566, -5274, -7879, -97, 4832, 3499, 2068, 712, -2973, -4912, 1252, 8088, 6124, -1635, -3277, 340, 2377, 2983, 6173, 5727, -1389, -4835, 1836, 7931, 5358, 2277, 1829, 658, -946, 2713, 8342, 7444, 757, -1770, 1830, 4806, 4605, 5502, 6021, 1918, -1665, 1715, 8384, 7519, 3130, 2363, 2823, 1687, 2529, 7420, 8477, 2824, -931, 1648, 5501, 5531, 5043, 5574, 3630, -617, 868, 6990, 8186, 4032, 1642, 2656, 2283, 1691, 5697, 8330, 3985, -1061, 109, 4058, 5217, 4128, 4355, 2762, -811, -990, 4492, 7727, 3924, -351, -61, 668, 1130, 3793, 6113, 2313, -2961, -2624, 1233, 3990, 3206, 1547, -746, -3185, -2782, 1250, 4773, 2430, -3183, -4558, -1871, -468, 473, 2247, -163]
2309a63n529n93M541L611j414k734k510j273P33L653L076j932n350k577K636L884
2325a941K75j90j768m319j431M913M409j422l839k004j003J729L676K048j910
2340b777m893k104K509M477J212j793k041k654n39L693M287m75m223k357M68K276
2356d934K838J617j762m170j439K798L983J369k116k438j435P90K874L759l77
2371A357l771l048J334K798K835R40j659l380j122K652M042J216j937k738j292
2386a773J191L176K641J28l780k477J009L105K557M81k047k935n88K310L484J414
2402G896k132k872j280J366K903K138m99k809k817M42L349K433k39k269k579r31
2418B100K548K836J141k242l391j671K173L005J002o61l148k422K37L242K386
$$ y = [-163, -5692, -6285, -1744, 1867, 453, -2281, -4791, -6064, -5331, -1678, 1398, -534, -5884, -8461, -5825, -1941, -1666, -1856, -3624, -7943, -9374, -4461, -52, -1474, -5313, -7317, -8320, -6591, -2915, -867, -2777, -7670, -9774, -7265, -2788, -1576, -3369, -5410, -8064, -8603, -4910, -623, -1098, -5321, -7678, -7210, -4934, -2096, -479, -2241, -6411, -7850, -5052, -1069, 300, -1816, -4254, -5689, -4899, -2025, 1734, 1357, -2414, -5462, -4128, -1330, 1505, 2445, 786, -2594, -3716, -1064, 2978, 4194, 2257, -481, -1773, -582, 2594, 5235, 5363, 1583, -894, 115, 3220, 5777, 6258, 4211, 1276, 688, 2998, 6482, 7896, 5764, 2892, 1612, 2978, 5881, 8019, 7520, 4711, 1894, 2336, 5685, 8118, 7879, 5610, 3031, 2100, 4648, 7484, 8625, 6383, 2992, 1321, 3494, 6499, 7501, 6840, 3692, 1270, 1507, 4749, 7135]
2433G135n80k899k536o14K097K524P60k339l192j112Q67L009J730j728l023j969
2449a870K62K473K233m29l301k523n6J637K924L76k912k646j265J862K485J467
2465G17j506l398j859Q56K504K064k63l377k423J26K475K659M57k528k976r45
2481g417K455K582Q88j314l038j430R50K606K208o38k743k102L66K572K302N12
2497a241k175k634n82K238K834J099j541k305j703J645K963K015o98k688k207
2512d980J162K722K062J51j836k143p63K443L148Q13k154k057q96J215K680J917
2528C484n51k687k181J392L191J556n87j375j943r32K013L627M25k625j873m25
2544E09J124K466J570q69k324j886N82L012J873r44k149j131p93J326L177J195
$$ y = [7135, 6555, 3656, 1120, 506, 2603, 5127, 5887, 3548, 356, -756, 111, 3120, 4850, 3122, 99, -1870, -1608, 865, 3098, 2669, -632, -3155, -3211, -1574, 1350, 1726, -1186, -3832, -5097, -3235, -750, 717, -789, -4187, -6046, -5190, -2686, -622, -885, -4262, -6685, -6559, -4084, -1425, -968, -3496, -6472, -7417, -4962, -2380, -1492, -2806, -5844, -7274, -6324, -3718, -1510, -2148, -4891, -6993, -6627, -4055, -1753, -1241, -3416, -6050, -6632, -4394, -1560, -461, -2002, -4307, -6010, -4365, -1402, 613, -85, -2773, -4980, -3818, -1096, 966, 1117, -719, -2862, -3625, -1182, 1966, 2779, 625, -1432, -2328, -1113, 1567, 3484, 2933, 246, -1935, -543, 2648, 4204, 3617, 2242, 299, -633, 1380, 5007, 5432, 2807, 934, 509, 1633, 4099, 5669, 4800, 2476, 590, 1172, 4184, 6057, 5113, 2964, 1833, 1040, 2366, 5543, 6738]
2560F738l066k758K25J593J353J315k60l004j991P37L037J531r76k609j020m42
2576D03J184K533J291k458l795j32K815J156R7Q9k150k734M73L250J721j414k482
2593a53j093o3R05K178J463j917m099j191L602K200n13p63j530k367j69L711K633
2610B834j981l418j334J191J506J118J378j485m127j270L860L019j053k097m92
2625b351j533n52L183L428j773m799j089K272J794R39O94j251l565j576L764M166
2641A751j050l558j073L18N1K260L400j407n279j494L639K943k73q89o16k257
2657c534j316L102M389j171m639j076K225P87K84K399m61m652j491L715L784j471
2673H74k161p4q19p78K282L515o35m321j876K909K442r79L53P00k847k481L165
$$ y = [6738, 3672, 914, 1139, 2732, 4085, 5400, 5140, 2136, 145, 882, 3919, 5450, 4474, 1865, 845, 403, 1587, 4120, 5411, 2953, -842, -974, 1841, 2997, 3094, 3183, 1033, -1701, -1228, 2022, 3743, 2329, -153, -1246, -1309, -404, 1774, 3237, 1320, -2779, -3970, -368, 1832, 1319, 556, -974, -3341, -3510, 201, 2834, 853, -2565, -3899, -2708, -1202, -84, 1294, -191, -4318, -5588, -1728, 1291, 238, -1859, -2351, -3884, -4436, -1253, 2175, 402, -4397, -5486, -3214, -1420, -481, 213, -1038, -4603, -6179, -2415, 1751, 701, -2857, -3930, -3612, -3561, -1301, 2099, 692, -4587, -6081, -2442, 501, 228, -661, -1277, -3534, -4850, -1748, 2641, 1470, -3169, -4245, -2020, -1233, -949, 1450, 989, -3663, -5154, -1439, 2345, 874, -1287, -1361, -2180, -2958, -676, 2839, 2204, -2117, -3993, -1084, 1358, 379, 732, 1432, -1415, -3896, -731]
2690g31M378j352l546J70J179r83M68K961J62l760j926L249K211j138j537J477
2706A282m32k724R83M277j83m084l09K805o23j675K045J952k635k839K437K443
2722B720r66j728J304J218k797j348L708K232l496j764K844j34k316N87L974r80
2738C058l983q7L254K40k071J230J627k666k870L142L567j437l356N22J978k195
2754d7L21L680O44m908k044M036J956j761m91J300j779l004K291N103n84n103
2770c90j098K920M41r88K681J056m836l468M063N044j454l212M0l80j875J487
2786C1N205K29o076l298M075K816j253J72Q46l599l456L360O023r17n113j521
2802b476J848L0P76L096O38o005l499M048N220j221k962m08o56k901K586N536
$$ y = [-731, 3647, 2295, -1251, -1081, 98, -885, -417, 2544, 2706, -1054, -2980, 269, 2480, 1342, -195, 1282, 850, -1874, -891, 3386, 3203, -881, -1190, 1615, 992, -683, 1362, 3314, 679, -2160, 277, 2720, 1754, 26, 1330, 2548, -249, -1597, 2111, 4343, 847, -917, 1927, 1793, -523, 64, 4038, 3058, -925, -1012, 2242, 2482, 411, 1641, 3268, 602, -2268, 874, 4441, 3004, -352, 170, 2148, -47, 274, 3954, 4598, -310, -2354, 1682, 3638, 1877, 1386, 2686, 907, -2097, 194, 5297, 4713, -390, -1488, 1432, 1873, 885, 3566, 4622, -214, -3682, 381, 5425, 3971, 759, 799, 419, -1456, 31, 5236, 5465, -611, -3909, 166, 2982, 1729, 1901, 2747, -852, -4308, -948, 5075, 4158, -955, -2476, -628, -598, 178, 3274, 3912, -2093, -5592, -1544, 3676, 2455, -507, -915, -1571, -4472, -1886, 3650]
2818C650n82o466k215L377K006m10P69K23l964l097L472N663p91n216r06J442
2834c045o03O06L813Q49o065l030L701M178j435j912O80j473k457K148N037k05
2850G87n211j692K693J154p15J664P56l477l053L090M556r69l638P78Q16j728
2866d189O60L791O65m013k377L019K262j059p84J983j015l099J718M135m50l248
2882b001kJ848q9j296K162J679k359k290K120K937j359j435J858Q14k641j76L009
2899B779J074k530r43K579k65j653Q12K962p92l154O07K411kj482O79J746j768
2916C060k037K233K514j598k053J305O72j758L36K760K75l509j064K168J309r38
2932C675l33J000j286k325J008L561k08l296m41J320l95p09K142Q81l379k252
$$ y = [3650, 3068, -3398, -5613, -2236, -230, -640, 129, 352, -3612, -6709, -3237, 2426, 1635, -3581, -4487, -3045, -3648, -3042, 771, 1620, -4445, -7475, -3774, 404, -1031, -2943, -2263, -3736, -6193, -4045, 992, 787, -4424, -6116, -3423, -2269, -2984, -1320, -564, -4041, -7094, -4004, 552, -417, -4055, -3277, -2461, -4189, -3529, 262, 927, -3086, -5463, -2444, -182, -1241, -2025, -42, -1057, -4156, -2438, 1697, 1247, -2001, -2003, -155, -244, -1540, 622, 2301, -58, -2348, -228, 2709, 1350, -85, 1773, 2587, -54, -230, 2779, 3853, 1323, 380, 2959, 2694, 1041, 1853, 4815, 4023, 869, 1476, 3887, 3885, 2403, 3082, 4828, 3060, 1023, 3256, 5770, 4172, 2119, 3424, 4096, 2338, 2674, 5434, 5709, 2200, 1136, 3304, 4613, 3675, 3342, 4342, 3056, 731, 1739, 5300, 5092, 1796, 1355, 2675, 2280, 1571, 3713, 4594, 1215, -1037]
2948a037J904K329n63j052l41r59j396O67K933O44l208k213J356J304l48M50P64
2965A234k242k757J522L148n7k278p60k76m69O81K206L89k793k506J219K497J51
2982a091q34j19j193k175J042L697L90k902j367L94O39O37J537Q6j965j867M67
2999d624K794O61p30j569l18n51O04K773Q56k459j974J006J005P94P88j17j136
3016b197j395K03K570R86j020j157k3K65J11J913R83j803k064R54J570R12J43
3033I51l82r35q64M51J995N84n50j335p37J238O33Q25Q69q69k317J94J976O92
3051B419j40R2j245o71M38J298Q50k06j797m09O29O15P39K26m87j429p02J571
3069A791J097k90n53q88p63PJ735P91o68j132q02J17J112O81j05o90p57j087R77
$$ y = [-1037, 867, 3196, 2633, 1581, 1240, 281, -1115, -448, 2485, 3129, -79, -2292, -936, 368, 20, 470, 1234, -1008, -3765, -2243, 905, 848, -1430, -2190, -2466, -2935, -2254, -48, 341, -2452, -4958, -3739, -1242, -1091, -1925, -2044, -3237, -5412, -4370, -673, -283, -3185, -4552, -4158, -3519, -2882, -1345, -1259, -3224, -5091, -4624, -1830, -1169, -1899, -3468, -3786, -4337, -3733, -960, -104, -2563, -4537, -3531, -2526, -1732, -944, -1061, -2197, -3592, -3389, -819, 167, -853, -2010, -2033, -1768, -1657, 256, 1239, -564, -2628, -1674, -104, 808, 951, 569, -366, -1230, -779, 1216, 1800, 1250, -85, -822, 416, 1049, 1874, 2743, 1874, -443, -249, 1727, 2419, 2279, 2371, 1126, 455, 893, 2191, 3041, 2835, 1038, 629, 1258, 1873, 2612, 2838, 2351, 922, 220, 1791, 2888, 2598, 2045, 1157, 394, 401, 2136, 2927, 2259, 1127, 325, 442, 1554, 2235, 2130, 1440, 683, -404, 573]
3088E73J735J43j405j095j53K17J240R02r22j362n97M23Q84P80N8j355o03q4O89
3107F8J021K63q95j263k12L41R29Q14p2j564r08M78J480M93l27p83j289R4R03
3126d29J047K18r80j025n7P73Q54J73l89q97q76R04J007N20k66j120q55J7J090
3145b91Q43K81r20r79l95R10J044K03l21q64j266Q53J126P08l46j019o09m35J287
3164a90P43N3o82j201m53R84J204K59q12r31m72M73J131P41q26r49m88K34P12
3183d70P42k12p11p92n8O13R51K68r20p45l22L69R20R50o83j436m73M22Q07P50
3203c0L83j019j119k7R16Q68J21p06o37k20K8J044J026p14j303l24L90J023K81
3222a9L68p71j094m25J565R25N02j201j070L25R5R93O32N1j383q52R14J017M09
$$ y = [573, 2308, 2451, 1046, -49, -202, 15, 1255, 2157, 1235, -127, -724, -301, 583, 1363, 1421, 66, -537, -621, 68, 1089, 1352, 457, -806, -1018, -677, 252, 1066, 994, -570, -1478, -1000, 480, 973, 646, -137, -1426, -1332, -429, 618, 836, -144, -1169, -1226, -453, 401, 574, 185, -712, -1588, -684, 323, 843, 577, -543, -1398, -1381, -291, 552, 833, -87, -1066, -1461, -551, 493, 696, 375, -489, -1755, -902, 224, 932, 586, -433, -1042, -1477, -190, 553, 606, -76, -1277, -1730, -746, 458, 717, -95, -1026, -1498, -1025, 106, 847, 21, -928, -1416, -1182, -470, 272, 60, -651, -1443, -1501, -888, 63, 331, -589, -1334, -1656, -1287, -367, 583, -100, -1536, -2009, -1587, -780, -30, 353, -666, -1785, -1812, -896, -28, 93, -613, -1250, -1470, -1442, -398, 628, -86, -1389, -1713, -1323, -300, -19, 349, -422, -1516, -1941, -376, 549, 1051, -150, -1220, -895, -800, 193, 825, 876, -507, -1359, -445, 572, 981]
3241I81l1n67q18m27J006J577j7j081j232L22R19O56N13j37j299q39O42J609R6
3260A873k44p52k76q14J162J738k89j322j144M18J040O20K07L2j177j137Q32J742
3278B509J16j229k70n4n63M43J498J42j833j112P62J386j24K03p37k06j183K82
3296C0K229L91k246j041R12J38m30J466M14j864j728J135J714L1o84n70m80o11
3314a194J05J746N12j610j805J206J157q32J02R10r19k158R13K056j32j624k39
3331a806P66m96m07J005P09j360j503R99J372j01j571J114L24j468o54K353K72
3348d52j670k72Q25K11r03L33J181j81j699N96J454k80j106L85J558j105j639
3365b764J493J687j139j246J483M60j520l53K246N40j922l44J273N96j264M50
$$ y = [981, 950, 383, -435, -862, 144, 1721, 1704, 623, -609, -287, 632, 1288, 1801, 1664, 365, -474, 168, 1777, 1873, 1629, 877, 601, -213, 949, 2687, 2398, 1076, -68, 350, 1390, 2010, 2217, 2249, 1072, -65, 767, 2509, 2625, 1396, 1126, 1072, 509, 952, 2450, 2592, 759, -353, 409, 1795, 1671, 1874, 1137, 931, -252, 30, 2259, 2650, 404, -637, 275, 413, -17, 1449, 1863, -1, -1729, -594, 1120, 1151, 467, -103, -583, -1194, -1089, 657, 1169, -441, -2246, -1040, 117, -715, -613, 297, -622, -2780, -1867, 189, 57, -1567, -1806, -1040, -1536, -1943, -938, -229, -1589, -3092, -2093, -721, -822, -2393, -1279, -955, -2423, -3077, -724, -452, -2122, -2394, -1569, -1358, -2261, -1928, -747, -928, -2627, -2031, -577, -857, -1963, -1578, -20, -1125, -2764, -1271, 416, -723, -1969, -486, -26, -1546, -1899, 347, 887, -1035, -1379, -106, 490, -774, -324]
3381c24J511m75j932L24K739n29j292K77J135j032r29J911J627k008j952J648
3397F99J596n80o74R84J07k185n9K677J323k346j442J838q5r73J118K046j873
3414B171k737J189K461J68j651L63K52j490q02L008J667k742k585J456J856q68
3430A716p4J331r97l047K70L645Q55k559j341J022j09o12J814J488k446l221J037
3447a228L434q3j842M70k04k183j25L624J354l412k592J535J326n61N02J215j749
3464e19k794M57L649P05k436j431J066j74r71K382J611k988k741J222L240p52
3480d74j276P39m49j995J95L579M64k979j536J434J084j117P71J554j243k623
3496c872R08L276j36k861M82J272q14r22J961J715k523k231K190J778q38j030
$$ y = [-324, 1187, 712, -1220, -896, 1843, 1314, 22, 299, 1434, 402, -527, 1384, 3011, 1003, -949, 699, 2295, 1715, 1041, 2025, 2132, -53, -112, 2565, 3888, 1542, 100, 1938, 1853, 880, 1998, 4044, 2171, -566, 623, 3084, 3252, 1601, 1964, 2216, 726, -76, 2932, 4599, 1857, -728, 728, 2584, 1716, 1642, 2973, 1976, -1071, -801, 2844, 3699, 1140, -201, 821, 712, 100, 1914, 3402, 956, -2265, -1228, 2206, 2123, 281, 751, 547, -1636, -1761, 1863, 3217, -195, -2787, -1252, 74, -487, 15, 1230, -519, -3313, -2856, 793, 1498, -938, -2369, -1303, -1477, -2448, -66, 1545, -1443, -4184, -2962, 278, -474, -1750, -1011, -1460, -3455, -3260, 319, 783, -2196, -3732, -2298, -1214, -2331, -1560, -6, -1249, -3872, -2964, 312, 176, -2685, -2203, -931, -1745, -2667, -706, 1009, -1514, -3745, -1555, 223, -615, -1645]
3512a645J251J21j898J8L088K94k621r68K179N72j443L92J948r81j967J040K514
3529A894n19k666R54J863j086j316J938Q18j904j068K108J184j934o25J492O76
3545A809j522k12J828l27j543J45K458o61k088K76J961o67j319J494Q72j410j914
3562h20J861J911j356j774J011R27j128k19J611K31k249q77K257J071k145n7J057
3579A312q44j106J083K182j490k451O54J518O9p78P70K38j952p71J874J741j498
3596E51j626J46Q27q06M58J768o61k307p22K638N19j080l51K69q21n62J439J777
3614A456j375k270M67J746J5o13O98k87j585n89K592J171j570j419O61M25o07
3631a084O76J154n11k176k70K199R42j080m38N87j198l75J617J513j257j794L36
$$ y = [-1645, -394, -273, -2171, -2153, 935, 1229, -1392, -2360, -181, 391, -1052, -660, 1288, 307, -1660, -620, 1894, 1375, -1291, -337, 1526, 440, -876, 1062, 1880, -24, -1092, 1016, 2200, 266, -359, 1133, 1809, 287, 75, 1903, 1576, 33, 178, 2636, 1975, -113, 163, 2124, 1457, 138, 1632, 2504, 1094, -820, 1041, 2952, 1596, -178, 833, 1760, 632, 413, 2024, 2255, 6, -871, 1386, 2457, 312, 255, 1312, 468, -638, 445, 2627, 1137, -1314, -660, 858, 927, 149, 919, 1157, -795, -1566, 308, 2049, 551, -1075, -929, -102, -908, -450, 1318, 657, -1650, -2372, 266, 785, -295, -646, -377, -1198, -1760, -321, 1456, 81, -2189, -1722, 24, 39, -574, 124, -163, -1748, -2337, 255, 1426, -144, -1563, -902, -477, -1084, -408, 746, 235, -1941, -2211, -12, 930, -150, -588, -1, -1199, -1574, 43, 1556, 299, -1495, -1159]
3648a159J199j11R3M91r4j534o28J913J316j366o80Q17l42p71R86J204p28j692
3666a086M64J191K80m25q1J53p33q16J260J344j031j216M46Q09l56k43R42L50
3684A252j774m20J292K56l59q9K54o24l80O39R92j66r48l81P23j19l59J46M25
3703C60l26j165J275K59k10j46k4l46m32J66J349m30q39k26L10M75k37L10Q1Q0
3723B84j125K58Q12k05l06j06K87n56K64P18M9q01k59M45K11O5K9L32j79k38n04
3744e25O73O91l50m57j14Kj2L89R55r44n34J16M75M13q6p7l95j26K38M88L37j38
3766A019m20k24j36K49R5O64n15n55m30R93N46j76k71m86k8L42K07K76j5q00j12
3787B23PM23K29o4Qr34J75O61M06m98J02o38J12l7L19L22m34m51l02K53M17K17
$$ y = [-1159, 40, -71, 22, 513, 419, -1115, -1743, 170, 1486, 120, -560, 257, -85, -856, 130, 1334, 606, -1086, -622, 569, 849, 424, 343, 496, -237, -1053, 207, 1551, 520, -696, -250, 559, 203, -40, 902, 1252, -522, -942, 350, 606, 247, 158, 412, -212, -592, 47, 1039, 873, -75, -456, 267, 148, -211, -65, 360, 34, -1131, 144, 403, 193, 47, 23, -323, -755, -589, 760, 330, -509, -735, -425, 50, -187, 123, 204, 284, -841, -583, 229, 24, -282, -388, -101, -657, -393, 325, 374, -427, -686, -241, -30, 35, 64, 396, 217, -21, -525, 148, 839, 489, 32, -82, -80, -92, 297, 1252, 308, -226, -110, 365, 778, 692, 615, 220, 94, 332, 820, 1157, 1019, 599, 375, 239, 488, 583, 1247, 732, 177, -253, 740, 1286, 1110, 839, 353, 325, 667, 874, 1150, 1135, 335, 223, 230, 653, 882, 818, 826, -108, 67, 728, 1134, 636, 738, 100, 212, 175, 494, 816, 382, -69, -371, -118, 299, 516]
3809E16k02j47q49J81K97L94q3l43l54l96O90J44m05L07m13p06L19N49J57k20
3829e64m97j83j62O17L52j88k84p29M2L04L17N9l5n21K36l07L59Q22m34n63j9
3850a378pJ31N16Q1o15n31N81M5N58K53k42o78j85L52O58K80m21k08k6R5pM28
3872c20K61j20o47M0L87K69M87j93k85P3j40R14Qk02l42l32L58K66L15L18m45
3893F70k86K14K31K63j20K12l79m62L76O86L6j22n56K1L19R1J37K32l96k87l25
3914E55Q91L32k84O5p03L8O0N30J98j60p50n5J58K31L03J07m30n65l59P23L20
3935A205j97l90q9M8k83L93M19k99j024J20J82L63kl33q3l61k43L87P07o10o35
3956g25o5M88k20j51K85K83r27k73O64M71p16L11k56l6m39K72O25n01n85J76O64
$$ y = [516, 314, 167, -682, -501, -204, 190, 107, -236, -590, -986, -296, -152, -557, -250, -663, -1369, -1050, -501, -344, -564, -1061, -1244, -1406, -789, -437, -625, -909, -1638, -1596, -1292, -975, -916, -951, -1472, -1236, -1543, -1184, -362, -796, -1359, -1378, -1385, -1254, -738, -657, -1272, -1803, -1222, -1177, -619, -366, -608, -1286, -1471, -1119, -461, -181, -602, -810, -836, -741, -748, -320, -59, -179, -826, -786, -399, -130, 357, 164, -121, -48, -188, 726, 734, 532, 190, -142, 216, 482, 797, 1115, 670, 384, 598, 829, 1092, 972, 1184, 805, 343, 719, 1405, 1441, 1319, 763, 784, 1103, 1194, 1331, 1563, 1167, 880, 555, 1446, 1778, 1494, 1559, 856, 894, 954, 1484, 1682, 1522, 772, 717, 875, 1106, 1409, 1516, 1086, 521, 162, 885, 1205, 1008, 618, 529, 577, 294, 687, 1106, 807, -217, -97, 85, 448, 446, 113, 30, -331, -574, -187, 520, -90, -725, -790, -302, -522, -673, -388, -105, -1032, -1305, -641, -170, -886, -575, -831, -867, -1306, -1034, -409, -910, -1495, -1319, -655]
3977f55l13m08L77M17o98m41N51P55p52k86K95M41o59j88Q32q3k06m11M65M42
3997e25n25L6N40k41o15L04Q70l12l99K96N50m44n49O57O80l66p14M21N86l17
4017f7m41J018P9r97j95J075K91n45j90Q88n58q51J158Q49m69j267K62Q80J31
4036A051r61J084L59j166n79J120Q99j128m51R09n3q13K98J530k49j874m4J279
4054A211M48q90MO48q55j100J263J469q30k044Q99P16o70j2J184r4k026R6J251
4073F68J055q46q73M35l90k43M07J305m56j850l11J617J21r94K58P01j155j016
4091a567K107R58j514j345L49J133j87n69J239k12j740l91J713R95j205j239J270
4108b05k68p15O53J768r32k271N61J542k81l74M79J84j243q70K178J002j336j485
$$ y = [-655, -968, -1376, -999, -582, -1280, -1721, -1170, -415, -1167, -1453, -1158, -717, -1376, -1564, -732, -815, -1021, -1432, -967, -525, -1050, -1014, -474, -715, -1330, -1026, -156, -468, -867, -571, -21, -465, -1014, -357, 323, -43, -757, -336, 250, -67, -508, 510, 589, -408, -603, 472, 763, 218, 28, 916, 358, -493, 665, 1514, 1045, -222, 40, 920, 1051, 90, 1174, 1533, 367, -212, 908, 1807, 679, 228, 1137, 1084, 271, 569, 2099, 1850, -24, -68, 1211, 1659, 769, 773, 1421, 566, -534, 729, 2198, 1368, -676, 223, 939, 269, 257, 1441, 1347, -679, -583, 668, 1723, 877, 4, 439, 49, -194, 213, 1518, 1062, -788, -1099, 518, 639, -355, -97, 604, -551, -1567, 540, 1498, -16, -1361, -1012, 121, -66, -635, 604, 392, -1348, -1739, -26, 969, -236, -1475, -205, -473, -1188, -535, 1233, 301, -1970, -1409, 133, -148, -522, -43, 141, -1102, -1972, 206, 1208, -128, -1613]
4126a613R10J144j137K0J078K12k265j45K551J25j414k55P01n0j016Q63J697j507
4144a01j534R90J416k29j156L00J091j438p45K024P78j592j337J590P41p89j14
4161a05Q85k67j562O16J615l5k014J43J413m9j192P54N00r90j156J344J936j360
4179D76j495J044P44q93m67J054O16j823m18J857O81j949m19J381o6j050N96J281
4197A150r89j258O03J403n83r55P36K98j079o13J580J462j934j425J161Q98l10
4214A45p04J077m52j576O17K017K9j970m29J579j82o80P34Q04r87j365N59J998
4232A214n30j329N56K90k57n52J301P35j857j036J749N41o80J1L85m26j115N80
4250d20J819q1j931k86J393L69o41L70P50j524p05J023J273n00j372P32K66o01
$$ y = [-1613, -703, 441, -696, -676, 402, 614, -1651, -1796, 755, 880, -534, -789, -88, -138, -1154, -291, 1406, -101, -1635, -645, 771, 542, -614, -314, 777, -661, -1406, 618, 1396, -196, -1533, 57, 798, 9, -105, 780, 513, -1049, -433, 1182, 1147, -867, -724, 689, 640, -552, 202, 702, -288, -1444, -100, 1836, 476, -1019, 25, 769, -124, -591, 463, 1079, -744, -1162, 695, 1376, -573, -992, 389, 323, -727, -131, 1150, 161, -1097, -494, 909, 326, -629, 107, 405, -674, -1287, 293, 1755, -179, -1604, -443, 455, 145, -559, 518, 66, -1510, -893, 1124, 1153, -817, -1246, 333, 151, -529, 205, 1009, 22, -1343, -784, 1214, 684, -645, -89, 201, -56, -608, 693, 1428, -429, -1465, 284, 825, 145, 156, 541, 115, -1000, -420, 1399, 1318, -613, -899, 494, 863, 222, 592, 1342, -182, -887, 136, 1409, 909, -463, 269, 535, -66]
4268f6Q5J241M8j407r10J293J094j107l57R19l49j215Q84J332l35j588J56Q44
4286E62j93K3K34N78j040r13R39J077p87r52P24o0n33j7J254R3j843K0R41L15
4306D22o46K3K42j61p54L02J331o55j006K98O52l82n55P00O26r14p24Q38L40n71
4326e94j96M11j16j07o5L84L32j445K21Q37K64j001K29O39l55p26N28Q94n21q63
4346a250O19K83m24k24J17O63m54m88O34K37l61l21P64K23j125J98O12j16l29
4365g42K75M52l21n22M93M75l69k21J58M65j9m24N07L97l79l80L71L61l34k54
4385a1N54l94j26K71M18J31k23m76M30Lk9O9N14p80k74P43lJ57j42M2j17m9J17
4408H25L87j92k69j89R9K75Q2l18J00K9n32L95L66L4n78k77Q66n98k57M31K24
$$ y = [-66, 19, 1260, 1308, -99, -1009, 284, 1378, 271, -86, 833, 484, -731, 153, 1485, 1150, -438, -282, 562, 369, 392, 626, 1204, 164, -749, 190, 1267, 480, -472, 252, 192, -341, -358, 896, 989, -854, -834, 107, 422, -224, -201, 41, -120, -874, -572, 759, 104, -902, -604, 48, -334, -889, -189, 437, -477, -1201, -363, -23, -594, -790, -379, -495, -602, -667, -283, 49, -1396, -1175, -338, -74, -1075, -846, -207, -562, -1288, -760, 134, -387, -1250, -631, -348, -772, -996, -879, -216, -670, -1158, -524, -287, -648, -969, -205, 18, -1107, -909, -297, -413, -742, -467, -15, -336, -858, -365, 110, -259, -480, -322, 143, 124, -300, 207, 604, 225, -155, 216, 577, 243, -11, 543, 149, 23, 294, 712, 843, 620, 144, 574, 577, 548, 617, 1131, 351, 77, 820, 817, 974, 832, 874, 757, 708, 825, 1212, 1020, 751, 562, 661, 936, 1018, 700, 800, 829, 297, 692, 1058, 1092, 514, 237, 1103, 505, 248, 679, 903]
4429I03o23k77L28R9L3j02j13m4j72L50k44M18j74p31k1M42j18O2j8j09m19J74
4451c56M04j53j60J88j80k62m8K49L63l23j53k11M8M7k77K91l85L1K08P2L31l68
4473f44l06pL97q3j29O2K26l31RK41j13J56j38K18j39l18L97K95l54m2l25M57
$$ y = [903, 280, 3, 331, 430, 463, 361, 248, 204, 32, 382, 138, 556, 382, -349, -370, 72, -46, 16, -2, -111, -530, -356, 48, -105, -265, -77, -257, -519, -567, -318, 45, -278, -431, -642, -594, -547, -824, -533, -918, -887, -679, -607, -276, -644, -950, -957, -560, -643, -772, -710, -484, -815, -806, -565, -678, -522, -660, -442, -581, -899, -502, -207, -561, -603, -928, -471]
$$ [...]
8191b79
##END NTUPLES=NMR FID
##END=
