##TITLE=1H_LR-697-K1
 DMSO-d6, 8 sc, 
 25.10.2019
##JCAMPDX= 6.0         $$ Bruker NMR JCAMP-DX V2.0
##DATA TYPE= NMR FID
##DATA CLASS= NTUPLES
##ORIGIN= UXNMR, Bruker Analytische Messtechnik GmbH
##OWNER= root
$$ XWIN-NMR		Version 3.5
$$ Fri Oct 25 16:15:00 2019 Russian Standard Time (UT+4h)  she@DPX200
##.OBSERVE FREQUENCY= 200.1315
##.OBSERVE NUCLEUS= ^1H
##.DELAY= (6, 6)
##.ACQUISITION MODE= SIMULTANEOUS
##.ACQUISITION SCHEME= undefined
##.AVERAGES= 8
##.DIGITISER RES= 18
##SPECTROMETER/DATA SYSTEM= spect
##.PULSE SEQUENCE= zg30
##.SOLVENT NAME= DMSO
##.SHIFT REFERENCE= (INTERNAL, DMSO, 0, 15.7039)
##AUDIT TRAIL= $$ (NUMBER, WHEN, WHO, WHERE, WHAT)
$$ ##TITLE= Audit trail, XWIN-NMR		Version 3.5
$$ ##JCAMPDX= 5.01
$$ ##ORIGIN= Bruker BioSpin GmbH
$$ ##OWNER= she
$$ F:/spectra/data/she/nmr/H-F/1/audita.txt
$$ ##AUDIT TRAIL=  $$ (NUMBER, WHEN, WHO, WHERE, WHAT)
(   1,<2019-10-25 16:13:19.89 +0400>,<she>,<DPX200>,
      <created by zg, POWCHK disabled, PULCHK disabled
       configuration hash MD5:
       00 E9 B6 7A A2 85 ED C7 34 08 36 98 17 FE 4E 26
       data hash MD5: 16K
       F3 74 AC 52 B5 6E AA 4E F1 FE AA 5C D4 B8 D3 0A>)
$$ ##END=
$$ 
$$ hash MD5
$$ 65 55 92 1E 21 A7 11 4A 2D 16 12 B8 75 2C 9B 63
##$RELAX= 
##$RELAX= 
##$RELAX= 
##$RELAX= 
##$RELAX= 
##$RELAX= 
$$ Bruker specific parameters
$$ --------------------------
##$DU= <F:/spectra>
##$EXPNO= 1
##$NAME= <H-F>
##$PROCNO= 1
##$TYPE= <nmr>
##$USER= <she>
##$AMP= (0..31)
100 100 100 100 100 100 100 100 100 100 100 100 100 100 100 100 100 100 
100 100 100 100 100 100 100 100 100 100 100 100 100 100 
##$AQSEQ= 0
##$AQ_mod= 1
##$AUNM= <au_zg>
##$AUTOPOS= <>
##$BF1= 200.13
##$BF2= 200.13
##$BF3= 200.13
##$BF4= 200.13
##$BF5= 200.13
##$BF6= 200.13
##$BF7= 200.13
##$BF8= 200.13
##$BYTORDA= 1
##$CFDGTYP= 0
##$CFRGTYP= 5
##$CHEMSTR= <none>
##$CNST= (0..31)
1 1 145 1 1 1 1 1 1 1 1 1 1 1 1 1 1 1 1 1 1 1 1 1 1 1 1 1 1 1 1 1 
##$CPDPRG= <>
##$CPDPRG1= <>
##$CPDPRG2= <>
##$CPDPRG3= <>
##$CPDPRG4= <mlev>
##$CPDPRG5= <mlev>
##$CPDPRG6= <mlev>
##$CPDPRG7= <mlev>
##$CPDPRG8= <mlev>
##$CPDPRGB= <>
##$CPDPRGT= <>
##$D= (0..31)
0 1.2 0 0 0 0 0 0 0 0.06 0 0.03 0 0 0 0 0.0002 0 0 0 0 0 0 0 0 0 0 0 0 
0 0 0 
##$DATE= 1572005599
##$DBL= (0..7)
120 120 120 120 120 120 120 120 
##$DBP= (0..7)
150 150 150 150 150 150 150 150 
##$DBP07= 0
##$DBPNAM0= <>
##$DBPNAM1= <>
##$DBPNAM2= <>
##$DBPNAM3= <>
##$DBPNAM4= <>
##$DBPNAM5= <>
##$DBPNAM6= <>
##$DBPNAM7= <>
##$DBPOAL= (0..7)
0.5 0.5 0.5 0.5 0.5 0.5 0.5 0.5 
##$DBPOFFS= (0..7)
0 0 0 0 0 0 0 0 
##$DE= 6
##$DECBNUC= <off>
##$DECIM= 24
##$DECNUC= <off>
##$DECSTAT= 4
##$DIGMOD= 1
##$DIGTYP= 9
##$DL= (0..7)
0 120 120 120 120 120 120 120 
##$DP= (0..7)
150 150 150 150 150 150 150 150 
##$DP07= 0
##$DPNAME0= <>
##$DPNAME1= <>
##$DPNAME2= <>
##$DPNAME3= <>
##$DPNAME4= <>
##$DPNAME5= <>
##$DPNAME6= <>
##$DPNAME7= <>
##$DPOAL= (0..7)
0.5 0.5 0.5 0.5 0.5 0.5 0.5 0.5 
##$DPOFFS= (0..7)
0 0 0 0 0 0 0 0 
##$DQDMODE= 0
##$DR= 18
##$DS= 0
##$DSLIST= <SSSSSSSSSSSSSSS>
$$ [...]
##$SUBNAM2= <"">
##$SUBNAM3= <"">
##$SUBNAM4= <"">
##$SUBNAM5= <"">
##$SUBNAM6= <"">
##$SUBNAM7= <"">
##$SUBNAM8= <"">
##$SUBNAM9= <"">
##$SW= 24.0689530833862
##$SWIBOX= (0..15)
0 0 2 0 0 0 0 0 0 0 0 0 0 0 0 0 
##$SW_h= 4816.95568400771
##$TD= 16384
##$TD0= 1
##$TE= 0
##$TE2= 300
##$TE3= 300
##$TEG= 300
##$TL= (0..7)
0 120 120 120 120 120 120 120 
##$TP= (0..7)
150 150 150 150 150 150 150 150 
##$TP07= 0
##$TPNAME0= <>
##$TPNAME1= <>
##$TPNAME2= <>
##$TPNAME3= <>
##$TPNAME4= <>
##$TPNAME5= <>
##$TPNAME6= <>
##$TPNAME7= <>
##$TPOAL= (0..7)
0.5 0.5 0.5 0.5 0.5 0.5 0.5 0.5 
##$TPOFFS= (0..7)
0 0 0 0 0 0 0 0 
##$TUNHIN= 0
##$TUNHOUT= 0
##$TUNXOUT= 0
##$USERA1= <user>
##$USERA2= <user>
##$USERA3= <user>
##$USERA4= <user>
##$USERA5= <user>
##$V9= 5
##$VALIST= <valist>
##$VCLIST= <CCCCCCCCCCCCCCC>
##$VD= 0
##$VDLIST= <DDDDDDDDDDDDDDD>
##$VPLIST= <PPPPPPPPPPPPPPP>
##$VTLIST= <TTTTTTTTTTTTTTT>
##$WBST= 1024
##$WBSW= 4
##$XGAIN= (0..3)
0 0 0 0 
##$XL= 0
##$YL= 0
##$YMAX_a= 165160
##$YMIN_a= -287284
##$ZGOPTNS= <>
##$ZL1= 120
##$ZL2= 120
##$ZL3= 120
##$ZL4= 120
##$ABSF1= 10
##$ABSF2= 0
##$ABSG= 5
##$ABSL= 3
##$ALPHA= 0
##$AQORDER= 0
##$ASSFAC= 0
##$ASSFACI= 0
##$ASSFACX= 0
##$ASSWID= 0
##$AUNMP= <proc_1d>
##$AZFE= 0.1
##$AZFW= 0.1
##$BCFW= 1
##$BC_mod= 2
##$BYTORDP= 1
##$COROFFS= 0
##$CY= 11.3945322036743
##$DATMOD= 1
##$DC= 2
##$DFILT= <>
##$DTYPP= 0
##$F1P= 19.5091578491511
##$F2P= -0.509923556040331
##$FCOR= 0.5
##$FTSIZE= 0
##$FT_mod= 4
##$GAMMA= 1
##$GB= 0.15
##$INTBC= 1
##$INTSCL= 1
##$ISEN= 128
##$LB= 0.24
##$LEV0= 0
##$LPBIN= 0
##$MAXI= 10000
##$MC2= 0
##$MEAN= 0
##$ME_mod= 0
##$MI= 1.114404
##$NCOEF= 0
##$NC_proc= 0
##$NLEV= 6
##$NOISF1= 3.799351
##$NOISF2= 2.8
##$NSP= 1
##$NTH_PI= 0
##$NZP= 0
##$OFFSET= 15.70392
##$PC= 1
##$PHC0= -9547.954
##$PHC1= -16.99912
##$PH_mod= 1
##$PKNL= yes
##$PPARMOD= 0
##$PSCAL= 0
##$PSIGN= 0
##$REVERSE= no
##$SF= 200.130013532006
##$SI= 16384
##$SIGF1= 3
##$SIGF2= 2
##$SINO= 400
##$SIOLD= 16384
##$SREGLST= <1H.CDCl3>
##$SSB= 0
##$STSI= 0
##$STSR= 0
##$SW_p= 3612.71676300578
##$SYMM= 0
##$S_DEV= 0
##$TDeff= 0
##$TDoff= 0
##$TI= <>
##$TILT= no
##$TM1= 0
##$TM2= 0
##$TOPLEV= 0
##$USERP1= <user>
##$USERP2= <user>
##$USERP3= <user>
##$USERP4= <user>
##$USERP5= <user>
##$WDW= 1
##$XDIM= 8192
##$YMAX_p= 0
##$YMIN_p= 0
$$ End of Bruker specific parameters
$$ ---------------------------------
##NTUPLES= NMR FID
##VAR_NAME=  TIME,          FID/REAL,        FID/IMAG
##SYMBOL=    X,             R,               I
##VAR_TYPE=  INDEPENDENT,   DEPENDENT,       DEPENDENT
##VAR_FORM=  AFFN,          ASDF,            ASDF
##VAR_DIM=   8192,          8192,            8192
##UNITS=     SECONDS,       ARBITRARY UNITS, ARBITRARY UNITS
##FACTOR=    0.0002076,     1,               1
##FIRST=     0,             0,               0
##LAST=      1.7004516,     0,               0
##MIN=       0,             -287284,         0
##MAX=       1.7004516,     165160,          0
$$ Real data points
##PAGE= N=1
##DATA TABLE= (X++(R..R)), XYDATA
0@%%%%%%Qj6J6j6K4l2M0n6O4p2Q9j11J34j58J82k11K50k88L29l81M36m94N62o37
30c38P19q09R07j015J136j268J411j569J743j931K138k370K624k904L217l565
46a874L959m407M914n501O189p007Q002r236J0817j2937J5938k0548K8633m6937
60b9995J63255o510k82303M9345J22291J12162L0567k0653j58675j07793Q2323
71d5986J74717J1040r8266o8827j5108j1718O1624Q7335k6050j29910k9203R3984
83C632N9981l7017m2127l0392k5159L5517R0359k472j13388n2223Q5883P8987
95E1581j8526m7542l1193l6347R532R2747O4607o4547r7001k492O0507M6496L0814
108E8636p458q5480p8392N6357J30539L1694q1504p1463o742L2896O3611N0984
$$ y = [0, 0, 0, 0, 0, 0, 0, 8, -8, 8, -8, 16, -16, 24, -32, 32, -40, 49, -62, 72, -86, 96, -115, 135, -153, 176, -205, 231, -263, 299, -338, 381, -428, 479, -536, 600, -668, 743, -826, 917, -1014, 1124, -1246, 1378, -1526, 1691, -1874, 2085, -2322, 2592, -2909, 3280, -3727, 4275, -4961, 5856, -7081, 8857, -11691, 16942, -29995, 133260, 126750, -155553, -106208, 16083, 128245, 158812, 138159, -20516, -128309, -45986, 128731, 139771, 41505, -27322, -42430, -54148, 7476, 94811, 68761, -61149, -90352, 3632, 63613, 26596, -15531, -45923, -71082, -35565, 54794, 52322, -61066, -113289, -27406, 51581, 33055, -14487, -45680, -82027, -72495, 20252, 84859, 20312, -76689, -79181, -18674, 27822, 58636, 51178, -34302, -112694, -56337, 74202, 105896, 24392, -47071, -53813, -20917, 42694, 93678]
120I3678m3045j03220k2713Q3061O4785j3864l6076k8883k9676R872O7872L5251
132G7042o0122o9801R651N2616K9818M185k5405n9536k7855O1651P2107k3956
144D0395q1367k8348L5765M1118K3909k197m9510n5808J6145P2211K9217l7437
156D093m1900j4243N100L5353N1353j512o9142m8160L4968O1746J9755k1114l6150
169a9853l0998J2335O0937L7977l9929o0780j598M2844K8635L360j3582l1233
181a1885k1552K8314N0222M745m2541l3084L405K4217L2057J7895k9957n7084
193c5248r059N5687M7122j5369m9147l2635K659L7184M5462O89n4500m5362J6716
206c5801M7644K3070j1776k9124l2417p715L7548M5278m349m7102l1814J1013
$$ y = [93678, 50633, -52587, -75300, 7761, 72546, 58682, 22606, -6277, -35953, -26081, 41791, 77042, 16920, -52881, -43230, 9386, 39204, 43389, 17984, -41552, -69407, -7756, 64351, 40395, -40972, -69320, -33555, 7563, 31472, 29275, -20235, -76043, -59898, 12313, 41530, 4093, -37807, -52050, -46950, -11597, 39756, 38244, -30898, -79058, -44090, 17656, 37411, 16297, -19853, -50851, -38516, 22421, 60398, 20469, -40311, -41909, 935, 29570, 32930, 19348, -11885, -33437, -5123, 45099, 49844, 7303, -25781, -22376, 1841, 33898, 51793, 21836, -35248, -44307, 11380, 58502, 43133, -6014, -38649, -35990, 1194, 46656, 47345, -7155, -52517, -35801, 11843, 34913, 23137, -5987, -38404, -46119, -8571, 36707, 32358, -14744, -46558, -35545]
218c5545L2754K8636K51l6640l8137J0605N0224K6350k5110l6790r476J7624K7780
231A2526J7175j2924l5391j4548K6957L3890L735k0998k3659r651J5255L4221
243B6588J7229k6712m1852n366L4425L4278J833k8772l5718p534L4312M0163j618
256D1256m1132l1186Q043L0507K4305q40k7333l2348k764L2928L0275m686l0754
269c729k6752J61K6700L0924N48l5731l2765Q606L7938K2478j2713l0704j9888
282c4927J0042L1874K0437j4133l2330j3480J7714K5988J2037j0986k4547j5850
294b8161J2242L0782J5842j6823l0188j0616J8185K9024J2867j9199l2117r536
306b7698K4754L1589K828k5321k5236j632K2272K3937K788k2608k5280q27K2525
$$ y = [-35545, -2791, 25845, 26096, -10544, -48681, -38076, 12148, 38498, 13388, -23402, -32878, -15254, 12526, 29701, 16777, -18614, -33162, -6205, 27685, 31420, 10422, -13237, -22888, -7633, 26588, 43817, 17105, -24747, -30113, 4312, 38590, 40423, 11651, -24067, -31601, 2711, 42874, 41256, 124, -31062, -23019, 7488, 31793, 30953, 3620, -28728, -31492, 1436, 31711, 27025, -3729, -30481, -30320, -3620, 27304, 27852, -7879, -40644, -32038, 5900, 28378, 15665, -15039, -34927, -24885, 6989, 27426, 13293, -19037, -32517, -14803, 11185, 23222, 12236, -12311, -28161, -15919, 14863, 30705, 13882, -16306, -26922, -8737, 20287, 33154, 13955, -18162, -27698, -2944, 28645, 31473, 6152, -19084, -20716, 1556, 25493, 28281, 5673, -19607, -20434, 2091]
319B091K2284N72k1594k3574k885K2201K5910N5k7005k5450K968K6660K2207m969
333A9471k7651k1822O650K7870J8989r985k6402j5481R875K3501J5012p491k3154
346a0618j5976Q483K4483J5582q786k4210j4725J0168K6016J4929j2514k6483
358a3651j1522J5853K6141Q663j6304k3494o688J7044K2531N536j6694k0876m327
371a7788J6517K0097M421j5934k0865m650J6767K1186L739j8340k2131k955J9752
384a84K1522j40k1847k0675K337K1391J7586m179k1100j6238M433J9559J4777
397A7242m801j9418j4533M686J9236J4719m593k0316j4671N984K1382J4323p861
410A1379k1334j3055J0066K2044J0967j0829k1065r162J2789K0215P613j2461
$$ y = [2091, 24375, 24947, 3353, -20221, -23106, -905, 25005, 25060, -1945, -27395, -24427, 2233, 24440, 19471, -8180, -30002, -23352, 4518, 23507, 13522, -12880, -28361, -18486, 5015, 20027, 12536, -10618, -26594, -18111, 6372, 21954, 13168, -11042, -25767, -15599, 10417, 25346, 12832, -13651, -25173, -9320, 16821, 25484, 9180, -14314, -21002, -3958, 18573, 24109, 7415, -13461, -17788, -1271, 18826, 23247, 7313, -13552, -18202, -1435, 19751, 23490, 5150, -16981, -19936, -184, 21338, 21198, -649, -21324, -18987, 2404, 19990, 15811, -5289, -21527, -17094, 2465, 17242, 12441, -6977, -21510, -16824, 2412, 17131, 12538, -7778, -22449, -16465, 4917, 19240, 11379, -9955, -23010, -12944, 9100, 20067, 9238, -11827, -20989, -8200, 12015, 19628, 7167]
422G167j8248o297J1943J8350O522j1317j8547n931J2417J8852N610j2969j9350
435a1798n064J5180J8850L155j6594j8476j314J6827J6536l26j6724j5726L57
448a5117J5835J5109k132j6007j4173J686J5148J3716j635j5671j4498K255J6868
461A384J3672m234j7290j2831N526J7668J1681o733j7907r903Q573J7324P503
474A4433p861j5459p285P666J6056P944q359j5731o789R382J5404P008q517j6339
488h447o788J0726J7139N089j1990j6007l135J1816J4801K854j2209j5414j223
501a2788J3228J3516k75j2591j2223m17J0849J2779R04j2792j3616O45J3695J1805
515A2719j642j2874j2137J111J4279J2179l561j5755r593N047J3692Q701m700
$$ y = [7167, -11081, -17378, -5435, 12915, 19437, 8120, -10427, -16358, -3941, 14911, 20521, 7552, -11798, -16862, -1682, 17168, 20323, 3729, -14747, -16061, 766, 17302, 16976, 252, -15474, -15117, 718, 15827, 13695, -2312, -16485, -14799, 349, 14065, 12430, -3241, -17739, -15484, 1384, 15056, 10822, -6468, -19299, -13773, 3895, 15576, 8843, -9064, -18967, -10394, 6930, 14433, 6572, -8887, -16172, -8506, 7550, 15494, 7135, -8596, -15385, -6003, 9401, 16409, 7892, -8447, -15235, -4509, 12630, 17719, 5729, -10278, -13413, -1597, 13204, 16058, 3849, -11565, -12788, 440, 13956, 13681, 1090, -11133, -11550, -701, 12078, 12982, 190, -13426, -12781, 914, 12719, 11077, -1797, -13934, -12823, 1456, 13635, 10074, -5681, -15274, -10227, 3465, 12166, 7466]
528G466j2692r271M517J4315P926o386j2522o170N602J1550P958m657j3937p735
542a4036P652J4298N748q293j2202m465P193J3453M499r628j3429j791J0503J1156
556A0658Q55q428j0300k806R075J2174J343j1356j1276J23R940J0613J058r986
570A687j2388q83J2666J1769k725j2508r576J855J0890J0179q41j2404j0366L136
584i509J1778P162l426q900p795J324J0301R260k791j1450p661N039J0043N488
598H863l442r361o586M266J1666N858p300j0436k531O146Q880L445n544j0411
612f487l279Q289J0495J197q366q668j552O399R920L244q562j1523j035J0687
626G59R294n31q681q939j433Q401J0722K29j0577q944J982R057O369m76p264q707
$$ y = [7466, -5226, -14497, -9980, 4335, 12261, 5875, -6647, -12817, -7215, 4335, 12293, 7636, -6301, -14036, -6384, 7914, 13662, 5369, -6833, -11298, -4105, 9348, 13847, 4219, -9210, -11001, -498, 10658, 11513, 3085, -7215, -10021, -946, 11228, 12571, 1215, -10061, -9938, 2, 10615, 11673, 1687, -10701, -11584, 1082, 12851, 10126, -2382, -11958, -10103, 787, 10966, 10125, -2279, -12645, -9509, 2269, 9431, 6005, -2895, -10690, -9366, 935, 10195, 7404, -4046, -11707, -6668, 3375, 8863, 5421, -3940, -10526, -6260, 5406, 11264, 3964, -6472, -9003, -2857, 6023, 9468, 3924, -6487, -9766, -1477, 9018, 10215, 1849, -6819, -8371, -1972, 7948, 11192, 2630, -8893, -9928, 759, 10053, 9522, 841, -8098, -9531, -1130, 9592, 9821, -756, -9700, -7718, 1339, 7708, 7232, -32, -8739]
642h739m23R376Q523k545q951n422K032O994O307j081r074p462L908J0156M806
657H405n092p756l263L704P832M675m885r965k652O264Q666K010m799p448l385
672g689M314R574L645p490r391q88O847P085K339n027r003k933O925R437L80p883
688B42o625J43N663O652J874o973p770j13P902N554j637n948m819K06N721P144
704G216p99q665o113K733P951M224k818o270n057K261Q153O042m413r251l082
719g888L805O957L924k786p240m862L715Q843L590m965p087k671K920O557M804
734G616l037q359l643N430P079J508m682n251k493L563O849K352n237o585k6N365
750D49M526k35m114n337j526N979O390o04o676m586J313N307M738m96n914o463
$$ y = [-8739, -9162, 214, 8737, 6192, -2759, -8181, -6149, 845, 7152, 6071, -3003, -10465, -6557, 3599, 8405, 3313, -4443, -7706, -4002, 3830, 8505, 3620, -6345, -8997, -2733, 5933, 7943, 3144, -4304, -7689, -3375, 6199, 9844, 2354, -7037, -7925, -1078, 6007, 8346, 3319, -5684, -8617, -1692, 7745, 8125, 242, -6383, -6240, -577, 6075, 7949, 976, -6794, -6907, 995, 6549, 4912, -1036, -5855, -5649, 72, 7216, 6417, -2248, -8361, -5628, 2323, 6547, 3729, -2541, -7598, -5337, 2816, 8858, 4445, -4806, -7888, -4083, 2874, 6798, 4012, -3228, -8090, -4375, 4468, 8058, 3093, -3994, -6665, -3745, 2812, 7616, 4579, -3780, -7423, -1993, 5086, 6594, 1912, -3339, -5832, -2269, 4580, 6932, 1695, -4890, -4916, 449, 4975, 4740, 626, -4711, -6237, -258, 6132, 5528, -1148, -5734, -4421, 886, 5624, 5128, -786, -7249]
766g249J548P610N429k578o608m553J658N692N441j323p425n098K993O888L452
781E877k030n339m022J052O217M518k722o550k938L382N124K949k372n728l041
796e623L035O503J972m565m706q80L384M288J807l555n651j300N199N141l37m719
812gm095l15M372N167L26n513n523O17O049M173q94m978m700N67N140N018p14
829D690o021m100J431M928L814p10m882m281J121N329L830k157m844k917J678
844c091M212L532j699n010l159K675N151K475l020m539k288K617M942K365l155
859B008n103j662L756M447R30k771m513j475L203M725J129m033m564j37L574L927
875C441J010l837m661l33M009M457q4m329l580J31L759L820J67m091m089O80M536
$$ y = [-7249, -5701, 1909, 7338, 4760, -1848, -6401, -4743, 949, 6390, 5067, -2358, -7456, -4463, 2425, 5877, 3847, -1492, -5514, -4462, 1755, 6273, 3551, -2999, -5937, -2555, 2569, 5518, 3146, -2582, -5623, -2588, 3915, 5887, 1322, -3384, -4264, -880, 3408, 5215, 1660, -3991, -5291, -92, 5049, 4712, -7, -4102, -4417, -45, 5122, 5448, -65, -5588, -4971, 1078, 5251, 4357, -621, -5321, -4754, 386, 5404, 4690, -1331, -5431, -4000, 928, 4742, 4032, -850, -5131, -4010, 1319, 5149, 2992, -1852, -4769, -3091, 1121, 4653, 2954, -2056, -5215, -2540, 2611, 5086, 2066, -2473, -4761, -2144, 2798, 5163, 2008, -3095, -4757, -1001, 3446, 4376, 1605, -2908, -4383, -1180, 3545, 4674, 641, -3923, -4060, -486, 3441, 4451, 614, -4047, -4380, -371, 4086, 4002, -327, -3907, -3776, -17, 3803, 3970, -121, -4210, -3530, 1006]
892A006K584p24l770l383Q82M014L931j480m381l186J951L913K758j737l665l025
908d312J672M529K419k009m281k288K137M281J871j830m283k200K280M643J611
923D240k570m024j288K219L738J506k630l803j226K692M075P93k709l677j035
938c699K778L811O47l255l294j53L121K958J50l009l281M38K910L388m06l549
954d45k921M98L383K689o68l383k773R60L813K426j339l538j985J024L169K692
970C602j324l678k358J682L655J726j397l315j721J416L714J636k184l358j407
985c311K207L126J024j798l483r59K491L023P11k238l151o14K009L402K53j967
1001G25l216j52K378L064m7k620k641j47K272K894J38k441k737Q4K737K348m17
$$ y = [1006, 3590, 2866, -904, -4287, -3405, 609, 4540, 3060, -1321, -4507, -2556, 1357, 4115, 2378, -1287, -4312, -2640, 1889, 4308, 2299, -1982, -4270, -2133, 2148, 4019, 2189, -2094, -4294, -2014, 2629, 4240, 1670, -2354, -3642, -1423, 2315, 3821, 1191, -2612, -3838, -1146, 2929, 3722, 1013, -2664, -3699, -921, 2890, 3537, 282, -3012, -3165, -44, 2914, 3064, 55, -3226, -2788, 122, 3510, 3104, -445, -3366, -2868, 515, 3204, 2536, -847, -3620, -2660, 1153, 3579, 2240, -1298, -3283, -2259, 910, 3602, 2278, -1400, -3758, -2076, 1579, 3305, 1908, -1407, -3128, -1712, 2002, 3638, 1454, -1904, -3311, -1104, 2022, 3046, 1248, -2235, -3194, -703, 2320, 3031, 793, -2358, -2972, -963, 2439, 2692, 725, -2491, -2643, -265, 2799, 2752, 132, -2509, -2656, -384, 2510, 2648, 207, -2530, -2446, 291, 2639, 2222]
1018B222k670k207L58K735K328n25l200j890P05K865J970o81k875k201J185K929
1034A048J696j203k699j732J362K950J388j420k811j771J545L403R06j483l059
1049a880r68J709L071P20j803l107l97J714K911O36k342k152o27K003K468P02
1065B658k481k104m08K048K801j68k025k313k04K225K475l34k240k245J83K391
1081B59K143j43k785k086P34K745J519m79k791j657R23K475J607m16l051j529
1097b532J004K419J739j197k478j472J274K526J345j618k423j599J838K602J111
1112B539j284l122p57J955K287N78j605k506m31J598K490M28j443k910j40J766
1128e57K321K62j552k441m4J904K467o46j423k384N18J693J688N13k506k226Q63
$$ y = [2222, -448, -2655, -2297, 438, 2766, 2241, -959, -2849, -2144, 721, 2691, 2010, -865, -3066, -1881, 1048, 2744, 1541, -1158, -2890, -1528, 1422, 2810, 1390, -1421, -3192, -1647, 1756, 2662, 1179, -1880, -2848, -1139, 1932, 2652, 849, -2258, -2655, -941, 1970, 2606, 264, -1888, -2515, -512, 1956, 2658, 177, -1927, -2335, -287, 2514, 2346, 321, -1992, -2196, 29, 2504, 2170, -70, -2315, -2132, 259, 2402, 2259, -526, -2612, -1878, 867, 2386, 1907, -884, -2541, -1618, 857, 2464, 2048, -1003, -2532, -1528, 891, 2630, 1433, -1045, -2517, -1243, 1283, 2628, 1010, -1413, -3012, -1174, 1428, 2539, 1255, -1867, -2624, -669, 1618, 2196, 591, -1915, -2346, -748, 1742, 2170, 727, -2183, -2323, -557, 1764, 2026, 474, -1967, -2011, -107, 2360, 1714, 291, -2093, -1575, 118, 1806, 2319, -187, -2413, -1550]
1145a550K302J687n13k180j658M39K072J441n95k138j403P69K155J462q07k413
1161i30r57N65K359J239q06k607j308J484J926J542j564j876j395J353K222R00
1177B147j410k222o11J351K181P90j422k404l59J253K428J10j597k040K0J651
1193a34J820M32j721j950k32J834K050j57j820j844L15J766J560l44j622j641
1209a688L02J872J126J4j766j438J92K021J223l79k180j347P25K061J301q98j951
1226h10j235P91J954R65q84j911j014J123J861R53j063j994q38J238K040O13j107
1243F82k033m87J202J632J088j247k318l36J716J467L03j281j828k60J744J819
1259A863k12j602j861K69J631J606j74j538j394J46J703J618n74j507j510M5K060
$$ y = [-1550, 752, 2439, 1926, -254, -1912, -1473, 599, 2040, 1445, -693, -2096, -1327, 828, 2290, 1483, -930, -1887, -1322, 1037, 2276, 1470, -1137, -2445, -961, 965, 2507, 943, -933, -2328, -975, 1247, 2147, 737, -1485, -2096, -745, 1436, 2226, 804, -1600, -1959, -706, 1722, 1832, 235, -1805, -1785, -134, 1686, 2118, 397, -1553, -1785, 49, 2099, 1942, 122, -1722, -1407, 359, 1919, 1575, -47, -1688, -1386, 486, 1612, 1626, -140, -1578, -1386, 635, 1858, 1479, -701, -2048, -1323, 738, 2039, 1141, -810, -2045, -1254, 700, 1665, 781, -1130, -2144, -1021, 840, 1793, 730, -1264, -2102, -864, 1176, 1789, 682, -1351, -1838, -636, 996, 2084, 837, -1481, -1817, -101, 1366, 1669, 388, -1440, -1700, 44, 1863, 1651, 49, -1812, -1543, 88, 1694, 1520, -18, -1412, -1266, 437, 2055, 1481, -26, -1536, -1491, 569]
1276E69J303m43j945j447Q05J641J369r27j628r64M51K224O62j107j753o07O29
1293a168J843J165r09j894q75J077J485P83r71j715o01J117J637N57j023j815
1309a307o84J483J859J20j537j009k14R98J559K01j547j087L8J277J389n1j369
1326A19j319O3J246J578k37j645j101L30J516J086l06j674r58J98J901P86p02
1343H81j201r17L25J158R73j92j606j127O92J653Q63p31j696q97P20J684J008
1360A590r08j340r15P00J540M33o87j342l15P77J394M96j116j170m43J026J224
1377I44O95j339j558n8J314J237o2r90j288k07J324J176J21j149j501M47J120
1394B26J265m80j422q91Q9J489J162l65j140j112J46J136J189m50j153q02J80
$$ y = [569, 1872, 1429, -516, -1963, -1158, 483, 1852, 925, -703, -1667, -1216, 1008, 1670, 563, -1190, -1797, -1168, 675, 1840, 931, -963, -1838, -761, 724, 1507, 536, -1179, -1780, -663, 974, 1531, 508, -1307, -1991, -508, 1351, 1471, -66, -1075, -1289, -291, 1268, 1469, -78, -1165, -1127, 150, 1539, 1488, 119, -1200, -1137, 109, 1687, 1450, -195, -1296, -966, 550, 1636, 1330, -344, -1302, -1104, 797, 1583, 881, -320, -1237, -912, 246, 1219, 1027, -579, -1706, -1014, 639, 1502, 771, -925, -1822, -1102, 582, 1590, 682, -658, -1573, -873, 667, 1100, 413, -929, -1244, -467, 927, 1423, 307, -863, -1306, -280, 944, 1639, 300, -1258, -1316, -2, 1235, 1173, 183, -1105, -1312, 12, 1188, 1309, 160, -1341, -894, 226, 1491, 1011, -411, -1302, -1213, 276, 1438, 1073, -67, -1179, -1033, 103, 1292, 842, -311, -1113, -933]
1411i33J472O62l63j416q66P82J191N20l63j526m52P87J169N35r42j086m24Q77
1429c76J112L86o68j441k28Q07J303M93r80j376j61O63J388M78j114j357j38J235
1447B6J085L9r52r08k65J127J162k64j015p38k87J110R77o5q36j608M70J326P84
1466A168j90j151j092L40J266Q84l32j293r14M71J020P82n48j063n69M99J296
1483E74O05q66j280j23M86J228N15n25j161n51O88J221K55p59q47n48Q46R39M20
1502A117o60j052k83Q63J151J2j141p38k05R69Q32K03q83j085j01R43J110j60
1520H92o38j116k37J283P52r2q96j074K86R54Q93n42o26j118M72J125O70n39r43
1539d94q19R46N51P00l30j011p65M05J260L44j84j274m28O41R68M35m66j178l58
$$ y = [-933, 539, 1201, 838, -578, -1444, -662, 529, 1049, 686, -840, -1292, -505, 664, 1199, 257, -829, -1253, -376, 736, 1122, 454, -987, -1215, -408, 895, 1388, 408, -968, -1129, -466, 922, 1400, 286, -1071, -1209, 26, 1111, 1150, 198, -710, -975, 152, 1314, 1050, 35, -703, -990, 120, 1097, 1032, 196, -1412, -942, 384, 1168, 978, -173, -1265, -925, 341, 1225, 893, -400, -1314, -843, 177, 959, 411, -652, -1221, -722, 574, 1179, 313, -967, -1090, -604, 624, 1139, 614, -547, -1098, -410, 811, 1066, 307, -540, -1088, -242, 697, 1117, 457, -595, -878, -15, 1136, 1148, 7, -731, -936, 33, 865, 1068, 185, -900, -1001, -58, 1052, 892, 254, -862, -1099, 184, 936, 844, -52, -1126, -840, 114, 1007, 465, -161, -1279, -807, 318, 988, 449, -494, -1313, -367, 184, 884, 554, -457, -1222, -817, 443, 787, 603, -671, -1099, -458, 510, 945, 479, -699, -1057]
1558a057O35J156M56q96j022j83M24J232j6l62q95l01O87J109j03q76q05l28J084
1577f1J089p9j152m07j58J100N85k16p88o14q5Q04Q98l30o70r22J90Q59O52j45
1597E50r67n22J57J060N43m63o83p47M76N59Q26m19p68p30Q04P09K64k75j303
1616i29r6P12P55K27n82m63n72O16R11K80n42q59k34P05P32k9m64q62O8N23N39
1637D36L34r72k96j42N86J115m84m93r79K71P47M32K78j110m70J25Q69L15K02
1656G64p46o69J49M34P18j13j056o57N49P58P25o06p27l97M20R61J21k03o61p25
1676i61N80O83L22l87r24j2Q11J69M66m03q79j37O80O43J02p53o63j0P01P06P6
1697H10q64m68P9O73M70j13p11n72N31L34O50l9q29m55K15M31K96j30l99n28L45
$$ y = [-1057, -422, 734, 1190, 294, -728, -911, -487, 745, 729, 367, -528, -829, -142, 967, 864, -12, -817, -1145, -61, 1028, 949, -203, -610, -768, 332, 917, 701, -87, -701, -786, 18, 916, 586, -84, -1006, -816, 43, 695, 550, -417, -939, -782, 278, 821, 358, -325, -1072, -596, -37, 789, 370, -398, -1128, -324, 385, 649, 374, -929, -1025, -313, 442, 669, 87, -376, -948, -332, 579, 859, 317, -542, -776, -71, 661, 632, 168, -694, -626, -103, 436, 770, -202, -498, -640, -54, 1061, 577, 84, -895, -624, 123, 555, 833, -277, -747, -622, 247, 562, 764, 18, -651, -502, -68, 650, 537, -519, -1176, -627, 131, 856, 250, -477, -874, -454, 507, 628, 425, -236, -961, -381, 302, 624, 237, -687, -699, 112, 281, 747, 344, -535, -672, 8, 651, 753, 0, -663, -673, 28, 734, 810, -54, -522, -443, 230, 700, 587, -124, -696, -165, 169, 819, 780, -49, -504, -289, 142, 438, 308, -91, -619, -274]
1718b74N73M01k48p94j76Q0P29M00p09k89m42L13O33K52k10p18j93K66L45O97
1738F36l52n03l62K55Q37j26Q2q53j97K94P72J86n94m01p8N12N31J01o49k25l21
1759d55M87N47P2m90n29K02L01N39p1n41j042N22P25J97m06k18k45J39M34M70
1779F38n56k86m72L56N39L31l06n02o31K23N95P47m01l78m72J75N37N31l20q39
1799d91p8O95K42K13k18n91j50K41O73q5m05m50j66L60O34J45m61n44j14K04O28
1820B82p4k47l07M6J53P11j03l13m97k1N16J98J1j88p64L27J92P15j62n18q25
1841h68O89J25L74j21l69l88J21P24K9L2m00m42K55O60l93j12j46j54J05P08j76
1862B53k38o7m45L33M41Q9p50N3j07M35K87L99n24l95j43L15M04k10j22o42L59
$$ y = [-274, 299, 700, 452, -342, -518, -438, 291, 691, -18, -307, -749, -436, 197, 449, 239, -479, -672, -406, -61, 636, 284, -219, -581, -326, 511, 385, 467, -386, -583, -289, 483, 669, 75, -326, -404, 108, 639, 740, 91, -134, -455, 32, 579, 651, 161, -368, -166, 135, 674, 603, 62, -980, -458, 267, 464, 58, -160, -405, -266, 168, 638, 82, -204, -676, -320, 219, 550, 244, -258, -889, -666, -71, 676, 275, -103, -575, -400, 137, 668, 348, -491, -569, 126, 368, 581, 363, -228, -378, -137, 536, 451, 46, -404, -570, -210, 424, 569, 108, -436, -550, -346, 282, 208, -39, -346, -300, -147, 564, 461, 148, -349, -370, 146, 344, 355, 167, -597, -270, -78, 637, 475, -43, -868, -179, -54, 320, 199, -170, -558, -437, 287, 316, 348, -52, -494, -239, 421, 28, -84, -230, -384, -279, 429, 253, 15, -52, -497, -164, 277, 366, -384, -331, -438, -3, 284, 683, 159, -236, -379, -64, 340, 130, 8, -634, -275]
1883b75L48M60j90n02J87k65J50M85k91l0o32PO09J70K86m13k52KL10M18n47k47
1905b12k07L08M53p3p5m11l86J95O86N7k69k50l17L51P4K49j55j72m6L12K32j04
1927B40m67l5j81L61K57m3P6l11l26M03K65o9j8m82J50L93L6K80p44M7J41k68
1949b95P93k26l44l08J64N01J38j8n27k06K02M98L2n95K1l92L11L00K73j25l62
1970a65J89j56K13OL0m06J87j06M89j28J42l60m96N39j05M05l73j00K1K55l0K41
1992B92k90j90K3K06J39j47M50o91l0L78J39m7k53l51J16N10P9k16K40n53N5J48
2014GK21J60m71j32m0L00M4Q4k67K36m66M81k7K27j98l30q5K19J38k98j1j50q2
2037d40O80m7O7l32l53N37J60j88n0o4m31K68M04K29n25l35K05K58R0J71n56J18
$$ y = [-275, 73, 533, 343, -159, 28, -237, -87, 398, 107, 77, -555, -548, 61, 231, 517, 104, -148, -146, 164, 582, 35, -212, -419, -111, 342, 269, 194, -217, -603, -408, 278, 335, 66, -184, -501, -150, -76, 173, 18, -154, -200, 112, 344, 240, -227, -262, -443, -82, 175, 132, 208, -103, -429, -26, 239, 170, 152, -330, -180, 213, 249, 529, -215, -168, -27, -295, 498, 272, -72, -380, -216, 285, 423, 405, -122, -328, -126, 372, 404, -191, -170, -562, -251, 49, 322, 197, -165, 24, -132, 81, 87, 117, -289, -102, -208, 281, 153, 295, -65, -561, -22, -127, 278, -95, -195, -174, 81, 51, 292, 2, -188, -165, 41, 180, 33, 483, -208, -238, 140, 279, 232, -21, -372, -256, 254, 333, 117, 357, -196, -141, 7, 228, 388, -83, -215, -255, 45, 89, 173, -94, 142, -324, 157, 130, 357, 159, -171, -256, -37, 101, -197, -208, -358, -440, 240, 193, 260, -72, -425, 112, 272, 84, 34, -30, -461, -193, 211, 440, -85, -420, -215, 43, 133, 304, -252, -134]
2059a34j86L43K25P8l35LM3M8K26n8l22l80J99J18L36j39r1k11j24L01K83m7j54
2082B2r0k23M39M6m9k5k82j50J74P16n69mj98N0K68J26m8m56o2Q0P59m72jl72
2106c21L09k00L46k21N9P1k75O1L12l8l0k22R0K15J16M4k04l10j37J70J33J28
2128I6n8J9n78O74J44k56n1r6P4J98J76n51K06j81L39LL13m26k27K18j90n1M45
2151B40k92m7l10K56Q5qJ92k31j2J3L5K44j80k39l5M48J65m18Qj58K06l77N68
2174A53k53Rm7j87L76M8q0L48n19K43j60K36K15k72k12o0M7L1L89k13k30K50M8
2197A60M9k80J99l53m9L02K92j81k47k35J94J15K66M1m62J94j07J91KJ48m15k41
2219d17L26k1N21l09j89j71M0K79R6P2m16J40l8qM07p7n14J38J21j07L12N6k61
$$ y = [-134, -320, 23, 248, 326, -9, -6, 37, 85, 311, 253, -69, -449, -250, -132, 204, 65, -26, -237, -361, -60, 223, 176, 22, -68, -291, 148, 194, 145, 120, -162, -312, -138, 578, 9, 5, -193, -143, 125, 251, 203, -253, -315, -235, 524, 52, 51, -321, -12, -212, 134, -87, -28, 43, -232, -171, 141, 103, 73, -149, -59, 156, 272, 316, 112, -198, -335, -165, -32, 96, 38, 57, -521, 153, 297, 41, -10, -106, -32, 166, 342, -209, -3, -184, 155, 158, 471, 45, -182, 36, -154, -205, 240, -52, -99, -409, -153, -68, -76, 116, -115, -127, -114, -79, 165, -15, -254, -289, 159, 324, -94, -86, -244, -38, -415, 153, -100, -91, -138, -325, 51, 99, 19, 367, -152, 91, -69, 167, 382, 110, -102, -162, -115, -84, 305, 92, -138, 112, 160, 209, -71, 128, -225, -274, 28, 320, 139, -108, -343, -149, -34, 232, 273, -189, 5, -102, 89, 91, 239, -176, -417, -91, -112, 409, 100, -89, -260, -220, 59, 155, 227, -189, -49, -87, -95, 312, 235, -279, -141, -20, -127, 185, 241, -20]
2242b0j50j37K94Q6J60l83J77l15K66n7j06L46k31K29J61j33l36Oo8K27K2K92
2264C30l91j0o9K61o4J15j60k7J76k31J91J7j82K4kj13L04j28J5j64j26L66p5
2287E7O8j81k47K40J18j02J73r4l5j80n0J08k2J74j29j33O31k37j67j4J15m78
2309c85K12L87l16k48M93j18J04j0k54m5R5J73J24R0n46M8j2K60k35K23j17K10
2331A33k89n4O7J96l25P1r5R4O5J35J68o0q2J5J73j68j00j06P3R7L6N8n1k61J1
2356a99J12M4J92J89k28l6N2k2j07j71J66K32m40L16k67K27j02P8J45k28Q1J63
2378A97l30L44j89K94k69j29K52j76N69o01j58P6P8K75j59O6p2j3m02L58j84K79
2400A06M4l92q0j57N29j34K60j80J71k14p8J61j69jL43j54R6j35J3k92K23m6r3
$$ y = [-20, -170, -307, -13, 73, 233, -150, 27, -288, -22, -79, -185, 161, -70, 159, 320, 187, -149, -143, -211, 16, 38, 330, -61, -71, -140, 121, 57, 172, 12, -15, 161, -70, 121, 138, -44, -20, -22, -135, 169, 41, 56, -108, -234, 132, 57, 125, -56, -303, -63, 55, -47, 126, 32, -3, -183, -233, -125, -147, 27, -102, -235, 396, 159, -8, -22, 93, -385, -173, 214, -102, -350, 143, 25, 129, 119, -135, -180, -85, 88, 212, 302, -244, -196, -208, 52, -183, 40, -77, 133, -156, -210, -143, 53, -272, -201, -296, -202, -137, -2, 166, 106, 24, 39, 212, 44, -56, -162, -89, 8, 44, 102, 51, -210, -199, -87, -43, 149, 338, 110, 74, 126, 104, -3, -174, -8, 224, -216, 100, -167, 60, -42, 36, 181, -47, 34, 197, -133, 211, 22, 316, 47, -82, 170, -6, 563, -38, -196, -120, -42, 233, 74, 140, 68, 55, -347, 11, -173, 106, 150, -242, -322, -479, 50, -84, 176, -4, 167, -47, -125, 36, -133, -134, 209, 55, 151, 16, 29, -263, -40, -86, -179]
2423a79K64M3l43J7M34l11n0Q7Q8j65K41J00l43J73l18L60K40k66K41l14ro4M6
2446b8L28r6m04K80j16p4P7Q7k9k17o4M29k22R7N4k45j15O8K70j9j07j13K37K22
2470C00n55k03K41M31j41j35N6P3k74M31k83L25n77L74j38J06j64J61n1j12M8
2491h7Jj8J28J19j50J57j68O8n3K5Qk21j19M12j72J28l01J4Q7O1J55N6j16l93
2515c79M22R9j27K9k41k72L35j4K33k10J04j36N6J49J93j65k91R2m8L98j98k32
2537b03L26k06n2K10J0j72r1K95k41J99k7p6j56J33K01k72J05R0k75K59m23L50
2559a6o5p0j38N6q3J52M12k75J59j13j37J32k8nr4J2J02J7P9l95L11j60N7J24
2583C4l40L65k79J89J0K58k24l32K63j02L62j63J20R6m09K82r2J74o4l28J40K5
$$ y = [-179, 85, 128, -215, -198, 236, -75, -125, -38, 50, -115, 126, 226, -117, 56, -262, 98, 338, 72, 313, -1, -10, -74, -28, 300, 204, -200, 80, -36, -110, -33, 54, 25, -192, -256, 173, -49, 48, 102, -143, -258, -190, 80, 61, -46, -159, 78, 300, -255, -458, -217, 214, 73, -62, -6, 67, -207, 224, -59, 266, -311, 63, -75, 31, -133, 28, -23, -135, -87, -86, -104, 24, 143, -7, 150, -18, 50, -3, 22, 30, -191, -310, 102, -70, 58, -243, -229, -142, -81, 74, 130, 14, -379, 43, 142, 15, 44, -197, -469, -134, -148, 85, -125, -21, -157, -101, 48, 241, 76, -215, -123, -171, 227, 29, -203, 123, -83, -135, 75, 85, -87, -178, 117, -124, 75, 48, -28, -184, -51, 150, -122, -17, 73, -202, 57, -366, -16, -81, -151, -289, -233, -316, -164, 248, -27, 132, 19, -118, 14, -14, -19, -113, -101, 1, 18, 97, -298, 13, -147, -90, 34, -306, 59, -220, -31, -21, 237, 13, -319, -56, -158, 204, 41, 161, 257, -152, 130, 38, 212, 148, -180, -40, -15]
2605a5J75m91L08n0M0J62k7Mk53K14o1j56J98m35K04K3R5L04k55K5O0k59P7j02
2629b15L22m68N68l45n1K65j30J37j17J04J7J05l44J25O8j41L06j12R8q8J8l69
2651b47R5K12K02m1m24J98l13L43j78R0M8K82l09K75m3k39j6o6j15N50j02k22
2673b0Pn5O9L02j95m18L22j90J17R2l6q0J59nJ51K3j55R4j95M7o6K72Q3n63O9
2698a71K91o2l72M27j94J07p9L87n4l09J02l00J37%J93J9l0k30K85k63L27l31
2720a20J46K70l05J14j76R6N9n0k52nR6O6R4J3j9p1o8o8R0r4L74l57K9K9K68l09
2746a50J9K90k12j22J47r2J46K0R4l08J16n2O0p7M6l7K04o2J80l12l8j67K60K59
2770B12l09K11N8r4j73K06j54K45k06Q0l26K32K18l54K87r6j00K20p0K6k69Q3
$$ y = [-15, 160, -331, -23, -73, -33, 129, 102, 106, -147, 67, 6, -150, 48, -387, -183, -160, -65, 239, -16, 9, 69, -190, -113, -215, 107, -361, 207, -138, -189, 76, -54, 83, -34, 70, 87, 192, -152, -27, 41, -100, 206, 94, 192, 104, 122, -247, -152, 60, 262, 221, -203, -5, -318, 25, -153, -63, -15, 267, -42, 233, 190, -49, -65, -131, -246, 304, 202, -20, -13, -68, 1, 303, 108, -310, 12, -178, -61, 31, -5, -85, 74, 69, 220, 243, 88, 182, -13, 34, -32, 240, 323, -240, -171, 120, 58, -314, 113, -81, 26, -53, 334, 280, -29, 73, -227, -90, -90, 103, 122, 92, -138, 147, -116, 211, -120, 26, 296, -9, 105, -71, 25, 84, 34, -218, -223, -127, -61, 33, 46, 27, -44, -112, -180, -90, -184, 190, -167, -138, -109, 159, -150, -131, 159, -53, -175, -28, -120, 26, 46, 140, -168, -52, -104, -44, -121, -75, -112, 92, 30, 210, -102, -140, -307, -47, 212, -97, 114, 172, 78, -95, 111, -43, 202, -4, 76, -250, -18, 200, -154, 133, 37, -63, 157, 87, 113, -156, -73]
2792g3l4j9L0m1K46m73M53J3j42k87M41j64P8J35m0l47K72p3J9J01k09J35p7q7
2816a43J25Q8l7j68M0J17p6K9j71K04J50o7k05K84k68K54j47k79L63l33M05j92
2838b7OL21m45J42l62M67n8l14M56l83L41m4k6Q1Q6k19j45K14k17L0Q4L17j90
2861A15j18p2K56q2J35j22j93J20j5p1k03K18L09j72Q4q6j75M1M0P0k74K68m5
2884B8K12l82J20N6j87K51Q5k44J59J0k61Q9m2L65m01J77Q7p9J81j17n3J34j18
2907G0k5p2k1J1L15l03rL45l71n0QN8K22k58J13l7J18jj57m4J08J58j28j76r2
2932b18K49k22J16j7j61M54k34J57j49j96J66J83m8o9qN5k03m9K03J48j16R3Q
2955A42m7j95J84j10l5k11K75j13L3L73k36j17L03j39m48J11J02K01K54n7k77
$$ y = [-73, -107, -126, -96, -137, 109, -364, 89, 102, -40, -327, 114, -50, 28, 163, 123, -224, 48, -25, -6, 95, -114, 21, -56, -143, -18, 70, 33, -135, -95, 22, -54, -25, -196, 8, 158, 91, -114, 170, -98, 156, 9, -270, 93, -240, 165, -27, -21, 300, -145, -3, -365, 102, 44, -270, 186, -197, 144, 100, 74, 155, 241, 22, -123, 91, -126, -96, -12, 305, 115, -3, -75, 181, 99, 234, 112, -81, 39, 24, -47, -250, -32, 277, 105, 189, 103, -72, -31, 9, 79, -195, 73, 28, 240, -142, -22, 34, -153, 98, 183, -61, 98, 108, -153, -64, -106, 259, -142, 35, 122, 43, 224, 107, 54, 188, 70, 45, -27, -48, -37, 278, -25, -34, 311, -60, -110, -102, -44, 178, -80, 33, -4, 114, 113, -44, -88, 20, 178, 50, -126, -218, 31, -191, -75, -92, -253, 201, -33, 124, -25, -221, -55, 128, 80, 11, 3, 58, -145, -194, 9, 157, 41, 134, 142, 95, -100, 84, -26, -61, -272, 3, -110, -77, 296, 60, -57, 246, 107, -341, -230, -128, 73, 327, 270, -7]
2976gJ95l87j49J49J91k15K78N6O7j17j64L54l34M5o4K3PPK7j0K47n7j15j3K0
3001C4O2j1O1L07m33%j44j93J61K87L3m70K95p0J99j75R9N6j85K49j95J48j53
3024c8L6j20qK12j53K14j26j05m1q0J26J6J84p1M3p8L9j94n0J13J36j7K32r0m75
3049b95L0K35r6j6R0rL03k33R5K21j54j44p1P5j8j16J96j24j44K69m8j54qR1J32
3074A07k07o9J42O1j97K51O1j60j82K3J41L2J69j39Q2j29J37j38J80k09p4P6l
3097d5j91K44L7J10k48L92n03M51j52r5l1j66Q2M14k65J53r1j10K8J98j12p1j13
3120h4J57p8R5m04K56K02Jo8L3r0R6m4j75pjkJ53N1K49k56j75K12q3j08O3J97
3146A90j39k16K3J42j70K45Q5m22K36J10J6k56O4J85p9k5j69L73K5k0k31l9J36
$$ y = [-7, 188, -199, -348, -199, -8, -223, 55, 111, 178, 61, -103, 251, -83, -38, -102, -79, -72, -65, -38, -48, 199, 142, 27, 14, 34, 96, 85, 146, 453, 20, 20, -124, -317, -156, 131, 164, -306, -11, -81, 118, -57, 42, 98, -87, 162, -33, 115, -38, -2, -122, -130, 82, -71, 143, 17, -88, -129, -209, -83, -67, 117, 46, 89, 11, 50, -144, -194, -81, 55, 38, 270, 180, -295, -265, -30, -126, -142, -52, -61, 242, 9, 104, 325, 171, 27, -44, 31, 13, -103, 93, -31, -175, 94, 46, -108, -116, -25, 107, -100, -169, -27, 34, -163, 88, 149, -11, -193, -170, -29, 3, 172, 33, 115, -14, 123, -15, 165, -44, -118, -42, -45, -236, 8, 45, 155, -93, 299, -204, 247, 95, 0, -31, -197, -115, 299, 34, 187, 96, -14, 14, 212, 100, 29, -84, 73, -5, 90, -314, -58, 144, 145, 77, 110, 20, 116, 72, -103, -110, -111, -113, 40, 91, 340, 84, -91, 121, 38, -70, -7, 190, 51, -165, -142, 0, -170, 75, 160, -262, -26, 84, 100, -156, -92, 93, 14, -11, -180, 193, 218, 198, -33, -72, 64]
3169F4k45M32ql71J47r2J96J10j01j6J81l68j16n9L00p4m0J98k93J92K15m83N73
3192C42k63p2R9k08jk15O72k04l3J19n28L60O1O9k83j29K28J53k52J5%q4L15j14
3216D7k32O2J51%j83M06j2j38k05j88J69J78r8K08j08j18O0L3J83j68j62N3K14
3239A52j34j29L54j99k27K20k24J96q4K66j18j36RJ17j42K41j94M0J84j03J77
3260B66l02P7K8O0j87M8k83J86r1K74j73m1K22j39j18K3M9K82j1k40K66q4j85
3283g3k42L86j41r1K66j94J49j01NL18m75R0L39m90K37r7P4K12k35j3J18p9L47
3306C10j56p7n7k12J70p3K6O0k68J39Q1J4M27l85k03M49k03Pn5O3j00K93m86J00
3330a36J20j64L28j59K7n2J68m04J90o5NL14K08o54L87k22k61K65K87m02L49j46
$$ y = [64, -181, 251, 243, -128, 19, -73, 123, 233, 132, 116, 297, -71, -187, -246, 54, -20, -60, 138, -155, 37, 252, -231, 342, 79, 7, 106, -102, -103, -318, 354, 150, 117, 236, -292, 68, 129, 198, -85, -214, 14, 167, -85, -70, -70, -154, 161, 47, -185, -123, 28, 28, -155, 251, 239, 101, -104, -292, -123, 55, -43, 165, 57, -61, -1, 32, 215, 47, -115, -62, 152, 18, -111, 243, 44, -183, 37, -187, 9, -75, 191, 73, -63, -54, 63, -79, 162, -32, 8, 192, 89, 266, -36, 41, 69, 129, -58, -10, -293, -107, -198, 76, -97, -138, 84, -55, -173, -150, -101, 181, 170, -70, 196, 112, -73, -315, 71, -70, -161, 105, -89, 60, -41, -36, 282, -193, -103, 236, -254, -17, -114, -40, 172, -63, -76, 42, -37, 310, 154, 77, 20, -192, -22, -95, -69, -9, -277, -138, -57, -43, 384, -1, -204, 245, 42, 49, -6, 57, -43, 250, -236, -136, -16, -180, 148, -11, 16, -36, 132, -272, -82, -147, -142, 172, 380, -274, 113, -109, -370, -105, 182, -220, 129, -17]
3352a7l27M20k25J88k78jK73J34j82k9K89k9l79L64k45R2j40K36n5j96J16l3J09
3375H5j18K55m74M4O8J15J45J0k57nN78q17L26j82NL40l01L19P7m69J91j34J95
3398dPj68L12j73J6j47j11J92J28j06k3k14K86M3J51j86J58k99J57j5l11L05n2
3421e4n1K91N5o4k31J61j74Q3oK37k48M2J3j94nJ86k9q8L05l44K18p2j13J41J53
3446B12l21J9J50k27M3j66L34J49j05J60l15L92l42J96j47J46j51j01K0p7K44
3467A13k23K17M0k31K25m8k95K16n6J90k09n8o9P2K13k95J53r9L07m18M49j30
3489F4j04j80K1K23r6P7m5K13P5k54J68j98K03j11J82o7j64K79Mj69j18N8nJ6
3513G2l70J19K87j69j5%N3L43j81l67L12j63J0K36j01k19K28m5n6j5K29p1k17
$$ y = [-17, -344, 76, -149, 39, -239, -240, 33, 167, -15, -44, 245, 216, -163, 201, -44, 48, -92, 144, 89, -107, 9, -24, 85, -33, 222, -252, -208, -140, -25, 120, 130, -127, -132, 446, -371, -45, -227, -222, 118, -183, 136, 213, -256, -65, -199, -4, 3, -165, 147, -26, -10, -157, -268, -76, 52, -54, -77, -291, -5, 38, 189, 3, 161, -138, 19, 4, -307, -2, -54, -105, 186, 241, 177, -54, 107, -67, 16, 10, 247, -1, 41, 54, -140, -145, 41, 12, -76, 229, -115, 103, 31, -82, 59, 212, -109, -90, 60, -167, -124, -290, 44, 193, 88, 248, -67, 325, -17, 179, 32, 178, 27, -74, -54, -131, 113, -110, 107, 147, -84, 141, 93, -202, 14, -42, 148, -61, -119, -188, -116, 97, -198, -45, -144, 163, -255, 194, 64, -40, -220, -199, 24, -72, 5, -40, 173, 248, -6, 162, -36, 167, 56, 238, 171, 7, 286, 290, 121, 3, 61, 56, 72, -298, -179, 108, -61, -76, -76, -23, 320, 139, -228, 84, -79, -69, 167, 66, -153, 75, 30, -26, -41, 188, 117, -100]
3536a00m9K23j41j65K07N24o70o7L56k90J28K81j80j28m6K0R8j76K30p6k36L13
3558E6k5j70O0K17k2l40K56O8l42K59k27M04j24J38n2n3l2K0l3q7N2k04K00j0
3582Ik72QM44j71k9N3j72J01O8L4m5m2k07J33J63K13k85L8m7j01L16m58K22O2
3606C5J10l50K24j31J10O7K71m03r5M96m28J67k78J65j92J31N0J68j90J5J77J97
3628C16k74OKJ91l95L40p8o3J97l88J88N3j90N9L5q4q7L36l04J04J12p8k48M09
3652A59j55J05O3l45K81j52K87l75p4P6N1M9J84j71m59N20k84J23m8J50k8q8Q6
3675d5k64M48k27J24k6j59K34pJ45k08J40J8l22J79j54J57k58P8J80J32l69J14
3697i0k59M22r3k61L64k38K75J67m13r2N56l23L0j8j68J4R0L04p0j52j7JJ10j46
$$ y = [-100, -149, 74, -67, -232, -25, 499, -171, -238, 118, -172, -44, 237, 57, -71, -117, -97, 1, -175, 55, -21, -257, 56, 31, -139, -79, 138, 116, -224, 32, 100, -242, 17, -210, 194, 70, 208, 156, 103, 71, 91, 58, -29, 23, -181, 19, 9, -263, -255, 189, 18, -11, 42, -130, -29, 39, 73, 28, -14, -221, -88, 75, 288, 3, 41, -6, -107, 209, -249, -27, 35, 145, -205, 19, -112, -2, 65, 336, -67, -162, 334, -94, 73, -205, -40, -232, -101, -51, 117, -73, -58, 119, 316, 42, 48, 50, 241, -154, 186, 108, 45, 242, -146, 42, 95, -95, -36, -1, -85, -172, 164, -140, -36, 76, -2, -250, 159, 4, 109, 172, -173, 108, -44, 243, -132, -206, -130, -79, -30, 154, -17, -476, 44, -240, -117, -165, -15, -43, -131, -45, -309, 139, -88, 36, 10, -149, 85, 78, 223, 15, 155, 173, -149, 30, -124, 33, -225, -147, 33, 165, -204, -90, -349, 73, -20, -281, 83, -155, 120, 287, -126, -218, 338, 15, 45, 27, -141, -127, -37, 267, 197, 45, 28, 29, 139, -7]
3721gq6J64K4l14L05K8k36R1P8k22M37n46Q40l95p6j4j60K44j67k48J62L03k35
3744c0j71K63J16k33J45J08m25Pr6N60l52Q8j51K20J73l37J47j88Q1n0K35L43
3766D53p36K23k39L49L0p0j16K97p8k37J07n1J18j2r2J42K02m26j78L77l4O9k07
3789a09KJ81j38j42L12k0j81J66L6j55L8M9K1M5q4j50j50J37K16k73J10R1q5K56
3813A73J18m2k97n6L70p1J71j21k28k77K43O4J53l19pK95j46j94Q9J51J52j31
3835I0R2j71KL26m76K75L2l04L13r4q7j08J73K09j15l95L41j25K51l6k12M4P8
3858A03lq5k8J30M9j38O1L9l01R0j23P3J11j32J21L21j1k91j73L29Jk7j7J08l22
3883a15R8R1M4k8k0n23P20q9k14K19k44j52K85k94J51L42m06J70j5M2J5j04l2
$$ y = [-7, -93, 71, 95, -219, 86, 114, -122, -31, 47, -175, 262, -284, 556, 161, 85, 71, -89, 155, -12, -260, -98, 205, -30, -201, 62, 178, -55, 90, 198, -227, -220, -316, 244, -108, -20, -171, 49, 222, -115, 32, -156, -75, -125, 110, 453, -283, -60, -299, 50, 80, 10, -106, 191, 113, -124, -17, -68, 50, 38, -54, 88, 290, -136, -314, 63, 29, 98, -109, -107, 74, -64, -206, 106, 86, -95, 71, 107, -48, -10, 39, 60, 105, 21, -129, -279, -142, 74, -199, -89, 2, -83, 173, 291, 249, -48, -104, 266, 195, 366, 245, 17, -260, -17, 47, 200, -119, -126, 169, 23, -171, -82, 69, 221, 90, 182, 11, 13, 339, -137, 138, 170, -134, 179, 85, -2, -110, 63, 272, 157, -238, 103, -22, 229, 193, -19, 25, 103, 100, 15, -13, 117, 166, 28, 89, 128, -173, -83, -206, -133, -22, -154, -33, 288, 277, -14, -187, 142, 143, 116, 99, 207, -115, -17, 74, 118, 90, 70, -453, 267, 178, -36, 183, -61, -213, 72, -222, -71, 271, -135, 35, 20, 62, 77, -27, -59]
3906e9J30J84n9k18O0L65n37K0J02m8J31%j25J31j39M0J37Mk6k79pj95L12p9L88
3931B33k54J42J18l35J37J33l10L77k58J34j82M4L7k73K76J87N0p6n1j36J62k05
3953e0Q6j64K66j51l97P13l95Rp2M6k61K41Q1%k8J51k45J45m0J12J8J58j35j93
3977a05J22O0j23J20k9j27O5m3R9J65l32O3L31j60k00j62K20M57m43J26n4o8O6
4000D8k60L33k45K89k78K25j08J05j58L2L36k46L07l68K99m98J60k34L85k59K13
4021G8q3Q8l63J64L17n60O71j60l36L65m68K54jnK36l5l63J67R6O7K8n9l61K99
4045C6J22k23r4N19n46M4K99P7l73L3L58k47j28K20q2j30Q4q2J47O4j63K43n4
4068A24o8m0M4L03k83l35J18L6l7J76J04n4k87K37l42L6L60k94J65N8k21M12o3
$$ y = [-59, 71, 255, 196, -22, 38, 403, -134, -114, -12, -60, 71, 71, -54, 77, -62, -22, 115, 119, 93, -186, -193, -388, -76, -155, 233, -21, 121, 239, -96, 41, 174, -136, 241, -17, 117, -65, -21, 16, -257, 19, 206, 256, 180, 129, -7, 155, -50, 36, -128, 138, -13, -410, 303, -92, -83, -155, -109, -370, -129, -48, -48, -76, 75, -170, -25, -65, 47, 65, 223, 88, -105, 17, 77, -46, 74, 45, -82, -17, -60, 39, 204, -128, -65, 266, 106, -94, -256, -36, 421, -22, 104, 50, -18, 48, -212, 121, -124, 165, -113, 112, 4, 109, -49, -17, 319, 73, 380, 12, 311, -187, -27, -261, 124, -135, 78, -5, 83, -280, -116, 201, -359, 312, 152, -184, 181, -287, -33, -34, -39, 197, 162, -201, -34, 62, 129, 157, 98, -263, 36, 158, -65, -159, 360, -186, -142, 157, 234, -139, -106, 252, 5, -123, 97, 15, -115, -31, -113, 34, 98, -65, 178, 124, 56, 16, 60, 363, 80, -255, -137, -101, -138, 38, 142, 88, -199, 38, -304, -268, 92, -202, -37, 21, -200, 212, 149]
4091A49n4k11K95J97l19j04K12l75K71l08J42J52K5j46R1L71n74L9K76q9p8P5
4113C7k02L05r2kR9k64K48l4n4l95L73l2K72j83k87O6J20R0j19J64l15J94j58
4136a69P9J71J98k88J3j37K06J89m02K69l26N10r9k16r5O0K00q2j97K92k52j37
4158b13N5J47J00j23K13k73L7J59k66O5K57k65R3O0k73K14l08J84K84j35p7J20
4180E5q5j06J9k02K93J30j99Q0k36L17K1k64r6K18J43J31l31Q8j07L1J48j87M54
4203C15j72J10p0j9k78J34j2j35j07p0K79J89k21oL5J7J29l16L88j75r9J13j54
4226a25J13J87o5M7l44R4l6M1n2J81P8K9j58j12M01l07Nj22K60k94J69N4k7j67
4250a50K15m9p1kK30l64J24L10l43K63q0k48K26j14J00k31K72j61q0j0K05j17
$$ y = [149, 95, -116, 179, 376, 57, -47, 165, -210, 61, -247, -105, 47, 72, -74, 17, 388, -186, -147, 129, 40, -38, 37, -165, 140, 48, 46, 145, -119, 129, 95, 41, -354, 19, -13, 259, 76, -211, -145, -25, 65, -54, 110, -205, -11, -169, -90, 81, 279, -9, 4, -133, 73, 262, -140, 129, -197, 313, 214, -2, -97, -37, 163, 81, -116, 176, -76, -213, -158, -11, 89, -34, 179, -94, -57, 102, -164, -99, 158, -107, -14, 46, -227, -13, -321, -137, 147, 12, -65, 55, -30, -136, -117, -319, -26, 104, -95, -15, -251, 66, 87, -177, -273, -55, 88, 219, -112, -24, -131, -100, 48, -139, 315, 143, 253, 183, 164, -114, 20, 8, -127, -234, -304, -25, 164, -57, -63, -28, -11, 118, -198, 190, 15, -84, 29, -125, -12, 175, 110, 157, -187, -93, -129, -88, -140, 41, 119, 148, -10, -122, 279, -28, -23, -145, 115, -179, -10, 44, 17, -150, 65, 16, -55, -57, 173, -191, -67, 243, -100, 163, 83, -165, 61, -53, 47, -184, 88, -73, -153, -163, 42, -75]
4272g5j5j46L18j53r6K49j16j81K82k13n0jJ34j50P1n6Q1J69qK08k73J64k34j51
4296b42K75J34k39j94L75p5j30J02k75K50K24P5m93q4L23j3k1o5j67L82j15l8
4318a1J60q4j33p6Q5J58k71J78j87K8P2j8O5l03N30j94n2K3j38J56N9p2J51j34
4342hK72L0l60q2L60j6j50l03L10L4J0J14j06J06j78j36l6L06J70o26J49M10k6
4365B44k4l50J45j4J06k50J16l49P67o17M50k60p5JK65k61N1J24j55j27O9J68
4387B4qk25J98J84k33p3K92O5k04l95K71o8K47o1n4j51K97Lo7j96R4k51K72K7
4411a2k56K92l44M73k83J78j60l2j60K15J76j78L4Q7J8q1O6N9j07j27P5l8M9o0
4435a16J14K51j52l5k41K40j44L51k10Jk19k6J92k1K19k33L40l75R7K94j64q6
$$ y = [-75, -90, -236, 82, -71, -167, 82, -34, -215, 67, -146, -196, -197, -63, -213, -142, -198, -117, 52, 44, 252, -21, 143, -91, -242, 33, 167, -72, -266, 109, 34, -96, 6, -269, -19, 205, 280, -213, -297, 26, 13, -8, -73, -240, 142, 27, -11, 149, 65, -68, -144, -59, 99, -172, 6, -181, -153, -81, -99, -34, -337, 193, -1, -53, -30, -168, -12, 47, -25, 126, -8, 264, 294, -66, -148, 212, 196, 46, -257, 53, 87, 97, 211, 105, 211, 33, -103, -139, 167, 337, -289, -140, 270, 244, 220, -130, 15, 1, 107, -143, -27, -376, 391, -226, 224, -36, -111, -110, 155, -106, -55, 69, -86, -213, -144, 24, 16, -209, -11, 173, -60, -133, 159, 224, 20, -375, -104, -172, 75, 14, -40, -191, 106, 109, 42, -154, -60, -311, -39, -12, -268, 24, -320, 153, -130, 48, -112, -144, -304, -89, 87, -91, -57, 30, 48, -33, 33, 92, -15, -142, -67, -105, -56, -116, -2, 249, 97, 62, -179, 61, -83, 268, 58, 59, -160, -186, 6, -15, 204, -29, 311, -64, 33, 327, 163, 77]
4457G7P0q6j21o2J92j06j12l9J10J96k62M61k10j03n2J02p3Q8p3l3q1J05M4L9
4481G1J3n5J31k92K45J34k14r4N5m0K27k19J4q3K44j72J88l0k14K37k28p5Q6r5
4505a66M01l41P0k9j62J51Q4j54J08L7J82m57L72n4Q5L1l6J0k3l4k3J78k11r6
4529g7J72ON6k68K94k41J58k36j1o8L02o1J74k12j0lk51L57J22r6j7o5j0J08m85
4554c62N06p5j97m8J95j31J44q5L7m3J1R0J63k89M35k65K20n5j50N6Mk04q5M05
4578B77k01K75l05k21L32k33pJ03m3k28L32K7K8j5k74K87Q2k29K63m29J41M7L2
4601D1j40K76j89M3L9k14L51l70L37j60M0J03l1l17N42j57o14L71k6j4k3l6J22
4624b6J29k09K41K1k81K87k18K9o0J25k14lJ01J42o3Q9l6k3L69m33q0M39k59J6
$$ y = [77, 147, 61, -60, -122, 70, -36, -148, -187, -77, 119, -143, 318, 108, 5, -47, 55, -18, 70, -3, -36, -117, -12, 32, 71, 84, 29, 160, -132, 113, 247, 33, -61, -6, -46, 181, -38, -24, -107, 137, -35, 153, 123, -91, 146, -82, -157, -71, -166, 235, -106, -36, -65, -227, -76, 8, -146, -38, -1, 181, -276, 96, 42, 127, 158, 122, 132, 109, 75, 52, 230, 19, -77, 95, 101, 157, -111, 183, -58, 100, -136, -147, -215, 87, 26, 200, -12, -22, -25, -276, 81, 203, 107, 90, 25, 15, 123, -362, 144, 69, -128, -176, 19, -112, 32, -53, -16, -59, -48, 42, 205, -84, 351, 86, 306, 251, 101, 157, 161, -43, -128, 277, 76, 351, 46, -175, 157, -76, -83, 20, -23, -251, 81, 108, 136, 121, -153, 134, 216, -13, 250, -179, -38, 9, 41, -99, 177, -12, 31, 70, -144, 207, -163, 174, 14, 54, 157, 126, -191, 351, 194, -420, -49, -75, -89, -112, -148, -26, 103, -106, 135, 156, -125, 162, -56, -27, -87, 38, -176, -179, -78, 64, 1, 90, 54, 31, 400, -33, -113, 326, 67, 83]
4648H3j67K14m00J43K97j2j80n4n1K60K37l86J09j58J49L8j54j3M20k22k74J22
4670Ak08R2J56N0j57K28m53M21k08j30L27l14K22l0K9k9l09L82k50J69j44K41
4692H6l41J39J87k6n9j22r9L54k81O1J71j28j8l2L21M0l09j81M33k65j98K0R7
4715a50r9L82k18K56J39l96j74L06K33l77%O4K74m92O0K38K00k24m9J80p5j84
4737a06J6K93j76K35k32K6j98J67J65j09k68P9j48K17K42m30M40k79P4J14r4J20
4759A48m6k07J13l5l2K6q6K10j33m56N21k8k29K38P6J72j70j51J91j99q8K71l57
4782b51J64Q9J05m8K45n03J36l3j40J73R0L4j60N9P8k47K02R2Q0O1l06j05O5J97
4806G7k92pR5J30O2k04J50P5J63l43l7J82j1j06k67J79j29K60j47K69J0j95K66
$$ y = [83, -84, 130, -270, -127, 170, 158, -22, -76, -127, 133, 370, -16, 93, -65, 84, 122, -32, -45, 375, 153, -121, 1, -207, -115, 41, 91, -66, 162, -291, 130, -78, -208, 119, -195, 27, -3, 26, -3, -312, 70, -180, -11, -155, 86, -255, -116, 71, 45, -14, -136, -235, 119, -162, -101, 70, -58, -76, -108, 213, 253, -56, -237, 196, -69, -267, -247, -150, -249, 133, -85, 171, 310, -86, -260, 46, 279, -98, -98, -34, 240, -252, -192, 46, 246, 22, -27, 153, 78, -106, -90, 203, 27, 262, 30, 56, -142, 25, 190, 81, -187, -108, -256, -39, 203, -227, 213, -66, 8, 122, 28, 148, 102, -105, 8, -27, -59, -33, -119, 91, -42, -498, 23, -5, -234, 4, 80, 252, 82, -69, 122, -77, -165, 106, -251, -87, 2, 107, 59, 304, -199, -63, -96, -236, -63, 27, 61, -99, -40, 38, -209, -7, 85, 165, 226, -80, -185, -120, 77, -215, -222, -127, 3, 65, -139, 11, 86, 249, -94, -131, 51, 40, -66, -333, -154, -283, -23, -170, 99, 109, -86, 180]
4829A80k17j60J39n0J98K40k56k11L6P1mK32j59J56p5j10o3J1p4J09m3l8j5j51
4853b54N03q0j02r8k05N50o8j73m08N56j29j57J63j53k02K64K6O3j52j76N67l96
4875f1M7J21l5R2k95j78K18N1J65m32M73N0k10K09r5j52J19k38K29q2J02k81K23
4898D0L6j61J04J19j97m6L1L3M8r2K10k33J42j24N7J93l52K26p4K51l39K1K53
4921A46j20k7l7j9NN0m7j36K89r3j33J15m9j72L78jk70jK2M1P3L06l86K84j47
4946G1j92J06K78l75J17J1J36M5n22K68j05R4Q3m3J01pl32J54R0K41Pj62K14k39
4970C9k6J84k35k43L49R0k23J79l2k16K81n05L35K78k31l9J51qL1k64j04L90j51
4993C0o5R4M0k55K22k20K01k48J69J7M5N6q0M2K9k76K25r3M6j9j46Q6KK84n68
$$ y = [180, -37, -197, -58, -108, 90, 330, 74, -137, -101, -30, -34, 198, 39, 195, 120, 10, -53, -42, -116, -7, -50, -88, -103, -254, 249, 169, 67, -31, -236, 314, 246, 73, -335, 221, 92, -65, 98, -55, -257, 7, 33, 96, -56, -232, 335, -61, -14, 107, 72, 164, -131, -309, -91, -40, 125, -307, 166, 216, 6, 215, 120, -32, 87, -151, 78, -4, 98, -183, 40, 76, -85, 19, 138, -59, -105, -74, -41, 7, -85, 125, -108, 34, -90, -33, 160, -192, 34, -40, 211, -128, -107, 146, 26, -1, -38, -57, -52, -2, -49, -185, 104, 11, -122, -7, -56, -228, 150, 149, -121, -122, -100, -59, 14, 320, -66, 218, 71, -121, -15, 263, -112, 5, 16, 152, 197, -325, -57, -162, -68, 15, -28, 73, 66, -266, -112, -22, 219, 226, 64, 278, 39, 13, 197, -38, -281, 68, 158, -65, 114, 82, -134, 147, -358, -23, 255, 24, -15, 136, 128, 159, -105, -209, 181, 30, -35, 59, 99, -156, 66, -154, 47, -201, -32, -15, 30, 86, 6, 48, 77, -199, 26, -67, -21, -40, -186, -100, -98, 186, -382]
5018c82M98N2n05N21l11J07j0RJ10k01K14k1J03j26o6k23J32K78JJ4j80j32K40
5041A22k89L21J57n42N10k59Nk43J91J4Or2k31J72J41pJ30k04n5O0K81l96J42
5064f6LOJ65j53K36k87p1J77P2m9k6J8J85m11J80J37l7K06j93J26j34j46J37j45
5088g0P9J0j57R1R6k77L66o11N05J97k72L9j84k8Q9J07O1K37j77j24k21M84k72
5111c2l0K12K1r3R7r8K49j95k53L64k47n4J7P2o8j57L16k93j86M41m4J93k14K14
5135B32j08l11K10k49K40PQ4Nl11K15J05j94J95k56P3mJ38j43K40J84m36Q4K39
5158B39k5j27J01J73j74J59k23j67l3J50R3j56J11l09J42J26P9j51P8l3J2j4k69
5181b18J59k0N1p1K15j49J82j28q6J77j64l0o5L09l41K20L5K32k24L09m22k79
$$ y = [-382, 116, 168, -337, 184, -127, -20, -30, -21, 89, -112, 102, 81, 184, 58, -8, -231, -99, 179, 180, 194, 14, -118, 122, -167, 154, 311, -231, 279, 20, 25, -218, -27, -13, -7, -99, -330, -158, -17, -24, 106, -98, -153, -93, 188, -208, -66, -63, -57, 108, -45, 191, -96, -167, 10, 82, 33, 7, 25, 210, -201, -21, 116, 79, 285, 92, 218, 84, -62, 75, -70, 9, 19, -138, -47, 49, -228, 138, -473, 32, 229, -43, -4, -188, -216, -127, -20, 41, 278, 101, -23, -244, 240, -32, -62, 150, 171, 78, 175, 77, 326, 131, -122, 242, -5, -59, -42, 30, -38, -195, 121, -172, -358, 83, 39, 232, 18, 232, 124, -187, 23, -226, 14, 21, 105, 110, -201, 14, 119, -75, 120, -136, -63, -67, 71, -72, 168, 352, -84, 0, 239, 214, 87, 188, 361, 187, 346, 123, -44, -77, 73, 166, 10, 121, -188, -46, 80, 159, 8, 86, 53, 65, 51, -218, -59, -79, -28, -99, 116, -33, 149, 21, -65, 112, -52, -82, -147, 162, -179, 41, 76, 308, 84, 393, -29, -308]
5203c08J04M63m44O8J91L0k84J89J18k42J48j65K05k17K07j39J47j60J39m5L8
5224D3Q5k1m6J0m09M72j33Nj6J21m2j57J70j33R7k4j92J01K62Q2l35K64l92J51
5248c7l9J99n7l07J58J51j50j93L20k01M23k14j4r0J19K9QJ85n08N9L00J24n13
5271b48L11j51Q1J77K9j46k40K86Mo3k16K94l11nN17m57J55J85m18K05k13M89
5293B65k13j38J57m5l6J49Kj56J43m10M64pl54J87J68k32j32J24K86l66R2K13
5315A61P0j28o1J73k82l5J66K59l77J22j7k74K73m8J93k14J87j17k63L35k34O5
5337d6J69J8o7J6k51J13j16M19k8k25L46j25n5J1j45k1J81J9j15j43j5J54p0R5
5361A19K2k59L38L8j79Mk12J75j57J39j77K69l2m3J0q9L6M8j82O4k20K20r0k6
$$ y = [-308, -204, 259, -185, -117, 74, 104, -180, 9, 127, -115, 33, -132, 73, -144, 63, -76, 71, -89, 50, 5, 43, 128, 107, 61, 71, -338, 134, 1, 6, -10, 111, 69, -88, 82, -51, 46, 22, -170, -69, 193, 275, -60, 204, -188, -37, -76, 123, 66, -241, -83, 68, -82, -275, 45, -156, 267, 53, 39, -51, 68, 97, 105, 290, -218, -159, 141, 265, -248, 63, -88, -7, 170, 199, 53, -187, 99, 103, 40, -176, 118, -193, -198, 319, -138, 17, 202, -216, -11, -224, 265, 52, -86, 71, 26, -10, 139, 141, -15, 128, -282, 182, 175, -179, 8, 176, -56, -188, -64, 222, -144, -52, 161, 231, 103, 42, 215, -67, -102, 64, 323, -54, 68, 51, -223, 50, 2, 195, -19, 168, 51, -212, 123, -111, -46, 123, 141, 74, 90, -161, -48, -164, 255, 227, 2, 348, 223, 168, 179, 34, 13, 194, 213, 98, -45, -60, 94, 24, 119, 141, -118, 220, 258, 79, 83, -129, 46, -111, 28, -149, 120, 88, 45, 55, -34, 2, 50, -132, -68, -288, -68, -158, -184]
5385a84L42m4j85k74L99QP9q9j89J27l5K28q7j94K2K2M8K4P9k20L74m35J5K59
5409I0k84L59m1l9L28m60k5j73J41J45k27N20m23j64K18p1K40J1o4k78L03j98
5431i2k0K52l16J47p6K99p7k42j2K76k82K04m1J81k05P4m60J55M64k77L16j78
5453I0M1p7M7l8k13q4M15m31K08p9J22L4m0L1J8r6M2J27k40M95k72J17k3k60j4
5478h0J35j9l0J18j9j15J4M4J76l52K63m6k43l18N51k28L59k6j63jk02J71q6J15
5502A8L8j61R1k9p8O2N4p4N57l54k35m4O5K75j00p0k85L80K1j3k09kK16k07K81
5527A97l04J75J4j59j39L08k22m7M3on7K11j3lL6l7L1lJ57l27M67k73m9l45L36
5552iM5l0o4L17l50L28L8m9q3k49j62L52j59K22p0M5J48j65k4m47L63J64J31m18
$$ y = [-184, 158, 114, -71, -345, 54, 62, 141, 52, -137, -10, -45, 183, 96, -98, -76, -54, -6, 18, 97, -123, 251, -184, -169, 90, -194, 165, 124, 85, 413, -47, -72, -245, -104, 41, -186, 334, -89, -253, -35, -106, 134, 145, 81, -197, 106, -92, -112, 140, -176, -29, -105, 194, 117, -125, -137, 139, -143, 61, 20, 201, -4, 70, -390, -235, 229, -48, 268, 90, 131, 54, 101, 63, -150, -234, 181, -250, -42, -121, 1, 35, -5, 26, 44, -52, -10, 117, -123, 372, 100, 217, 194, -66, -80, 55, 36, 6, 124, 105, -10, 4, 48, 224, -128, 135, 89, -154, -472, 79, -149, 210, 184, 21, 20, -182, -11, -97, 18, 56, -105, -14, -43, -121, -59, -5, -79, 478, 124, -111, -155, -90, 185, 85, 15, -270, 110, 131, 118, -91, -93, 123, -84, 197, -107, 68, 82, -77, -216, 92, -130, -177, -134, -140, -197, 14, 1, -2, 34, -3, 28, 25, 182, -145, 322, 49, 0, -345, -9, 36, 6, -58, 259, -91, 237, 275, 226, 143, -106, -268, 84, -75, 147, 77, 122, 270, 105, 81, -366, -3, 161, 292, -126]
5576a26M72m19j34K20j04J08j36J46k27kK21j39K10k26K10O3l89L74o3p5J19M8
5598A51l08m06P00%j62j5n6J27j15P2J95m5k9MP8k69j9m2J06j65L73k17j38Q4
5622i6l9O8j32L23J09l05J30k1Mm5K26N1j93J53k4k76o3L47l12l7j38M66k29j76
5646b09R8J52k16J72k72L79l7r3J95j50J19j35N1p5J88j03O7J1k17l9J00j24J47
5669IR0j32K01j41l92O18n32n2M55j06k51M07m68J19J09K13m9k1J4k42K59n3O5
5692A20o1P5L5N2j61j92K9J75l46J34j64K82RpJ03J3J08m34J51k00J54K7K26q9
5716C9k45J77n5j78l3L14M3J7j51N0K6N6O2ok10J08R4j62j06J49R9k1%J26j02
5741I1Kk52M6K8K46k12L46j74p8R1j71J5j49M73m36J83k51L98K7j87p3j00K91
$$ y = [-126, 346, -73, -207, 13, -91, 17, -119, 27, -200, -202, 19, -120, 90, -136, 74, 137, -252, 122, 59, -16, 103, 151, -157, -563, 137, 137, -25, -40, -96, 31, -84, -12, 183, 138, 109, 113, 191, -78, -97, -139, -33, -198, 175, -42, -180, -96, -135, -67, -199, 124, 233, -72, 58, 37, 41, -4, 222, 273, 80, 233, 209, -67, -130, 217, -95, -132, -270, 196, -33, -209, -111, 41, -175, -3, -275, 104, 67, -26, 169, 19, 138, 3, 54, -21, 167, 64, 131, 142, -75, -114, -14, -138, 9, 99, -33, 168, 27, -365, 253, -279, -331, 124, 18, -233, 174, -294, -175, -66, 147, 98, 77, 91, -151, 108, 55, 120, 59, 134, 169, 221, 60, -132, -103, 72, -274, -140, -304, -22, -13, -20, 83, 96, 204, -230, -79, -279, -125, -98, 128, 39, -206, -29, -84, -262, -295, 19, 62, 79, -72, -22, 4, 60, 122, 116, -94, 14, 108, -54, -160, -11, 88, 67, 67, 193, 91, 93, -159, -113, -85, 161, -51, 295, 121, 43, 134, -37, -22, -171, 302, -134, 49, -202, 196, 223, 36, -37, -137, 154]
5764A54n17M12l6k21L63K4o0Jn1j20j03K74j05p1Q9j83J70k4j31M4K15o9q9k34
5788b68k0L06n5k9O6l6J56kk00J20j42k1l7R1q2L73k90M33j91l8K64m81R6J5R7
5813A25l5m17K80J29j68L9k04L30j33L9J85l97J42K38k2qJ4j48j61J37J17k27
5835a45K76j05j19L09k94J45k64J13K18l56K78j86o8M04l8p5m7k51L62o9r7j26
5857a35P6O2M3p4K99l91K0j21K58K8J6m0O3n0MK85j03m61jj29R5L46k72M00l56
5882a38l2K40j34R7q5R0j57L78m75J0M12o7o0k7n8J3LL2l00K68M64m59q0k6J3
5907g8L37k80J28q4K47k38q6k89M56J03j71k28J68Q6k91o5M14%q8J14j67l11M74
5930A51k69K07k39m0J24K1r7J54P6k22L47l29k5K15N0m13K18N6J0K55n4m3j42
$$ y = [154, -363, 49, 13, -208, 155, 179, 119, 120, 69, -51, -154, 120, 15, -56, 33, -150, 20, -4, -135, -91, 124, 55, -34, -268, -288, 18, -37, -66, 0, -36, 120, 118, -82, 38, -104, -125, -162, -71, -153, 220, -70, 363, 172, 134, 398, -83, 13, 28, 125, 90, -327, -47, 82, -86, -47, -251, 79, -54, -15, 170, -227, -85, 153, 131, 123, 137, -11, -172, -35, 82, -145, 131, 26, -93, 216, -78, 67, -197, -84, 134, -222, 56, -130, -198, 206, 168, 93, 46, -205, 157, 88, -9, -135, -59, 3, 46, -28, 271, -120, -100, -221, 37, 65, 81, 41, 104, 54, 58, 343, 240, -221, -222, -351, -256, 90, -182, 218, -138, -170, 70, -64, 33, -52, 38, -119, 259, -216, -206, 206, 139, 79, 52, -6, 7, 10, 42, -258, 10, 474, 15, -65, -91, -78, 259, -21, 107, 23, 270, 32, -54, -343, 113, 216, 45, -183, -15, 71, -220, -285, 129, 129, 41, 155, -12, -323, 151, -118, 89, -150, -190, -66, -45, -142, 12, 88, -134, 213, -116, -141, 74, 124, -289, -71, -15, -5, 250, 196, 153, 11]
5953A1j29j1P2J1J2L80m80L20j37KKJ40l83J67J50n49P04l32k4j82pM44m58Q7
5977a90Q7L54j60j85M04j87m2j34L2J64m96M18j73p9k0K21k6J3j89J85m0n0J77
6000H4j55J8l7J22J20k45K2j4j1R6P4lRmk34J39R3j52K44k11l21O27k56k06L97
6025A96Q1o63O64m10J99L01k33Jj31j01L29k84K99j94k63J49K95j30k43L84k55
6046iK8M0k6l2O1j90K03j05L2l5K31k14J19O5l35K7J6J81R2k53K08P1q9J26l58
6071a46L90j40M3j05j7k87L81j09k7j64J67N8j45n3L88l08r9J34K0L3l49O76n19
6094a78J41l8j32K63%p1o8L2j43J89J96l84O7L98j65k00o3K42J12N0m7l31K03
6117G3k67K67j16K4Q0j57J81j00M3K7j53n0J73r9lq7r5O3L16Q5m1J96o20M32j09
$$ y = [11, -118, -129, -57, -46, -34, 346, -134, 186, 49, 51, 53, 193, -190, -23, 127, -422, 282, -50, -74, -256, -263, 181, -277, -190, -103, 251, 91, -94, 310, 123, 81, -53, -21, 143, -353, 65, -108, -187, -207, 14, -12, 1, -188, -3, -43, -93, 84, -71, -53, -90, 32, 152, -93, -71, -85, -96, 0, 74, 71, 80, 76, -158, -19, 74, -78, 166, -45, -366, 261, 5, -201, 196, 277, -386, 278, -132, 67, 368, 135, 136, 5, -96, 233, -51, 248, 54, -209, -60, 235, 105, -138, 246, -9, 19, 59, 33, 1, 62, -128, 75, -30, 2, -33, 198, -16, 103, 168, -167, -140, -124, 57, 149, -104, 104, 175, 86, 212, -146, 244, 104, 147, 42, 25, -262, 119, 10, -17, -181, -14, 44, -101, -154, 234, -74, -173, -39, -19, 14, -335, 341, -178, -37, -75, -207, 56, 56, -15, -83, -51, -194, -5, 191, -193, -126, 272, 107, -93, -156, 86, 198, 248, 201, -130, 73, -194, 73, -43, -19, 61, -96, 85, -15, 28, 55, -98, -148, 25, -74, -77, -164, -259, -196, 120, 205, 164, 360, -260, 172, 63]
6142F3k18K50k79K11J01j43K63k92j81K71N3J9J07l22K22R6j3l95O2QL5k64K02
6165a44K70j72K01n0j76j25J9J56R2J11k09j70J8K28M4O0l5j70j4J47n6j82L92
6188B35k61n3k12J74RJ26j77M06m18J70r9l1J52j13J61R3m20L36O0j95k22M28
6210A49l85n7K11J66r4m5P2J43k1k34L64j08p1N0j10Ol67K31mq2K5M0K61q4j96
6235a40J11J97Qn2p4l06J76J92l49K39K7o4K08j42p8K4K55l60K51j80j23J29K50
6258A99m7J00m66M74j54l73K89j7J09J76j72k41J11r6r3K11L4r1J96k86l8J40
6280c5q2J92l25K97r8NK6j25J73M0J77q5l09J08L40m21K58j31p5J37n21N75j23
6303bJ00K27m24k4K99j01j3q9k71M38r7n8O3j97p6N93k93R7j53l20K21K40p9j03
$$ y = [63, -155, 95, -184, 27, 128, -15, 248, -44, -225, 46, 99, 118, 225, -97, 125, 221, 208, -187, -125, -117, -82, -346, -144, 126, -46, 155, 105, -71, -196, -177, -21, 71, 182, -27, -197, -179, 49, 93, 153, 118, -52, -66, 81, 25, -157, 235, -26, -79, -291, -117, -108, 18, -159, 247, -171, -1, -100, -131, 21, -92, 69, 162, -258, 78, 138, -57, -279, 149, -236, -293, -82, 84, -10, -55, 17, 160, 139, -95, 269, 161, 90, 140, 30, 36, -331, -100, -104, -186, -161, -121, 140, 56, -140, -29, 168, 176, 124, 50, -256, -80, 112, -237, 2, 29, -35, 173, 31, -47, -23, 232, -128, 123, -57, -180, -51, 199, 152, 252, -214, 260, 106, -267, 22, 5, 114, 290, 118, -123, -12, -108, -201, 10, 44, -47, 149, -137, -175, -35, -117, 75, -250, 47, -51, -46, -20, -145, 28, 68, 245, 160, -149, -41, 299, -122, 136, 5, -70, 67, -454, 121, -2, 98, 325, -99, -123, 176, 75, 62, -27, -298, 140, 43, -15, 48, -149, -225, 368, 75, 172, 19, -301, -80, 160, 81, -22]
6327b2m4J85j5J80k20k36O6J70m6J44q0M5n4q8R8k55K01q5L9K08k95L0J5J93O8
6352B02n4j97l52J97M8R0k8J15J82j90k10J8R7n9J63n4J54jo23L91J53J82Qr2
6376A40R7l70L16k35o4K50rl86K72m3m1K11j00O1j9k36j1M21j54r0Q8r0K9n9k6
6401d8J12J16N8o0j61l16q1K21M08j81K35j16j59j9k42K09j88K0M60p8j00k98
6423b08N52j27k07L6J13k12J03J55q1j19P3o8j90R4j74L20k32M37j38m80O21j49
6445A19j63r5K4K09k65J75jK1Nk06K99J28k29L29j01p3o6j76J77l44J70j20j65
6468c48N00M3j32o0K1J31k95J74J35j64J47j49J23k2p2%k16K76K29j62k29L2J72
6491A34N7j06oj53J91l9j39L2J8o8Q2l8%m0p9K41m4n08M69m5J10J01J96k68j05
$$ y = [-22, -66, 119, 104, 284, 64, -172, -106, 64, 18, 162, 82, 127, 73, -15, 83, -172, 29, -56, -17, 191, -104, -74, -59, 134, 202, 148, -49, -401, -204, -156, -66, -94, 21, 203, 13, -197, -179, -82, -141, 22, -32, 122, 121, -502, -111, 42, 224, 232, 140, 237, -133, 183, -52, -116, 134, 125, -261, 11, -32, -73, 138, 38, 99, 80, -156, -167, 254, 100, 10, 98, 8, 37, -22, -48, 64, 180, 238, 178, 17, -299, -380, -159, 249, 68, 303, 187, 28, 9, -233, -24, -212, -192, 268, 190, 90, -208, 344, 217, 10, 46, 159, -53, 50, 205, 124, 5, 78, 10, -180, -86, -260, 60, -172, 265, 127, -353, 268, 119, -44, -139, -115, 94, -171, 4, 3, 24, 29, -177, 122, 250, 21, 350, 249, 176, 110, -66, 111, -233, -63, -183, -348, 152, 195, 63, 3, 24, 155, -140, 34, 169, 5, 152, 3, 126, 104, 32, 32, -184, 92, 321, 159, -70, -38, 134, 191, 85, 79, -74, 117, 78, -61, -29, -11, -79, 3, -35, -35, -75, -154, 87, 43, -465, 4, -41, 69, 170, 366, 98, -7]
6516gQ9j27n6J4l6rJ74j72K9j61N22n16J21K49m2R9m60L15k9R7R8k36J24lp2J8
6542B3M7k30mj52J14J81o6K86k37O8j3j89M5J80k4J0N0J14k52k5J44l3l11L05
6566C1O2l53N14k43l21O06k31o9O8j42M9j36r6K78j06M02m21L1j10J22M1j07K88
6589A57k13j87K47j57O74k58k36m4k4p7Q0P2L26l12j41K35l1j10O0L6k81L46J6
6612A78k29l19M48J12n58Q5N33l82J99K25j89j45K1j79K53n9N3k37R0J20q7J30
6634F3p2J1o8N3j82J56l83P62k08N1k27j7J80j82K04k50J39k86J52J02j09K68
6656A57l8k82M73n78K07j88J07K28j32n7K48Oj96o2P2k2q6K04k29Q5K13m6K9O
6680A19l25M00j23j91j05J80J46J5k79L16r2Jj0J40j21j12j71K72l27J54j44P4
$$ y = [-7, 82, -45, -101, -87, -123, -132, 42, -130, -101, -262, 260, -256, -135, 114, 72, 171, -289, 26, -3, 94, 192, -44, 80, 77, 5, 23, 70, -160, -164, -316, -202, -21, -87, 199, -38, 30, 17, -172, -127, 53, 29, 39, 89, 203, -49, -74, 70, 37, -274, 31, 93, -260, 254, 11, -310, 296, 65, -4, 64, -78, -29, -165, -261, 17, -89, 313, -108, -77, -187, -65, -24, -131, 157, -56, -243, 4, -153, 521, 263, 27, -17, -41, -118, -38, 34, 360, 48, -93, 142, 111, 1, 61, 97, -184, 162, 178, -51, -370, 78, 190, -368, -283, 250, -132, 67, 292, 103, -42, -21, -200, 53, -6, 47, -190, -100, 20, -67, 63, -9, 2, -66, -13, -195, -39, -422, 340, 132, 183, -44, -61, 119, -63, 141, -109, 30, -256, -104, -2, -111, 157, 119, -163, 310, -268, -61, -249, -142, 86, -46, -103, 145, 151, -45, -107, -35, -57, -143, 61, -168, -83, 130, 84, 113, 119, -206, 194, 71, -120, -225, -45, 101, 116, -163, 153, 61, 62, 52, 192, 71, -41, -212, 60, -267, -113, -257, -183]
6702a83K6K60k5j2k91J35jJ04J3L7Lj27K01k72K99j10K31l69J22j49j9j32J71
6725h8N3P9m9k00j7L79J7m50J57K60Q1l7j07J39k63K60l85r3J74K32k31j8p6L43
6749A60k04K74l31J05r0j44K58Q9k62J55L9j38n4K52j66K18n28K84J72j99J13
6770Cp9J90k12LJ40o0J75j46P1l72K50Q6j69J18m4K33j74O7R3j93k8l2J59j71
6794i2P2P7J84m46j12O68n93P9K08j0nj06L7k29R4L2L64m74J96J31j40K5k1K02
6818A41n0Q2j84NL64o34jJ71O8L38l38L87m68J45k1p8J91m2n2q5J63n14L43K18
6842A49Q8k49L3r2j29K55j25p2K30J76k21J63k98J98j47J20K6L43n34J68k82K83
6864H3j05M6j15R1Q6l19N46j91o4M5k62J83J46K37m25j75P6J11J61k24J18n6J00
$$ y = [-183, -157, 103, 78, 66, -225, -90, -91, 13, 26, 63, 66, -61, 140, -132, 167, 57, 288, -81, 41, -108, -127, -259, -88, -35, 44, -5, -205, -222, 157, 174, -276, -119, 141, 222, 185, 78, 217, -46, 214, -171, -264, -90, 142, -89, -107, -183, 160, -44, 230, -101, 4, -86, -230, 28, 117, -145, 10, 49, -89, -143, 109, -57, 161, -367, -83, 89, -110, 3, -76, 114, -98, -95, 45, -15, 160, 14, 85, -287, -37, 49, -120, -2, -46, 187, 13, 80, 173, -20, -48, -80, 79, -92, -20, 57, 241, -205, -317, 351, -242, -163, 45, 35, 30, -76, -39, -268, -174, -142, 222, -252, -56, 75, -65, -40, -61, 141, 91, 173, -11, -6, 358, -276, -277, -106, -38, 300, -38, 349, -119, 26, 5, -73, 118, 76, 24, -61, 102, -412, -69, 149, 237, -12, 21, -71, -200, 55, -70, -142, 88, 264, 43, 206, -92, 106, -41, 79, 105, 448, -86, 82, -200, 83, -22, 24, -91, 0, 86, -233, 313, 122, 58, 103, -159, 24, 170, 407, -18, -193, -117, -6, 155, -69, 49, -7, 93]
6887I3J75j23q7J58l85K1K71l7j06j30M85n62L11RJ40j03p1J56l85K40n9j19K75
6910A67n6K09l77J21j17J93j53J98Mj25K0J4j23N1K03m19m9J63J74L05l03N0k41
6933i1j55K04J29k67R3P5k39M40l01J26j97K2L2N3k7J94K2Jk2j13N1L0l51Q1M90
6958B80k13J28j04k11P9J50j39M7j48K66k43R5k5n0j5O4J94m90L12J72j33l58
6980c42L40l52J53p0L08j9J64l9p0J80k83j49M19q9k57K8J81k11L55k06j96L09
7002A54m74L26M9j97J26L66n51J07J93j07K15q8pj69J94j34m42M66p5K2p7J91
7024H8k13L60Pj91k78j74M23K39k73J68j44Q8k15j29K70o9j66L73m8j59oJ63j52
7047c8k72L72l52N2M53j96J79l53O8l8J68Q6k47j82M27k9r8l7n3j06L47k60J35
$$ y = [93, 268, 145, 58, 216, -169, -148, 123, 86, -20, -150, 335, -227, 84, 93, 233, 130, 59, 215, -170, 70, 11, -108, 167, 111, 320, -57, 64, -53, 140, -13, 185, 189, 64, 84, 98, -25, 26, 229, -190, -239, -76, 98, 403, 100, 150, -91, -246, -42, 87, -180, -87, -12, -251, 189, -112, 14, -183, -161, -129, -76, -103, 91, 113, 114, 92, -21, 30, 60, -291, -210, 280, 67, 195, 91, -120, -41, 109, -30, 17, -131, 135, -108, -13, -38, -88, -103, -39, 155, -335, -23, 149, 16, -342, -2, -354, -201, -271, 37, 18, 182, 143, 73, 253, -30, -179, 240, 151, -106, -78, 103, -108, 247, 41, -155, 154, -320, 6, 55, -142, -16, 350, -201, -94, 99, -8, 207, 119, 112, -57, 137, 3, -439, 27, -48, -26, -103, 88, -125, 235, 242, 51, -227, -401, 22, 261, -12, 156, 12, 100, -115, -244, 26, -43, -209, 164, 116, -43, -49, 114, -38, -310, 62, -290, -238, 215, 19, 198, -155, -87, -125, 43, 129, -118, -300, 127, 98, 0, -37, -90, -196, 151, -109, 26]
7070B6J61n81N40n9m3L29k94J17j77J1m7r1k0K0K81j4k64J02L6Q2r6J32nj1m7
7095H8qJ25k66Q5j30J11k00J69N4j19l4K96j36o1J83r3L07m85L73k05J03l7K0
7118A40m45L22r7p4Q0j04K1k4p7M8M01k77K68j04n2q2j09P2J94M3P9j08ok33R4
7143c0l5K86k59L5n0K55l82L00j25L8o7%l5K86n15Q6M09k37o6J48j96L3K0K9p0
7168a42K38Q0l99J65j57K17R7l1k30m6K42j65Q5R5j32J03n6q0Q3q7K11m9o8O1
7192C5j67P8k99L38o0P4n3k61K58K26o7q1o8L50j85q0k08L36mj45J03m0j03K94
7216B71r8k61j35M2M52k94J94l52K5K22l2q2LK23k12J31L54n73J67j62J57j8J46
7239A68k63L8K9nR0r6r9J30Mj61K89k01J13K97k47J58j71k30j65K83j85L30j31
$$ y = [26, 187, -394, 146, 87, 44, 373, 79, 196, 19, 30, -17, -108, -128, -108, 173, 159, -105, -3, 33, 115, 19, 151, 146, 135, 88, 80, 205, -61, 24, -106, 5, -195, -26, 28, -91, -125, 171, 35, -26, 157, 64, 371, -114, 259, 54, 157, 120, 140, -305, 17, -80, -154, -74, -178, -157, -181, -258, -210, 191, -86, 182, 78, 26, -56, -165, -93, 101, 144, 223, 115, 109, -124, -30, -65, 221, -38, -3, -53, 202, -180, 120, -5, 33, -34, -34, -69, 217, -298, -212, 197, -40, -106, 42, -154, -121, -101, -72, -142, 96, 176, -223, -58, -215, 2, 99, 68, -162, -208, 34, -131, -46, 49, -83, 20, -36, -116, -33, -120, 91, 42, -26, 35, -132, -54, -353, -15, -75, -1, -54, -315, -57, 169, 102, 21, -47, 303, 118, 38, -170, 166, 162, 17, 120, 80, -23, 271, 173, -88, -223, -181, 271, -23, 171, -181, -156, 66, 34, -48, -45, 178, -34, 97, 451, -122, 45, -117, 40, 22, 168, -95, -57, -28, -33, 57, -39, -138, -8, -4, -165, 124, -77, 36, 333, 86, 244, 73, -157, -322, -39, -224, 106, -25]
7262b5j9J23J32j03l66K11j0j51K84LQ4j10L1mk87k8K00M1j11J17r3L92m58j35
7286b82K61O6r4k3L93m88N31m50K73j05l4J29j69R0j66J40L5l29K23J51j73p2
7308i3r8J10N9K14k09K03k2j5j76n09Q17k60n0J12j6q4q1K15k42L65l28J44M3
7331I9J1j64J14l03J17K02p5p0K55M4j43k17M61m21L5QK38j01J15M4k70J13j58
7354f6K43l61L30j71M5K66l57J69On7j13J01l35q4O36q4l7m2k3kN4K31l53qR0
7379G8j09lK65l93K19j28Q5K99m56Q0p1l7j08M00k89p8L16k21K3K01l3k43J61
7402d2q9J07l2j08n0J18j37k4J84M53l75K13k55lj2J10n2J24j57k2k07L12l8q1
7426f3J53J14j42l1R3m5j59k06N0L28l2J44j28j83N49o62L17j59J37j5Qn2j23
$$ y = [-25, -44, 79, 211, 108, -258, -47, -57, -208, 76, 79, 163, 53, 84, 80, -207, -235, -35, 6, -105, 12, -81, 311, -147, -282, -21, 45, -49, -72, 321, -167, 364, -86, 187, 82, 48, 177, 8, 98, -68, 72, 107, -222, 1, 152, -21, -93, -191, -81, -22, 192, -17, 186, 164, 149, -27, -536, 281, 21, -29, 83, 67, -17, -98, 117, -125, 240, -88, 56, 99, 110, -54, 60, -243, -126, 76, 1, -69, 186, 230, 87, -130, 331, -90, -55, -47, 191, 90, 205, 249, -21, 92, -66, 177, -184, 146, -25, 20, 286, -71, 98, 104, 47, -66, 35, -300, -384, 252, 168, 131, 89, 66, 64, 118, 349, -4, -12, 78, -31, -34, 231, -162, 57, -71, 14, 313, -143, -63, -134, -171, -279, 121, -168, -246, 70, -151, -128, 73, 40, -203, -42, -131, -24, -56, -164, -214, -96, -233, -257, -73, 380, 5, 218, -37, -40, -52, 58, 6, 130, -27, -49, -256, 56, 18, -63, 90, 204, 62, 31, 124, 79, -80, -286, -236, 92, 60, 204, 76, -107, 442, -220, 97, -62, 75, 60, 68, 16, -107]
7449a07K81k6l1k02p5J86j55L33l56L03l03J30mJ03j08J66O2l32N17m50K81k78
7471f5oQ0Q4k38R3N2M3J76%q3N9k51k12L28j20J06l00L95p5J2l23J48J82j63K32
7496A54j25l21K18K87k11o4J49Nk16L60k85k76K03j39M00j4j51q3K19j45J03l32
7518b64K4N0Q7m0J04j67J51N7l5L10l24k5N2nK76K1j39k48J9K37M6l22J5K55l90
7543b55R7J72j59J69k94L70p8j53K53j13k31K32j2j50K6R1m8L1M1J60k90J05R5
7566E9j07J06j78K16k16K09Q5l47J57q5k25N41k94Q1J36k71J23M2q5j95K18O1
7588C1K3K1q9r2K21l24K62J05l80L89j68P1j56J92l53J38qK43k37N0j55k3M32
7611A93k99J98lR7j83J7L62k82m10M11Mj49l8j7K56k94K54k05M05m51R1J52l38
$$ y = [-107, 174, 148, 117, -85, -160, 26, -129, 204, -152, 151, -152, -22, -26, 77, -31, 135, 197, -135, 382, -68, 213, -65, -71, 9, 93, -145, -52, 0, 43, 219, 219, 136, 195, -56, -268, 60, -60, 46, -254, 141, 66, 78, -245, -97, 85, -78, 154, 29, -292, -74, 213, 2, -62, 87, 92, -124, 236, -49, -325, -122, -261, 139, 125, -26, -109, 110, -35, 68, -264, -240, -190, -103, -143, -39, -206, -55, 2, -33, 277, -47, -72, -20, -25, 251, 272, 133, -115, -96, 141, 187, -135, -120, 135, -255, -158, 14, -145, 24, -270, 100, 22, -131, 122, 9, -222, 10, -2, -152, -126, -35, -83, -52, -11, 149, -141, -36, 59, -48, 58, -120, 96, -120, 89, 174, -173, -16, -101, -326, 215, -79, 2, 138, -133, -10, 32, -53, -248, -30, 31, 54, 75, -14, -106, 115, -209, 53, 158, -222, 167, -1, 70, -86, 106, -247, -109, -117, 126, -111, -61, -216, -239, 193, -106, 92, 89, 186, 3, 20, 382, 100, -310, 101, 105, -44, -82, -99, 157, -137, 117, -88, 317, -134, -43, 109, -229]
7634b29J09P6k0k19K02J88k87J18q1R8m2L51k27o3j33J3m3L6L09k94J43m1J55
7657A19J41k25j89K88q2k8J6k19kP3J90m1Lj91R8J43k68PK53r5j90L04j84J3K67
7682B01k38M8P1k00J18K87j38k18K15m27K78L9k53L93k66J43j44p0K18k37L05
7703A25k25k0M06l39J64l15n6K10q9R4J70J01m66M56k37k9l2J18J9nn5j39K40
7726I6k81J04J12L0j59J64p0J35k54J63k58J03l8r0J90K0q0L20j84J91qk15j8
7749b7J0j53J66j13K22j94Q9j28P6Q9l5J29j84k20N18o6l23J34M4k4N8j38P3J37
7773A40k81J6L48k40j10j37J72P2k84K67q3J39j58J38k12J59l5J51l17J00K65
7794A10k06J28K9j44K82j78l4Q8j93J21M21m20j35J41P2l56K94m6mL5J02r8k04
$$ y = [-229, -120, -44, -64, -283, -81, 107, -180, -62, -143, -45, -87, 264, 37, -26, -159, -146, -189, -153, 156, -138, 5, -36, 119, 260, 35, -154, 134, 52, 24, 40, -179, -181, -108, 82, 41, 44, -147, -49, 94, -174, -167, 86, -9, -199, 105, -79, -66, 201, -37, 11, 82, -118, 0, 287, 149, -69, 146, -281, -3, 36, -217, 176, -90, 53, -91, -161, 57, -180, 125, -100, -120, 286, -53, 111, -204, -260, -50, -139, -45, 125, 226, -240, 216, -21, -50, -82, 36, 55, 50, -5, -144, 96, -185, -81, 31, 61, -98, 66, -4, 131, -123, 40, -218, -115, -153, -243, -53, -33, -113, 207, 23, 214, 206, -9, -27, -17, -170, -4, -117, 105, -89, 0, -128, -52, 37, 2, 131, -53, -273, 245, 179, -144, -10, 34, 10, 68, -70, 3, 140, -141, -125, 223, -17, -127, -264, -92, -20, -304, -37, -120, 19, -139, -1, -213, -54, -89, 62, -255, -155, 110, -96, 32, 61, -83, 199, 21, -13, 75, -118, 3, 424, 4, -131, 10, 82, -274, 20, -26, -30, 5, 107, 9, -195]
7817a95K94k53K66M4q2j80J13K45l08RM9p7K5l39N07k15q5J82K2j41Q4J58J45
7840B68q9n39N46k40j57P7r7J52k64M82j02Pk97K28K62l05K15o0n4J10j55J57
7862A45j15k41K08R0j15J28J94nm86j03L96J37j01j11M2k53K48J8p6j8J06q1j32
7885a25l1M9M0j54K68k4M7k95P2J10l09L73r5L4j58L35k22K22L9o7k42P4j00M33
7909B74j7n35M67l46J94K5O7P0j21Ll06J85o9M4j33L10J96o9j57p3k05j43K04
7932a35K31l07J42mp4N40l03k42J27K36l87K91n9j65k6oK98M4K7p5l67P3K59m47
7956c29J81K31J11j53N9mM1j21J2l02J14O3L30pk28L8J01l07K8K4J64m8j8l36
7980c56J81L36k06j2J80l19L75n8r4j34K37k55J52j09K35m5L1n67M06Rj5K94n42
$$ y = [-195, 99, -154, 112, 156, 74, -106, 7, 252, -56, -47, 2, -75, -50, -389, 118, -97, -182, 0, 22, -119, -35, 123, 268, 179, -360, 186, -54, -211, -134, -231, -79, -343, 139, 37, 44, -253, -25, 237, -68, 147, 87, 33, 143, -12, 145, 30, -211, -3, 87, -28, 100, 294, 289, -197, -300, 96, 233, 132, 21, 63, -190, 58, 76, 0, -18, 88, 7, -125, -156, -107, -67, -221, 47, 23, 70, -225, -153, -43, -352, 21, -74, -40, -198, 137, -85, 137, 176, 109, -133, -59, -159, 274, 257, -278, 189, -157, 37, 62, 129, 199, 78, 81, -225, -40, -109, -65, -198, 112, 308, 239, 82, 9, -196, -339, -135, 96, -211, -69, -73, -147, 393, 90, -152, -25, 211, -176, 115, 56, -109, -135, -141, 157, 201, 228, 153, -214, -141, 118, -329, -148, 83, 194, 41, 100, 96, 137, 16, 28, -274, -160, -97, 233, 226, -2, 36, 137, -170, -142, -118, 46, -2, -20, -356, -175, 161, -45, -57, 123, -196, 179, 121, 27, -107, 130, -125, 27, -82, 153, 108, 139, -428, -22, -13, -28, 266, -276]
8003b76J19J02R4j45K58o3j76P5k01L24o9%k84j8k0J48j45L25N8n01N43JR3k22
8027B0j31K6j21J29K47p3l12J75j42J35j63L35j32j01O4oK08J19l26K0n6L16j88
8050D3j13K28j64q3R2q6J27o5j05J99j60J81j17j42Q9K19o7K23j70q9k87K27K96
8073B76k26m09M86m16O6J00p1K87R1l67j21M21q5Rj03j77K57O6k36J13j0M5ML11
8097C11n39L92l9j42j10N0p7K89j09o8J43j61P9J08nn4j80k23K88J12j52L36n89
8120c40M45n1l7j56K02j06j2Kl0N02k06l04P4J16R3l79J49L07k47L93o10J91K07
8143B03j58P3j42J58m72L15L2k1K00k57J11m2n1J43k04J09n1MNJ23q1P0j02K58
8167B23J4l90J05j84M66Pm10l2L80j75R7j99Q5J74O3q5Mj25K33P4l05k09K24m8
$$ y = [-276, -157, -55, 39, -106, 152, 89, -87, -12, -213, 111, 42, 42, -242, -260, -280, -132, -277, 48, 106, -395, 148, 149, 242, 20, -111, -85, -206, -77, 170, 97, -215, -40, -182, -47, -210, 125, -7, -108, -44, -50, 158, 277, -49, -29, -85, 231, 43, -70, 158, -6, -89, 3, -83, 44, -21, -126, 73, -87, 94, -23, -165, -76, 143, 76, 299, 129, 40, -247, -20, 276, 50, -359, 127, -289, -223, -123, -194, 93, 184, -183, -304, 117, 32, 41, -62, -239, 18, 84, -152, -39, -49, -4, 0, 311, -228, 164, 125, -17, -127, -77, -154, 135, 26, -42, 101, -60, 19, 127, 122, 68, -112, -335, -47, 65, -87, 249, -340, 105, 54, 17, -139, 63, -43, -55, -53, -83, 419, 213, -91, -17, 99, 192, -187, -38, 269, 22, 415, -195, -4, 203, 45, 118, -24, 134, -338, -23, 9, -12, 188, -69, 42, 0, -51, 92, -112, -3, -54, -50, -45, 78, -3, 67, -35, 223, 237, -153, -48, -232, 234, 241, -169, -201, 179, 4, 101, -98, -13, 161, 224, 139, 143, 18, 251, 325, 20, -189, 35, -13]
8191a3
$$ Imaginary data points
##PAGE= N=2
##DATA TABLE= (X++(I..I)), XYDATA
0@%%%%%%%%%Qj6J6j6J6k4L2l3M1n2O0p0Q3r3J04j22J42j61J83k07K34k66K98l32
33a75L72m16M61n13N71o31P01p78Q60r53J056j169J296j442J607j796K017k276
51a208K591k979L466m108M991o287Q386j2338K2307r2045k10060J47448K12305
64G2469P3864m9011p5066j15749l8231J34400J62484l5970j47916n7563M0906
75c5383L5738N1874N1370m9913j18949k286J16785M8650o9962n8737k798J1398
87b2213L8659N9508k5326j09980k8288J04035O8338n7039p4706j5368N583K8493
99b8304P1931K4876q9864r0416L0422Q7590L0743j6744l7833o7395l3759Q3062
111c5691J15756j2112j16032o0295L8547O2493M5382R687o0632q3414J4048J04983
$$ y = [0, 0, 0, 0, 0, 0, 0, 0, 0, 0, 8, -8, 8, -8, 8, -16, 16, -17, 24, -28, 32, -38, 45, -48, 56, -66, 76, -85, 98, -109, 125, -141, 157, -175, 197, -219, 242, -271, 300, -331, 370, -408, 452, -501, 555, -614, 682, -760, 847, -949, 1068, -1208, 1383, -1596, 1870, -2238, 2753, -3534, 4852, -7486, 14821, -77224, -287284, -139836, 72469, 146333, 97322, 22256, -93493, -131724, 2676, 165160, 129190, -18726, -76289, -35383, 355, 52229, 103599, 53686, -65263, -67549, 49236, 97886, 27924, -30813, -33611, -22213, 16446, 75954, 50628, -59352, -87640, 16395, 84733, 27694, -47012, -62380, -56797, -28304, 43627, 68503, -21361, -111777, -81355, 6235, 36978, 20234, -17599, -84994, -118753, -35691, 80065, 67953, -48079, -108374, -69827, -7334, 38048, 47735, -12897, -96311, -82263, 22720]
123B2720N3850m8265n6940j2614N347K7321N6599J3223o8523n5351L8982O9232
135D5581J4969k6408l4495l5619K077O7022N3132m6613q3493m115O3552M0751
147E6341n425k8217m5229l0038L7185P0117P089o0789m3531R313K7839K9630K2957
160D7242k5350o8896k5779N6716O0584o320m7232l4229o159K9176N0950J3006
172D3709n5998n4232K0059N7237K1002j9259k4933k0275j682L5109L9537j1874
184B8400n0572k1076K6694L5030J8683m532l5405l9939J4237O2921L1587l8898
196B7130n4039j0296L0224M2184K4186k2109n6247k5911L8987N2312N058l3897
208A7582l2269j3446J3452M0329K8544k5297n2610j7785L1000L7044R908k0197
$$ y = [22720, 76570, 28305, -28635, -41249, -35902, -8581, 48018, 61241, -7282, -62633, -23651, 45581, 60550, 34142, -353, -35972, -33895, 33127, 86259, 39646, -43847, -47962, 15590, 56341, 50916, 22699, -22530, -52568, -15383, 54734, 61823, 1034, -42497, -33184, -5345, 24285, 47242, 21892, -47004, -72783, -16067, 44517, 38197, -9035, -43264, -49423, -20247, 30703, 43709, -12289, -66521, -46462, 10775, 31777, 12518, -12415, -32690, -34372, 737, 40274, 28400, -22172, -43248, -16554, 18476, 37159, 32627, -2778, -42717, -28480, 34441, 66028, 27130, -26909, -37205, -6981, 35203, 59389, 37280, -18967, -44878, -5891, 46421, 51479, 17582, -14687, -28133, -14681, 25648, 54192, 28895, -23715, -41500, -10500, 26544, 36452, 16255]
220A6255l8065k2083K5976M7918Q488m1802l6238O248L0338K1906k58k4009k9535
233c4861J3L4707K7559j2115l1319j6339P450K3753K5134P91l4634l1599J2929
246b8531M3752K2999j7493l6076k0999J3744M0213K7618k0110m5454j6860K7541
258i656L6378J0882j8054l0404j7932J4792L7282J8672k0853l5819j3035J7883
270i864L0172J7046j6292l7713j9225K4656L8602P776k8371l1582n030K2806K8721
283B1702N641k6695l0729K6K7385K2929k569k2251k1302k558K1182K6842J740
296B1343k7135k5962L598K7818K3364l282k7234k4800N570L3134K2985j1236l1939
309a3776j5996J3486K7605J5832j0459k6905j5517J2636K7837J4261j2772k5022
$$ y = [16255, -21810, -43893, -17917, 30001, 38489, -3313, -39551, -33303, -2965, 18941, 18683, -5326, -34861, -34848, -141, 27418, 15303, -16016, -32355, -24905, -1152, 23982, 24773, -9861, -41460, -28531, 15221, 38220, 20727, -15349, -36348, -22604, 17609, 45227, 25117, -20337, -37197, -9656, 26722, 37604, 19550, -10854, -28786, -13994, 23288, 41960, 21107, -14712, -27747, -9864, 20308, 37354, 21062, -16651, -35876, -11220, 27382, 35158, 6787, -24795, -29825, -7019, 21702, 27343, 648, -30081, -30055, -2670, 20259, 17690, -4561, -25863, -28421, -7239, 19603, 21343, -5792, -31754, -28156, -338, 23026, 19744, -7490, -32290, -26720, 6414, 29399, 18163, -13776, -29772, -16286, 11319, 27151, 16692, -10213, -25730, -13094, 14743, 29004, 16232, -8790]
321h790j3445J0911K6743J6508j3142l0014j4173J6738K9464J0939j8812k8073
333a5146j0075J8970K8013O529k1523k6534l670J9923K2060L374j8547k2472m926
346b4024J8102K2798L716j9275k3254l512J9899K3180K258k1803k3539K79K4273
359i02K1741l649k4003j8627N448K3423J6955o007k2172j5113P307K1290J4890
372B0581o484k0513j3927O973K1674J5042p132k2656j4731R445K4472J3456j1486
385A4714k4284j1393J3501K3625R163j4438k2674p384J4189K0519O111j4295j9743
398a2389o175J3414J9132N995j4295k0378n914J4967K0409M068j6517k1059k837
411b1579J7967J9599P40j8764j8463Q16J9150J6679k646j8713j4925L184J7908
$$ y = [-8790, -22235, -11324, 15419, 31927, 18785, -11229, -25402, -8664, 20800, 31739, 12927, -15146, -25221, -6251, 21762, 28291, 6768, -19766, -23436, -3513, 18547, 21921, 3374, -19098, -24024, -5922, 16876, 20592, 1317, -21937, -25449, -5550, 17630, 19888, -1915, -25454, -25175, -902, 20839, 17190, -6813, -25440, -19992, 3431, 20386, 14379, -7793, -22906, -15599, 5691, 20581, 14097, -6416, -20343, -13370, 8304, 23346, 16214, -6442, -21173, -11728, 12744, 26200, 14714, -9570, -20963, -7462, 16163, 25326, 10888, -11786, -19170, -4981, 15538, 21649, 7354, -12389, -18564, -5150, 13982, 19977, 5682, -14696, -20610, -5643, 14766, 18834, 2317, -18742, -21579, -3612, 15987, 16727, -2037, -20500, -19684, -534, 16145, 13499, -5214, -20139, -16955, 953]
424I53J4338k832j7447j4012L392J8023J4522l610j8358j4033N343K0005J3873
437B0157o726k0447j1694R073K0009J0265r458j8543r288R736J8362Q330j0237
450I539j7560p449J0524J6425O731r631j7192o860R878J7477O179j2157j7670
463a1766m917J2713J6714L719j3932j7105k363J5451J5352k88j4910j3663K40
476a4755J3162J4114n20j4349j3772J083J4798J2895j453j4114j2546J146J5404
489A093J3752k904j6627j1648N171J6244J0591m998j5477j0212O388J6453Q493
502A6319p144j4846o839O937J3085P830o010j4490q007P614J5024O682q900j4421
516g166o005Q474J5101N794j0380j5634l543J1345J3125J950j0596j2616l002
$$ y = [953, 15291, 12459, -4988, -19000, -15608, 2415, 16937, 13327, -5031, -19064, -13721, 6284, 20157, 13431, -7016, -18710, -9637, 10372, 20637, 11179, -7364, -16652, -6916, 11446, 19776, 9539, -8021, -15470, -4946, 11479, 18210, 8579, -8613, -15473, -5595, 11882, 18061, 5904, -11766, -16683, -3970, 12744, 16463, 2531, -14574, -16937, -1486, 13866, 13578, -1332, -14995, -14755, -1593, 12521, 12001, -2348, -16120, -15037, -239, 12656, 11203, -2911, -15457, -14311, 1093, 14845, 11941, -4686, -16334, -11163, 5081, 15672, 10674, -4803, -15015, -8627, 7826, 16319, 9175, -5671, -12510, -5573, 7512, 15342, 9332, -5158, -13165, -5551, 9473, 16155, 7255, -7166, -13171, -4697, 10404, 16198, 5818, -9816, -13359, -2014, 11111, 13061, 2465, -10151, -13153]
529a3153J0560J3099J669j1827j2175K09J0180J0325J092r271j2737j506J2066
542a469J2577j218j2901r701J763J1381J0352j425j2724j0432M395J4013P249
555A1860n043j0838o542L458J0930Q821m636j3006p377O744J2223O122n356j1741
569d381p564N668J4114O876q328j3906m339Q061J1737M889o776j2880n313Q372
583c770J2309K716q441r803k614N862J0232M499p449j2217k741Q990R856P12p852
598B89q842j717Q354J0144M32j0969q932K579R971O509j817q233p155J320J0323
613B256Q021m215j0834n375L979Q690O491j555j0666p932M317J2345O275o068
627E729j0656m960M272J0361P114m999j1990m994P081R565K924n075q587m587
$$ y = [-13153, -2593, 10506, 12175, 348, -11827, -11618, -1438, 8887, 9979, 708, -12029, -13535, -1469, 11108, 9890, -3011, -12712, -10949, 432, 10784, 9359, -3365, -13797, -9402, 4611, 11860, 6817, -4021, -10563, -7105, 3825, 12646, 8010, -4996, -12373, -5629, 6594, 12716, 7360, -4381, -11945, -6277, 7837, 14713, 6385, -7521, -11860, -3799, 7938, 12827, 6051, -6829, -12142, -3770, 8539, 11255, 2814, -6989, -9603, -3741, 6491, 10990, 3541, -8676, -11417, -2427, 7429, 8141, 289, -8553, -10270, -1916, 8228, 8660, -2309, -11241, -8662, 1309, 7818, 6001, -2232, -9387, -8067, 2256, 10277, 6062, -4772, -10147, -6168, 2522, 9013, 7458, -3208, -11140, -6823, 5522, 11797, 5729, -4927, -9887, -5615, 4746, 11860, 6861, -5129, -10123, -3042, 6523, 9447, 4372, -4215, -8802]
641h802M586R712M956o437r839j839N865O819K430m860q775l221O926J0272N48
656H341q788p088O26O608O258O76p341q255P75J0161O289k658p446n466P01O490
672a17P535n86r038p216L323R025N569k852p405o095R52R284P020l765r530l852
688g748M724O715M005k528p693n294L727Q710L385m893p164j669L805O130L621
703G833m010r008k885O377P807R05n862o311j592M921Q054J653p583q162M19P587
719A43N681J63n208o949j118O351P731p9p571o358R64N980N631J020n682p180
735f481m52P722O236k581o308l987J283M998N397n70o742n078K998O596K793l413
751B411m921k397J386O418M221l534p628k173M729N651J746l425o492k979M464
$$ y = [-8802, -4216, 5496, 10452, 4015, -5824, -7663, -1798, 5021, 7451, 2591, -6184, -9405, -2479, 7793, 8341, -447, -7535, -6909, -301, 5957, 6633, -708, -8963, -8188, 1973, 8262, 5604, -1842, -7308, -6607, -117, 7418, 6832, -2206, -9422, -6099, 2926, 8495, 5643, -1762, -7857, -6905, 2379, 9399, 5634, -3896, -7748, -3024, 3691, 7696, 5168, -2525, -7819, -4092, 4618, 8003, 3110, -4054, -5723, -1918, 4212, 7833, 3823, -5185, -8070, -1693, 6114, 7019, 1157, -5154, -6746, -1825, 6229, 7882, 299, -7863, -7444, 143, 5824, 5987, 779, -6170, -7288, -937, 6794, 6715, -856, -7214, -6250, -270, 5361, 6381, 699, -6481, -6933, 789, 7025, 4444, -1864, -5851, -4568, 430, 5827, 5257, -1485, -6563, -3565, 3031, 5824, 2411, -2510, -4907, -3521, 2897, 7118, 3584, -4044, -6217, -1488, 4163, 5909, 2484, -4008, -6987, -2523]
766b523P972J915n885o640q81M667N407K336m110p443j976N748P140L95n403n340
782d621j111L838N881K134n401o080j87N595M641k58m417m422p70N002N208p33
798D299n810l664J817M768L426j654m198m445J641O470K974k672n612k434K713
813b381M849K894j865o209l334L496O355K429m300m859k026K600N613K724l392
828B594o482k025M194N439J294l165n021j893L076N641J663m447m930o81L880
843h63M352Q90l475m952p10M118M838k52m453l924N29L519M357Q3m541m479Q46
860d117N325L293j273m345l134R42M314L577q72n379l080J700M918K794j704m243
876a284l659J890N130K562k327m569k077K656L958K116k209m344k478K812M780
$$ y = [-2523, 5449, 7364, 1479, -5161, -6042, -1375, 4032, 6368, 2258, -5185, -7161, -1413, 5727, 6122, 719, -4621, -5732, -1894, 3987, 6121, 720, -5360, -5547, 48, 4689, 4431, 14, -4408, -5178, -176, 5032, 4299, -1511, -5175, -3358, 1410, 4836, 3182, -1016, -5461, -3820, 2650, 5624, 2952, -2660, -5094, -2381, 2468, 5362, 3497, -2712, -6046, -2550, 3805, 6234, 1934, -2925, -4951, -2351, 3262, 5986, 2594, -3888, -5913, -1719, 3720, 5014, 1849, -3172, -5065, -1989, 3652, 5315, 868, -4062, -4743, -863, 3489, 4379, 904, -4048, -4758, -640, 4198, 3946, -507, -4431, -3902, -383, 3974, 4057, -484, -4963, -4117, 1208, 4501, 3228, -1117, -4251, -3309, 1005, 4582, 3710, -1669, -4749, -3049, 1869, 4663, 2959, -1284, -4943, -3053, 2077, 4639, 2312, -2257, -4334, -1678, 2280, 4396, 2187, -2157, -4635, -1823, 2957]
891B957J254k688m203j327K624M059J539k750m512j234L388M362N67l471l987
906c422o74L543L833M38l487m114J80L945L257j87l085l934R9L802L505l20m112
923g33k949O45L531L131m12m099k483L77M187K556j006l850k717J465L392K849
939C884j584l774k247J751L616J867j472l832j733J947L588J841k190l824j362
954c524K018L582J507k625l387q18K155L678R34k712l455p16K664L435M55k638
970E53l494m88L083L137M96l154l046m5K854L099J09l238k456j60L259K388l53
987B544k984k365K9L312K584p76l051k236O51L247K237j217k832k124J262K714
1003I95K090j394l224j396J461K691J850j434l212j363J527L179J386j890l118
$$ y = [2957, 4211, 1523, -2680, -4007, -1383, 2676, 4215, 1465, -3047, -4281, -893, 3469, 4036, 565, -3422, -4096, -553, 3280, 3718, 231, -3883, -3703, 242, 3499, 3312, 227, -3707, -3608, 194, 3699, 3379, -733, -3682, -3037, 494, 3625, 3213, -886, -3369, -2992, 1195, 3751, 2745, -1105, -3822, -2357, 1035, 3884, 2300, -1474, -3721, -1970, 1646, 3513, 2041, -1791, -3524, -1577, 2011, 3852, 1662, -2162, -3524, -1506, 2076, 3583, 958, -2429, -3247, -1092, 2586, 3520, 808, -2647, -3363, -699, 2736, 3191, 553, -2941, -3429, -346, 2791, 3287, 133, -2913, -2958, -104, 2995, 3104, -134, -2590, -2750, 509, 2897, 2544, -440, -2805, -2776, 536, 3120, 2344, -707, -2943, -2292, 955, 3192, 1975, -857, -2981, -1719, 995, 3085, 1691, -1533, -2929, -1468, 1223, 3073, 1639, -1573, -2936, -1409, 1770, 3156, 1266, -1852]
1018a852j300K271K653J119j777l295q99K537K528P43j863k938n99K140K704Q01
1034B973k437k490p01K307K848jk392k607J19K693K304j49k319k711J3L109K223
1051B782p83k581j895K68L127J764p21k517k049N57K979J413o07k957j645J145
1067a720K559J778q55k836j476J278K731J149j424k739r10J325L008P49j677k644
1083a704j161J806K683J218k257k570o18J851K780L36k064k340n02K053K605N47
1099B663k426k446M8K139K403k67k154j985j51K552J902j87k468j951L41K355
1115C68J963o05k136k305R06K348J576n46k200j629P48K342J208p60k425j101
1131b248P64K403J654j052k629j013Q03K446J079j344j974j604J736K436Q22j384
$$ y = [-1852, -3152, -881, 1772, 2891, 1114, -2181, -3080, -543, 1985, 2728, 865, -2073, -2672, -532, 2172, 2973, 536, -1954, -2655, -348, 2500, 2499, 107, -2500, -2381, 312, 2616, 2467, 148, -2563, -2550, 559, 2782, 1999, -582, -2477, -2209, 918, 2682, 1961, -556, -2605, -2048, 931, 2344, 1737, -1220, -2865, -1720, 839, 2617, 1762, -1074, -2550, -1272, 1459, 2608, 1184, -1555, -2465, -1140, 1868, 2617, 940, -1704, -2865, -1059, 1624, 2842, 585, -1985, -2603, -752, 2028, 2364, 300, -2040, -2542, -489, 2116, 2663, 237, -2209, -2161, -22, 2381, 2114, -40, -2025, -2176, 376, 2278, 2091, -377, -2328, -1987, 368, 2331, 1726, -410, -2715, -1809, 539, 2115, 1569, -631, -2260, -1512, 830, 2038, 1278, -1147, -2248, -1484, 919, 2573, 1521, -1108, -2121, -1318, 1128, 2207, 863, -1111, -2715, -979, 1457, 2279, 895]
1147H95k463l71J273K713L22j776k327j81J340K230P98j664k652j03J802K085
1163A921K67k236j771j82K190J676K5j913j750k41K304J759l00k171j628P40J483
1180A73J613j43k081j695N08K156J612m66k597j172P31J890J440p87k074j217
1196b109R31J979R07p88j814j112J199J886Q28j107j695j140J299K110P20j331
1212G63j847o80J511J767O51j844j616m07J514J843L14j356j977n16J863J443
1228A426N14j650k086L5J680J735J72k026j501J52J651J787l90j981j061P9J494
1245C0J835n37k067j391P65J765J593r52j717j308N43K135J356j119j969j164
1261b202J320J702Q23q35j568j297J250K175K55j201j482m72J043J941N05j114
$$ y = [895, -1568, -1939, -666, 2047, 2369, 593, -1734, -1915, -575, 1655, 2453, 789, -1863, -1966, -164, 1921, 2188, -48, -1819, -2001, 189, 1865, 1890, -23, -1773, -2014, 290, 2049, 1749, -422, -2050, -1310, 173, 1786, 1643, -438, -2133, -1625, 531, 2143, 1677, -920, -2092, -1361, 529, 1969, 1182, -892, -2109, -1178, 801, 1708, 920, -894, -2006, -807, 1079, 1907, 800, -895, -2035, -736, 1374, 2094, 763, -1084, -1764, -253, 1514, 2165, 321, -1295, -1702, -188, 1655, 1969, 613, -1364, -1880, -17, 1426, 1940, 290, -1796, -1761, -81, 1654, 1826, -200, -1701, -1549, 102, 1889, 1499, -482, -1543, -1464, 30, 1865, 1328, -739, -2130, -1365, 400, 1993, 1041, -676, -1984, -1441, 694, 2050, 931, -1038, -2202, -882, 820, 1643, 808, -760, -2057, -807, 1368, 1623, 422, -1060, -1532, -489, 1452, 1957, 843]
1277H43k150m07J522J638M20j344j974j70J648J563M40j990j380m44J777J469
1293A461R0j376j628M0J262J728j26j559j665N56J586J110q3j789j586L87J897
1310C05J051p02j344j059O54J482J101o87j376j383J057J366J322r08j640j262
1326b023J186J745O71o69k082m69J131J841L83r45j995k79Q09K026M25j340j327
1343i12m89J237J374K59j220j336k76J165J452N0j395j072J41R82J348R0j392
1360Fj060l95J474J327l89j133j285O96Q68J137l25j651j062O60J421J060o85
1377F64r62j043N62J112J034p31j594o34N90J415Q70o04j054p68O71J348O36p78
1395G34j553m59P70J278N80o19j373o17R47J283K51o93j090r11J209J383L03j215
$$ y = [843, -1307, -1714, -192, 1446, 1866, 522, -1452, -1622, 26, 1589, 2029, 39, -1341, -1785, -8, 1461, 1551, 175, -1453, -1413, -151, 1577, 1451, -108, -1773, -1217, 369, 1479, 1396, -393, -1979, -1592, 305, 1356, 654, -690, -1749, -1095, 387, 1488, 801, -575, -1958, -901, 465, 1787, 879, -761, -2023, -837, 908, 1579, 910, -1172, -1641, -510, 1331, 1714, 769, -1226, -1505, -696, 1330, 1755, 415, -912, -1401, -164, 1210, 1469, 249, -1087, -1363, -198, 1254, 1304, -91, -1163, -1022, -40, 1308, 1398, 6, -1054, -1449, 25, 1352, 963, -170, -1455, -759, 109, 1246, 921, -730, -1792, -1132, 289, 1349, 664, -298, -1341, -779, 333, 1367, 636, -958, -1592, -1002, 413, 1283, 679, -375, -1143, -472, 876, 1512, 734, -819, -1278, -508, 770, 1350, 731, -642, -1259, -312, 971, 1222, 529, -561, -1472, -263, 1120, 1423, 208]
1413B08j344k28J171J317j35r35j087j36Q43J735n75q83j169M92O42J093J78j267
1431h0j423J29J846N50j71j133j262O71R96J201n16j139j095O60J301N05m18j425
1449h03k74L58J296P44n67j329k13O6J433P04q11j271l31O60J376N66j172j113
1467f81k45M13J205M19p77j157l81J095R77J77p85j216J89M03J199M1p93j159
1485a076KJ072J009j04j198j172M96J202P85l68r76p16J68P61J221l04j050j193
1503a441O98J060N42j26j139r33P75R75Q04o10j208l74M18J157L86l25j174l45
1521h60M44R74P17q04j380M8Q08P70M28j073p30k84R49N98N55q62r63k10P98P19
1541F42K25p83q83l8P96R07j33q29o20m00J156J071m26p88q37K36O98R61j44r35
$$ y = [208, -1136, -1364, -193, 1124, 989, 54, -1033, -1169, -326, 1409, 834, -49, -1218, -726, -84, 1009, 1187, -80, -1503, -1374, 472, 1022, 851, -282, -1544, -873, 123, 1324, 808, -331, -1426, -766, 535, 1040, 622, -803, -1077, -719, 577, 1321, 754, -575, -788, -722, 711, 1415, 604, -667, -998, -338, 1038, 1604, 432, -681, -926, -513, 692, 1111, 334, -823, -1204, -109, 868, 1045, 260, -956, -767, -364, 835, 876, 83, -1076, -1074, -2, 1007, 903, -295, -1467, -971, 231, 1016, 648, -328, -1044, -876, -115, 1106, 802, -248, -1441, -743, 317, 859, 733, -406, -1339, -564, 411, 1215, 605, -603, -977, -559, 598, 984, 659, -515, -860, -416, 558, 1275, 471, -909, -861, -53, 717, 1145, 72, -658, -942, 7, 605, 1160, 298, -665, -875, -77, 642, 867, 84, -799, -837, -41, 866, 733, -96, -716, -1116, 40, 1111, 685, -103, -940, -704, -6, 955, 811, -124]
1561a24q79J72R71J103n78j243m29M11J089N49n19p10q37O37R88N63n39j231j32
1580g38L53R67K46m88p60n11P17P79L34m55j012j87M12J146K68q00o03p95R73
1599a54R16q7o10r58K03M96J207l31n80o98j58P79N07j0p32p13K85O72Q14n42
1619C06k69j055L58R85N84m16p83q14M21R21P03o13o69n76O22O94N90l25j285
1638f21l26M70J012J62j12j066n9K67Q02L54m43r51j88O80P78P1o49j002k27J139
1658I1M16L94r62l89n9N50O93l7n31q39k68J243L88k67l41r30K30Q29N15j56n60
1679A0r35L86O64N12j97n52o00j30Q80P47l67o41m10N13L44M93l33q72o0O46L89
1700D87L52m32j085l13R12N95j65N2q43p7J67R38M1l05p38q7K90R48j94o69o9
$$ y = [-124, -1003, -831, 140, 1243, 665, -578, -1007, -596, 493, 1042, 523, -187, -1024, -387, 601, 1164, 625, -606, -738, -385, 582, 828, 340, -420, -931, -214, 565, 899, 444, -568, -755, -343, 803, 1071, 271, -332, -1127, -154, 762, 675, 65, -893, -690, -194, 1013, 682, 102, -596, -754, 25, 532, 522, -210, -923, -638, 34, 848, 306, 37, -1018, -660, 325, 909, 493, -290, -1104, -683, 238, 941, 328, -341, -917, -295, 399, 989, 664, -621, -947, -477, 535, 697, 585, -481, -540, -273, 529, 883, 440, -511, -699, -19, 759, 830, 181, -821, -1048, 91, 507, 901, -61, -450, -509, 41, 734, 697, 166, -673, -941, 302, 690, 423, 82, -848, -618, 211, 726, 570, 10, -925, -539, 125, 637, 440, -112, -712, -842, 38, 785, 418, -223, -633, -120, 224, 717, 384, -488, -548, 98, 487, 839, 407, -678, -991, -79, 516, 351, 403, -440, -517, -350, 588, 629, 324, -414, -501, -211, 737, 543, -126, -195]
1721a95n49P15N45L4o57k36k02P53M04N9n77o85J23M40M33O0n21o00L24M48O8
1742A84Mp86L5R8N93O60l27p36q04N62N29O07j38p37m41N27N62K13l64m86l57
1763f02M39M23o3k8m49k96L90N49M8j53p25j29M99P73p2m60n59j27M98M16J98
1784E70m87m96j35M61Q86l81l91m70j74P87K76N6n53k51Q7J34N79k5o57l04J25
1805c63O76l0K84p72m56J70P27K50l26m16l01M81J33M22j10o04l60P90L43J11
1825F49k85m80l36o6O17N35m86l32l36M12N54K05l40n70j77M96K22N4N0o89J34
1846a69K77L20Jm34l59J33L10M54rn17m41K51L69J19r2l0o01K20O1N14N5o32k32
1869d32N2N13J34N2l08l73m8M03L79j61l32k89L48K81J63j45n85J86j06K93N32
$$ y = [-195, -744, -29, 516, 550, -107, -343, -545, 208, 612, 671, 94, -591, -468, -28, 405, 465, -56, -656, -332, 116, 184, 188, -598, -563, -465, 128, 788, 461, -275, -1079, -517, 12, 619, 481, -256, -697, -170, 392, 605, 241, -245, -602, -163, 260, 197, 169, -280, -576, -186, 363, 411, 258, -467, -596, -97, 676, 604, 144, -415, -542, -44, 372, 570, 83, -413, -548, -87, 799, 418, 27, -443, -617, 170, 446, 502, -51, -302, -215, -81, 498, 473, -184, -488, -363, 313, 283, 567, -205, -661, -491, 236, 486, 160, -256, -557, -76, 57, 479, 369, -235, -595, 195, 538, 649, 364, -116, -452, -518, 99, 634, 148, -184, -520, -108, 446, 651, 311, -259, -436, 60, 282, 336, 386, -303, -169, 108, 428, 429, -5, -364, -231, 79, 533, 524, 7, -434, -183, 186, 305, 213, 183, -418, -198, -137, 377, 432, -200, -432, -380, 133, 267, 319, 11, -362, -410, -7, 372, 211, -121, -410, -62, 219, 382, 237, -348, -162, -268, 25, 557]
1890E57o35J0l61L08O18l18J26p09j80P02K93K55k33p03J51j77N62oj29n78L15
1911a32J55K24O1k94k05K1L19J49j99j75m17L83K39j50L54n26k66P4L37M21K8
1932D01o35l07K25L59L66m59J05o35M89J56L21P3n19j49j58P50j43J4m47m5O0
1953a78M00K7n60Q1m2J97K27K25j41m38j75K85J18L53l48m15L94j02M65j71k63
1974f1l81k64N27M19P2k11m79J00J60L96m1l13l01K11K20j30L42m80JK29KK33
1996B51J32q70J72N8N28l6J66l33p28O94K73j85n3l31N8M0J49M59l12l98NJ83
2018g8K62N2j29k21k21L02J6L01j41m71O2Q1J47N54o04K36k06J93P6L69n61k65
2040b46j93L36J44J40l22k33mK88M05j11n63J93k23P10l60M05l39n35J11N32K75
$$ y = [557, -78, -68, -429, -121, 497, 179, 305, -404, -584, 118, 411, 666, 433, -270, -119, -296, 266, 260, 131, -447, -132, 23, 247, 308, 14, -191, -170, 149, 298, 99, -76, -493, -110, 129, -21, 333, -193, -459, -385, -48, 373, 401, -234, -541, -316, 43, 409, -50, 55, -580, -91, 65, 386, 459, -60, -209, -367, 383, 240, 254, -193, -238, -178, 222, 249, -311, -230, -272, -75, 152, 377, 236, -202, -377, -92, 26, 379, 31, -384, 10, -92, 373, 202, -61, -442, -706, -179, 240, 312, 101, -378, -278, -118, 278, 237, -76, -377, -166, 54, -76, 266, -214, -213, 16, 18, 251, 383, -487, -315, -257, 271, 235, 401, 68, -660, 34, 307, 122, 69, -262, -204, -164, -15, 444, 132, -266, -261, -78, 184, 236, 107, -114, -335, -33, -17, 284, 143, -328, -266, -185, -38, 516, -88, 148, -58, 135, 211, 580, 19, -246, -439, -103, 41, 181, -141, -374, -378, -90, 315, 204, -359, -166, -389, 321, -39, 366, 27, -508, -397, 135, 410]
2061D10k44l85K08k11J02L11k62p0OQ7J20J00N8j81j97M0k2N05n10k60K43J92
2083D0m03N71k86L1j95M3M46p3J10k94j04j7N47l59j03l18L06J6K51k6L6o05j85
2106e71K32K29K22l06M9r8K38K38k86K05k23l86K77K27n8N7m40L22J31k97J06
2127a32K15j57rJ43k17J81k72J53j92K62M37k96k98j72L28M39j74k62k39J66q2
2148a78J55J87k13K8l5p4L27l07J30j33l16M58L79K5m79J72k26j10K05K50k74
2169b9l75N57j06j33L24k24j52r3M14j57m1k00MJ16j7K20j10k57K09K8K17l35
2191a40K62K2k20l0N20j23j61J19l90N13k92MK50n20J14j58L18M1j86l37J95L84
2213A85J16m1l5m88J61p2J24M23n56k76N27O7J42l19j97j72K94mK80l44K23J18
$$ y = [410, 166, -219, -11, -222, -120, 191, -71, -141, -135, -48, 72, 172, 230, 49, -148, -108, -130, 375, -135, -395, -152, 40, -363, 208, -78, -47, -242, -199, 247, 174, 284, -10, -114, -131, 416, 57, -46, -364, -58, -42, 209, 183, 219, -386, -571, -339, -110, 112, -194, -145, -243, -5, 233, -53, 152, -71, -457, -180, 47, -11, 46, -394, -72, 59, -238, -132, 83, -74, -83, 60, -157, 24, -248, -95, -287, -25, 412, 116, -182, -354, -26, 413, 239, -23, -262, -96, -178, -23, 164, -49, -21, -56, -130, 197, -110, 20, -113, -429, 29, 408, 433, -46, 126, -100, -210, -5, 245, -29, -404, 153, 47, -86, 238, 14, -138, -231, 183, 26, -15, -215, -211, -95, -112, 108, -2, -259, -50, -22, 195, -140, 122, 144, -76, -106, 414, 291, 130, 249, -141, 372, 80, 84, 334, -186, -72, -230, 88, 129, -57, -394, -199, 185, 301, 260, 225, -263, -102, -174, -50, 373, -183, -459, 68, 135, 277, -42, -239, -411, -117, -121, 159, -185, 38, 156]
2235A56m77N00j35J11k34q5N8m8M59l57J43n6j75J65K72j03m61J73kJ06k3K13
2257B00k10k02j08J85K42k88M08m22L17L9J04M9j92j86n6J90j44K41m63J36J57
2278cP7o4K25m62J57r4M40k48j5m33J25K32o3L81r5m58K22k3j9K31j46k80R8K97
2302H2o7l89K83N2O2J11K1P0p0j79j01N8K40k54j12J20RJ98L2j26j89r2R9J23
2326a9K59n4k09l5P2K0K46o7m53K69Q6O7J5l18q3L8J95J06j36m9j32J00O6K29
2350B13j60O5n1l97J58K33m3M31m39k93J91J90J48k68j24M6K13n7J74k09J03j27
2372cm7J51J68k66k05K74j74k65J60L21k65k33L85J54q3j27j73l0J01p1J98o8
2394i8k9N02k99J81lj17n52O54k68j3j24pn8K04J29l78L80k24M4q5L62k54j81
$$ y = [156, -321, 179, 44, 155, -79, -164, -106, -154, 305, -52, 91, 35, -140, 25, 297, 194, -267, -94, -96, 10, -13, 200, -10, -212, -320, -135, 107, -181, 227, -195, 122, 161, 265, 314, 122, -64, -120, 70, -74, 167, -296, -160, -3, 74, 10, 235, -227, -70, -164, 276, 28, 13, -420, -295, -63, -126, 255, 160, -298, -76, -99, -118, 113, -33, -313, -215, 82, 15, -374, -91, -39, 23, 134, 155, 225, 155, -24, -125, -67, 173, -81, -193, -73, -64, 134, 166, 40, -149, -241, -142, -19, 240, 186, -23, -58, 14, 34, 280, 213, -240, 29, 115, 182, 197, -121, -204, -166, 29, 135, -1, -50, -182, -82, -16, 213, 53, 118, 67, -330, -172, 61, 18, 449, 10, -283, -92, 98, 246, -22, -146, -100, 113, 56, 230, 21, 124, -3, -50, 101, 269, 3, -202, 72, -102, -367, -207, 114, -151, -384, 1, 155, 72, -55, -228, -258, -157, -228, -30, -98, -127, 375, 76, 257, 254, 137, -415, 239, -29, -42, -166, -173, -231, -27, 102, -276, 104, -120, -76, -161, 201, -53, -234]
2417b34Q0J19j69M58k09n7q8j7L29j00j34k11Q6K0k02n1M95j95n0J05j22L23k47
2440g1K97k82l5M0K18k85k67K27P8J33j95M12l46L45m64J92j37K95k01J94j42
2461FJ21o2j34J32n8k16K00j22L50m61j6J92O5R5l45L28k58O9J50R8l39L97l71
2484a79M4K67p2m29O7L36m31M82K7j52o4J05p6Q9R6l00K66J20k49mj78K22R5q5
2508cJ95l47L66k41j12O0j70L26l4K3l68K69K9K14l61J06R6J15j56K79l84J00
2530BK6M08m74K92q8k60J43j32k04K68K9l89K56J81M7j11m8k2j70J78R5k35J43
2553f5j76R2K89j33J1o0k09M3J57K73k06k74L09l07L26K4k38J86k96J1R0L62J16
2576C25k92oj14q1J56n2p5J30Mj57M85j42m33J62j34L11J65m82L28J9l00M9J74
$$ y = [-234, -154, -35, -204, 254, 45, -12, -100, -117, 212, 112, -22, -233, -147, -127, -329, -380, 115, -80, -130, -25, -147, 176, -71, 226, -56, -91, -51, 167, -118, -385, -158, -80, 53, -142, 270, -76, 269, -195, -3, -140, 155, -46, 148, 6, 127, 65, -69, 63, 5, -211, -11, -133, 217, -244, -260, -68, -3, 92, -253, 75, -183, -114, 36, 134, -205, 192, -179, -135, 132, 60, -369, -302, 34, -397, 85, 112, -40, -104, 1, -75, 14, 110, -190, 76, 196, -53, -57, -235, -13, 82, -3, 192, -155, 211, -30, -142, -82, -252, 74, 40, 63, -305, -36, -7, 207, -154, -48, 48, 163, 7, 286, -98, 2, 28, 436, -38, 254, 166, -94, 49, -83, -287, -19, 10, -379, -123, 58, 105, -6, -54, -76, -246, -68, 27, -208, -65, -241, -149, 140, 7, 18, -42, -251, -208, -51, 222, 16, -258, 51, -256, 70, 94, -144, 42, -254, -243, -153, 209, 325, 33, 27, -87, -168, -12, -64, -139, -9, -5, -162, 323, 181, -252, -90, -224, 87, 252, -230, 98, 117, -183, -134, 40]
2599D0J05k94K8L98k55L16k90j09J0P3K33j03J8j17k8j73q9K17r4L2J06M23l67
2622H0J12j55j13K84j44j04N5q8m8m1J68P1M2lk73mL75L3m86M06k27j91L5R7K97
2647A78q7k90Q5Q9j56O0K48j07L5n8J41j2j64K53k81J70k31P9j48K22N6j0J85
2670B57k26k51K18j00M5J94j11k93K41j29NJ89j86Q7k98K98J85%Q1l48N9J26q8
2693d5L46l07k13M01j84l7pr7N0k2J85k17K63O2n2q3j37K18j34k00N15p89O36
2716A52j33O2q5kk00K78J61j10l09l32M81P0K5qr8j4n6Q8Q4k2J17j72J24r3j71
2741a63O8K2m9J59Q2o9Qn0J33m7l80N43k25n8l2J61k11L50j37n5m8k13L52nk65
2766a29J14nl8K4l0j41N5OM08l73J81j04k44K58o5rK46j56O9p9J97k0p5l13L61
$$ y = [40, 145, -149, -121, 277, 22, 338, 48, -61, -51, 22, 255, 152, 170, 53, 25, -148, -237, -20, -114, -82, 24, 447, 80, 192, 37, -76, 208, 64, -40, 15, -73, -121, -162, 6, 77, 119, 116, -157, -161, 214, 247, -239, 167, -60, -251, -216, -119, 178, 91, -199, -114, -25, -181, -121, 127, 20, 55, -3, 138, 126, -38, 215, -66, 104, -127, -48, -196, 26, 82, 72, 257, 31, -220, -2, -102, -57, 137, 26, -267, -26, -155, -150, 39, -147, -60, -358, -60, 125, 125, 206, -142, -83, 43, -45, 301, -6, -219, 182, -2, -39, -46, -143, -93, -115, 70, -147, 116, 178, 126, 43, -94, 124, -10, -210, 305, -484, 152, 19, 81, -4, -6, -206, 72, 233, 123, -186, -518, -37, 33, 58, 50, -48, -62, -118, -30, 54, 32, 149, -23, 101, 8, -163, -95, -73, -122, 37, 119, 50, 58, 8, 141, 94, -286, 257, 32, -26, -58, 103, -108, 242, 105, 50, 2, -211, 141, 136, -129, -15, -20, -58, -34, -64, -205, -150, -144, 264, -109, 72, -32, -276, -18, -83, -92, 154, -2, 67, -12, 185, 165, 90, -223, 138]
2791A38j10r7K88m52K90k55J62j0J72k86L3J84k14M4J58J1k6Q8k7k38M64m84L17
2814A50j32k40M95m26M14r6k48L00l13J09k55K78j4j51N9j68L03o3k06K27J71
2835A94k7J58k66N4k34K04k86L09n2j57K66o1j51j7K75l25K83j68k09J24M14n13
2857a85KK97j00m4l3L9J30l56N71l35N4J5k73J67K30l16M03j38l8r7q9K2R7j49
2881a26P8J23j70n2J18l7MmM9O2k49J07K44l9p1n4j98L93m20J71J95m11P4j2J04
2906a21L06l99O1N0Q7J15j82L06k50mM9K3j17J57J61j92l19K18j44L11m2j76O7
2929c5l02L41k1m7L64n16N5L04j59p3j7N6Q7L0O7p9j09k29L9J57J12r7J95j41
2953a8Q1J8k2J5M0j8m27L25j81L10l55J82J44n03J68J35j56R7K97m8p9r6J63J58
$$ y = [138, 28, -69, 219, -233, 57, -198, -36, -46, 126, -160, -127, 57, -157, -113, 45, 56, 30, 118, 91, -147, 317, -167, 150, 18, -222, 273, -153, 261, 165, -83, 217, -96, 13, -242, 36, 22, -129, -70, -238, 65, 2, -204, 23, 194, 167, 325, 59, 113, -121, 83, -203, 106, 54, -103, 163, 102, -49, -66, 209, -116, 167, -1, -210, -86, 328, -185, -183, 114, 14, -30, -63, -24, 106, -250, 321, -14, 40, 55, -218, -51, 179, -137, 266, 128, 90, -7, -96, -74, 23, -126, -48, 75, -95, -147, -29, -66, -62, -66, -17, 45, -204, -97, 147, 108, 37, -17, -215, 178, -242, -71, 124, -287, -213, -225, -121, 185, -214, -153, -103, -16, 99, -83, 223, -27, -31, 18, 41, -76, 81, 242, 50, -269, -51, -195, 116, 74, -102, -35, -337, 4, -17, -64, 300, -216, -161, 143, -16, -89, -106, -50, 37, 67, 134, 55, -54, -283, -244, -87, 25, -72, 123, -18, 63, 81, 59, 74, 114, 96, -331, -6, -187, 123, -232, -50, 94, -409, -241, -106, -262, -165, 132, 84, 5, -91, 72, 230]
2977B30k52p7K25J55j65j97J72O9k0j14j9j96J53o9J12k1N0k56L17j84Q1M8K85
3000C27j85k71R5K9K9K32l21j24Q4Q4j73K01l48M99j85N3k03L25k24p7K22j90
3022a21P7j02J24J45j23rK28k64L45j02n6r2K95k89k15Q5L4P6O5l82M09j26J02
3045A04l98K94Q5J39l58M04k34k3o1j60N03k45l56P00o20M21k09K70K7N9n79K65
3067B8M0j18O9j27J60j5M4j04J6J36l1Qk40J40J39l47J68m3j04P1j04K46k35J56
3091d7r2J54J1q4J47l03K62J29k7k88J8O2K49j3k93l30L71J21N0k27K71j89k31
$$ y = [230, -22, -99, 126, 281, 116, -81, 91, 160, 140, 26, 7, -189, -36, -105, 7, -14, 36, -220, 97, -87, -6, 42, 327, 142, -129, -34, -5, 24, 256, -65, -189, -105, -21, -194, 7, -341, 158, -27, 26, -177, 148, -76, -153, 69, -121, -44, -146, -22, 123, 0, -9, 219, -45, 300, 198, 142, 50, 345, 56, -159, -74, -40, 36, 101, -281, 128, 2, 104, -294, 0, 85, 224, -134, 270, 36, 13, -48, -208, 295, 50, -306, 394, -226, 195, -14, 256, 283, 342, -237, 28, 68, -50, 19, -108, 52, 37, 81, -23, -7, 129, 98, 106, -134, 6, 145, -202, -34, -77, -181, -110, -214, 32, -203, -47, -139, 15, 26, -58, 89, -214, 48, 177, 150, -138, -120, -58, 191, 178, -115, -445, -74, 47, 97, -130, 141, -48, -279]
$$ [...]
8191D64
##END NTUPLES=NMR FID
##END=
