##TITLE=1H_LR-696-RMK1
 DMSO-d6, 8 sc, 
 15.11.2019
##JCAMPDX= 6.0         $$ Bruker NMR JCAMP-DX V2.0
##DATA TYPE= NMR FID
##DATA CLASS= NTUPLES
##ORIGIN= UXNMR, Bruker Analytische Messtechnik GmbH
##OWNER= root
$$ XWIN-NMR		Version 3.5
$$ Fri Nov 15 14:31:55 2019 Russian Standard Time (UT+4h)  she@DPX200
##.OBSERVE FREQUENCY= 200.1315
##.OBSERVE NUCLEUS= ^1H
##.DELAY= (6, 6)
##.ACQUISITION MODE= SIMULTANEOUS
##.ACQUISITION SCHEME= undefined
##.AVERAGES= 8
##.DIGITISER RES= 18
##SPECTROMETER/DATA SYSTEM= spect
##.PULSE SEQUENCE= zg30
##.SOLVENT NAME= DMSO
##.SHIFT REFERENCE= (INTERNAL, DMSO, 0, 15.7039)
##AUDIT TRAIL= $$ (NUMBER, WHEN, WHO, WHERE, WHAT)
$$ ##TITLE= Audit trail, XWIN-NMR		Version 3.5
$$ ##JCAMPDX= 5.01
$$ ##ORIGIN= Bruker BioSpin GmbH
$$ ##OWNER= she
$$ F:/spectra/data/she/nmr/H-F/1/audita.txt
$$ ##AUDIT TRAIL=  $$ (NUMBER, WHEN, WHO, WHERE, WHAT)
(   1,<2019-11-15 14:30:38.46 +0400>,<she>,<DPX200>,
      <created by zg, POWCHK disabled, PULCHK disabled
       configuration hash MD5:
       00 E9 B6 7A A2 85 ED C7 34 08 36 98 17 FE 4E 26
       data hash MD5: 16K
       D9 41 BE 0A 57 9E EE DC 87 9D FE 02 32 D9 CC 41>)
$$ ##END=
$$ 
$$ hash MD5
$$ 83 A3 9C 7C 70 B5 5E 10 B2 B8 FA 0E FB 1F 81 84
##$RELAX= 
##$RELAX= 
##$RELAX= 
##$RELAX= 
##$RELAX= 
##$RELAX= 
$$ Bruker specific parameters
$$ --------------------------
##$DU= <F:/spectra>
##$EXPNO= 1
##$NAME= <H-F>
##$PROCNO= 1
##$TYPE= <nmr>
##$USER= <she>
##$AMP= (0..31)
100 100 100 100 100 100 100 100 100 100 100 100 100 100 100 100 100 100 
100 100 100 100 100 100 100 100 100 100 100 100 100 100 
##$AQSEQ= 0
##$AQ_mod= 1
##$AUNM= <au_zg>
##$AUTOPOS= <>
##$BF1= 200.13
##$BF2= 200.13
##$BF3= 200.13
##$BF4= 200.13
##$BF5= 200.13
##$BF6= 200.13
##$BF7= 200.13
##$BF8= 200.13
##$BYTORDA= 1
##$CFDGTYP= 0
##$CFRGTYP= 5
##$CHEMSTR= <none>
##$CNST= (0..31)
1 1 145 1 1 1 1 1 1 1 1 1 1 1 1 1 1 1 1 1 1 1 1 1 1 1 1 1 1 1 1 1 
##$CPDPRG= <>
##$CPDPRG1= <>
##$CPDPRG2= <>
##$CPDPRG3= <>
##$CPDPRG4= <mlev>
##$CPDPRG5= <mlev>
##$CPDPRG6= <mlev>
##$CPDPRG7= <mlev>
##$CPDPRG8= <mlev>
##$CPDPRGB= <>
##$CPDPRGT= <>
##$D= (0..31)
0 1.2 0 0 0 0 0 0 0 0.06 0 0.03 0 0 0 0 0.0002 0 0 0 0 0 0 0 0 0 0 0 0 
0 0 0 
##$DATE= 1573813837
##$DBL= (0..7)
120 120 120 120 120 120 120 120 
##$DBP= (0..7)
150 150 150 150 150 150 150 150 
##$DBP07= 0
##$DBPNAM0= <>
##$DBPNAM1= <>
##$DBPNAM2= <>
##$DBPNAM3= <>
##$DBPNAM4= <>
##$DBPNAM5= <>
##$DBPNAM6= <>
##$DBPNAM7= <>
##$DBPOAL= (0..7)
0.5 0.5 0.5 0.5 0.5 0.5 0.5 0.5 
##$DBPOFFS= (0..7)
0 0 0 0 0 0 0 0 
##$DE= 6
##$DECBNUC= <off>
##$DECIM= 24
##$DECNUC= <off>
##$DECSTAT= 4
##$DIGMOD= 1
##$DIGTYP= 9
##$DL= (0..7)
0 120 120 120 120 120 120 120 
##$DP= (0..7)
150 150 150 150 150 150 150 150 
##$DP07= 0
##$DPNAME0= <>
##$DPNAME1= <>
##$DPNAME2= <>
##$DPNAME3= <>
##$DPNAME4= <>
##$DPNAME5= <>
##$DPNAME6= <>
##$DPNAME7= <>
##$DPOAL= (0..7)
0.5 0.5 0.5 0.5 0.5 0.5 0.5 0.5 
##$DPOFFS= (0..7)
0 0 0 0 0 0 0 0 
##$DQDMODE= 0
##$DR= 18
##$DS= 0
##$DSLIST= <SSSSSSSSSSSSSSS>
$$ [...]
##$SUBNAM2= <"">
##$SUBNAM3= <"">
##$SUBNAM4= <"">
##$SUBNAM5= <"">
##$SUBNAM6= <"">
##$SUBNAM7= <"">
##$SUBNAM8= <"">
##$SUBNAM9= <"">
##$SW= 24.0689530833862
##$SWIBOX= (0..15)
0 0 2 0 0 0 0 0 0 0 0 0 0 0 0 0 
##$SW_h= 4816.95568400771
##$TD= 16384
##$TD0= 1
##$TE= 0
##$TE2= 300
##$TE3= 300
##$TEG= 300
##$TL= (0..7)
0 120 120 120 120 120 120 120 
##$TP= (0..7)
150 150 150 150 150 150 150 150 
##$TP07= 0
##$TPNAME0= <>
##$TPNAME1= <>
##$TPNAME2= <>
##$TPNAME3= <>
##$TPNAME4= <>
##$TPNAME5= <>
##$TPNAME6= <>
##$TPNAME7= <>
##$TPOAL= (0..7)
0.5 0.5 0.5 0.5 0.5 0.5 0.5 0.5 
##$TPOFFS= (0..7)
0 0 0 0 0 0 0 0 
##$TUNHIN= 0
##$TUNHOUT= 0
##$TUNXOUT= 0
##$USERA1= <user>
##$USERA2= <user>
##$USERA3= <user>
##$USERA4= <user>
##$USERA5= <user>
##$V9= 5
##$VALIST= <valist>
##$VCLIST= <CCCCCCCCCCCCCCC>
##$VD= 0
##$VDLIST= <DDDDDDDDDDDDDDD>
##$VPLIST= <PPPPPPPPPPPPPPP>
##$VTLIST= <TTTTTTTTTTTTTTT>
##$WBST= 1024
##$WBSW= 4
##$XGAIN= (0..3)
0 0 0 0 
##$XL= 0
##$YL= 0
##$YMAX_a= 342114
##$YMIN_a= -300674
##$ZGOPTNS= <>
##$ZL1= 120
##$ZL2= 120
##$ZL3= 120
##$ZL4= 120
##$ABSF1= 10
##$ABSF2= 0
##$ABSG= 5
##$ABSL= 3
##$ALPHA= 0
##$AQORDER= 0
##$ASSFAC= 0
##$ASSFACI= 0
##$ASSFACX= 0
##$ASSWID= 0
##$AUNMP= <proc_1d>
##$AZFE= 0.1
##$AZFW= 0.1
##$BCFW= 1
##$BC_mod= 2
##$BYTORDP= 1
##$COROFFS= 0
##$CY= 11.3945322036743
##$DATMOD= 1
##$DC= 2
##$DFILT= <>
##$DTYPP= 0
##$F1P= 16.9975609425685
##$F2P= -3.02152046262296
##$FCOR= 0.5
##$FTSIZE= 0
##$FT_mod= 4
##$GAMMA= 1
##$GB= 0.15
##$INTBC= 1
##$INTSCL= 1
##$ISEN= 128
##$LB= 0.24
##$LEV0= 0
##$LPBIN= 0
##$MAXI= 10000
##$MC2= 0
##$MEAN= 0
##$ME_mod= 0
##$MI= 1.114404
##$NCOEF= 0
##$NC_proc= 0
##$NLEV= 6
##$NOISF1= 3.799351
##$NOISF2= 2.8
##$NSP= 1
##$NTH_PI= 0
##$NZP= 0
##$OFFSET= 15.70392
##$PC= 1
##$PHC0= -9457.093
##$PHC1= 16.80088
##$PH_mod= 1
##$PKNL= yes
##$PPARMOD= 0
##$PSCAL= 0
##$PSIGN= 0
##$REVERSE= no
##$SF= 200.130013532006
##$SI= 16384
##$SIGF1= 3
##$SIGF2= 2
##$SINO= 400
##$SIOLD= 16384
##$SREGLST= <1H.CDCl3>
##$SSB= 0
##$STSI= 0
##$STSR= 0
##$SW_p= 3612.71676300578
##$SYMM= 0
##$S_DEV= 0
##$TDeff= 0
##$TDoff= 0
##$TI= <>
##$TILT= no
##$TM1= 0
##$TM2= 0
##$TOPLEV= 0
##$USERP1= <user>
##$USERP2= <user>
##$USERP3= <user>
##$USERP4= <user>
##$USERP5= <user>
##$WDW= 1
##$XDIM= 8192
##$YMAX_p= 0
##$YMIN_p= 0
$$ End of Bruker specific parameters
$$ ---------------------------------
##NTUPLES= NMR FID
##VAR_NAME=  TIME,          FID/REAL,        FID/IMAG
##SYMBOL=    X,             R,               I
##VAR_TYPE=  INDEPENDENT,   DEPENDENT,       DEPENDENT
##VAR_FORM=  AFFN,          ASDF,            ASDF
##VAR_DIM=   8192,          8192,            8192
##UNITS=     SECONDS,       ARBITRARY UNITS, ARBITRARY UNITS
##FACTOR=    0.0002076,     1,               1
##FIRST=     0,             0,               0
##LAST=      1.7004516,     0,               0
##MIN=       0,             -300674,         0
##MAX=       1.7004516,     342114,          0
$$ Real data points
##PAGE= N=1
##DATA TABLE= (X++(R..R)), XYDATA
$$ [...]
2550I72n628r74M689N661J093m748n840q30N249N527N05n844n328N57N252N295
$$ 972 -4656 -5630 -941 4720 5813 1065 -4775 -5605 -356 5171 5676 -168 -5496 -4939 313 5608
2566E608p06n478m728N21N373M611o03n046m813P18N058M585k99n356n041N47
$$ 5608 4902 -576 -5304 -4783 590 5201 4598 -448 -5261 -4543 515 5100 4801 -555 -5596 -5049
2582e049N707N132j181n867m468J139O006M388j704n979m023K297N509L723k169
$$ -5049 658 5790 4609 -1258 -5726 -4587 1419 5807 4103 -1876 -5899 -3602 1907 5630 3461
2597C461n125l809J845N141L807j576n460l568J903N519L484j769o168l767K491
$$ 3461 -1664 -5473 -3628 1513 5320 3744 -1716 -5284 -3381 2138 5622 3853 -2315 -6082 -3591
2612c591O321L265l012o007k571K931N884K244k810n639k519L045N047K962k923
$$ -3591 2730 5995 2983 -3024 -5595 -2664 3220 5464 2654 -2985 -5504 -2459 2588 5550 2627
2627B627n560k527L094N342K591l198n516k279L250N719K133l822n661j651L875
$$ 2627 -2933 -5460 -2366 2976 5567 2369 -3147 -5426 -2176 3543 5676 1854 -3807 -5458 -1583
2642a583N711J180m076n275j072L951N009J189l835n182j054L941M961R73l904
$$ -1583 4128 5308 1232 -4043 -5115 -1164 3845 5034 1199 -3983 -5037 -1096 3865 4838 934
2657I34n106q80L921N304Q00m070n285o46M359N228M86m690m803M4M467M428J6
$$ 934 -4172 -5052 -1131 4173 4973 903 -4382 -5028 -669 4559 5045 355 -4448 -4404 63 4491 4507
2674D507m799m057q9M390M375L53m727m484K92M175M569j87m424m863O83M916
$$ 4507 -292 -4349 -4438 -48 4327 4680 -47 -4531 -4239 -64 4505 4318 -106 -4969 -4286 630
2690F30M423n21n209m289J162M941L968j458m893l404J099M711L164p55m807l319
$$ 630 5053 4532 -677 -4966 -3804 1137 5105 3647 -1246 -4650 -3551 1160 4324 3569 -1238 -4557
2706d557J021M815L491j213n102l213J128M938L748k082m856l066J798N206K968
$$ -4557 -3536 1279 4770 3557 -1545 -4758 -3630 1308 5056 2974 -1882 -4948 -3150 2056 5024
2721E024k183m900k912K320M572K752k179m442k686K164M742K540k618m409k521
$$ 5024 2841 -2059 -4971 -2651 1921 4673 2494 -1948 -4634 -2470 2272 4812 2194 -2215 -4736
2736d736K494M656K328k095n329k045K518N407J484k504n144j934L256M966J326
$$ -4736 -2242 2414 4742 2647 -2682 -4727 -2209 3198 4682 2178 -2966 -4900 -1644 3322 4648
2751D648l066m745j166K976M163J657l097m583j210K916M471J643l268m745j292
$$ 4648 1582 -3163 -4329 -1353 2810 4467 1370 -3213 -4423 -1507 2964 4607 1339 -3406 -4698
2766d698L657M505J213l568m832q02M211L858O42l954l763m43L563L981M42l537
$$ -4698 -1041 3464 4677 1109 -3723 -4525 -314 3544 4186 232 -3531 -3974 -411 3570 4012 475
2782D75m015m42L592M031K64l703m036l65M247L767K37m446l632J59M144L791
$$ 475 -3540 -3982 -390 3641 3905 202 -3834 -4199 48 3815 4052 -394 -4026 -3867 277 4068
2798D068n25m046l344N26L823L470o60l571l850R06L799L325n80m180l281J113
$$ 4068 3543 -503 -3847 -3321 502 3972 3312 -259 -4109 -3203 596 3921 3341 -839 -4120 -3007
2814c007L825L316j230l871l323J248M444L076j608m344k946J537M225K841j590
$$ -3007 818 4134 2904 -967 -4290 -3042 1402 4478 2870 -1474 -4420 -2883 1342 4183 2593
2829B593m159k244J409L847K562j481l995k852J800M459K078j561m311k429J723
$$ 2593 -1566 -3810 -2401 1446 4008 2527 -1468 -4320 -2520 1939 4017 2456 -1855 -4284 -2561
2844b561M475K200j895m328j908K444L905J652k218m161j584K561L485J882k415
$$ -2561 1914 4114 2219 -2109 -4017 -1573 2332 3984 1766 -2395 -3979 -1418 2067 3949 1534
2859A534l862j440K110M285J413k428m008j459K493L927J274k974l631j366L048
$$ 1534 -2328 -3768 -1658 2627 4040 1612 -2396 -3855 -1362 2565 3839 865 -2766 -4132 -1084
2874a084M019J074l061l894q36K890L746N66k548l786p94L093L656N22k901l664
$$ -1084 2935 4009 948 -2946 -3782 -892 2854 3420 872 -2914 -3708 -615 3041 3563 662 -3002
2890c002p00L237L589M56l385l388j97L365L330R9l086l668J24L263L336k18l252
$$ -3002 -3702 -465 3124 3580 195 -3193 -3390 -25 3305 3404 318 -3350 -3226 37 3373 3155 -97
2907i7l275K60L318K718o6k863l183K07L372K831m8l392l401N31L585L064n63
$$ -97 -3372 -3112 206 2924 2858 -5 -3188 -2981 391 3222 3174 -218 -3619 -3088 497 3561 2998
2924B998l684k868Q48L431K828p72l827k515R86L404K733r34l768k442J183L452
$$ 2998 -686 -3554 -2706 725 3553 2781 -1046 -3561 -2575 829 3562 2628 -1140 -3582 -2399 1053
2940A053K342p71l442k511R47L672K300j311l622k288J363L725K041j470l591
$$ 1053 3395 2624 -818 -3329 -2382 1290 3590 2279 -1343 -3631 -2268 1457 3498 2028 -1563
2955a563k053J702L230K023j550l240j912J608L082J919j566l450j856J804L624
$$ -1563 -3616 -1914 1316 3339 1789 -1451 -3363 -1755 1327 3246 1680 -1770 -3626 -1822 1802
2970A802J619j744l488j906K228L577J374k140l759j029K390L130J377k526l155
$$ 1802 3421 1677 -1811 -3717 -1489 2088 3462 1322 -2437 -3466 -1076 2054 3431 905 -2250
2985b250j204K433L274R07j965l402j372K357L571O85k195l096r25K409L495N50
$$ -2250 -3454 -1021 2253 3160 1195 -2207 -3579 -1222 2349 3034 839 -2257 -3182 -773 2722 3272
3001C272k781k872p84K912L122K92k564l200p7K425K662J80k350l083J24K232
$$ 3272 491 -2381 -3165 -253 2869 3161 597 -2603 -2680 -255 2407 2587 237 -2846 -2722 -490
3017d90L512o0k789l025k9K586L119L1l016k954P23K978K411k47l304k549N76
$$ -490 3022 2962 173 -2852 -2881 -295 2824 2855 -161 -3115 -2392 586 2997 2750 -554 -3103 -2527
3034b527L128K143l97k984k423P09K853K114j69k850k594N72L029K527r93l012
$$ -2527 601 2744 2347 -637 -3060 -2351 502 2616 2447 -403 -2997 -2425 604 3131 2138 -874
3050h74j991M01L119K678j268k909k157J048L221J895j270l197j954J478L034
$$ -874 -2865 -2464 655 3333 2065 -844 -3001 -1953 1268 3163 1893 -1304 -3258 -1780 1254
3065A254J810j111l002j999J092K862J938j191k854j718J223L126J632j512l141
$$ 1254 3064 1953 -1049 -3048 -1956 906 2844 1653 -1201 -2919 -1696 1430 3062 1550 -1591
3080a591j678J651L095J655j765l212r57J520L308R76j810k921j061J596K817
$$ -1591 -3269 -1618 1477 3132 1367 -1845 -2802 -1282 2026 3002 1192 -1729 -2790 -1194 1623
3095A623J451j521l148j410K204K608J113j909k938r77J837L130Q14k172k615
$$ 1623 3074 1553 -1595 -3005 -801 1807 2920 1011 -1927 -2904 -1067 2063 2877 705 -1910
3110a910p53K090K787N83k190k943m14K492J887Q73j975k804l64K327K535L75
$$ -1910 -2663 -573 2214 2797 607 -2336 -2750 -258 1629 2502 527 -2277 -2641 -314 2221 2596
3126B596k145k633o07K441K724M58k576k804J40K595K306K0k618k581N76K190
$$ 2596 451 -2182 -2789 -348 2376 2834 258 -2546 -2406 189 2495 2515 -103 -2684 -2108 82
3142H2K375k1k392k231j61K605K168J21k328k932O98K284K290l09k777k341L85
$$ 82 2457 2436 44 -2187 -2348 257 2425 2546 218 -2714 -2016 268 2558 2249 -528 -2869 -2484
3159b484L290J705k49k731k037M64K924J737n88k678k105P12L001J759r04k748
$$ -2484 806 2511 2262 -469 -2506 -2042 882 2619 2031 -647 -2752 -2040 961 2720 1816 -932
3175i32j599R76K617J462q31k658j856J006K620J823j103k756j474J001K837J624
$$ -932 -2531 -1555 1062 2524 1693 -965 -2821 -1815 805 2628 1525 -1231 -2705 -1704 1133 2757
3191B757j236k615j370J125K606J061j267k354j509J779K195J338j405k582q83
$$ 2757 1521 -1094 -2464 -1339 1267 2328 1061 -1293 -2802 -1023 1172 2510 1105 -1477 -2360
3206b360J239K403J430j579k887p64J728K312R16j529k476j037J797K400P16j562
$$ -2360 -1121 1282 2712 1133 -1754 -2518 -790 1522 2438 909 -1567 -2604 -807 1593 2309 747
3222G47k652l23J352K585P49j950k240m30J569K273P93k059k301k76J673K634
$$ 747 -1905 -2228 -876 1709 2458 508 -1732 -2162 -593 1680 2473 414 -1887 -2163 -490 2144
3238B144M82k348k293m57K127K512K15k268k125l5J730K374L08k141k137o2K029
$$ 2144 2626 278 -2015 -2472 -345 2167 2382 114 -2011 -2046 -316 2058 2366 225 -1912 -1974 55
3255E5K201O6k154k212j0K009K015J34k061k578N02K132K374m61k570j815N30
$$ 55 2256 2322 168 -2044 -2054 -45 1970 2104 43 -2535 -2033 99 2473 2012 -558 -2373 -1843
3272a843K282J877n26k289j831O40K149J639k30k593j646M86K386J858l36k966
$$ -1843 439 2316 1790 -499 -2330 -1690 459 2098 1868 -725 -2371 -1885 501 2359 2023 -943
3288i43j458R50J920J957p45k376j651R26K289J550q17k575j231J029J769J828
$$ -943 -2401 -1451 469 2426 1681 -695 -2346 -1420 869 2419 1602 -973 -2204 -1175 594 2422
3304B422r98k456j491J330K321J131p99k537j128Q62K643J103j308k146j372J643
$$ 2422 1424 -1032 -2523 -1193 1128 2259 1460 -1077 -2205 -1343 1300 2403 1095 -1051 -2423 -780
3320g80K231P15r46k748r30J764K245O73j659j865p59J469K182O07j510k071q29
$$ -780 1451 2166 1220 -1528 -2458 -694 1551 2224 565 -1300 -2059 -590 1592 2199 689 -1382 -2211
3337b211J285K503N09j496k289n43J857J775Q84j784k045n18J648J947P68k163
$$ -2211 -926 1577 2086 590 -1699 -2242 -385 1390 2274 490 -1555 -2073 -425 1522 2290 127
3353A27j655o27J985J947L27k062k127J01J820J764M06j863k068j59J854K048
$$ 127 -1528 -2155 -170 1777 2104 42 -2085 -1984 -164 1600 2006 143 -1925 -2084 -230 1818
3369A818L21k223j947K80J997J877o6k019k055K05J949J785j53k103j626k8K330
$$ 1818 2139 -84 -2031 -1751 246 2123 2057 38 -2017 -1812 137 1922 1769 -334 -1960 -1988 342
3386C42J780m47j836j965N91K024J737n82k105j794O05K037J950r11k129j256
$$ 342 2122 1675 -161 -2126 -1535 489 2226 1644 -461 -2255 -1650 387 2337 1426 -703 -1959
3402a959M67K108J319p09j879j653Q26K304J310p56k039j574J015J847J412p78
$$ -1959 -1492 616 1935 1226 -653 -2306 -1480 824 2134 1378 -661 -2235 -1220 627 2039 1261
3418A261k199j174P23K355J441j369k276j004J133K311R82p79k617p75J183J756
$$ 1261 -938 -2112 -1389 966 2407 1038 -1238 -2242 -1109 1202 2184 1405 -1212 -1987 -804 952
3434I52R94j071k084p55J274K081M61j108j856r97J361J996M54j198j583q84J232
$$ 952 1946 875 -1209 -1964 -690 1391 1852 744 -1112 -2109 -748 1248 1702 504 -1079 -1963 -731
3451g31J628P72r31k400j02J273J722O54j516j848n15J833J868j1j093k206l48
$$ -731 897 1669 738 -1662 -1764 -491 1231 1885 369 -1479 -1994 -161 1707 1696 603 -1603 -1951
3468a951J632K145O4j726j643l97K101J382j67j680j554k23K046J811K68k092
$$ -1951 -319 1826 1890 164 -1479 -1876 225 1607 1440 -240 -1794 -2017 29 1840 2108 16
3484A6j455k05J685J748m9j873j607L54J261J819p6j789j656M44J610J589k17
$$ 16 -1439 -1644 41 1789 1740 -133 -1740 -1386 -125 1694 1618 -171 -1827 -1383 227 1816 1599
3501A599j986j225K27J795J217k73j877j332N79J656J433j92k476p81K69J704
$$ 1599 -387 -1612 -1385 410 1627 1354 -523 -1855 -1276 380 1813 1621 -855 -1636 -1367 337
3517C37J341l79j619j464M12J994J111n31k017j036O83J876J107p04j723j411
$$ 337 1678 1299 -320 -1784 -1372 622 1733 1202 -815 -1851 -1168 708 1815 1111 -612 -2023
3533b023J121J484J294r17j781j265J095J595J167p47j960o11M31K145Q70j078
$$ -2023 -902 582 1876 959 -822 -2087 -992 603 1770 1023 -937 -1548 -1117 1028 1898 820
3549H20j998m44J343J427M43r17j768p42J239J904M74j071j684o21R17K030L65
$$ 820 -1178 -1622 -279 1148 1591 674 -1094 -1836 -597 1307 1781 710 -974 -1595 -678 1352 1717
3566A717j123j860k15J047J636O56j322j848k07J194J367P28j231j764k02J282
$$ 1717 594 -1266 -1481 -434 1202 1858 536 -1312 -1519 -325 1042 1770 539 -1225 -1427 -145
3582a45J462M16j754j256j95J169J668K51j725j177k31J505J214N72j765j562
$$ -145 1317 1733 -21 -1277 -1472 -303 1365 1616 -109 -1286 -1517 -12 1202 1774 9 -1553
3598a553k41J693J632J49j717j399k4J363J498j41j396j445K43J834J120l46j641
$$ -1553 -1794 -101 1531 1680 -37 -1436 -1460 -97 1401 1260 -136 -1581 -1338 496 1616 1270 -371
3615c71j133K98J308J437k19j478j309J91J691J213k36k078q65M54J541J060p63
$$ -371 -1504 -1206 102 1539 1320 -158 -1467 -1276 415 1628 1392 -686 -1551 -1097 444 1504 741
3632G41j029j075j48J811J328p85j338j246O99J591J033q66j156j260O58J774
$$ 741 -288 -1363 -1511 300 1628 843 -495 -1741 -1042 549 1582 716 -440 -1700 -1042 732
3648G32J014o11j793q31N95J550J120o50j861p09M44J484J077p97j294j068O06
$$ 732 1746 1135 -658 -1489 -894 656 1776 1126 -735 -1444 -1000 484 1561 764 -530 -1598 -992
3665i92J843O89q45j568n54O42J877L83q22j730m75J207J022J054q26j977l71
$$ -992 851 1540 695 -873 -1427 -785 1092 1475 653 -1077 -1552 -345 677 1731 905 -1072 -1443
3682a443J051J175O74j293j159m39N96J712M48q62j485n98J496J038M52j103j217
$$ -1443 -392 783 1457 164 -995 -1434 -838 874 1322 460 -1025 -1623 -127 911 1363 260 -957
3699i57n36J134J475L31j169j567J55P44J610K61j167j277l84J134J310K41j189
$$ -957 -1493 -359 1116 1447 278 -1289 -1134 -390 1220 1481 314 -963 -1347 -213 1097 1338 149
3716A49j325L01Q51J354k44j238j166j4J465J313l14j333q73k43J305J283j42
$$ 149 -1176 -875 -24 1330 1086 -152 -1318 -1332 133 1446 1132 -201 -1074 -1317 -12 1271 1129
3733A129j335j214L15J311J138j27j354j106j0J513J236k18j653j011M43J447
$$ 1129 -206 -1420 -1105 206 1344 1217 -137 -1243 -1253 260 1496 1278 -375 -1386 -943 504
3749E04R18r0j544r77K81J432J019m92j664p42N03J142J153n23j293q74M35J114
$$ 504 1422 1332 -212 -1189 -908 524 1543 1051 -613 -1355 -852 290 1443 920 -373 -1247 -812 302
3767C02R87n03j451o57N15J335Q67l18j366j205P65J694L19o69j192o33N78J598
$$ 302 1289 786 -665 -1322 -807 528 1395 1077 -289 -1494 -729 965 1284 615 -577 -1210 -632 966
3785I66L90p97j495k93P43J346M91r69j148n60O57J451O78j040j273m29P29J405
$$ 966 1356 559 -936 -1229 -486 860 1351 382 -766 -1326 -669 782 1460 420 -853 -1282 -553 852
3803H52P61j078j442m98J291J072J47o93j380l11R46J151L98r34j283k70J056
$$ 852 1613 535 -907 -1405 -114 958 1105 412 -968 -1279 -333 818 1216 282 -1001 -1271 -215
3820b15J115N18j267j175j64P15J593L0q19j131m89J035J162j4q82j033J7Q59
$$ -215 900 1418 151 -1024 -1188 -473 1120 1150 331 -800 -1289 -254 908 894 12 -1021 -1004 -145
3838a45J158q2q15j463N33R10Q13L95j174j174n0J255P93J03j025j161J78J135
$$ -145 1013 931 116 -1347 -814 96 909 1304 130 -1044 -1094 161 954 1057 32 -1129 -951 184
3856A84Q70o2j143r22Q2J341O04K15j233j040K42J425N50j30j083j074J89J365
$$ 184 1054 992 -151 -1073 -991 350 954 1169 -64 -1104 -862 563 1113 983 -100 -1174 -985 380
3874C80O61k21r87j067L34J184Q13l13q46j121K03J304P05l04j470l22O67P83
$$ 380 1041 820 -167 -1234 -900 284 1097 784 -62 -1183 -980 324 1029 725 -745 -1067 -400 383
3892C83Q24q27r14o43K98J473O81p78j238l29L90J231L93m43j102o62O88J483
$$ 383 1207 380 -534 -1177 -879 594 1275 497 -741 -1070 -680 551 944 501 -601 -1263 -575 908
3910I08L7m87p97q62P91R83N14l92j456l30Q21J037Q7n82j040q2N40R20P43r97
$$ 908 945 458 -339 -1201 -410 573 1087 695 -761 -1091 -270 767 854 272 -768 -850 -310 610 1353 356
3930C56j165l23O08J215P64j006j285l75R37R64L35q23r58m12P56J122Pk96j294
$$ 356 -809 -1132 -524 691 1455 449 -836 -1211 -274 690 1025 202 -756 -1168 -412 710 717 421 -873
3949h73kR58Q76Kr90j072lJ072Q77J20r30r90n9J017J202j02r06r68l71Q20J389
$$ -873 -875 83 959 961 -29 -1101 -1104 -32 845 965 35 -955 -1014 3 1205 1103 197 -771 -1142 -322 1067
3970A067j60j208q35J35J037J024j89q81p39r7J052P58j11j038j027O59Q91N95
$$ 1067 907 -301 -1136 -1001 36 1060 871 -10 -749 -846 206 964 853 -185 -1212 -553 338 933
3988I33l91q24r30K14J398O30k58j396l62L97R60R07n27j056q62N56J015O15l22
$$ 933 542 -282 -1212 -998 400 1030 772 -624 -986 -589 371 1278 751 -305 -1167 -611 404 1019 697
4007F97j014j154P74J083N55n37j053l71N17Q03O96l06r27p75L94R89P97l64j330
$$ 697 -317 -1471 -697 386 941 404 -649 -1020 -503 300 996 690 -237 -1012 -618 371 1168 804 -526
4026e26m97N52J143J95m99r37p08Q90O67O27n45j155l50O83J155N06j057r24k99
$$ -526 -1023 -471 672 867 368 -569 -1277 -387 280 907 362 -793 -1143 -460 695 1201 144 -780 -1079
4045a079M58J061O46r22r83k10O71J037P6n43j467K56N41J080K52o80q17n64J255
$$ -1079 -621 440 1086 164 -819 -1029 -358 679 755 212 -1255 -999 -458 622 874 194 -623 -1187 68
4064F8R53k93o37q64Q3O95Q37M24j374n05l02O71R33K47q97j048O13L31P20K22
$$ 68 1021 728 91 -773 -690 5 842 1266 -108 -613 -915 -244 689 936 39 -1009 -396 -65 655 877
4084H77j055o51l9Q79Q34J66j195q22K43J127O79j87j139p22K08Q86Q32p2r34
$$ 877 -178 -829 -868 11 845 1011 -184 -1006 -763 364 1043 856 -283 -1005 -797 89 921 849 -85
4103h5m55l23R91Q97l79q39n61N3R39N12j03q00o43N5J142P07k71j186o13M90
$$ -85 -540 -863 128 1025 646 -193 -754 -701 238 750 647 -153 -796 -741 401 1108 837 -349 -962 -472
4123d72J107O48o47j106q49M32J067O16j62j032n83M23J122N73p74q69p09Q42
$$ -472 635 1283 636 -470 -1319 -887 180 796 634 -398 -981 -558 564 1137 363 -506 -1215 -373
4141c73J199m8j14j223l00P46N53L31m84r12m29O71J048L57p46r90j88M73R52
$$ -373 826 778 664 -559 -859 -113 440 771 287 -625 -1054 -383 665 1022 276 -714 -902 -429 523
4160E23L83m69j130j34N49P91M29n53j025j58O79P41M42j067q03r4J074N77K32
$$ 523 906 437 -693 -827 -278 513 942 389 -636 -794 -115 626 1068 1 -802 -896 178 755 987
4179I87n60j121l5P16N22P02j194q19j0Q00P52J73j047q98N11K31J267q7r64r15
$$ 987 427 -694 -729 -13 509 1211 17 -802 -812 -12 740 913 -134 -1032 -521 -290 977 890 -74 -989
4199i89J16Q28J147j89j056m45j91J084P96j87r50p06J06M24R26q7j160k00N0
$$ -989 -873 -45 1102 913 -143 -588 -779 305 1101 914 -36 -742 -636 -212 714 627 -533 -733 -683
4218f83P41P85l44n65q31L36R06N24m73n35r73O52R78K31q6j101l60K53J042M02
$$ -683 58 843 499 -66 -897 -561 345 869 396 -139 -1112 -460 518 749 663 -438 -798 -545 497 899
4238H99j33j153k48J88M00R25q01n06l71J32R90L89l40p06l11P6R33M98m72r53
$$ 899 766 -387 -635 -447 -47 878 77 -429 -800 -668 322 711 371 -335 -646 -570 363 861 389 -564
4258e64k95M93J178J25o44q06l93M69Q31O21q01o29m45M05J044L47o99q93k43
$$ -564 -859 -366 812 937 293 -513 -906 -437 394 1015 214 -415 -860 -455 589 936 237 -656 -899
4277h99O19R93o0l98r99k79P80O43N55q80o01m07R10O38J38o38q27m1O24N57M09
$$ -899 -280 713 653 255 -744 -1023 -243 400 955 75 -526 -933 -23 615 753 115 -712 -753 -129 428 837
4298H37o72r02K46L74P04R5p27p46oP28Q09j35o46n30O4K97Q19K02o13p10k54
$$ 837 165 -737 -491 -117 587 682 -45 -791 -797 -69 740 605 -41 -571 -507 -210 609 811 198 -512 -766
4319g66Q36M91J43p53p10K26P53M57rr35n84L94O89M60k24o83n21J05R96R9J59
$$ -766 70 561 704 -49 -759 -533 220 677 668 -267 -851 -457 232 692 468 -215 -736 -631 365 464 623
4340F23o53n15J82L78P25l60q26j70Q0P22N48l71m42q84O19O33M05l68o71m46
$$ 623 -30 -545 -363 15 740 380 -446 -616 -536 186 734 363 -79 -963 -344 289 694 326 -345 -791
4360g91L93P31N60n05p24n51M53P56L64n10m08q51R05O36L23m18n81l17K78Q45
$$ -791 -398 333 893 388 -336 -887 -434 322 686 176 -232 -1083 -178 458 781 363 -218 -535 -257 588
4380E88K82k43j071l36N86R55L9l17j028j45N26O85M37o10o91l07J86J012R2p56
$$ 588 870 627 -444 -780 -194 761 800 483 -545 -690 -164 521 958 348 -343 -650 -464 548 640 -116
4400a16n98K02N25L42K17l21q97k63Q66O96O6n05q91O0L57Q41L70j073l25j65
$$ -116 -714 -512 13 355 572 251 -646 -909 -43 653 719 214 -677 -617 -260 581 951 -122 -447 -612
4420f12K92J073l40k34o76l13Q07M08J57k98q22l89R06L58J15p01m30L06K55O95
$$ -612 -320 753 413 179 -497 -810 -3 405 562 264 -558 -947 -41 317 432 -269 -699 -393 -138 557
4440E57K75j115n32K17Q11L71O5q06n00K17O14N86l86m57n67K65L45L96M7l14
$$ 557 832 -283 -815 -598 213 584 649 -157 -657 -440 174 760 374 -83 -650 -385 -40 356 403 89
4460H9j034P49L62O95m17o56l69p6P03N78j95o30n53L98L32M83r7q00L1q1Q91
$$ 89 -945 -196 166 861 444 -212 -581 -657 46 624 429 -201 -754 -356 -24 459 362 -438 -407 -488 403
4481D03K29k41k11o37J01N67N26n03n80l21K18R85j11q3q35k24P11N47K05n09
$$ 403 632 391 180 -457 -356 211 737 234 -346 -667 -449 536 425 342 -493 -717 -6 541 746 237
4501B37p47l5J47R09N60o39q67k04M82O41J25m43o52j72K18P59L28n83o65J42
$$ 237 -510 -545 -398 511 1071 432 -435 -639 -157 484 609 166 -486 -658 -440 319 647 64 -601 -459
4521d59K75N12M89m83q74l25N04R50J75m15r73J79N50K17O8l50o13k3O63L54j29
$$ -459 -184 328 817 334 -540 -865 -361 589 764 349 -624 -445 105 322 390 40 -573 -596 67 421 292
4542B92k56m51k1L87P15l26n05k95K39R4Q41m52J76j192J41P73K33n3k39o29j6
$$ 292 36 -415 -436 -49 666 340 -165 -460 -221 -127 714 262 438 -754 -613 160 393 340 101 -528 -544
4563e44N48N00J28p34n47K61M29O98m63n42m74K72N96O01o34l7o63L0Q92J64j85
$$ -544 4 504 632 -102 -649 -388 41 739 276 -266 -740 -468 128 729 95 58 -605 -575 317 481 296
4584B96k47q27P28K30N65j43q08j65j35P48N13m69m17m75M60K91M40k50l83m60
$$ 296 49 -778 -50 180 745 602 -206 -371 -506 242 755 286 -131 -606 -146 145 585 335 -48 -508
4604e08K30L77L89m8o94p5K2Q80m3q4n02o34O59NM52j14p59l7J60N54K26k44r39
$$ -508 -278 99 488 440 -254 -329 -307 573 530 446 -56 -690 -31 -26 426 312 -447 -484 -324 230 456 212 -727
4627g27K05K16P78l96q6l72j67N24M91j2l20j84n60N65M90J23m07r7o90N07M82
$$ -727 -522 -306 472 76 -10 -382 -549 -25 466 454 134 -50 -610 -45 445 568 161 64 -626 -119 363
4648C63K28o88l34j74M41Q71k31o08j99k35N11M72k18J34q66m1L26N54J91o26
$$ 363 591 -97 -431 -605 -164 707 476 -132 -331 -566 -55 417 199 333 -533 -574 -248 306 497 -129
4668a29m10J57M99K48N3k29m56o4J83P53j58o24j82Q7K18Q86n89l83l62J71L14
$$ -129 -539 -382 117 365 418 189 -267 -331 -148 605 447 -177 -359 -272 -54 832 243 -140 -502 -331 -17
4689a7M64J54q07k89k9R18Jj00l77k42K6J46Q68l26l03p87K64N81K55J35o59n35
$$ -17 447 601 -206 -495 -524 394 395 295 -82 -324 -298 -152 716 390 87 -700 -436 145 400 535 -124 -659
4711f59K80O09R4k3m73k41N9N04N53k91o95n12O13L54K55l18m87j16L22L01N49
$$ -659 -379 230 324 301 -172 -413 -354 150 703 412 -283 -795 -182 172 427 109 -378 -494 -172 129 678
4732F78l77o90n6M16L13M17n63m78M7J93P07r2j93p76j56N40M71P2j86l34l58
$$ 678 301 -389 -445 -29 284 701 138 -340 -293 -100 607 515 322 -454 -610 -70 401 473 287 -47 -405
4753d05M52L39J32m87k95m24N87O54j13l06j37k32J5P21J54m87q18K03N07L98
$$ -405 47 386 518 31 -264 -688 -101 553 440 134 -3 -235 -220 501 655 168 -650 -447 60 458
4773D58N5m08n91J47N53K89Q9j79p50k2N51L54j54n81k68jN77K01j10k10m42j24
$$ 458 513 105 -486 -339 214 503 592 413 -337 -359 192 546 392 -189 -457 -458 119 320 210 0 -442 -566
4795e66N44N20n4n52l52J71L50K82M4m56l00j87N75K75J22o20n55N01J4M78L7
$$ -566 -22 498 444 -108 -460 -289 61 343 387 -69 -369 -556 19 294 416 -204 -759 -258 -244 234 271
4816B71n48k43M23J48O4K88n25m98M38L68K74l38l08l09K46O99p6j31m18j98j73
$$ 271 -277 -520 -97 51 115 403 -122 -620 -182 186 460 122 -186 -495 -249 450 374 243 -175 -373 -546
4837e46Q14K96J5p90p5r2N07J70l13k66j20K1P49j56m0q46K10N56N0N4J20q87
$$ -546 268 564 579 -211 -286 -378 129 299 -14 -280 -400 -379 370 214 174 -672 -462 94 144 198 318 -569
4859e69J10L22L93K05j70m54r3J69N06J88m22l64l54K75P96j65o36N3n03P18L87
$$ -569 -459 -137 256 461 291 -163 -256 -87 419 607 185 -179 -533 -258 538 373 -263 -210 -713 5 392
4880C92r7k08n05J38L11L65J4k99m55r3M73L24J0k80k86j19J14O01J4m01o50K82
$$ 392 295 87 -418 -280 31 396 410 111 -344 -437 36 360 370 90 -196 -315 -201 400 414 13 -637 -355
4902c55M57M33k99k18p39L07M32N17j60l05l22k58N54K16R2j56j048M23L59N75
$$ -355 102 535 236 18 -721 -414 18 535 375 70 -252 -510 44 260 352 196 -852 -429 -70 505
4922E05L6o21l10j57O21K92j05p7r26N31P50K49k25r16j27M44J29N14o32m1j63
$$ 505 541 -80 -390 -547 74 366 261 184 -742 -211 539 788 563 -353 -480 -36 93 607 -25 -66 -229
4943b29R5J49N19l68j74n38L79L67N21l81n24k14L04M68j95k14l57j69M16O52
$$ -229 -134 15 534 166 -8 -546 -167 200 721 340 -184 -398 -94 374 179 -35 -392 -561 -145 507
4963E07k24m1l88k73J74L29M31l80k72m92L74K91M31k64m35k5j8Q12k03j93m07
$$ 507 283 242 -146 -419 -245 84 515 135 -137 -629 -255 36 467 203 -232 -257 -275 537 334 141 -266
4984b66j0J97L85K05n12j20n53P45M64l89M8k49pj42N45M8n10m50n5O31L79N4
$$ -266 -276 -79 306 511 -1 -121 -674 71 535 146 194 -55 -62 -204 341 389 -121 -571 -626 5 384 438
5006D38m00l45j48M63K71O0l23k69k91J41P30j83j88j96n1L60J57Q3k67n39L07
$$ 438 38 -307 -455 8 279 339 16 -253 -544 -403 327 144 -44 -240 -291 69 226 309 42 -497 -190
5027a90k2P35n2o56j71j49Q03O6J47p74l48K70N24J03j22m76J69k19K84N22l25
$$ -190 -212 523 471 -185 -356 -505 298 364 511 -263 -611 -341 183 286 164 -312 -143 -362 -78 444 119
5048A19j43n31N5O72J66n0k31k10q9M02K10J82o01k12j44N96K18k03l17m82L48
$$ 119 -24 -555 -500 172 338 288 57 -153 -242 160 370 552 -49 -261 -405 191 409 206 -111 -593 -245
5069b45O82N3r9o79k11N62Q7K13n9n11j4j61L87N95q54lJ47l34N07K66k76l37
$$ -245 437 490 391 -288 -499 63 150 363 304 -207 -221 -382 5 600 -254 -257 -110 -444 63 329 53 -284
5091b84L8r1N25J8p6m23n3L56L36K04n14o3k68R6O56j91K2p06Q3M28J85m3j31
$$ -284 -246 -337 188 206 130 -293 -346 10 346 550 36 -27 -295 -199 457 266 288 -418 -335 93 278 235 104
5114A04m24j90M45N03j68j71k31j67K01K63L16n89j39r7L02K64K60l99k44k55
$$ 104 -320 -510 -65 438 270 99 -132 -299 -98 165 481 -108 -247 -344 -42 222 482 83 -161 -416
5134d16N50M8L28n24j74j02K65N59m36Mn81Q7P05q1J25o01l7j4L34N06l28p9n21
$$ -416 134 182 510 -14 -188 -290 -25 534 98 102 -479 -392 313 232 357 -244 -281 -295 39 545 217 138 -383
5157c83K48M26j10J61o97QK53J17M20m3m01k30J80M28oOo89o2l0O74J8j44j73
$$ -383 -135 291 181 342 -355 -347 -94 23 443 400 -1 -231 -51 377 371 377 -312 -374 -404 270 288 144 -29
5180b9k86R9K09M12l16j34r4MK72N24l24o86n9N0L97M63l16k87m58N72%K01P9
$$ -29 -315 -216 -7 405 89 -45 -139 -135 137 661 337 -349 -408 -358 39 502 186 -101 -559 13 13 214 293
5203B93o54j74K42P37q4l41m4l47R4O74Q7m31k17k15O8M29Pp2j87j58K08P08n23
$$ 293 -361 -535 -293 444 360 19 -25 -372 -278 396 483 52 -165 -380 -312 117 124 52 -135 -293 -85 623 100
5226A00k2k06j15K11K66J60m11M5m81N65J23K55n90J33l40K31L81p5Mn10j85L51
$$ 100 78 -128 -243 -32 234 394 -17 28 -453 112 235 490 -100 33 -307 -76 305 230 234 -276 -461 -110
5248a10L54L5j89k59J46k01N52mk37n89L7L32L14p8k30j98%M15K11k29j03k82
$$ -110 244 279 90 -169 -23 -224 328 324 87 -502 -465 -133 181 103 -127 -325 -325 90 301 72 -31 -313
5270c13o3L54N84l37l17l39L92J47K64k02j37l75K47M14p3J82m61k77R1N3L70
$$ -313 -376 -22 562 225 -92 -431 -39 108 372 170 33 -342 -95 319 246 428 -33 -310 -219 -166 204
5291B04R3n60j27M8L68N09j13m72k75J85K11L88k87n41J68M84j34P7j29k62k78
$$ 204 297 -263 -390 -342 26 535 422 -50 -325 -140 71 459 172 -369 -201 283 149 226 97 -165 -443
5312d43K54K64K38k83l84l7R7K90L99m55p4o2J2K22L99j2o16k77K87N20j06j36
$$ -443 -189 75 313 30 -354 -391 -294 -4 395 -60 -134 -196 -184 38 437 425 -191 -468 -181 339 233 97
5334I7k71j96J39M19j8n2j61n22M96M28j57J61m52j63L56K98j85k32j17k23L63
$$ 97 -174 -370 -231 188 170 118 -43 -565 -69 359 202 363 -89 -252 104 402 217 -15 -132 -355 8
5355HK20rj35j82pR4J03lj65j78O8oL95l0J12m53J2J18K47M9k71m06K40M25j77
$$ 8 228 219 84 -98 -105 -11 92 89 -76 -254 -186 -192 203 173 285 -168 -156 -38 209 258 -13 -419 -179 246 69
5380F9J4J01l75K12L1L1k6k39J14j4K28n1K55l31k43P0J68M43Kk85l50O9K16J07
$$ 69 83 184 -191 21 52 83 57 -182 -68 -82 146 95 350 19 -224 -154 14 457 459 174 -176 -107 109 216
5404B16p8j45l67J89J94K02k47j00j93P0J5M40j3n0m97P0K00M46O9n76k3K7J52
$$ 216 138 -7 -374 -185 9 211 -36 -136 -329 -259 -244 196 183 133 -364 -294 -94 352 421 -155 -178 -151 1
5427AN9j44p7l75K95M38J04r3m81k62K32K18L46l6m42pj95O44J16j73j07j03Q7
$$ 1 60 -84 -161 -536 -241 197 301 208 -273 -535 -303 -85 261 225 -217 -224 -419 225 341 168 61 -42 45
5450D5P6K97j43l98p1j0M00K55k81l39m9Q0J78J44O2m84MJ00j30L83L4j80l02
$$ 45 121 418 275 -123 -194 -204 196 451 170 -169 -218 -138 40 184 246 -238 -234 -134 -264 119 153 -27 -329
5473c29M03R1J01m43jj90J46K26K43k21l66J57j34M65J38j02l68N9K93k44L30
$$ -329 74 165 266 -177 -178 -368 -222 4 247 26 -340 -183 -317 148 286 184 -184 -125 168 -76 254
5494B54n3k77l38M94q3J88k51r3j65M98L70o28K7j19M7L02k6J94p64M71p1n0K16
$$ 254 201 -76 -414 80 -3 185 -66 -159 -324 174 544 -84 -57 -176 -129 173 147 341 -423 48 -23 -73 143
5517A43N9k6n40M0L43q3KN0k51R0m0O75m78K57n51M3J49R6K99l79k23J37K87Q2
$$ 143 202 176 -364 -324 19 -64 -62 -12 -263 -173 -213 462 -16 241 -310 -267 -118 -22 277 -102 -325 -188 99 181
5541A81j42M0k69j06K49J57j13J25l66o4N84J8n82K86j83N2J96K56k09k60p7L8
$$ 181 39 79 -190 -296 -47 110 -3 122 -244 -308 276 294 -288 -2 -185 -133 63 319 110 -150 -227 -189
5563a89L64M06n23j6k07j90N30L47l20k44l32K19M21K6m79M82l51j10K85J55l16
$$ -189 175 581 58 42 -165 -355 175 522 202 -42 -374 -155 266 292 -187 295 -56 -166 119 274 -42
5584d2k76L7n6N36p5J68o35M58l6j6L33n22j84KJ86L33j34J03n58L47O7L90l43
$$ -42 -318 -281 -337 199 124 292 -343 115 79 63 396 -126 -310 -308 -122 211 77 180 -378 -31 36 426 83
5607H3k68M2R3K22jK26m37j51O8j58M55J20k82l57K51R7j8J89j77R2j96J79o1
$$ 83 -185 -143 -50 172 171 397 -40 -191 -123 -281 174 294 12 -345 -94 3 -15 174 -3 89 -107 72 11
5630A1K72l34m8p6J47L44j20k88j26O1J20K04P5n37l2L07J22K90j01p25M54K80
$$ 11 283 -51 -99 -175 -28 316 196 -92 -218 -157 -37 167 242 -295 -327 -20 102 392 291 -434 20 300
5652C00m99M67k07k86O6n5M52K1l21P9k11K0Q6M11N6p05L92r6K21j82K48j48n75
$$ 300 -199 268 61 -225 -159 -214 238 259 -62 17 -194 -174 -88 323 379 -326 66 -30 191 9 257 109 -466
5675d66K72L77p6R5m53K57j88K45K37j44j63j99M82m6qm02M9M6l66N82Pn6k77
$$ -466 -194 183 107 202 -251 6 -182 63 300 156 -7 -206 276 230 222 -180 -131 -85 -451 131 138 82 -195
5698a95O7M4KJ15J48l90j5L9L44l29J78j66k94N18K47o5m72K62o3J30L36n05J67
$$ -195 -128 -84 -82 33 181 -209 -224 -185 159 -170 8 -158 -452 66 313 248 -224 38 -25 105 441 -64 103
5721A03k8l14K67J30k50j15j10O4L33r6K38n75J43q3L43J92k44j64K6J71p2M9
$$ 103 75 -239 28 158 -92 -207 -317 -253 80 -16 222 -353 -210 -293 50 242 -2 -166 -140 31 -41 8
5743HL56l88k59Q6K29nK05l03j46K70n6K93l36j90Q6n6K74K47j83Qm89K08l6M85
$$ 8 364 -24 -283 -197 32 27 232 -71 -217 53 -3 290 -46 -236 -150 -206 68 315 132 140 -349 -141 -177 308
5767C08j37k29r5K40j37J9J33L8k49L0K6J56J17j58k82J37J10j9L4p9k83J82J82
$$ 308 171 -58 -153 87 -50 -31 102 140 -109 -79 -53 103 220 62 -220 -83 27 8 42 -37 -320 -138 44
5790D4K86j31k12q9j59M75j36LMj21P8K97J85n26j24J32P9mL4P7j60k68K21k27
$$ 44 330 199 -13 -102 -261 214 78 81 85 -36 42 339 524 -2 -126 6 85 81 115 192 32 -236 -15 -242
5814b42N25m46J91j8k1J21k34J31q1l8J75J44J0j48j01j96J03L34j57R1j63m4
$$ -242 283 -163 28 10 -11 110 -124 7 -74 -112 63 207 217 69 -32 -228 -125 209 52 143 -20 -64
5836f4K14J23j04N6k30j99O4J93k84J93kk53N37j3j51n9l19J67K13L17n18LrJ76
$$ -64 150 273 169 225 -5 -204 -140 53 -231 -38 -40 -293 244 231 80 21 -298 -131 82 399 -119 -116 -125 51
5860E1j05kP6J35l57O6R9K48o1k21M9OL0K02L6j58k12k8r8J44M91n02j88L89J0
$$ 51 -54 -56 20 155 -202 -136 -37 211 150 -71 -22 -16 14 216 252 94 -118 -146 -244 -100 391 -111 -299 90 100
5885A00J79j91k26j64N1N6K38L5j51m25M58K18j74L5k94K84l01M00n5J02k25r2
$$ 100 279 88 -138 -302 -251 -195 43 78 -73 -498 -40 178 4 39 -255 29 -272 128 73 175 -50 -142
5907a42J6kL70k03m0o9J65P8L68k77m92j6J67J92K16k30m27L52k34L29k16R6R
$$ -142 -126 -128 242 39 -1 -70 95 173 541 264 -228 -244 -77 115 331 101 -326 26 -208 121 -95 1 10
5930A0J7O8k35K64k12l57K87p5K70J59l9m66L34j97M48O5k65j69P8p1K17J55q2
$$ 10 27 95 -140 124 -88 -445 -158 -233 37 196 157 -309 25 -172 276 341 76 -93 -15 -86 131 286 204
5953B04l85j53O13J24k97j23j00q7M43Pk68J24k11K16K24k60j22L03k20j8j09
$$ 204 -181 -334 279 403 106 -17 -117 -204 239 246 -22 102 -109 107 331 71 -51 252 32 14 -95
5974i5R0Q2j37K2P0J7j16K86ok35k89M87k28o3J88j84O1j02K26o4p8n3q0K90L3
$$ -95 -5 77 -60 -38 32 49 -67 219 213 -22 -311 176 -52 -115 73 -111 -50 -152 74 10 -68 -121 -201 89 122
5999A22j32J67m84N4K31%M69n66k25o2N90j58M31m65r3l8J14M25k94L88n94K80
$$ 122 -10 157 -327 -273 -42 -42 427 -139 -364 -426 164 6 437 -28 -121 -159 -45 380 86 474 -120 160
6021A60O2l19J87m38M70j73L13k53J83j23l52J83K15j22K1k27R3J42J32k5j82
$$ 160 222 -97 90 -348 122 -51 262 9 192 69 -283 -100 115 -7 14 -213 -120 22 154 129 -53
6042e3J6m29N28J49j42k1k76K48j4L3O41m76j41P6k88M94k68KK7nJ19l88K16j32
$$ -53 -37 -466 62 211 69 48 -228 20 6 39 680 204 63 139 -149 345 77 79 106 101 220 -168 48 -84
6066h4Q7j69k5N32j91j53n0k6K87j62Q7k45J51M5j58q1M81k84j8j90N98l24k69
$$ -84 3 -166 -191 341 150 -3 -53 -79 208 46 133 -112 39 84 -74 -155 326 42 24 -166 432 108 -161
6089a61L05j29R4j28L56l63J19k31J81q3N7P7j22K80k17m9K35l67K84K0k22P1
$$ -161 144 15 109 -19 337 -26 93 -138 43 -40 17 94 -28 252 35 -14 221 -146 138 158 -64 7
6111GQ4L4J4k95K58j52K99m08J24p6j29K84K14j37l80J97R8J7k2n5k51L33k36
$$ 7 91 125 139 -156 102 -50 249 -159 -35 -111 -240 44 258 121 -259 -62 36 53 31 -24 -275 58 -178
6134a78J36P2k67J60l79N22mj7k2o1j95K94Q9J79J3k50n6k74K17J34j88M4k14
$$ -178 -42 30 -237 -77 -456 66 62 45 23 -38 -233 61 150 329 342 92 36 -238 -21 113 -75 -31 -245
6157b45J51J95o3K72n04J7mK55j09K10j01k55L93j64K17j16k02p6j13K56J66l25
$$ -245 -94 101 38 310 -194 -177 -181 74 -35 175 74 -181 212 48 265 149 -53 -129 -242 14 180 -145
6179a45K10j58k26M88k32L8N3j30O8K11k50N3J58k31r4M40m23Q0m9K66J38l58
$$ -145 65 -93 -319 169 -63 -25 28 -102 -34 177 -73 -20 138 -93 -187 253 -170 -90 -139 127 265 -93
6201i3J16j9j53j70M50N1K2k28j83J53J78j65J03k55o4J51K22n4J32k5j62k25
$$ -93 23 4 -149 -319 131 182 204 -24 -207 -54 124 -41 62 -193 -257 -106 116 62 194 169 7 -218
6223b18K40O9J04k29J26m55K79p2Mm1K25j62M7K64m0j02j81n8L84j68J9M1j68
$$ -218 22 91 195 -34 92 -363 -84 -156 -152 -193 32 -130 -83 181 141 39 -142 -200 184 16 35 76 -92
6246i2m8Q1J09L5j4J36k71l0K94k38J65k95j98K60K65q7k58N2P1M14m19P3n1k24
$$ -92 -140 -59 50 85 71 207 -64 -94 200 -38 127 -168 -366 -106 159 72 -186 -134 -63 351 -68 5 -46 -270
6270b70K31L97k40j4R5K7n82L42O7n2j99J98P3j36J44R2j23l15K74j06K01q6p
$$ -270 -39 358 118 104 199 226 -356 -14 53 1 -198 0 73 -63 81 173 50 -265 9 -97 104 18 11
6293A1j56M4J99o3k37L75m03K70j56N6J37k38K06k31K61j36p9J53m8K82j44k09
$$ 11 -145 -101 98 35 -202 173 -230 40 -116 -60 77 -161 45 -186 75 -61 -140 13 -35 247 103 -106
6315a06J72J1l41J86j07K70m40J23K25L9M44m54O1k32J22K02p5N5k85M7j8J28
$$ -106 66 77 -264 -78 -185 85 -355 -232 -7 32 476 22 83 -149 -27 175 100 155 -130 -83 -101 27
6337B7J89k44q9J5o6J13m4j14L80j57k44M15l50M20j65n25M39L80m60l0j98M1
$$ 27 216 -28 -117 -102 -168 -55 -99 -213 167 10 -234 181 -169 251 86 -439 0 380 -80 -110 -308 -267
6359b67J07o8J35J12j53j02K78L9r3N5q6L08j47j88L44j09j23Q0l12J60K73m50
$$ -267 -160 -228 -93 19 -134 -236 42 81 -12 43 -43 265 118 -70 274 165 42 122 -190 -30 243 -207
6381b07J16K1j39P2L0L70J01n18q2N88j6n8k86K09m27L88o5l44K46j45K74K8l84
$$ -207 -91 -70 -209 -137 -107 263 364 -154 -236 352 336 278 -8 201 -226 162 97 -247 -1 -146 128 156 -228
6404b28K29k69nJ95K9J39J05k13j66o3K39J70k89K72l98K3J98K85k29l73K58J7
$$ -228 1 -268 -273 -78 -49 90 195 -18 -184 -247 -8 162 -127 145 -253 -230 -32 253 24 -349 -91 -74
6426g4M2pK0O3j98L13k45M29j75M4j66j76J35J96l59J3M51l63l4J52k8r5k24L16
$$ -74 -32 -39 -19 44 -154 159 -86 343 168 212 46 -130 5 201 -158 -145 306 -57 -91 61 33 -62 -286 30
6450C0J08j07Q3p8k35M84k36k20M30l50K41m18M59j92L9j88J0J26M74p49M8J27
$$ 30 138 31 114 36 -199 285 49 -171 259 -91 150 -268 191 -1 38 -150 -140 -14 460 -289 -241 -114
6472a14K1R4K66k91J8o2j22K75o6q3Q2K6J60j62rJ3j35M79n42J67r5K10p2j25
$$ -114 -93 1 267 -24 -6 -68 -190 85 19 -64 18 44 204 42 33 46 -89 390 -152 15 -80 130 58 -67
6496f7q1J03R0k12J23P0n0K89j12K7p0k69J57o0m6L3J04j68L39k80J0P0J16N6
$$ -67 -148 -45 45 -167 -44 26 -24 265 153 180 110 -159 -2 -62 -108 -75 29 -139 200 -80 -70 0 116 172
6520A72l32K64j66J21K19l25JN2j55N7j45J27P2Lj22J68j1P5p2N0j11P3l51J82
$$ 172 -160 104 -62 59 278 -47 -46 6 -149 -92 -237 -110 -38 -35 -157 11 0 75 3 53 -58 15 -336 -154
6544a54N9mJ55J08k66J02Q5Lj60m2J62j63k1M74k97L4k98J27r0L55K1m87K72o7
$$ -154 -95 -99 56 164 -102 0 85 88 -72 -114 48 -115 -136 338 41 75 -223 -96 -186 169 190 -297 -25 -92
6568i2P6O9O0j11k67O21l92L71l49k4p4o2O1k2J32J17q3j74p7K97K6j8jj93Q4
$$ -92 -16 53 113 2 -265 356 -36 335 -14 -38 -112 -174 -113 -135 -3 114 31 -143 -220 77 103 85 84 -109 -25
6593b5P7J26l4l11P0j26R4N28m31J45k29J45K91n56M5K82l36J44L0J89k17J45
$$ -25 52 178 144 -167 -97 -223 -129 399 -32 113 -116 29 320 -236 -191 91 -245 -101 -71 118 -99 46
6615D6j33P4r4R2R4M17p16L82j96K06j98j34q5K52nk01K32j47K54r0P6j30j08
$$ 46 -87 -13 -107 -15 79 496 -220 162 -34 172 -26 -160 -245 7 2 -199 33 -114 140 50 126 -4 -112
6638a12O1j42N4J27q5Q7K8L4m8K03Q5k7k93J47l3p0m7k67K33J12L2J73j6m24L1
$$ -112 -51 -193 -139 -12 -97 -10 18 52 4 207 292 265 -28 119 86 16 -31 -298 -65 47 79 252 236 -188 -157
6663a57M32l22M9j01J70k40J81J82j1k07L2j81J90J37m94M92l34j16J23K18J81
$$ -157 275 -47 2 -99 71 -169 12 194 183 -24 8 -173 17 154 -340 152 -182 -298 -175 43 224
6684B24k76J28j68K00k9m3o0k10P5K0l2M03l81P9R0K28l98M0K10J89l17O9K1j09
$$ 224 -52 76 -92 108 79 36 -24 -234 -159 -139 -171 232 -149 -70 20 248 -150 -110 100 289 -28 41 62 -47
6708d7J79j05K1l54L52M3j72p9K52j98j4L08l21O8M20n24K97J1j37p7J56M2j60
$$ -47 132 27 48 -306 46 89 -83 -162 90 -108 -122 186 -135 -67 353 -171 126 137 0 -77 79 121 -39
6731c9n3J31k19K25j08K69j93j71J07J55j6l5J5O8M6m4J22l94L79m59K97n7J39
$$ -39 -92 39 -180 45 -63 206 13 -158 -51 104 88 53 68 136 182 138 260 -134 245 -214 83 26 165
6754A65j95O9Ok73J90l35J98L4K08K74l82K42l3l16m8J46J57j71L38k61J96k99
$$ 165 -30 39 45 -228 -38 -373 -175 -141 67 341 -41 201 168 -148 -196 -50 107 -64 274 13 209 -90
6776i0J32M5L1k16J88J09k50M47l79j47K19j15o5j61K99o0J3J29n3m4J8j96J36
$$ -90 42 87 118 -98 90 199 -51 396 17 -130 89 -26 -91 -252 47 -13 0 129 76 32 50 -146 -10
6799a0J83l69M77m10N2j3J75p5n6M09l03k49K18K17n6R5k82l83O71l30L61k75
$$ -10 173 -196 281 -129 -77 -90 85 10 -46 363 60 -189 29 246 190 285 3 -380 291 -39 322 47
6821D7j54j4K0J56k5l2L5%k96K07J59q8M5o3m4j87K98n5M3J81m00J45j98j4K15
$$ 47 -107 -121 -101 55 30 -2 33 33 -263 -56 103 15 60 -3 -47 -234 64 9 52 233 -167 -22 -220 -234 -19
6846a9mP8P2J41qm44J91J28k40J31m5j95j67J68K75n3J01J37l46L54j91q7k59
$$ -19 -23 55 127 268 260 -184 7 135 -105 26 -19 -214 -381 -213 62 9 110 247 -99 255 64 -23 -282
6869b82K74J32n43L97J34l2n2k3J5K57l43O4P3k82K01p0K37r5j47K77m33L52l32
$$ -282 -8 124 -419 -22 112 80 28 5 20 277 -66 -2 71 -211 -10 -80 157 62 -85 192 -241 111 -221
6892b21Q2m1L80Q3j68j12N0p3J19l2r2k9r3K58q9K2qN2n0k24K45m2l6j05p6O9
$$ -221 -139 -180 200 283 115 3 53 -20 99 67 -25 -54 -147 111 22 44 36 88 38 -186 59 17 -19 -124 -200 -131
6918a31J97p0J00O0j97j64JK11j24K44Rj62K22j74L80l97K5O2j28P5J98n5j61
$$ -131 66 -4 96 156 -41 -205 -204 7 -117 127 136 -26 196 22 402 5 30 92 -36 39 237 182 21
6941B1P7n3M1k66L10j25Q8j64L9l6K71k36k17L40p0l2q6L25r2o6k32Q7Q5p3R0
$$ 21 98 45 86 -180 130 5 93 -71 -32 -68 203 -33 -250 90 20 -12 -98 227 135 69 -163 -76 9 -64 26
6966B6K55m84K05k8K8j87Q8J40L2j44K12k05Kp5r8J84P7P8l02J52O7K0o5k62K23
$$ 26 281 -203 2 -26 2 -185 -97 43 75 -69 143 -62 -60 -135 -233 -49 28 106 -196 -44 23 43 -22 -284 -61
6991f1K25k37L85k58j23L7K8K60r9l28L05p7K6k08J08L4P0p9J96j15k85J20o9
$$ -61 164 -73 312 54 -69 -32 -4 256 157 -171 134 57 83 -125 -17 17 87 8 204 89 -196 -76 -145
7014a45k51L57j89J15K28j04Q9k94M1J70J38l96K3M88k81J19j09o2K38lN6l44
$$ -145 -396 -39 -228 -113 115 11 100 -194 -153 17 155 -241 -218 270 -11 108 -1 -63 175 172 228 -116
7036a16j48L43j20j60M28k23J5P0k47K49K51k63k94J6J76K44k89p1J53p8j29J51
$$ -116 -264 79 -41 -201 227 4 19 89 -158 91 342 79 -215 -199 -23 221 -68 -139 14 -64 -193 -42
7058d2J3J34k17K66k23O9P5j52j85K63j2K37m24K27K89j30q3k63K83j53j2k68
$$ -42 -29 105 -112 154 -69 0 75 -77 -262 1 -11 226 -198 29 318 188 105 -158 125 -28 -40 -308
7080c08K36j76K04m0J02q6R6k31J0L99k45J03l0r4j8M9j51K3L56k29P3L18k68
$$ -308 -72 -248 -44 -84 18 -68 28 -203 -193 206 -39 64 34 -60 -78 -29 -180 -157 199 -30 43 361 93
7103I3j42j27J29j20J94k46N68m31J70J08m61N06k45K08o9q9l21L30j23j14K70
$$ 93 -49 -176 -47 -167 27 -219 349 -82 88 196 -265 241 -4 204 135 46 -275 55 -68 -182 88
7124H8J49l24r2M69l41r8M93k69P9k29J2L98j95J05q7l4j80N3J3J41m30L79p9
$$ 88 237 -87 -179 290 -51 -149 344 75 154 -75 -63 335 140 245 158 124 -56 -3 10 151 -279 100 21
7147B1J13l78K27j79K10L4P9k50N4J16Jk70K30N5k27L48n9k36K37j04j91R0K81
$$ 21 134 -244 -17 -196 14 48 127 -123 -69 47 48 -222 8 63 -164 184 125 -111 126 22 -169 -79 202
7170B02j46j91J12m7p6j03M4R6R4k35O0R3K50m1j00j71P1J09Q4j39P8k20M0L6
$$ 202 56 -135 -23 -70 -146 -249 -205 -109 -15 -250 -190 -97 153 112 12 -159 -88 21 105 -34 44 -176 -136 -100
7194a00N6j56m8L47J35k96q5K09j42J67m82J28M49k60J15j68K2R3J4j83L9K29
$$ -100 -44 -200 -248 99 234 -62 -147 62 -80 87 -395 -267 182 -78 37 -131 -109 -16 -2 -185 -146 83
7216H3P5k51K28j26q6J92k20r6L31O0j46k4l04k1K07P4J16o0j24K76k00k83M13
$$ 83 158 -93 135 9 -77 115 -105 -201 130 190 44 20 -284 -305 -98 -24 92 32 -92 184 -16 -299 114
7239A14l3R3J6j86j57J05k5K12J74k10j30j58j58K41J80o2K76k69M7L30j38l72
$$ 114 81 174 190 4 -153 -48 -73 139 313 103 -27 -185 -343 -102 78 16 292 23 70 400 262 -110
7261a10J18J03m05N84k70n2Mj52K10L2L00N3n44J15k31j3K29J56l0k37K5k9K08
$$ -110 8 111 -294 290 20 -32 -28 -180 30 62 362 415 -129 -14 -245 -258 -29 127 97 -140 -115 -144 64
7284F4l1Q3m9j21K57l93J84J14m3m9j67J61O44p81k41M26J68k61k06K78K8m6j78
$$ 64 33 116 67 -54 203 -190 -6 108 65 16 -151 10 654 -127 -368 58 226 -35 -241 37 65 19 -159
7307a59O9J70J3j03j46J36J10o6Q1l56J38O0K5J17k86J61j78K34m43N23l06K1
$$ -159 -90 80 93 -10 -156 -20 90 24 105 -251 -113 -53 -28 89 -197 -36 -214 20 -423 100 -206 -185
7329a85PJ47o8QK39l95M79l88L06r6k67M0J7L86j12k26J23J70nl7j72on4J44L34
$$ -185 -178 -31 -99 -91 148 -247 232 -156 150 54 -213 -173 -156 230 118 -108 15 185 180 143 -29 -35 -89 55 389
7354C89n16k5J85k4J17k20O8p0K86j06j04n1p1J33Ok00K07L6j14L1P8J56r3M2
$$ 389 -127 -152 33 9 126 -94 -26 -96 190 84 -20 -71 -142 -9 -3 -203 4 40 -74 -43 35 191 98 140
7378A40k26p8j9K12o0Q5r9J44J66m27m8K89j9j25L47j47j42K0q7P2o9M9J17k76
$$ 140 -86 -164 -183 29 -31 54 -45 99 265 -162 -210 79 60 -65 282 135 -7 13 -74 -2 -71 -22 95 -181
7402a81M41j42k56J12J04n9N1m4m7K3JQ5n4L3k47J19L05k98m6O1j36j01M01j35
$$ -181 260 118 -138 -26 78 19 70 26 -21 2 3 88 34 67 -180 -61 244 -54 -100 -39 -175 -276 125 -10
7426a0Pn3K17jl69j1L9K14j81J47k15R4L4O9O8J15k71N0J37j94n6K32k95M19j22
$$ -10 -3 -56 161 160 -209 -220 -181 33 -148 -1 -216 -122 -88 -19 49 164 -107 -57 80 -114 -170 62 -233 186 64
7451F4J92l29J78K75m15J27l4k83P5N23m34J50L9K3m8k31J06j97m4K50j30M93
$$ 64 256 -73 105 380 -35 92 58 -225 -150 373 -61 89 128 151 103 -128 -22 -219 -263 -13 -143 350
7473C50m38J18%l2J12k56L26J75j33J46k52o6j51J72P2l11O24n78J60n7j26M67
$$ 350 -88 30 30 -2 110 -146 180 355 222 368 116 50 -101 71 143 -168 456 -122 38 -19 -145 322
7495C22n20J59k28L34k9M6olnl18K60j28j10L37M8j03j4o3N7k10j78K81j1K3K40
$$ 322 -198 -39 -267 67 38 84 78 75 70 -248 12 -116 -226 111 159 56 42 -21 36 -174 -352 -71 -82 -59 181
7520A81l01j59K79m8lK64k06K47k89R9k23K18J46J31j07l32J07J65o5r7K16m36
$$ 181 -120 -279 0 -48 -51 213 7 254 -35 64 -159 59 205 336 229 -103 4 169 104 7 223 -213
7542b13L19m18Q4L99l84L71m85L00Kj44K53O8o0M6j98j4K20k98L50k89L4J88k75
$$ -213 106 -312 -228 171 -213 158 -327 -27 -25 -169 84 152 92 138 -60 -74 146 -152 198 -91 -57 131 -144
7565a44J50n8M8LK06r7p4l41K37J11K8l0L62n12J71p9OJ71J7m72L59q0j66P7J03
$$ -144 6 -52 -4 -1 205 108 34 -307 -70 41 69 39 401 -111 60 -19 -13 158 175 -297 62 -18 -184 -107 -4
7590dJ45K8L46m67j84J32q2J37J84k01j25Q4P0J18k52R6O0r5k72N17p4M0o9nr0
$$ -4 141 169 515 48 -136 -4 -86 51 235 34 -91 -7 63 181 -71 25 85 -10 -282 235 161 201 132 127 37
7615C7l5L4n9j71K28k8O6K9j69M39m79N1j50Q7J26n6P6q4K13l86L35j85J64J5
$$ 37 2 36 -23 -194 34 6 72 101 -68 371 -108 -57 -207 -120 6 -50 26 -58 155 -231 104 -81 83 98
7639I8k49L25N4j77o0m9o8K30k8R3k44j32M2O2J04Q1k28J6J13R2L9k36j30L32
$$ 98 -151 174 228 51 -9 -58 -126 104 76 169 -75 -207 -165 -103 1 82 -146 -130 -17 75 114 -122 -252 80
7663H0o9j60L33l83P6J45j7J06j57P1L6K6k59K77J2j20j42J21m0M4J70j20j71
$$ 80 11 -149 184 -199 -123 22 5 111 -46 25 61 87 -172 105 117 -3 -145 -24 -64 -20 150 30 -141
7686a41L39k5k21K39k77L53m79K87l02L59j78K23k03Q8l33K61K14j81J24p9j72
$$ -141 198 173 -48 191 -86 267 -212 75 -227 132 -46 177 -26 62 -271 -10 204 23 147 68 -104
7707a04P1L1k0j78J5K71j40K35k68k53M10J94k78K53j36j23J38K76m8o51J98J96
$$ -104 -33 -2 -22 -200 -185 86 -54 181 -87 -340 70 264 -14 239 103 -20 118 394 346 -305 -107 89
7729H9K78j72N6M5P0m28RL84l59O2j29O8J94k11j15p5L32J59l14Q6L5l32kL91
$$ 89 367 195 251 296 366 -62 -53 331 -28 34 -95 -27 167 -44 -159 -234 98 257 -57 29 64 -268 -270 121
7753A21j73J83k9k43l9L15n1j24m4r4K39J6l79L96j72K39k3q6Q8k03p6Q6k21K57
$$ 121 -52 131 102 -141 -180 135 84 -40 -84 -178 61 77 -302 94 -78 161 138 52 140 -63 -139 -53 -274 -17
7777a7K5P0j64O1J3Q1l00L3J68K3o3%j00K25R1k32L25k47K63k66j68J94k88M06
$$ -17 8 78 -86 -25 -12 69 -231 -198 -30 -7 -70 -70 -170 55 146 -86 239 -8 255 -11 -179 15 -273 133
7801A33kL3l04J57k29J49m0K25k03K19J62m88K50k14N6J97j46J32k69J64J71k06
$$ 133 131 164 -140 17 -212 -63 -103 122 -81 138 300 -188 62 -152 -96 101 -45 87 -182 -18 153 -53
7823e3L3p9R4L99l92M7J27o4k58J1j5M9K32k07m5J39P1k15L3o6K63qq2J89k37
$$ -53 -20 -99 -5 394 2 49 176 112 -146 -135 -150 -101 131 -76 -121 18 89 -126 -93 -159 104 96 14 203 -34
7848c4k79L36j90J76J7j86K49l55L83K57n21J00K29j81K16l10K24m33J42N7n5
$$ -34 -313 23 -167 9 26 -160 89 -266 117 374 -147 -47 182 1 217 -93 131 -302 -160 -103 -158
7869a58N8K85k23K8J34j16j00J84J15k93j44J16Q0j68K71j20R0Q3l8l58KL51j15
$$ -158 -100 185 -38 -10 124 8 -92 92 207 -86 -230 -114 -34 -202 69 -51 39 122 84 -274 -272 79 -36
7892c6K86p8k98L35j56m6K9j43K3L9J01m00M53j90P0r6J11k1O5M9j30j9J94O6
$$ -36 250 172 -126 209 53 7 36 -107 -84 -45 56 -344 109 -81 -11 -107 4 -17 48 97 -33 -52 142 208
7916B08k57K19J07r6q7j57r5J8L16l01K37j1j82K00j1k83L93l37j42M26m9l2k35
$$ 208 -49 170 277 181 94 -63 -158 -140 176 -125 112 101 -81 119 108 -175 218 -119 -261 165 116 84 -151
7939a51K34J69l32L9M5j76J18j06R7L38l41l9K42k99L40n1o2R0l51L43Q7l73J00
$$ -151 83 252 -80 -41 4 -172 -54 -160 -63 275 -66 -105 137 -162 178 127 65 155 -196 147 234 -139 -39
7962c9k10L76J44j74n7k53L53R7k39j09K9L03m27J19J81o3ol0l6K67m29j8K05
$$ -39 -249 127 271 97 40 -213 140 237 -2 -111 -82 221 -206 -87 94 31 25 -5 -41 226 -203 -221 -16
7985a6q0K51k57K7OJ09J76m20Q1J42j46Q8n3O6L1n1k02L39N3l17K65p2k4r4N4
$$ -16 -96 155 -102 -75 -69 40 216 -204 -123 19 -127 -39 -92 -26 5 -46 -248 91 144 -173 92 20 -4 -98 -44
8010d4K04L7l06J55K1L56m43K1J24k11J24Nl7j48L13j44J17j43J98k0J17n81L03
$$ -44 160 197 -109 46 67 423 -20 1 125 -86 38 43 6 -142 171 27 144 1 199 179 296 -285 18
8033A8j62M8J52j53M34l23Kk7j27K37R8m42M61jj7k09k43K22K6r1n9m1K57j44
$$ 18 -144 -96 56 -97 337 14 16 -11 -138 99 197 -245 216 215 198 -11 -254 -32 -6 -97 -156 -197 60 -84
8057h4J89n8j39J37o6J61k76k3O6nj02J90n7K21K9o8k49J98L33m20N8O1j04K18
$$ -84 105 47 -92 45 -21 140 -136 -159 -93 -98 -200 -10 -67 154 183 115 -134 64 397 -23 35 96 -8 210
8081B10j54K5j21K8J34l44M83j55l8j92oJ25J59m34K56J71q1J57n07K87Q9p4j53
$$ 210 56 81 -40 -12 122 -222 261 106 68 -124 -130 -5 154 -280 -24 147 66 223 -284 3 92 18 -135
8104a35J50J04p0pL1j26J69k90K83j15K24k74j69j19N26m02K86l85J13L82o7l3
$$ -135 15 119 49 42 73 -53 116 -174 109 -6 218 -56 -225 -344 182 -220 66 -319 -206 176 109 76
8126G6O5j61J4Oj45L65m16K52n0K15k24k37M38j89j47L23k47n4L29n18M97j85
$$ 76 141 -20 -6 0 -145 220 -196 56 6 221 -3 -240 198 9 -138 185 -62 -116 213 -305 192 7
8148Gj97J71J62k48j65J49R9K55k52j08J26j33N0j79N0L64l23L93j26J31k72k81
$$ 7 -190 -19 143 -105 -270 -121 -22 233 -19 -127 -1 -134 -84 -263 -213 151 -172 221 95 226 -46 -327
8170c27L79r5n2L21k43J74j32R4K3m4j33k01J91K72k94N0M44m44J00p5r6
$$ -327 52 -43 -95 226 -17 157 25 119 142 98 -35 -236 -45 227 -67 -17 427 -17 83 8 -88
8191h8
$$ Imaginary data points
##PAGE= N=2
##DATA TABLE= (X++(I..I)), XYDATA
0@%%%%QqQj6J6k4M0m8N6p2Q4j00J21j43J70k04K40k75L19l68M21m86N58o34P22
$$ 0 0 0 0 0 8 0 8 -8 8 -16 24 -24 32 -40 44 -56 65 -78 92 -112 128 -147 172 -196 225 -261 297 -337 385
29C85q16R16j033J160j296J449j617J801k002K219k460K729l021L342l703M101
$$ 385 -431 485 -548 612 -684 765 -852 949 -1053 1166 -1294 1435 -1586 1756 -1947 2154
45B154m544N049n618O267p023P907q959J0241j1838J3896j6673K0631k6779L7758
$$ 2154 -2390 2659 -2959 3308 -3715 4192 -4767 5474 -6364 7532 -9141 11490 -15289 22469
59B2469o3367K31239J45789m04424j69445R7898L28825J53130j17651k96672j36038
$$ 22469 -40898 190341 336130 -68294 -237739 -139841 188984 342114 224463 -72209 -208247
70b08247J24990K80103J29322j31523k88357j54301J11676K83794J63661j13080
$$ -208247 -83257 196846 326168 194645 -93712 -248013 -136337 147457 311118 198038
80A98038k93092j68370J19414K87546J40681j55419k96334j20020J76981K88891
$$ 198038 -95054 -263424 -144010 143536 284217 128798 -167536 -287556 -110575 178316
90A78316R1735j95828k83392q4476J84660K58804P5932j69462k39110p3923J57557
$$ 178316 270051 74223 -209169 -293645 -108985 149819 225751 56289 -182821 -256744 -99187
101i9187K29126O7296j69248k43752o7997J90357K67934P1676k05211k77228o4440
$$ -99187 129939 197235 27987 -215765 -283762 -93405 174529 246205 40994 -236234 -300674
112c00674K12014K64648M0163k18525k39305p398K28778K24648p401k28291k20256
$$ -300674 -88660 175988 216151 -2374 -241679 -249077 -20299 204349 196948 -31343 -251599
123b51599O14K15897K20098J5541j99103k18534k2457J97420K19500J6578k11733
$$ -251599 -250985 -35088 185010 200551 1448 -217086 -239543 -42123 177377 193955 -17778
134a7778k24943q50K32661K27637j6073k45563k19415L0264K43101K02110l8706
$$ -17778 -242721 -243571 -10910 216727 200654 -44909 -264324 -234060 9041 211151 172445
145A72445k26072j77040M5864K10320J61062m5607k01922j57064M6129K09669
$$ 172445 -53627 -230667 -184803 25517 186579 140972 -60950 -218014 -171885 37784
155C7784J71435l8212k13952j76812M2206K22507J76178n2775k23439j54173Q1659
$$ 37784 209219 171007 -42945 -219757 -177551 44956 221134 168359 -55080 -209253 -127594
166a27594K34880J39860r8793k32618j23432J08360K26711J19103r8110k07664
$$ -127594 107286 247146 148353 -84265 -207697 -99337 127374 246477 148367 -59297
176e9297j09868R1909J99356J09838q9705k02559j12513R7101K17355J16978j08402
$$ -59297 -169165 -77256 122100 231938 142233 -60326 -172839 -75738 141617 258595 150193
187A50193k31784j18464J18883K33313J04987j31731k28704q8919J35413K11502
$$ 150193 -81591 -200055 -81172 152141 257128 125397 -103307 -192226 -56813 154689
197A54689O8002j41882k04519o4176J33980J95233O3954j29769j98474p6105J18407
$$ 154689 222691 80809 -123710 -187886 -53906 141327 205281 75512 -122962 -199067 -80660
208h0660J95594P5369j24493k01621p1311J35625K02850N5701j54357k06011m3844
$$ -80660 114934 190303 65810 -135811 -207122 -71497 131353 187054 32697 -173314 -217158
219b17158J61857J97376L1381j59677j81879k1825J51845J65703J6479j45093
$$ -217158 -55301 142075 173456 13779 -168100 -189925 -38080 127623 144102 -991
229i91j58291j3638J45907J63243J8782j48597j70220j8248J56531J75935J4515
$$ -991 -159282 -172920 -27013 136230 155012 6415 -163805 -182053 -25522 150413 164928
240A64928j62895j70357Q55J72620J62440j7211j77403j50769L0081J77590J43407
$$ 164928 2033 -168324 -167469 5151 167591 150380 -27023 -177792 -147711 29879 173286
251A73286l2721j70289j37482K7909J60950J34283k3812j57621j34710K4126J61973
$$ 173286 140565 -29724 -167206 -139297 21653 155936 132124 -25497 -160207 -136081 25892
262B5892J37794l0668j74941j42427L8818J82914J39112m7688j84008j28876N5403
$$ 25892 163686 133018 -41923 -184350 -145532 37382 176494 128806 -55202 -184078 -128675
273a28675J76915J13864o2706j69231j02183O6062J64251R9726o2144j61225j02195
$$ -128675 48240 162104 99398 -69833 -172016 -105954 58297 158023 95879 -65346 -167541
284a67541N7780J62422J06922n5198j62047j04101O3462J68507R8943p5219j71111
$$ -167541 -109761 52661 159583 104385 -57662 -161763 -98301 70206 169149 93930 -77181
295g7181q8234Q9475J74549Q0765r2996j67823p0919R2828J58436O4720q8435
$$ -77181 -165415 -75940 98609 179374 86378 -81445 -152364 -59536 98900 163620 75185
306G5185j48919n9267Q7907J47867O0087r1267j53687o3185R4696J59947O3630
$$ 75185 -73734 -133001 -45094 102773 162860 71593 -82094 -145279 -50583 109364 172994
317A72994j01157j63346n8351J05691J58432M4819j14691j54081l4317J17915
$$ 172994 71837 -91509 -149860 -44169 114263 159082 44391 -109690 -144007 -26092
327b6092J46557K5832j19282j44093k7525J12107J38719K8462j08113j37654l0376
$$ -26092 120465 146297 27015 -117078 -144603 -32496 106223 134685 26572 -111082 -141458
338a41458J07469J37318K6243j15761j41108k0951J24645J43388J4433j30028
$$ -141458 -33989 103329 129572 13811 -127297 -148248 -23603 119785 134218 4190
348D190j40195o198J29778J31638p9j25845j20127P395J23479J15298q225j22232
$$ 4190 -136005 -142203 -12425 119213 119134 -6711 -126838 -119443 4036 119334 111109 -11123
360a1123j14006Q252J23346J17808m761j23832j18348P845J27756J16933j5226
$$ -11123 -125129 -116877 6469 124277 119516 -4316 -122664 -114819 12937 129870 114644
371A14644j32197j11437K6092J36801J05778l3950j38099j00235L7489J32816
$$ 114644 -17553 -128990 -102898 33903 139681 105731 -32368 -132603 -95114 37702
381C7702R3869l6932j28145r0125L5480J24004Q7324l7603j26643q9508L9446
$$ 37702 131571 94639 -33506 -123631 -88151 35853 123177 85574 -41069 -130577 -91131
392i1131J30733R0371m4502j36127q9167M9173J36491Q2808n6335j34965p3773
$$ -91131 39602 129973 85471 -50656 -139823 -90650 45841 128649 72314 -62651 -136424
403a36424O1118J31482O6770o3932j27632o2444O3994J25332O2315o1148j23225
$$ -136424 -75306 56176 122946 59014 -68618 -131062 -67068 58264 120579 59431 -63794
414f3794o1791O1885J24741O2640o4064j26376n8708P1601J29943N4978p7043
$$ -63794 -125585 -63700 61041 123681 59617 -66759 -125467 -53866 76077 131055 54012
425E4012j28750m7187Q2410J26395M1628q3501j20681l5937Q3209J16533L3181
$$ 54012 -74738 -121925 -39515 86880 128508 45007 -75674 -111611 -28402 88131 121312
436A21312q1495j13849l3142Q0870J13918L2486q2802j16179l2151Q6455J16877
$$ 121312 39817 -74032 -107174 -26304 87614 120100 37298 -78881 -111032 -24577 92300
447I2300K7025r2152j17520k2594R4623J13944J5414r7779j09893j0244R5723
$$ 92300 119325 27173 -90347 -112941 -18318 95626 111040 13261 -96632 -106876 -11153
458a1153J03346O246r5839j00636n588R3967R9066N944r4436j00595n662R5881
$$ -11153 92193 98439 2600 -98036 -103624 -9657 89409 95353 917 -99678 -105340 -9459
470i459J00709L025r8767r9436L712J03139R7076r852j06022r2121J5625J07102
$$ -9459 91250 94275 -4492 -103928 -100216 2923 99999 90147 -15875 -107996 -92371 14731
482A4731Q8499j7239j03156q3774J9392J00728Q1147j9375r9477p8838K1490J02090
$$ 14731 103230 85991 -17165 -100939 -81547 19181 100328 80953 -18524 -97362 -75872 26218
494B6218Q0392k3112j05288q1278K6283J08337P9637l0655j08671p4669L4971
$$ 26218 106610 83498 -21790 -103068 -76785 31552 111189 80534 -28137 -102806 -67835
505f7835J07425O8267m1390j06367o3527M2935J04671O0955m3099j03673o1932
$$ -67835 39590 107857 66467 -39900 -103427 -60492 44179 105134 62035 -41638 -103570
516a03570M0501J01262O0658m1434j01719n9194M4548J03253N5476n0554j06367
$$ -103570 -63069 38193 98851 57417 -44302 -103496 -58948 44305 99781 49227 -57140
527e7140n3097N4906J07271M9439n7260j04215m4990N8385R9905M0154n8617r5791
$$ -57140 -110237 -55331 51940 101379 44119 -60096 -105086 -46701 53204 93358 34741 -61050
539f1050l5899O0914R5780L4857o0794r6191l5464O2002R9051L6117o3292r7990
$$ -61050 -96949 -36035 59745 94602 33808 -62383 -97847 -35845 63206 99323 36031 -61959
551f1959l1582O7307R7514K5668p2081r4765j9548P5570R3892J7228p6257r1875
$$ -61959 -93541 -26234 71280 96948 24867 -69898 -89446 -13876 80016 97244 20987 -70888
563g0888j5750P4263Q8035J4510p2408q6070j3423P3249Q5919J0478p7654q7836
$$ -70888 -86638 -12375 75660 90170 17762 -68308 -81731 -8482 77437 87915 10261 -77575
575g7575r609Q0041Q8768O916q2769q7828l598Q2284Q2799j838q3110p8309N768
$$ -77575 -87184 -7143 81625 88541 5772 -82056 -85654 -3370 79429 77591 -5519 -83828 -78060
588g8060Q2769P5290q180q2832p4520P741Q1887P4620p225q1244p3409R264Q2480
$$ -78060 4709 79999 71819 -11013 -85533 -77792 4095 78715 71490 -9754 -83163 -73899 8581
601H581P1367j3175q4648o8747J8877Q8486O7395k1724q8816o4630K4324Q7829
$$ 8581 79948 66773 -17875 -86622 -67745 20741 88136 66412 -22404 -87034 -62710 25119
613B5119O0800k5541q4532n6206K8135Q3593N4144k9863q4388n4431L1669Q6363
$$ 25119 85919 60378 -24154 -80360 -52225 31368 85512 55649 -28739 -83170 -51501 34862
625C4862N4975l2702q7505n4174L4206Q7628N0626l8907q8045m6590M2520Q7447
$$ 34862 89837 57135 -30370 -84544 -50338 37290 87916 49009 -39036 -85626 -43106 44341
637D4341M2545m5597q7495m1613M5788Q5270L9719m5019q4078l8757M4705Q2429
$$ 44341 86886 41289 -46206 -87819 -42031 43239 82958 37939 -46139 -84896 -40191 42238
649D2238L6093m6721q3147l4921M9864Q4722L3520n2795q5191l1808N3959Q4546
$$ 42238 78331 31610 -51537 -86458 -36594 48128 81648 28853 -56338 -88146 -34187 50359
661E0359K8568n4728q0968k2947N6516P8100J9938n7494p6588j7970N8246P7666
$$ 50359 78927 24199 -56769 -79716 -23200 54900 74838 17344 -59244 -77214 -18968 58698
673E8698J8340n7327p6176j7386N8576P5164J5642o0490p4098j0877O4404P3549
$$ 58698 77038 19711 -56465 -73851 -15275 59889 75531 15041 -59057 -69934 -5530 68019
685F8019P653o6819p3211m955O7545P1599L255o7166o8684j260O6349O5509j873
$$ 68019 75672 8853 -64358 -69313 -1768 69831 73086 5920 -62764 -64024 2325 67834 65961
698F5961o7134o4603L308O8505O5330m382p1317o6520M749P0874O5108o583p1817
$$ 65961 -1173 -65776 -62468 6037 71367 66985 -4332 -70852 -66103 4771 69879 63296 -8521
711h521o2725J0965P2063N8757j4727p3480n7929J7176P4152N6529j6756p2807
$$ -8521 -71246 -60281 11782 70539 55812 -17668 -75597 -58421 15731 72260 55504 -17303
723a7303n5261J6787P0909N3294j8568p0261n0541K1960P2084M9486k4005p4105
$$ -17303 -72564 -55777 15132 68426 49858 -20403 -70944 -48984 23100 72586 48581 -25524
735b5524m9141K6012P5421M7939k7141p3332m4574K9395P1842M0073l2241p1053
$$ -25524 -74665 -48653 26768 74707 47566 -25766 -70340 -40945 30897 70970 38729 -32324
747c2324l7106L5178P1708L5949l5824p2589l6333L5555P1340L5500l6304p0697
$$ -32324 -69430 -34252 37456 73405 37581 -35008 -71341 -35786 35554 71054 34750 -35947
759c5947l2448L8996O9494K8613m2956p1635k6712M5526P2087K6372m6200p1975
$$ -35947 -68395 -29399 40095 68708 25752 -45883 -72595 -27069 45018 71390 25190 -46785
771d6785k5257M5265O8565K2287m6451o6386j8524M8121O6616J6768n0505o7947
$$ -46785 -72042 -26777 41788 64075 17624 -48762 -67286 -19165 47451 64219 13714 -54233
783e4233j6811N1425O8056J7322n0661o6202j4687N1237O4014J1111n3188o1776
$$ -54233 -71044 -19619 48437 65759 15098 -51104 -65791 -14554 49460 60571 7383 -54393
795e4393p295N5863O2756O074n6539o2105n660N5698O0964N184n3945n7932j936
$$ -54393 -61688 -5825 56931 63005 6466 -55639 -61299 -5601 55363 60547 6602 -51330 -53266
808e3266N5092N5523j592n6769n5433L348N9623N6555m252o0401n5512M370N9599
$$ -53266 1826 57349 55757 -1012 -56445 -53097 6526 63081 58829 -1572 -57084 -52714 6885
821F885N2378p667n9211m9153J1209O0409M7371j4383o2865m7503J4777O2417
$$ 6885 59263 51596 -7615 -56768 -45559 14850 62221 47838 -15027 -62530 -47753 14664
833A4664M7553j4586o1775m6356J6068O0037M2988j8492o1397m0768K1214O3324
$$ 14664 62217 47631 -14144 -60500 -44432 15605 58593 40101 -21296 -62064 -40850 22474
845B2474M1006k3669o4494m0886K3929O3816L9229k3851o1602l6117K5954O1094
$$ 22474 63480 39811 -24683 -65569 -41640 22176 61405 37554 -24048 -60165 -34211 26883
857B6883L2904k8437o1349l1479L0170O2782L2052l0527o2391l1175L0217O0737
$$ 26883 59787 31350 -29999 -61478 -31308 31474 63526 32999 -29392 -60567 -30350 30387
869C0387K9685l1891n9078k6224L4428N9745K2922l7004o0199k2612L7974O0340
$$ 30387 60072 28181 -30897 -57121 -22693 37052 59974 22970 -37229 -59841 -21867 38473
881C8473K1471l7819n8863j9782L7899N6289J6816l9740n5570j5034M1746N5962
$$ 38473 59944 22125 -36738 -56520 -18621 37668 54484 14744 -40826 -55860 -14114 41848
893D1848J3603m3470n6853j3121M3376N6018J1647m3414n4737r264M4892N2564
$$ 41848 55451 11981 -44872 -57993 -14617 41401 53048 9634 -45103 -54367 -9475 43089
905D3089O540m6890n2348m494M8821N2134L782m8523n1462l224M8065N0017K054
$$ 43089 49629 2739 -49609 -54103 -5282 46852 50634 2111 -49351 -52575 -4510 45507 47561
918D7561m7854m7821P76M8795M7525k393n0220m6889L721N1312M7301m414n1057
$$ 47561 -293 -48114 -47338 1457 48982 46589 -3631 -50520 -46799 4513 51814 47400 -3657
931c657m5327N985N0856M3127p947n0865m1226J0450N1967M0153j2177n1874m0130
$$ -3657 -48984 -42999 7857 50984 43037 -7828 -49054 -38604 13363 53516 41339 -10535 -50665
944e0665J2221N2048L8930j3144n1277l7344J4883N1084L5216j7217n1878l4505
$$ -50665 -38444 13604 52534 39390 -11887 -49231 -34348 16736 51952 34735 -17143 -51648
956e1648J8810N2759L3416k0163n3326l2220K0569N2554L0362k2229n1396k8583
$$ -51648 -32838 19921 53337 33174 -20152 -52372 -31803 20751 51113 28884 -22512 -51095
968e1095K3696N1254K6853k5255n1534k6481K5965N2255K6032k6696n1561k4554
$$ -51095 -27399 23855 50708 25453 -26081 -52562 -26597 25658 51690 24994 -26567 -51121
980e1121K7211N1553K2267k8916n0237k0933L0874N1109J8936l1578n0586j8154
$$ -51121 -23910 27643 49910 20994 -29243 -50176 -19302 31807 50743 19165 -31421 -49575
992d9575L2447M9919J6726l2171m8703j5359L3147M7623J3625l4578m7308j2406
$$ -49575 -17128 32791 49517 17346 -31357 -46716 -13569 34054 47679 13101 -34207 -46613
1004d6613L5412M7599J1062l6070m7506j0736L7198M6143Q597l7936m4748o697
$$ -46613 -11201 36398 47460 11390 -36116 -46852 -9654 36489 45086 7150 -37598 -44295
1016d4295L8766M3499M355l9449m3715l527L9754M3127K712l9990m2074j791L9787
$$ -44295 -5529 37970 42325 2876 -40839 -44366 -4612 38515 41227 1237 -40837 -42628 -2841
1029b841M0947M26m0954l9702J587M1803L9523k954m2779l9135M226M3448L8008
$$ -2841 38106 38532 -2422 -42124 -40537 1266 40789 37835 -4944 -44079 -39853 3595 41603
1042D1603n060m2483l6681O866M3105L4824q089m3150l3685R674M3840L3662j0115
$$ 41603 36543 -5940 -42621 -35755 7350 42174 34085 -9065 -42750 -33076 10764 44426 34311
1055C4311m4178l2985J1018M3431L2403j1666m3589l0532J3530M3555K9861j5142
$$ 34311 -9867 -42852 -31834 11597 44000 32334 -11255 -41787 -28257 15298 45159 30017
1067C0017m4409k8835J6433M4578K7883j7134m4431k6518J7407M3546K4785j9008
$$ 30017 -14392 -43227 -26794 17784 45667 28533 -15898 -42416 -25009 18537 43322 24314
1079B4314m3052k3493J9975M3203K2131k0798m3879k2056K1589M3591K0972k1877
$$ 24314 -18738 -42231 -22256 20947 43078 22280 -21599 -43655 -22066 21525 42497 20620
1091B0620m3089k0260K3831M2045J8005k4966m2012j6674K6057M1979J6083k6730
$$ 20620 -22469 -42729 -18898 23147 41152 16186 -25826 -42500 -16443 25536 41619 14889
1103A4889m1718j5090K6977M0986J4017k7039m0327j2360K8061L9909J1170k9085
$$ 14889 -26829 -41919 -14942 26044 40061 13022 -27305 -39665 -11604 28305 39475 10390
1115A0390l9875j0445L0365M0183R077l0642l9415p800L0699L8537O328l1334
$$ 10390 -29485 -39930 -9565 30618 39695 9053 -30362 -38162 -7463 31074 37402 6068
1127F068l7336m873L2432L6389L860l3050l6405l146L3161L5919K483l3372l5240
$$ 6068 -31268 -36141 -3709 32680 36540 3490 -32915 -36061 -2900 33019 35502 2130 -33110
1140c3110j577L3587L4538l47l4181l3864J306L5276L3179k378l6100l2455L360
$$ -33110 -34687 -1100 33438 33091 -1090 -34954 -33648 1628 34807 32429 -3671 -36126 -32766
1153c2766L5816L1509m510l5526l0085N498L5726K9249o627l5993k8435P251L6531
$$ -32766 3050 34559 30049 -5477 -35562 -30064 5662 34911 28284 -7709 -36144 -28893 7638
1166G638K8460q234l6338k7836R292L6580K6799j0120l6482k5884J1445L6990
$$ 7638 36098 27864 -8474 -36310 -27018 9562 36361 26241 -10241 -36125 -24680 12310
1178A2310K4825j2804l6790k3775J3716L6893K2903j4236l6619k1454J4496L6194
$$ 12310 37135 24331 -12459 -36234 -22518 14375 37278 23042 -13577 -35031 -20535 15659
1190A5659K0990j5949l5679j9999J6102L6088J9372j7408l6153j8720J8245L6423
$$ 15659 36649 20700 -14979 -34978 -18876 17212 36584 19176 -16977 -35697 -17452 18971
1202A8971J7366j9470l6144j6556K0292L5961J4703k0969l5429j3647K1232L5014
$$ 18971 36337 16867 -19277 -35833 -15541 20420 35123 14154 -21275 -34922 -13690 21324
1214B1324J2787k2423l4513j2344K2705L4621J1400k2871l4213j1007K3585L3927
$$ 21324 34111 11688 -22825 -35169 -12464 22157 33557 10686 -23527 -34534 -10949 22978
1226B2978R981k4053l4013q455K4963L3781P347k5848l3432n829K6489L2010N754
$$ 22978 32959 8906 -25107 -33562 -8599 25182 32529 6681 -26751 -32580 -6091 25919 31673
1239C1673k6673l1681m298K6755L0423L822k6488l0341k878K7293L0302K178k8133
$$ 31673 5000 -26681 -30979 -4224 26199 30021 3533 -26808 -29686 -2393 27909 30087 1954
1252A954l0048j542K8630K9422N25k8943k8400P86K9257K7610k203k9726k6757
$$ 1954 -28094 -29636 -1006 28416 28941 -2 -28402 -27616 1641 29251 27048 -2678 -29435
1265b9435L212L0049K5871l778k9930k5564M078K9402K5647m781l0201k4293O128
$$ -29435 -26223 3826 29697 25919 -4011 -29575 -25497 3905 29552 24771 -5430 -29723 -23595
1278b3595L0051K3859p108l0951k3811Q420L1358K3110q996l1476k1653R645L0781
$$ -23595 6456 30315 23207 -7744 -31555 -23135 8223 31333 22337 -9139 -30792 -21147 9634
1291I634K0625j0089l0698j9813J1425L0875J9249j2127l0708j9145J2163L0951
$$ 9634 30259 20170 -10528 -30341 -18916 11959 31208 19081 -11627 -30772 -18609 12342
1303A2342J8682j2508l0833j7689J3511L0528J6416j4168l1160j5538J5870L0863
$$ 12342 31024 18516 -12317 -30006 -16495 14033 30449 16281 -14879 -30417 -14547 16316
1315A6316J4797j6287l0795j3823J6204L0160J2836j6553k9591j2118J7403K9121
$$ 16316 31113 14826 -15969 -29792 -13588 16572 29408 12855 -16736 -28854 -11451 17670
1327A7670J1654j8225k9565j1108J8890K9112J0438j9035k9519r681K0140K8720
$$ 17670 29324 11099 -18466 -29574 -10684 18428 28866 9831 -19688 -29369 -9229 19491
1339A9491Q350k0740k8048p426K1533K7851N943k1878k7457n470K2017K6962N574
$$ 19491 27841 7101 -20947 -28373 -6840 21011 26954 5076 -22381 -27851 -5834 21128 26702
1352B6702k2128k6959m315K2199K6574L717k3356k6120k674K4141K6130J946k4357
$$ 26702 4574 -22385 -26700 -4501 22073 25790 2434 -23686 -26360 -2219 23911 25857 1500
1365A500k5635j259K4371K4963P79k4438k4124L95K4514K3545j495k4620k2793
$$ 1500 -24135 -25394 -1023 23940 24719 281 -23843 -23448 1066 24611 23116 -1504 -24297
1378b4297J572K4977K3093k400k5297k2235K958K4932K1899l527k5863k1324N033
$$ -24297 -22725 2252 25345 22945 -2352 -24587 -21629 3303 25202 21675 -4188 -25512 -20479
1391b0479K6350K0354n796k6644j9725O771K6077J9237p364k5652j8449P547K5342
$$ -20479 5871 26225 20429 -6215 -25940 -19169 6908 26145 18781 -6871 -25320 -17773 7569
1404G569J7816q166k5695j7475R016K5951J7453r828k6396j6816J0187K6634J5899
$$ 7569 25385 17219 -8476 -25951 -16935 9016 26469 16641 -9755 -26571 -16384 10250 26149
1417B6149j0678k6287j5148J1634K6458J3923j2295k6582j3347J3342K6275J2562
$$ 26149 15471 -10816 -25964 -14330 12128 26051 13756 -12826 -26173 -12831 13444 26006
1429B6006j3433k5613j2432J3550K5427J1628j3875k5573j0788J4612K5780J0569
$$ 26006 12573 -13040 -25472 -11922 13505 25133 11258 -14315 -25103 -10491 15289 25858
1441B5858j5400k5985r937J5686K6072Q918j6788k4397q427J6569K4497P286j7372
$$ 25858 10458 -15527 -25464 -9778 16294 25212 8424 -15973 -24400 -7831 16666 23952 6580
1454F580k4110o277J7660K3673O200j7940k4180n225J7989K3425M875j8227k2894
$$ 6580 -17530 -23807 -6147 17526 23726 5786 -18394 -23619 -5630 17795 22670 4443 -18451
1467a8451m578J9186K2795L313j9969k2629k177K0378K2146J905k0387k1875j396
$$ -18451 -23029 -3843 18952 22265 2296 -20333 -22510 -2132 20014 21919 1532 -20343 -21739
1480b1739K0578K1198M35k0327k0812K60K1090K0285q07k1346k0404J334K1651
$$ -21739 -1161 20037 20472 145 -20667 -20407 683 20968 20161 -1185 -21589 -20255 1396
1493A396K0022j434k1458j9592K008K2012J8630l445k1956j8009M209K2363J7995
$$ 1396 21418 19984 -1474 -21066 -19058 2954 21584 18139 -3817 -21826 -17617 4746 22741
1506B2741m878k2693j7360N256K1775J7193n125k2436j6395O487K2438J5253p309
$$ 22741 17863 -4830 -22190 -16934 4841 22034 16909 -5527 -21922 -15435 7003 22256 14947
1519A4947k2000j5641P404K3126J4919p919k2975j4453Q170K2461J4132r379k2395
$$ 14947 -7053 -22694 -15290 7836 22755 14836 -8139 -22592 -14422 8039 22171 12792 -9603
1532i603j2735J0313K2128J2434j1106k2485j1689J0868K2786J1176j0768k2106
$$ -9603 -22338 -12025 10103 22537 11431 -11054 -22743 -11875 10911 22087 11319 -10787
1544a0787j1193J1572K1717J0146j2280k1794r329J2877K2352R208j3584k2218
$$ -10787 -21980 -10408 11309 21455 9175 -12619 -21948 -9071 13281 22489 8905 -13313
1556a3313q794J3718K1808Q259j3746k1292p318J4496K0471O471j4864k1003n498
$$ -13313 -22107 -8389 13419 21678 7932 -13360 -20678 -6182 14289 20760 5896 -15107 -20605
1569b0605J5050K1005N982j5672k0619n540J5259K0532M536j5911j9929l395J6502
$$ -20605 -5555 15450 21432 5760 -14859 -20399 -5140 15392 19928 4017 -15912 -19307 -2805
1582b805J9742K930j7284j9935k259J7408J9602J646j6936j8775j595J6941J8496
$$ -2805 16937 19867 2583 -17352 -19611 -2203 17399 19045 2109 -16666 -18261 -1320 17176
1595A7176N10j7251j8053K2J8139J8000j002j8209j7674Q07J8017J7589j133j8377
$$ 17176 17686 435 -17618 -17596 543 18543 17541 -668 -18342 -17535 482 18071 16938 -1439
1609a439j6782K245J8423J5956k992j8959j5614L608J9557J5256m029j9280j5220
$$ -1439 -18221 -15976 2447 18403 15411 -3548 -19162 -15554 4003 19259 15230 -4050 -19270
1622a9270M518J8639J4675m581j9020j3630N405J9070J3542o213j9704j3109O411
$$ -19270 -14752 3887 18562 13981 -5039 -18669 -13264 5806 19348 13135 -6569 -19678 -13267
1635a3267J9754J3091p148j9615j2179P439J9378J1432q052j9189j0682Q350J9532
$$ -13267 6487 19578 12430 -7185 -19364 -11925 7453 18885 10833 -8356 -19038 -10688 8844
1648H844J0590r193j9244j0286R020J9316R837r055j9521r269J0123J9150Q225
$$ 8844 19434 10241 -9003 -19289 -10269 9047 18884 9829 -9692 -18961 -8838 10312 18537
1661A8537j0243j9457q118J1425J8932P965j1524j9168o990J1105J8883O600j1478
$$ 18537 8294 -11163 -19281 -7856 11076 19041 7517 -11651 -18641 -7536 11347 17947 6469
1674F469j8397n689J2093J8214N161j2873j7725n060J2940J8030M814j3173j7513
$$ 6469 -11928 -17617 -5524 12690 17851 4978 -12747 -17807 -4867 13163 17977 4804 -12709
1687a2709m721J3620J7124M003j4012j6963k914J4550J6658K363j4696j6875j802
$$ -12709 -17430 -3810 13314 17317 3305 -13658 -16572 -2022 14636 16999 2303 -14572 -16374
1700a6374J4655J6453J542j4551j6066j221J4593J6022M32j5388j5526L19J5351
$$ -16374 -1719 14734 16276 1725 -14341 -15562 -969 15053 15485 97 -15429 -15110 241
1713B41J5538l30j5931j5569J083J6045J4815j851j5852j4337K282J6230J3681
$$ 241 15779 15449 -482 -16051 -14968 1077 15892 14041 -1811 -16148 -13866 2364 16045
1726A6045k651j6380j3450L167J6160J2916k562j6852j2567L624J6049J2146l767
$$ 16045 13394 -2986 -16436 -13269 2891 15807 13245 -3607 -16174 -12550 3499 15645 11878
1739A1878j6201j2268M757J6932J1654n455j7017j1468N970J6911J0680o008j6618
$$ 11878 -4323 -16591 -11834 5098 16752 11297 -5720 -17188 -11218 5693 16373 10365 -6253
1752f253j0119O031J6678R961o653j6804r789P725J6633Q818p365j6488r010Q027
$$ -6253 -16372 -10341 6337 16298 9645 -7159 -16948 -9223 7410 16228 8863 -7625 -16635 -8608
1766h608J6433Q650q276j6422q118Q766J6320P287r241j6150p016R699J6252O408
$$ -8608 7825 16475 8199 -8223 -16341 -7575 8745 16032 6791 -9359 -16375 -6676 9576 15984
1780A5984r689j6173n900R738J5976N773j0408j5489n195J0625J5510M765j0786
$$ 15984 6295 -9878 -15778 -6040 9936 15709 5301 -10188 -15383 -4758 10752 15517 4731
1793D731j5874m066J1052J5492M056j1579j5203l431J1874J5001K586j2125j4534
$$ 4731 -11143 -15209 -4157 11335 15391 3812 -11391 -14822 -2948 12053 14639 2514 -12020
1806a2020k153J2399J4192J707j2304j4210j472J2554J3471J807j2781j3527q18
$$ -12020 -14173 -1774 12418 14125 1821 -12389 -13861 -1307 12164 13971 1190 -12337 -13155
1819a3155J2562J3680J58j2988j3617L16J3496J3198o33j3437j2980J072J3520
$$ -13155 -593 13087 13245 257 -13360 -13044 452 13650 13017 -420 -13400 -12328 1192
1832A192J2260j292j3900j2020K080J3979J1488k163j4249j1138K320J4148J1255
$$ 1192 13452 12160 -1740 -13760 -11680 2299 13787 11624 -2625 -13763 -11443 2705 13960
1845A3960k836j4184j0793L098J4401J0392m096j3969j0212M178J4462J0012n016
$$ 13960 11124 -3060 -13853 -10755 3646 14038 9942 -4027 -14239 -10061 4401 14413 9397
1858I397j4038r778N254J4286Q650n171j4180q425N531J4299Q322o500j3781q212
$$ 9397 -4641 -14419 -9165 5121 13771 8600 -5580 -14005 -8474 5825 14147 7647 -6134 -14346
1872a4346O485J4158P790o369j4509p493O855J4432O934p495j4129o171P400J4396
$$ -14346 -7861 6297 14087 7718 -6791 -14284 -7429 7003 13937 6442 -7687 -13858 -6458 7938
1886G938N944q070j4106n886Q383J3910N239q304j3591n019Q590J3262N050r254
$$ 7938 13882 5812 -8294 -14180 -5797 8113 13352 5048 -8543 -13562 -4972 8290 13340 4086
1900D086j2993m300R335J3088M028r456j3333l663R548J3491L185j0155j2942
$$ 4086 -8907 -13207 -3872 9216 13244 3788 -9545 -13208 -3660 9831 13016 2861 -10081
1913a0081k458R970J2813K393j0466j2539j744J0466J1879K021j0807j1842j326
$$ -10081 -12539 -2569 10244 12637 2171 -10368 -12112 -1646 10233 12254 1447 -10395 -11721
1926a1721J0622J1842J183j0888j1970k5J0712J1557N5j1530j1616Q22J1375J1050
$$ -11721 -1099 10743 11926 1038 -10932 -10957 -245 11312 11367 -163 -11779 -10957 418 11468
1940A1468m55j1881j0478R25J1571J0613j332j1901r669J434J1892R498j882j1952
$$ 11468 11013 -868 -11346 -10421 1150 11763 10431 -1470 -11139 -9705 2187 11685 9803 -2149
1954b149r561J957J2268R481k361j2247r322L021J2217R162l782j2369q459M018
$$ -2149 -11710 -9753 2515 11996 9635 -2612 -11934 -8913 3304 12466 8684 -3685 -12144 -8126
1968h126J2074Q413m395j2094p958M314J2208P484m229j2323p286M786J2039P193
$$ -8126 3948 12361 7966 -4128 -12086 -7772 4436 11920 7691 -4632 -11918 -7132 4907 12100
1982A2100n150j1980p140N405J2408O395n668j2322o295N991J2445O123o726j2485
$$ 12100 6950 -5030 -12170 -6765 5643 12038 6370 -5952 -12247 -6256 6189 12312 5586 -6899
1996f899m882O557J2031M896p280j1220m995P161J1409M916p229j1777m842P838
$$ -6899 -11781 -5224 6807 11703 4423 -6797 -11792 -4631 6778 11694 4465 -7312 -12154 -4316
2010d316J1721L696p410j1563l443P684J1817L123q377j1536k661Q399J1332K408
$$ -4316 7405 11101 3691 -7872 -11315 -3631 8186 11309 2932 -8604 -11265 -2866 8466 10874
2024A0874q383j0955k500R040J0451J990q833j0483j857R348J0311J577r448j0326
$$ 10874 2491 -8464 -10964 -1924 8527 10517 1684 -8799 -10656 -1308 9003 10580 1132 -9194
2038i194j365R451J0429J054r712j0102j75R398R740Rr521r858N93R958Q828n44
$$ -9194 -10559 -1108 9321 10375 663 -9439 -9614 -216 9524 9533 12 -9846 -9253 705 9533 8989
2054H989r348r478R75R435R307q95j0311q648J344J0174Q809j807j0486q404K110
$$ 8989 -359 -9837 -8862 573 9880 8985 -1326 -9974 -8630 1544 10353 8546 -1940 -10344 -8234
2069h234J0683Q104k400j0691p882K599J0659P635l070j0200p390L192J0162P307
$$ -8234 2449 10553 8153 -2538 -10420 -7821 2838 10473 7403 -2797 -10187 -6995 3167 10474
2083A0474l494j0183o993L235J0678P075m258j0426o373L883J0733O048m348j0719
$$ 10474 6980 -3203 -10196 -6961 3717 10792 6534 -3892 -10265 -6382 4351 10399 6051 -4668
2097d668n923N125J0507N542n379j0231n152N025J0198M970n317r797m887N288
$$ -4668 -10591 -5466 5041 10583 5204 -5027 -10179 -5154 5044 10014 4697 -5100 -9987 -4699
2111d699J0341M336n460j0255m492N938J0223M188o230j0014m088O444J0359L144
$$ -4699 5642 9978 4518 -5737 -10229 -4291 5932 10120 3890 -6124 -10212 -3768 6591 9735
2125I735o247r886l279O522R956K813p058r680k771P475R381K643p435r146k596
$$ 9735 3488 -6398 -9677 -3155 6801 9614 2556 -7124 -9895 -2420 6961 9604 2169 -6977 -9573
2140i573P624R418J894p428r391j602P767R324R91p977q908r37P887Q739Q09q008
$$ -9573 -1949 7469 9363 1935 -7456 -9058 -1291 8033 9024 1047 -7861 -8798 -911 7828 8637 629
2156F29q678n74P911Q845j08p793q260k13Q183Q594m73q402q182J92Q827P933
$$ 629 -8049 -8623 -712 8133 8025 232 -8028 -8241 -58 8536 8063 -339 -8521 -8329 498 8431
2172H431p22q744p652J067Q910P492j502q854o976J283R151O851j963q167p680
$$ 8431 7709 -1035 -8687 -7620 1290 8782 7280 -1574 -8550 -7267 1884 8735 6772 -1395 -9075
2187i075K210Q772O715j980q733o800K518R263O379l208r098o263L497R028N849
$$ -9075 -6865 1907 8622 6642 -2091 -8891 -6373 2890 9269 6061 -3037 -9300 -5803 3225 9074
2202I074l150r448n367L257R279N324l810q783n468L829R118N356m233q806n153
$$ 9074 5924 -3524 -8891 -5634 3645 8969 5159 -3624 -9092 -5263 3855 9211 4978 -3828 -8981
2217h981M340Q790M787m507r064m199M793Q698L975m897q746l994N334Q891L367
$$ -8981 -4641 4149 8936 4429 -4635 -8834 -4041 4657 8632 3735 -5011 -9005 -3671 5220 8587
2232H587m886q782l551N096Q717L129n217q693l041N797Q710K675n924q817k132
$$ 8587 3701 -5081 -8632 -3536 5181 8310 3093 -5600 -8641 -2844 5866 8541 2617 -6200 -8332
2247h332N831Q368K546o121q537j938O283Q317J694o650p863j558O291Q613J065
$$ -8332 -2501 5867 8413 2292 -6245 -8183 -1900 6417 8111 1461 -6402 -7960 -1669 6944 8009
2262H009o621p845j145O543P714R03o460q185p92P499P470L76p427p388j03P620
$$ 8009 1388 -6457 -7602 -1059 6655 7558 1098 -7087 -7879 -380 7090 7466 39 -7349 -7452 168
2278A68O870j1p249p214M81P465O682n31p238o406L45P347O883j058p581o531
$$ 168 7038 7027 -222 -7436 -6955 510 7192 6661 -577 -6983 -6638 709 7592 6534 -1047 -7578
2294g578J000P534O841j425p952o384K008P631O105j949q121n386K233P770N422
$$ -7578 -6578 956 7797 6372 -1580 -7964 -5956 1675 7780 5831 -2290 -7676 -5443 2327 7749
2309G749k163p904n515K301P860N630k504p970n071K650P849N090k976q042n121
$$ 7749 5586 -2318 -7833 -5532 2328 7958 5454 -2516 -7587 -4937 2912 8002 5026 -3016 -8137
2324h137L470Q525M462l684p945m548L809P834L996l889p631l716L601P804L892
$$ -8137 -4667 3858 8320 4636 -3309 -7857 -4048 3786 7782 3893 -3738 -7454 -3853 3951 7843
2339G843m091p686m018M341P733L549m448p873l092M457Q055L123m865q031k812
$$ 7843 3752 -3934 -7952 -3611 4122 7671 3223 -4650 -7742 -3285 4770 7893 3028 -5003 -7815
2354g815N448P492K377n109p619k052N029P151K114m643p570j951N049P079K339
$$ -7815 -2367 5125 7502 2393 -5226 -7278 -2249 4902 7016 2373 -5197 -7148 -2099 4980 7319
2369G319n649p337j790N835P495J590o130p315j286O157P236P48o088o802m67
$$ 7319 1670 -5667 -7457 -1622 5873 7463 1333 -5982 -7268 -1111 6125 6873 785 -6017 -6484
2384f484O378O159K65n783o550k74O266O106M48o593n957n07O625O130R0o849
$$ -6484 -106 6053 6318 535 -6015 -6289 -23 6083 6531 -62 -6019 -6526 99 6229 6319 -530
2400e30o073N43O724O226n97p467n670J051O984N438j356o248n609J254O587N089
$$ -530 -6603 -6060 664 6890 6293 -1174 -6844 -5793 1191 6629 5273 -975 -6584 -5330 1257 6346
2416F346j271o343n442J366O695N467j721o739n398J892P155N069k147p174n022
$$ 6346 5075 -1268 -6710 -5344 1351 6818 5097 -1642 -7040 -5148 2007 7076 4929 -2245 -7267
2431g267K817P204M296k655p135m245L027P057L514k932o133m022K476O675M121
$$ -7267 -4450 2754 7050 4395 -2740 -6985 -3958 3099 6613 3681 -2452 -6474 -3998 2677 6798
2446F798k890o813l893L141O897L659l071p609l558L851P315L033l981o872k854
$$ 6798 3908 -2905 -6798 -3657 3240 6899 3828 -3781 -7339 -3488 3827 6860 2879 -3993 -6847
2461f847M163O832K306m393o244j923L912O298K362m133o291k406L775O755K509
$$ -6847 -2684 4148 6454 2061 -4183 -6106 -2194 4104 6466 2333 -3958 -6364 -2589 4166 6675
2476F675m354o725k421M800O923J465m816o962r39N048O502Q56n159n987p11N147
$$ 6675 2321 -4404 -6825 -2025 4898 6363 1547 -5415 -6354 -1306 5196 6052 893 -5094 -5805 -658
2492f58N621M36m523o134l12M846O032O53n267o288o17N702N979N50n499o244
$$ -658 4963 5399 876 -5258 -5570 -724 5308 5961 694 -5594 -6211 -509 5470 6020 521 -5723
2508e723L4N995N698k99n992n797J090N591N205p14n764m851N27N755M772n91
$$ -5723 -5689 306 6004 5705 -287 -6084 -4994 597 5802 5088 -676 -5527 -5000 755 5527 4936
2524D936n594m879M49O051M994q70o237m963J315O168M713j671o476m259K009
$$ 4936 -658 -5537 -5088 963 5957 5087 -1150 -6113 -4798 1370 6083 4412 -2064 -6323 -4314
2539d314O512M232k564o181l596K290N565L700j746n811m237K088O112M090k518
$$ -4314 2198 6430 3866 -2315 -5911 -3621 1944 5644 3898 -1913 -6150 -4062 2050 6140 3622
2554C622n894l668K308O407L379k595o406l291L033O370K635l174o029k672L461
$$ 3622 -2272 -5940 -3632 2775 6154 3559 -2847 -6138 -3105 3265 5900 2726 -3303 -5975 -2514
2569b514N842K590l318o022k436L281N686K626l042n991k638L710N699K715m190
$$ -2514 3328 5918 2600 -3422 -5858 -2577 3109 5735 2693 -3298 -5936 -2226 3473 6188 1998
2584A998n997k173M376N898K042m758n965j140M339N771J040m654m803j115M079
$$ 1998 -3999 -6172 -1796 4102 6144 1386 -4579 -5719 -1380 4391 5431 777 -4026 -5141 -1062
2599a062M827J321m020n022j121L980N110J256m268n751r87M864N990L22n078
$$ -1062 3765 5086 1066 -3956 -5077 -1097 4013 5269 1001 -4750 -5737 -873 5117 5439 361
2614C61n422j47N157M955m17m633m585O0M987M249k29m719m321L56M693M636j1
$$ 361 -5061 -5208 -51 4904 4487 -146 -4731 -4671 316 4565 4336 -383 -4704 -4348 345 4981 4970
2631D970n263m427L31M707N068j050n569m027J077N602M116j452n573l599J375
$$ 4970 -293 -4720 -4389 318 5386 4336 -1233 -5260 -4183 1419 5535 4083 -1490 -5089 -3714
2646c714N193L660j568n221l382J647M884L059q74n085l948J657N151L961j905
$$ -3714 1479 5139 3571 -1650 -5032 -3385 1499 4558 3684 -1401 -5349 -3692 1459 5420 3515
2661C515n614l502K304N444L480k685n237l057K706N202K467k419m983k510K432
$$ 3515 -2099 -5601 -3297 2147 5627 2942 -2295 -5352 -2646 2556 5023 2604 -2379 -4889 -2457
2676b457M784K454k073n228k807K872M887K601k602n080k499K981N363K216l579
$$ -2457 2327 4781 2708 -2520 -5327 -2455 2432 5033 2431 -2649 -5148 -2167 3196 5412 1833
2691A833n177j852L412M966K015l427n243j499L409M954J497l348m770j489L361
$$ 1833 -3344 -5196 -1784 3182 5197 1770 -3473 -4972 -1563 3391 4888 1540 -3230 -4719 -1358
2706a358N184Q76l156m943j434L636M898J163l592n043q74M054M549O97m460m286
$$ -1358 3826 4702 1546 -3397 -4831 -1195 3703 4866 1274 -3769 -4643 -589 3960 4657 197 -4089
2722d089k98M069M488J53m178l981l67L868M288J13l837m404k3M344L992km100
$$ -4089 -4387 -318 4170 4323 145 -3836 -4203 -335 3953 4066 229 -4175 -4198 146 4138 4136 36
2739C6m499K39M835L895o76m435m078Q77M801L512r48m644l100Q20M183L527q43
$$ 36 -4463 -4224 611 4506 3830 -605 -4683 -3806 995 4507 3559 -1085 -4185 -3365 818 4345 3502
2756C502m636l227R31M098L606q95m671k948P91M689L394j268m815l033J447N022
$$ 3502 -1134 -4361 -3430 668 4274 3379 -1292 -4240 -3449 1240 4634 3366 -1449 -4482 -3035 1987
2772A987K652j616m909k694J805M772K499j552m502k922K354M107K352k147m218
$$ 1987 4639 3023 -1886 -4580 -2775 1997 4496 2944 -1558 -4480 -2126 1981 4333 2186 -2032
2787b032k501K046M831K254k271m613k300K442M528K108k377n064j538K672M488
$$ -2032 -4533 -2487 2344 4598 2327 -2286 -4586 -2144 2384 4492 2115 -2949 -4487 -1815 2673
2802B673J599k498m580j508L013L634J935k570m431j617K772M370J682l123m383
$$ 2673 4272 1774 -2806 -4314 -1301 2333 4268 1698 -2733 -4350 -1578 2792 4474 1351 -3032
2817c032j278K946M537R07l006m262o68K874M359O00l271l508q75L228L684Q55
$$ -3032 -4310 -1364 3173 4080 1074 -3188 -3856 -982 3377 3977 706 -2802 -3677 -449 3235 4090
2833D090l545l882n54L550L607N67l351l878j60L055M131L25l771l984K3L842
$$ 4090 545 -3337 -3891 -341 3266 3833 482 -3396 -3556 -501 3630 3955 184 -3800 -3777 65
2849F5L643n65l672k998J36L603L572l28l772l438O35L250L694n27l606l448N31
$$ 65 3708 3143 -529 -3527 -3391 212 3784 3456 -316 -3754 -3119 131 3825 3298 -308 -3756 -3225
2866c225L603L478q31l815k834M13M171K834j032l842k820J148M106K381j289
$$ -3225 378 3856 3025 -790 -3624 -3211 960 3794 2762 -1080 -3900 -2752 1354 3735 2446
2881B446l825k436J503L680K560j630l575k612J254L946K457j471l722k642K132
$$ 2446 -1379 -3815 -2312 1368 3928 2298 -1277 -3889 -2635 1311 3768 2297 -1425 -4067 -1935
2896a935L701K077j911l686j992J739L847J792j627m115j917K336L517J914k100
$$ -1935 1766 3843 1932 -1754 -3746 -2007 1840 3632 2005 -2110 -4027 -1691 1826 3740 1640
2911A640l838j509J833M007J239j811l829j805K260M059J501k060m261j438K529
$$ 1640 -2198 -3707 -1874 2133 3372 1561 -2268 -4073 -1813 2246 3747 1687 -2574 -4012 -1483
2926a483M044J102k716l549q97K400L761O99k429l557r72K670L593P60k585l641
$$ -1483 2561 3663 947 -2602 -3499 -1099 2662 3361 932 -2625 -3597 -927 2666 3426 841 -2800
2942b800j089L325L358P11l037l408n52L062L554K66l222k781m42K744L399N6
$$ -2800 -3889 -564 2794 3505 468 -2940 -3492 -430 3124 3390 168 -2613 -3055 -311 3088 3144
2958C144l146k767l44L067L159J28l303l029K00K944L043o6l052k886l20L401
$$ 3144 -2 -2769 -3113 -46 3113 3241 -62 -3091 -2891 53 3096 3030 -22 -2908 -3228 173
2974A73K889k32l238k970R44L371K025n10l032k650Q49K846K731o52l187k511
$$ 173 3062 2830 -408 -3378 -2434 937 2962 2452 -580 -3230 -2381 465 3196 2544 -643 -3154
2990c154Q27L540J696l27l316k305J035K959K604j230l376k465J316L507K119
$$ -3154 -2327 1213 2909 2582 -734 -3039 -2004 955 3559 2329 -1047 -3512 -2196 1311 3430
3005C430j335l381j878J090L322J840j361l111j928J599L240J269j139l142j606
$$ 3430 2095 -1286 -3164 -2074 1248 3088 1727 -1384 -3312 -1713 1527 2796 1657 -1485 -3091
3020c091J252L353J856j806l131j670J657L563J488j996l493j207K058K958J291
$$ -3091 -1839 1514 3370 1564 -1567 -3237 -1580 1983 3471 1475 -2018 -3225 -1167 1791 3082
3035C082k025l008j379K123L100J033j944l161q91K119L168J128k245l292j108
$$ 3082 1057 -1951 -3330 -1207 1893 2926 982 -2179 -3070 -951 2217 3345 1100 -2192 -3300
3050c300K398K986J149k466l192n37K411L113L78k426k936n21K365K927L05k062
$$ -3300 -902 2084 3233 767 -2425 -2962 -551 2562 2940 514 -2422 -2943 -578 2349 2654 592
3066E92l343N4K173K891J87k315k956N4K204L190K61l012k719R0K423L001q9k882
$$ 592 -2751 -2697 -524 2367 2554 239 -2717 -2663 -459 2731 2992 -20 -2739 -2649 -226 2775 2686 -196
3084a96k333J73K686K346j40l109k139J57K901K097N3k769k367P8L040K353n46
$$ -196 -2529 -2356 330 2676 2536 -573 -2712 -2555 346 2443 2496 -273 -2640 -2562 478 2831 2285
3101B285k771k140M13K751K328p16l218j998J020K894J879q98k728k064R12K949
$$ 2285 -486 -2626 -2213 538 2866 2150 -1068 -3066 -2046 848 2727 1829 -899 -2963 -2051 898
3117H98J956j136k833j556J004K593J650j059k764j740J247K829J730j157l029
$$ 898 2854 1718 -1115 -2671 -1667 926 2576 1517 -1247 -2987 -1740 1089 2819 1662 -1367
3132a367j316J360K874J360j526k677j587J535K663J054j118k731j086J458K466
$$ -1367 -2683 -1323 1551 2911 1385 -1292 -2879 -1344 1319 2373 1255 -1476 -2562 -1104 1362
3147A362J226j476k645j420J854K620J160j547k906j155J915K881J041j825l185
$$ 1362 2588 1112 -1533 -2953 -1099 1521 2681 1134 -1772 -2927 -1012 1869 2910 1085 -2100
3162b100n82K145K509P70j991k520p36J721K528O95j822k471o61J955K388N89
$$ -2100 -2682 -537 1972 2742 751 -1769 -2505 -784 1744 2439 617 -1854 -2515 -560 1828 2417
3178B417j850k458p18K142K702K72k282k640J37K089K631L65k687k418j10K372
$$ 2417 567 -1891 -2609 -467 2235 2507 225 -2415 -2278 -189 2442 2807 120 -2298 -2408 -36
3194c6K236J77k374k258J18K134K143k66k073j985r9K702K043r4k653k116k3K834
$$ -36 2200 2377 3 -2255 -2137 -3 2140 1874 -199 -2184 -2283 419 2462 2368 -285 -2401 -2424 410
3212D10K297p53k337k250Q55K205J899m42k242j706K7K477K146p45k357j888M23
$$ 410 2707 1954 -383 -2633 -1778 427 2326 1884 -358 -2064 -2037 440 2586 1841 -516 -2404 -1981
3229a981K892J401m09k706j399M63K488J813j175k789j168J264K220J593j214
$$ -1981 911 2312 1903 -803 -2202 -1739 749 2562 1387 -1402 -2570 -1306 914 2507 1293
3244A293k403j348J233K228J284q99k377j646J214K522J068p34k461j344J283
$$ 1293 -1110 -2458 -1225 1003 2287 1388 -989 -2635 -1421 1101 2169 1435 -1026 -2370 -1087
3259a087K265J246j116k843r38J436K298J234j728k270j048J626K425Q47j710
$$ -1087 1178 2424 1308 -1535 -2473 -1037 1261 2495 767 -1503 -2551 -925 1500 2347 637
3274F37k378m65J523K149Q08j667k509n73J759K362Q71k027k211p39J714K369
$$ 637 -1741 -2206 -683 1466 2274 607 -1902 -2475 -716 1646 2517 490 -1721 -2460 -746 1623
3290A623P27j749k568k9J823K341K72k212k058m60K045K247k1j940j852m78K376
$$ 1623 2350 601 -1967 -1996 -173 2168 2440 228 -1830 -2290 -245 2002 1981 41 -1811 -2289 87
3307H7K141J5k121j994j69J799K039K35k075j921r0K242J857K5k045k073K90K129
$$ 87 2228 2243 122 -1872 -2041 -242 1797 2032 -43 -1964 -2054 188 2045 2070 25 -2048 -1758 371
3325C71J569J19k311k161O44J993K127n29k110j665L58J990J767l35j755k311
$$ 371 1940 2059 -252 -2413 -1769 224 2351 1822 -288 -1953 -1595 395 2162 1827 72 -2239
3341b239M76K436J440n36k565j468P79K193J514k45k354j613Q47K072J657q79
$$ -2239 -1763 673 2113 1577 -988 -2456 -1677 516 2030 1785 -569 -2182 -1335 737 2394 1515
3357A515k419j423J392J896J374j038k365p95P43K064J687j483k236j407J381
$$ 1515 -904 -2327 -935 961 2335 1297 -1068 -1863 -1120 944 2631 1148 -1088 -2495 -1114
3372a114K227R83p96k647o72J015K347Q78j575j827r41J227K048P16r85k268r33
$$ -1114 1113 2096 1300 -1347 -2019 -1004 1343 2221 646 -1181 -2122 -895 1153 1869 884 -1384 -2317
3389b317J672K135N62j218k243n54J465J961O97j608k145j87J392K112K42j690
$$ -2317 -645 1490 2052 834 -1409 -1963 -498 1463 2160 552 -1593 -1780 -388 1724 1966 276
3405B76k043j15J531J941L61j722k032k16J657K279M58k119j884l64J652K284
$$ 276 -1767 -1882 -351 1590 1951 229 -1803 -2019 -362 1917 2375 256 -1628 -1992 -340 1944
3421A944R7j819j841k97J980J779j27j588j904k4J859J747k30j739j760RK001
$$ 1944 2041 222 -1619 -1916 64 1843 1716 128 -1776 -1800 59 1806 1576 -163 -1923 -1914 87
3438H7J622k33j713j306j98J981J975q90j657j597J92K287J230m24k065j385O60
$$ 87 1709 1476 -237 -1543 -1741 240 2215 1325 -332 -1929 -1737 550 1780 1356 -709 -2094 -1434
3455a434J760J609n67j652j811M25K346J482q52j962j479J026J878J168q73j776
$$ -1434 326 1935 1368 -284 -2095 -1670 676 2158 1306 -656 -2135 -1109 769 1937 1064 -712
3471g12j210M48K355R11n55k037j137O54J961R86o63j967j145J182J689J019q13
$$ -712 -1922 -1474 881 1792 1237 -800 -1937 -1283 678 1664 1001 -966 -2111 -929 760 1779 966
3488I66k016j021J261J654J138j084j776p36J117J665P00j177j727r56J492J875
$$ 966 -1050 -2071 -810 844 1982 898 -878 -1614 -497 1168 1868 691 -1036 -1992 -500 1375
3504A375L89j030k297j83R39K096P13j243k197p73J834J923L21j317j863m15J251
$$ 1375 1764 734 -1563 -1746 -807 1289 2002 759 -1438 -2211 -377 1546 1867 550 -1313 -1728 -477
3521d77K062K58j362j901n06J706J355O01j728j405k56J488J750J71j562j606
$$ -477 1585 1843 481 -1420 -1926 -220 1135 1736 8 -1397 -1653 -165 1585 1756 194 -1412
3537a412r3J288J839Mj527j713J95J178K035k49j750j241j27J586J836l52j687
$$ -1412 -1505 -217 1622 1626 99 -1614 -1419 -241 1794 1545 -205 -1446 -1573 13 1849 1497 -190
3554a90j357o4J910J210J67k027j382L67J792J273m61j727j315N48J715J197n95
$$ -190 -1547 -1611 299 1509 1676 -351 -1733 -1366 426 1699 1238 -489 -1804 -1256 459 1656 1061
3571A061j646j109K99J869J100k71j956j082O50J831J174q66k031m62M36J914
$$ 1061 -585 -1694 -1395 474 1574 1303 -653 -1735 -1085 746 1920 1054 -977 -1439 -1003 911
3587I11Q12q99j738o86M05K154Q33q95j511r42O48J707N98q60j338j147J315J670
$$ 911 1723 824 -914 -1600 -1195 959 1792 897 -614 -1556 -908 799 1397 537 -801 -1948 -633 1037
3605A037P31p92j760o73P56J573O13o63j820q35J172J827O71j249j878k61O54
$$ 1037 1768 976 -784 -1457 -701 872 1485 822 -998 -1833 -661 1166 1837 588 -1290 -1551 -897
3622h97K294J90j135j637m20J219J673M20j426j499l42J066J782K00j281j488
$$ -897 1397 1587 452 -1185 -1605 -386 1287 1707 281 -1218 -1560 -494 1288 1488 207 -1281
3638a281k67J230J274L99j103j554k06J313J182P26j304j697l73J719J444o0j214
$$ -1281 -1548 -318 956 1355 252 -1302 -1508 -195 987 1713 409 -1288 -1661 58 1502 1442 228
3655B28j431q3J449J198k38j122j375q7J390J432K06j619j160J32J299J503j60
$$ 228 -1203 -1286 163 1361 1123 1 -1374 -1461 -71 1361 1567 -52 -1212 -1080 219 1722 1562
3672A562j895j189Q8J630J169n2j553j160L55J253R93j99j192j128J42J480J350
$$ 1562 -333 -1522 -1434 196 1365 1313 -240 -1400 -1045 208 1201 1002 -190 -1318 -1176 304 1654
3689A654q67j105j011k3J899R87n70j585q52L12J454J060o2j724j028N44J388
$$ 1654 787 -318 -1329 -1352 547 1534 964 -621 -1473 -1161 293 1353 1291 -433 -1461 -917 471
3706D71J011o21j430q29Q70J025Q29o54j360p88O34J415J089j048j369o26M62
$$ 471 1482 861 -569 -1398 -528 497 1326 672 -688 -1476 -842 573 1662 614 -755 -1381 -919
3723i19J824R11r58j639m81N31J430Q58j068j455q24J110J610N97j147j154m87
$$ -919 905 1816 858 -781 -1262 -731 699 1557 489 -966 -1790 -680 930 1527 380 -774 -1261
3740a261P22J405L01o30j216m48N93J465L42j123j100m79J106J197M11q97j527
$$ -1261 -539 866 1167 537 -679 -1127 -534 931 1273 150 -950 -1429 -323 874 1285 388 -1139
3757a139k60J016J492L8r81j310j25J085J477j64j151j331QJ125J638j66j374
$$ -1139 -1399 -383 1109 1147 166 -1144 -1269 -184 1293 1129 -22 -1353 -1345 -220 1418 1252 -122
3774a22j191M2J216J041N07j391j374K14P78J258J83j229q49n72J658J011j31
$$ -122 -1313 -1271 -55 986 1493 102 -1272 -1058 -280 978 1161 -68 -917 -1489 169 1180 1049
3791A049j166j034K80J441O82j61j226j002m1J582J144m36j332j084K53J489R90
$$ 1049 -117 -1151 -871 570 1252 1091 -135 -1137 -1178 404 1548 1112 -220 -1304 -1051 438 1428
3808A428n72j095j082N29J048R75m04j389o68L71J246R17k60j545p58O90J157
$$ 1428 856 -239 -1321 -792 256 1231 827 -562 -1230 -859 387 1304 1044 -501 -1259 -569 588
3825E88Q69p49j168q25O64J188P35n42j219r67O87J276O78l21j375o67N78J160
$$ 588 1457 708 -460 -1285 -621 567 1302 760 -459 -1426 -739 537 1215 894 -481 -1148 -570 590
3843E90O35p26j464j77M50J660M54j087j224j88P58P64O63o41j155l40O58J271
$$ 590 1225 499 -965 -1142 -692 968 1422 335 -889 -1077 -319 445 1108 467 -688 -1028 -370 901
3861I01J33q36p20j037Q03J464M50n41j372m46O85J477K8n95j372l63R50J381
$$ 901 1034 198 -522 -1559 -756 708 1158 617 -755 -1201 -516 961 989 394 -978 -1341 -391 990
3879I90M02q77j354n16R31J167M43j193r44k51J130R16K65r78j251j62J024J187
$$ 990 1392 515 -839 -1355 -424 743 1186 -7 -951 -1202 -72 844 1109 131 -1120 -1282 -258 929
3897I29K26j202j074j58J122J016n4p32p93m29J119J020K37j072q76k64J234J008
$$ 929 1155 -47 -1121 -1279 -157 859 805 73 -720 -1149 -30 990 1227 155 -721 -985 249 1257
3915A257k49j126j197J50J267R95l0j324q04L99Q37J069l44j190j073N17J263
$$ 1257 1008 -118 -1315 -1165 102 1097 1067 -257 -1061 -662 175 1244 900 -290 -1363 -846 417
3932D17Q51m44j056q94L22R67J070n60j275n22L49R95J050m51j203n73J80J493
$$ 417 1268 824 -232 -1126 -804 163 1233 673 -602 -1124 -775 220 1270 819 -384 -957 -777 716
3950G16P42q13j382m0P3J149O67k36r74j060N65J210M96m94j419n10P45J283M86
$$ 716 1458 645 -737 -777 -704 445 1112 876 -98 -1158 -593 617 1113 619 -800 -1310 -565 718 1204
3969A204o92j208n08R00P95N56o56r18o00P75Q69M59n98j218k71O67J368M2m44
$$ 1204 512 -696 -1204 -304 491 1047 391 -527 -1127 -352 517 976 378 -840 -1111 -444 924 966 522
3988E22j343m42R14J215L7l33j265k74O22Q91N72j014r07j95P45J077N44j259
$$ 522 -821 -1263 -349 866 903 570 -695 -969 -347 544 1116 102 -805 -1000 -255 822 1366 107
4006A07q45k35P78R80J65p70j022j89J292P61L45j222j143j57Q84J360J8j305
$$ 107 -738 -973 -195 785 950 180 -842 -1031 261 1022 1367 145 -998 -1155 -271 1089 1107 -198
4024a98p02k23J146Q13Mq93j030K17J056O39j09q15q98K11P81R52k02j158o40
$$ -198 -900 -1123 23 836 840 -53 -1083 -866 190 829 720 -95 -993 -782 -1 951 749 -409 -1049
4043a049M82L19J177J76j313j028M18J032R58m11r19r51K45J174Q30l52j551m09
$$ -1049 -567 -248 929 1105 -208 -1236 -818 214 1172 761 -158 -1109 -864 310 1140 788 -763 -1172
4061a172N83P67P74m40q36o43M57P22R03m38j080n01K77R80P10m58j115n35O27
$$ -1172 -589 178 952 512 -324 -967 -510 212 1115 677 -403 -904 -627 353 1063 605 -510 -1045 -418
4080d18R25M80m39j289k13N74Q11L84n87q99k16M41J314O5m70j014l89M17J087
$$ -418 507 987 548 -741 -954 -380 431 815 228 -671 -887 -446 868 933 463 -551 -940 -523 564
4099E64M45o63j008o97P89J013N20p88o88l84N91J027P1o13j006l53R61J076j76
$$ 564 1009 346 -662 -1359 -570 443 963 175 -513 -897 -306 721 792 179 -827 -1180 -219 857 681
4118F81l52j059o0M76P85N96p02j034r6O96P35p6m29j061L1R60O41J07n14j239
$$ 681 329 -730 -790 -314 471 1067 365 -669 -765 -69 666 590 161 -900 -869 91 732 839 325 -914
4138i14K52N48O89N13j092p65K09Q02P90l70o39q18J01Q48O21N3q04q57K64N93
$$ -914 -662 -114 575 1088 -4 -769 -560 242 1032 662 23 -795 -694 154 775 828 24 -833 -569 24
4158B4Q91nq89j075L94Q71N55P9q86q18J77R91N90l86q01p97K89J358J71q4r35
$$ 24 915 910 21 -1054 -660 211 766 845 -41 -859 -682 309 899 513 -288 -1085 -796 562 733 649 -286
4179b86o30N75N98O56l13r46l90M34P61M45m70q92k99K77P62N04m63q50m66P44
$$ -286 -916 -341 257 913 600 -346 -736 -302 459 904 434 -458 -757 -480 282 786 323 -527 -993 -249
$$ [...]
8191A76
##END NTUPLES=NMR FID
##END=
