##TITLE=1H_LR-696-C1
 CDCl3, 8 sc, 
 11.11.2019
##JCAMPDX= 6.0         $$ Bruker NMR JCAMP-DX V2.0
##DATA TYPE= NMR FID
##DATA CLASS= NTUPLES
##ORIGIN= UXNMR, Bruker Analytische Messtechnik GmbH
##OWNER= root
$$ XWIN-NMR		Version 3.5
$$ Mon Nov 11 16:11:23 2019 Russian Standard Time (UT+4h)  she@DPX200
##.OBSERVE FREQUENCY= 200.1315
##.OBSERVE NUCLEUS= ^1H
##.DELAY= (6, 6)
##.ACQUISITION MODE= SIMULTANEOUS
##.ACQUISITION SCHEME= undefined
##.AVERAGES= 8
##.DIGITISER RES= 18
##SPECTROMETER/DATA SYSTEM= spect
##.PULSE SEQUENCE= zg30
##.SOLVENT NAME= CDCl3
##.SHIFT REFERENCE= (INTERNAL, CDCl3, 0, 15.7039)
##AUDIT TRAIL= $$ (NUMBER, WHEN, WHO, WHERE, WHAT)
$$ ##TITLE= Audit trail, XWIN-NMR		Version 3.5
$$ ##JCAMPDX= 5.01
$$ ##ORIGIN= Bruker BioSpin GmbH
$$ ##OWNER= she
$$ F:/spectra/data/she/nmr/H-F/1/audita.txt
$$ ##AUDIT TRAIL=  $$ (NUMBER, WHEN, WHO, WHERE, WHAT)
(   1,<2019-11-11 16:10:33.04 +0400>,<she>,<DPX200>,
      <created by zg, POWCHK disabled, PULCHK disabled
       configuration hash MD5:
       00 E9 B6 7A A2 85 ED C7 34 08 36 98 17 FE 4E 26
       data hash MD5: 16K
       48 AE 60 2A DE 51 7E D1 D7 D5 8D 68 7E DD DC 1E>)
$$ ##END=
$$ 
$$ hash MD5
$$ B3 23 4E C3 75 76 EB C9 AB 4A 2F F0 55 05 EF C2
##$RELAX= 
##$RELAX= 
##$RELAX= 
##$RELAX= 
##$RELAX= 
##$RELAX= 
$$ Bruker specific parameters
$$ --------------------------
##$DU= <F:/spectra>
##$EXPNO= 1
##$NAME= <H-F>
##$PROCNO= 1
##$TYPE= <nmr>
##$USER= <she>
##$AMP= (0..31)
100 100 100 100 100 100 100 100 100 100 100 100 100 100 100 100 100 100 
100 100 100 100 100 100 100 100 100 100 100 100 100 100 
##$AQSEQ= 0
##$AQ_mod= 1
##$AUNM= <au_zg>
##$AUTOPOS= <>
##$BF1= 200.13
##$BF2= 200.13
##$BF3= 200.13
##$BF4= 200.13
##$BF5= 200.13
##$BF6= 200.13
##$BF7= 200.13
##$BF8= 200.13
##$BYTORDA= 1
##$CFDGTYP= 0
##$CFRGTYP= 5
##$CHEMSTR= <none>
##$CNST= (0..31)
1 1 145 1 1 1 1 1 1 1 1 1 1 1 1 1 1 1 1 1 1 1 1 1 1 1 1 1 1 1 1 1 
##$CPDPRG= <>
##$CPDPRG1= <>
##$CPDPRG2= <>
##$CPDPRG3= <>
##$CPDPRG4= <mlev>
##$CPDPRG5= <mlev>
##$CPDPRG6= <mlev>
##$CPDPRG7= <mlev>
##$CPDPRG8= <mlev>
##$CPDPRGB= <>
##$CPDPRGT= <>
##$D= (0..31)
0 1.2 0 0 0 0 0 0 0 0.06 0 0.03 0 0 0 0 0.0002 0 0 0 0 0 0 0 0 0 0 0 0 
0 0 0 
##$DATE= 1573474232
##$DBL= (0..7)
120 120 120 120 120 120 120 120 
##$DBP= (0..7)
150 150 150 150 150 150 150 150 
##$DBP07= 0
##$DBPNAM0= <>
##$DBPNAM1= <>
##$DBPNAM2= <>
##$DBPNAM3= <>
##$DBPNAM4= <>
##$DBPNAM5= <>
##$DBPNAM6= <>
##$DBPNAM7= <>
##$DBPOAL= (0..7)
0.5 0.5 0.5 0.5 0.5 0.5 0.5 0.5 
##$DBPOFFS= (0..7)
0 0 0 0 0 0 0 0 
##$DE= 6
##$DECBNUC= <off>
##$DECIM= 24
##$DECNUC= <off>
##$DECSTAT= 4
##$DIGMOD= 1
##$DIGTYP= 9
##$DL= (0..7)
0 120 120 120 120 120 120 120 
##$DP= (0..7)
150 150 150 150 150 150 150 150 
##$DP07= 0
##$DPNAME0= <>
##$DPNAME1= <>
##$DPNAME2= <>
##$DPNAME3= <>
##$DPNAME4= <>
##$DPNAME5= <>
##$DPNAME6= <>
##$DPNAME7= <>
##$DPOAL= (0..7)
0.5 0.5 0.5 0.5 0.5 0.5 0.5 0.5 
##$DPOFFS= (0..7)
0 0 0 0 0 0 0 0 
##$DQDMODE= 0
##$DR= 18
##$DS= 0
##$DSLIST= <SSSSSSSSSSSSSSS>
$$ [...]
##$SUBNAM2= <"">
##$SUBNAM3= <"">
##$SUBNAM4= <"">
##$SUBNAM5= <"">
##$SUBNAM6= <"">
##$SUBNAM7= <"">
##$SUBNAM8= <"">
##$SUBNAM9= <"">
##$SW= 24.0689530833862
##$SWIBOX= (0..15)
0 0 2 0 0 0 0 0 0 0 0 0 0 0 0 0 
##$SW_h= 4816.95568400771
##$TD= 16384
##$TD0= 1
##$TE= 0
##$TE2= 300
##$TE3= 300
##$TEG= 300
##$TL= (0..7)
0 120 120 120 120 120 120 120 
##$TP= (0..7)
150 150 150 150 150 150 150 150 
##$TP07= 0
##$TPNAME0= <>
##$TPNAME1= <>
##$TPNAME2= <>
##$TPNAME3= <>
##$TPNAME4= <>
##$TPNAME5= <>
##$TPNAME6= <>
##$TPNAME7= <>
##$TPOAL= (0..7)
0.5 0.5 0.5 0.5 0.5 0.5 0.5 0.5 
##$TPOFFS= (0..7)
0 0 0 0 0 0 0 0 
##$TUNHIN= 0
##$TUNHOUT= 0
##$TUNXOUT= 0
##$USERA1= <user>
##$USERA2= <user>
##$USERA3= <user>
##$USERA4= <user>
##$USERA5= <user>
##$V9= 5
##$VALIST= <valist>
##$VCLIST= <CCCCCCCCCCCCCCC>
##$VD= 0
##$VDLIST= <DDDDDDDDDDDDDDD>
##$VPLIST= <PPPPPPPPPPPPPPP>
##$VTLIST= <TTTTTTTTTTTTTTT>
##$WBST= 1024
##$WBSW= 4
##$XGAIN= (0..3)
0 0 0 0 
##$XL= 0
##$YL= 0
##$YMAX_a= 191788
##$YMIN_a= -63674
##$ZGOPTNS= <>
##$ZL1= 120
##$ZL2= 120
##$ZL3= 120
##$ZL4= 120
##$ABSF1= 10
##$ABSF2= 0
##$ABSG= 5
##$ABSL= 3
##$ALPHA= 0
##$AQORDER= 0
##$ASSFAC= 0
##$ASSFACI= 0
##$ASSFACX= 0
##$ASSWID= 0
##$AUNMP= <proc_1d>
##$AZFE= 0.1
##$AZFW= 0.1
##$BCFW= 1
##$BC_mod= 2
##$BYTORDP= 1
##$COROFFS= 0
##$CY= 11.3945322036743
##$DATMOD= 1
##$DC= 2
##$DFILT= <>
##$DTYPP= 0
##$F1P= 19.5091578491511
##$F2P= -0.509923556040331
##$FCOR= 0.5
##$FTSIZE= 0
##$FT_mod= 4
##$GAMMA= 1
##$GB= 0.15
##$INTBC= 1
##$INTSCL= 1
##$ISEN= 128
##$LB= 0.24
##$LEV0= 0
##$LPBIN= 0
##$MAXI= 10000
##$MC2= 0
##$MEAN= 0
##$ME_mod= 0
##$MI= 1.114404
##$NCOEF= 0
##$NC_proc= 0
##$NLEV= 6
##$NOISF1= 3.799351
##$NOISF2= 2.8
##$NSP= 1
##$NTH_PI= 0
##$NZP= 0
##$OFFSET= 15.70392
##$PC= 1
##$PHC0= -9453.014
##$PHC1= 11.60088
##$PH_mod= 1
##$PKNL= yes
##$PPARMOD= 0
##$PSCAL= 0
##$PSIGN= 0
##$REVERSE= no
##$SF= 200.130013532006
##$SI= 16384
##$SIGF1= 3
##$SIGF2= 2
##$SINO= 400
##$SIOLD= 16384
##$SREGLST= <1H.CDCl3>
##$SSB= 0
##$STSI= 0
##$STSR= 0
##$SW_p= 3612.71676300578
##$SYMM= 0
##$S_DEV= 0
##$TDeff= 0
##$TDoff= 0
##$TI= <>
##$TILT= no
##$TM1= 0
##$TM2= 0
##$TOPLEV= 0
##$USERP1= <user>
##$USERP2= <user>
##$USERP3= <user>
##$USERP4= <user>
##$USERP5= <user>
##$WDW= 1
##$XDIM= 8192
##$YMAX_p= 0
##$YMIN_p= 0
$$ End of Bruker specific parameters
$$ ---------------------------------
##NTUPLES= NMR FID
##VAR_NAME=  TIME,          FID/REAL,        FID/IMAG
##SYMBOL=    X,             R,               I
##VAR_TYPE=  INDEPENDENT,   DEPENDENT,       DEPENDENT
##VAR_FORM=  AFFN,          ASDF,            ASDF
##VAR_DIM=   8192,          8192,            8192
##UNITS=     SECONDS,       ARBITRARY UNITS, ARBITRARY UNITS
##FACTOR=    0.0002076,     1,               1
##FIRST=     0,             0,               0
##LAST=      1.7004516,     0,               0
##MIN=       0,             -63674,          0
##MAX=       1.7004516,     191788,          0
$$ Real data points
##PAGE= N=1
##DATA TABLE= (X++(R..R)), XYDATA
0 0 0 0 0 0 0 0 0 0 0 0 0 0 0 0 0 0 -1 3 -7 8 -8 8 -8 9 -13 15 -16 18 -21 24 -27 31 -35 38 -43 48 -54 59 -66 75
40 75 -82 90 -99 112 -121 136 -151 168 -186 207 -232 261 -295 334 -384 445 -523 623 -725 682
60 682 4552 74193 76643 6212 -4738 14377 -3348 -43885 -43704 -11626 13956 18389 15626 10030
74 10030 7617 18578 38057 28489 -9250 -20876 11708 38370 40099 51746 71361 59439 23165
87 23165 5233 8299 12157 22811 53985 87296 87634 59948 49829 69524 73655 46934 32932
100 32932 51192 66009 66844 72979 83855 83134 77020 69328 51780 35182 44588 76496 98732 92910
114 92910 78272 76845 73077 49612 32670 46239 60680 53548 54335 73859 75121 54476 49837
127 49837 59439 46691 17828 11291 30108 45795 47127 46876 48488 37726 15902 5203 6311
140 6311 3848 7391 28921 43062 28340 10423 13893 15423 -1831 -17175 -13878 -5016 -3292 -2304
154 -2304 6443 14835 7565 -7719 -13469 -16983 -29179 -32569 -13172 4572 843 -8610 -10546 -14864
168 -14864 -27164 -35345 -35499 -30767 -24541 -19413 -15212 -16433 -22347 -25103 -23987 -32282 -47503 -48464 -33750
183 -33750 -26037 -29237 -26461 -20758 -25801 -38357 -45285 -46295 -44301 -39092 -31132 -25488 -27213 -32893 -33811
198 -33811 -33348 -38780 -45377 -41430 -32857 -30790 -30152 -25183 -21759 -23240 -25676 -29203 -33817 -34155 -28401 -21977
214 -21977 -17463 -16220 -16146 -15832 -18243 -23424 -25493 -19420 -12444 -10626 -9334 -6085 -5091 -5687 -7310 -9510
230 -9510 -10965 -9239 -7208 -6215 -3146 -62 1429 2083 187 -4605 -6771 -3586 -27 1268 3086 4949
246 4949 5697 3721 133 -2974 -1197 2807 3273 2427 3924 6407 6738 5612 3769 2168 1701 3463
262 3463 3396 3174 4790 7816 10021 8498 4729 3545 6825 8881 8269 9155 12338 12682 10707 8938 8241
279 8241 7426 8675 11623 12677 12356 12125 14852 16578 14613 10873 11018 13925 14619 13096 13613 16470 17035
296 17035 15722 12831 9776 8995 11769 13447 12722 12210 14056 15343 11679 6532 4804 6833 8010 6254
312 6254 6178 8963 10684 9244 6063 3386 954 -152 505 448 -106 2278 4689 3769 -1827 -4975 -5209
329 -5209 -5101 -6306 -6131 -1728 957 -351 -1991 -2933 -5757 -9618 -10450 -8083 -7140 -7545 -4780 -284 -316
346 -316 -6144 -9693 -8831 -8841 -11485 -11604 -6611 -1588 -823 -3031 -4665 -6679 -8422 -9781 -10281 -9163 -4911
363 -4911 -904 498 -1269 -4073 -5043 -6376 -9297 -11366 -8881 -3380 256 1240 1012 868 -1340 -4713
379 -4713 -7792 -8452 -5949 -1882 1534 2669 3333 2968 422 -3367 -5713 -5969 -4261 -1328 3046 6260
395 6260 6862 4925 3040 1774 -1940 -4773 -2778 3286 6741 7407 8283 10122 8514 3182 -961 -777
411 -777 1327 2845 5766 9423 11891 11475 9710 7128 3488 1382 3119 6603 8541 10624 13411 14970
427 14970 12460 7225 3829 3686 4041 4261 7243 11742 14804 14050 12153 9087 5955 3180 2532 3833
443 3833 6889 10204 12693 13612 11563 8376 4655 2076 903 1694 4113 7266 9355 10154 8828 5951
459 5951 1719 -1073 -2131 -1808 221 3409 6611 7489 6257 2902 -703 -3898 -5579 -6040 -4578 -1433
475 -1433 1156 2375 1662 -1662 -4466 -6729 -9069 -10235 -8843 -5620 -2605 -1966 -2787 -4741 -7405 -10240
491 -10240 -13083 -14079 -12795 -9642 -6619 -5358 -6051 -8001 -10325 -13057 -15641 -16812 -15541 -12432 -9426
506 -9426 -7931 -8225 -9090 -10548 -13275 -16401 -17476 -15648 -13299 -10843 -9134 -8075 -9180 -11359 -13485 -15085
522 -15085 -16173 -15503 -12808 -9017 -6992 -7283 -7490 -7823 -10050 -12984 -13557 -11917 -9503 -7579 -4877 -3540
538 -3540 -3885 -5014 -5924 -7105 -9204 -9030 -5378 -1960 -874 -1160 477 1385 -1311 -3838 -3484 -1156 311
555 311 1463 3985 6217 5947 4576 4166 2611 1289 1186 4432 6536 7592 9106 11455 10944 7374
571 7374 5984 7253 7932 7051 8542 13078 14554 12682 11493 12043 10929 8408 7977 10618 12221 12504
587 12504 14078 16006 14154 10645 10071 10839 9337 8687 11491 15104 14854 12844 13209 12652 9800 7685
603 7685 8859 10163 8927 8791 12301 14277 10643 7320 8263 8851 5876 3539 6783 10420 10204 8728
619 8728 8522 7375 4209 2410 3273 3806 2930 4061 7497 6641 3150 1706 3395 1686 -2345 -2573 913
636 913 2177 180 1093 3166 1631 -3681 -5823 -3356 -3203 -4850 -4062 -468 -507 -3983 -5944 -5807 -7339
653 -7339 -8955 -7942 -6615 -7161 -7640 -5002 -4004 -7426 -10506 -9980 -8780 -11862 -13192 -9581 -6063 -6851
669 -6851 -9572 -9356 -9576 -12457 -13948 -11485 -10189 -10714 -10347 -7646 -7233 -9905 -11355 -10238 -9717 -11798 -11825
686 -11825 -8790 -7040 -7481 -6009 -5165 -7312 -10627 -10172 -7042 -7250 -8472 -5871 -1196 -1905 -5915 -6392
702 -6392 -3080 -3202 -6063 -5827 -2156 -734 -1829 -302 1356 -167 -2782 -2237 -827 -1388 -1873 2027
718 2027 5238 3516 1291 2198 3587 262 -1081 2115 4800 3639 2576 5641 7590 4730 1803
733 1803 3114 4948 3120 2131 5162 8107 7022 5413 6257 6607 3811 2858 5335 6888 5693 5491
749 5491 8328 8905 5755 4218 5628 5849 3964 4086 6422 7437 5949 6284 7974 6315 2413 2499 5680
766 5680 6077 3492 4697 7801 7759 4322 2623 4066 3728 2537 2717 4330 3963 3406 4431 5038 1653
783 1653 -272 1579 2979 847 -1153 2050 4681 2720 -206 76 1451 -422 -1899 -748 1152
798 1152 74 -504 693 492 -1773 -3259 -1093 -754 -3025 -3321 -358 266 -1963 -3041 -1665 -1670 -4136
815 -4136 -4788 -2274 -1599 -3433 -2660 -1047 -1725 -4911 -5162 -2457 -2616 -5030 -4346 -1153 -1698 -4415 -4209
832 -4209 -2183 -3015 -5286 -5098 -2543 -2801 -4019 -2674 -1304 -3417 -5407 -4363 -2906 -4547 -5585 -2916
848 -2916 -791 -2525 -4455 -2965 -2128 -3940 -5555 -4095 -2053 -2760 -3012 -1563 -794 -2719 -3846 -2509
864 -2509 -2330 -3939 -3714 -684 773 -1740 -2225 -452 86 -2314 -3524 -1354 92 -972 150 2099
880 2099 1448 -538 -118 739 -340 -2121 -340 3059 2635 800 1405 3385 2259 -469 -265 1620 2066
897 2066 2211 3296 4633 3704 2792 3187 3215 1090 615 2870 4687 4072 3785 5132 5667 3980 1869 2205
915 2205 3041 2673 3544 5009 5997 4569 4001 4573 3509 1383 1408 3500 4685 4063 3787 5210 5627 3361
933 3361 1637 1620 1725 1742 2436 3566 4001 3791 3860 3576 1366 -275 604 1870 1719 997 2348 4434 3360
952 3360 910 41 342 -137 -762 323 1203 1619 2289 1898 1236 -890 -1578 -691 -1034 -1686 -881 1246 1917
971 1917 659 -407 -1359 -1678 -2863 -2900 -2396 -1721 -747 -47 102 -1362 -2776 -2736 -2959 -4309 -4853 -3388
989 -3388 -1390 -1333 -2532 -3160 -3210 -3739 -5448 -6368 -5729 -4963 -3877 -3023 -3576 -3753 -4691 -4971 -5996 -7537 -8146
1008 -8146 -6304 -4560 -4439 -4964 -4592 -4439 -5164 -7171 -7795 -7297 -6162 -4864 -4341 -4001 -3873 -3254 -4383 -5928
1026 -5928 -6807 -5547 -4345 -3625 -3049 -2657 -1514 -1112 -1912 -3767 -4183 -3346 -1840 -1421 -994 -252 1735 2180
1044 2180 558 -860 -524 127 462 763 1504 3026 4042 3721 3009 2143 1635 2180 2768 2891 2872 4177
1062 4177 5677 5900 4503 3698 3725 4183 3774 3307 4141 5465 6438 5890 5426 4626 4264 4565 4350 3809 4042
1081 4042 5646 6773 6218 4873 4657 4902 4680 4003 3221 4283 5677 6089 5396 4861 4544 5017 4494 3407
1099 3407 3228 4266 5033 4794 4430 4377 4374 4186 3506 2500 2453 2739 3336 3771 3300 2688 2882 2892 2346 1311
1119 1311 815 1408 1910 1568 1224 999 1150 944 298 -126 -1291 -619 -302 -331 -1104 -1496 -1127 -824 -2034
1138 -2034 -3050 -2574 -2228 -2277 -3021 -3352 -2922 -2545 -3058 -3569 -3974 -3785 -3818 -3540 -4092 -4214 -3931 -3514 -3882 -4557
1158 -4557 -4678 -3826 -3895 -4379 -4421 -4188 -3925 -4311 -4123 -4198 -4145 -4118 -3718 -3524 -4145 -4175 -3686 -3384 -3583 -4392 -3395 -2936
1180 -2936 -3086 -3517 -3763 -3295 -2963 -3518 -3517 -3651 -3272 -2225 -2006 -2750 -3638 -2885 -2143 -2718 -3776 -3104 -1369
1199 -1369 -1501 -1991 -2275 -1510 -1192 -1843 -2060 -1851 -1437 -1274 -72 184 -679 -635 277 469 -571 -815 476
1218 476 1898 1565 1137 1645 2223 2249 1635 1469 1306 1402 2698 3992 3430 2478 3310 5032 4151 2179 1612
1237 1612 3585 4966 3872 3556 4398 5090 4684 3733 2783 3074 3162 4310 4503 3704 3263 5260 5580 3220
1255 3220 1336 2205 3794 3005 2131 2543 3798 3850 2939 1870 1545 1049 681 1452 1248 727 1394 2486
1273 2486 2371 -63 -888 343 475 -751 -1311 50 1446 703 79 -335 -278 -1228 -1430 -779 -866 -1441 -448
1292 -448 843 375 -1885 -1363 -452 -957 -2654 -2186 -358 53 -596 -609 276 -413 -1849 -2274 -1444 -1659 -1902
1311 -1902 -367 554 -478 -1514 -724 -311 -1606 -3016 -1969 -490 -349 -1427 -686 -65 -486 -1883 -2172
1328 -2172 -2316 -2164 -1967 -642 -320 -971 -725 141 -696 -2831 -3227 -1448 -935 -1891 -1884 -212 472 -894 -1709
1347 -1709 -1759 -2029 -2204 -1788 -1122 -776 -799 108 814 -495 -2182 -2124 -817 -1328 -2042 -1125 1190 1238 -186
1366 -186 -240 -134 -994 -1529 -803 535 -24 -207 1692 2040 739 -971 -123 717 200 -1342 186 2389
1384 2389 2149 1176 898 1413 583 146 198 796 718 1391 2611 2879 1296 231 1561 1682 63 -528 1534
1403 1534 2798 1635 1046 1992 2511 1110 216 1002 584 48 1020 2411 2760 1672 1086 1718 1176 -536
1421 -536 -664 860 2014 1169 1442 2225 1631 909 449 875 -47 -241 550 1955 1195 733 1688 2266 708
1440 708 -1006 -524 1389 1019 -221 971 2152 1676 166 426 322 -142 -457 539 1173 360 -9 1361
1458 1361 1597 268 -618 -146 641 -774 -944 298 1258 685 33 428 -9 -1712 -1441 -272 -356 -1334
1476 -1334 -1020 838 373 -1630 -2037 -866 -824 -2190 -2306 -1209 -576 -1155 -1682 -869 -1445 -2559 -2318 -2082
1494 -2082 -2460 -3055 -1623 -801 -1566 -2844 -1969 -1040 -2145 -3547 -2761 -1672 -1793 -2333 -1853 -1203 -2008 -2716
1512 -2716 -2234 -1854 -2611 -2878 -1694 -1405 -1827 -2148 -1006 -691 -1901 -2665 -1790 -1109 -1969 -2120 -956 -384
1530 -384 -1239 -1385 -1171 -984 -1741 -1605 -677 -710 -1685 -672 288 124 -1442 -995 111 -46 -1217 -923 380
1549 380 616 413 211 684 314 158 577 948 403 460 1728 2198 1347 1099 2003 2663 1658 969 1805 2486
1569 2486 2380 2292 2761 3097 2790 2674 2908 2892 2454 2530 3325 3619 2916 2839 3836 4112 3032 2613 3026 3159 2816
1590 2816 2560 3235 3516 3162 3048 2904 2326 2034 2035 2588 2048 1660 2402 2548 2206 1352 1083 1455 1327 476
1610 476 176 513 529 584 500 411 70 -493 -302 -612 -1142 -1135 -292 -212 -404 -1156 -723 -905 -1362 -1724 -1605 -1059
1632 -1059 -1082 -878 -794 -907 -970 -1162 -1319 -1652 -1735 -1637 -1238 -866 -1065 -1115 -558 -888 -1404 -1640 -1438 -1270 -1402 -1059
1654 -1059 -882 -533 -902 -1034 -1301 -1448 -1768 -1834 -1316 -1538 -1171 -1269 -869 -768 -1637 -1896 -1958 -1824 -1745 -1557 -1545
1675 -1545 -1368 -1306 -1321 -1346 -1903 -2103 -2263 -1650 -1912 -1753 -789 -961 -1166 -1559 -1800 -1710 -1757 -1683 -1217 -948 -728 -541
1697 -541 -544 -459 -562 -1044 -1067 -547 -10 -208 -133 422 619 643 188 52 -40 284 464 506 771 1339 1434 1363 1137
1720 1137 1089 1042 709 724 947 1481 1551 1717 1267 1504 1239 1258 983 959 1262 1427 1730 1515 1195 1207 1245 1176 877
1743 877 1051 999 1234 1462 1448 1342 1117 962 522 536 840 752 681 1279 1278 993 789 692 744 649 450 605 557 736
1767 736 954 1073 660 738 406 80 39 -84 283 297 334 276 404 58 -45 -717 -412 -229 -219 -489 -452 -515 -411
1790 -411 -1005 -1377 -1261 -1187 -1180 -1465 -1192 -1435 -1263 -1637 -1353 -1899 -1874 -1793 -1547 -1717 -1473 -1277 -1421 -1736 -1699 -1360
1812 -1360 -1491 -1963 -1709 -1356 -1070 -1474 -979 -1100 -902 -1061 -1097 -928 -825 -408 -509 -5 -151 36 4 396
1832 396 18 25 113 501 690 824 874 810 792 853 617 808 846 754 1038 1373 1295 1453 1456 930 935 650 909 1342 1062
1857 1062 1211 1563 1242 1246 841 682 675 579 729 372 586 855 844 818 108 -157 9 343 -32 262 149 440
1879 440 678 249 -214 -125 -482 -250 16 163 255 141 446 404 215 -155 -237 -69 283 214 572 570 781 409
1901 409 412 471 98 62 289 383 600 726 639 998 390 461 338 533 257 212 772 1026 867 354 615 559 77
1924 77 -656 27 52 107 303 518 553 526 126 -141 -87 -11 -181 117 319 156 143 43 266 -228 -693 -840 170
1947 170 -128 -331 141 449 85 -70 -168 -509 -677 -377 141 -58 -770 -303 179 264 -876 -1269 -416 22
1967 22 -486 -970 -128 335 -31 -259 -912 -846 -814 -636 -721 -693 -1012 -325 -138 -771 -1325 -1272 -693 -937 -1780 -1535
1989 -1535 -839 -769 -967 -850 -737 -1409 -1649 -1536 -1417 -1660 -1415 -725 -405 -1043 -1653 -1516 -1029 -1424 -1515 -1184
2009 -1184 -783 -979 -1071 -854 -446 -826 -1010 -711 -624 -1478 -1120 354 -109 -809 -541 82 205 -815 -898 4
2029 4 445 -87 -159 483 227 -380 -60 278 0 -302 407 882 290 -260 902 1282 990 -96 503 1219
2049 1219 396 78 474 1363 709 595 914 852 660 275 846 1233 -24 147 1560 1745 658 529 1247
2068 1247 1268 484 170 1431 1464 1562 1403 1870 1378 538 1108 1618 672 212 966 1654 1873 750 1031 1847
2088 1847 1390 564 902 1429 1290 908 1266 1733 1431 708 1197 1879 1038 358 843 1540 1335 535 1021 1352
2108 1352 655 148 626 790 445 229 764 728 249 344 699 411 -577 -482 284 176 -772 -750 150 -102 -827
2129 -827 -1200 -584 -510 -1361 -1116 -315 -654 -1109 -1181 -690 -958 -1308 -1323 -894 -1299 -1776 -1460 -774 -900 -1636 -1314
2150 -1314 -984 -1386 -1437 -1610 -1107 -1464 -1556 -985 -959 -1665 -1729 -942 -891 -1865 -1835 -1026 -578 -971 -1478 -962 -387 -913
2172 -913 -1569 -842 -962 -816 -354 -235 -553 -783 -290 -12 -553 -1133 -742 139 363 -305 -574 259 364 198
2192 198 -414 75 -33 -45 403 121 337 304 771 740 159 -367 426 688 548 399 373 945 890 352 226 761
2214 761 668 688 490 725 755 1105 1591 1236 321 315 895 906 514 227 1042 1386 1151 659 618 820 1062 671
2236 671 547 783 655 1439 1613 915 382 950 1068 522 315 304 1096 1398 932 640 822 587 824 184
2256 184 88 205 78 576 610 153 523 772 674 -79 -884 -243 596 118 -156 -409 506 23 -289 -870 -744
2277 -744 -177 -302 -353 -829 -357 -198 10 -477 -881 -920 -946 -686 -1041 -1113 -644 -264 -473 -965 -1062 -1183 -930 -1089
2299 -1089 -981 -759 -888 -760 -601 -730 -1267 -1148 -691 -1075 -895 -1098 -651 -175 -192 -699 -718 -313 -797 -907
2319 -907 -841 -880 -519 -90 -308 -444 -451 -45 -157 -615 -715 -423 -44 -18 -218 -58 402 123 -200 -271 -155 69
2341 69 35 32 141 439 -100 345 196 -46 1 145 310 260 171 459 362 749 349 -105 24 272 492 452 335
2364 335 863 869 750 640 23 107 512 844 569 268 521 1240 1006 466 210 499 856 526 311 249 627
2385 627 785 757 456 198 463 232 40 -206 69 453 793 357 195 90 454 386 190 -241 13 180 390
2406 390 426 -37 3 246 194 -96 -176 -154 463 457 157 316 122 92 369 -176 -379 -229 285 415 81 -72 243
2429 243 283 363 -82 -165 120 248 621 158 133 448 493 197 -218 65 371 542 408 173 390 241 315 234
2451 234 -89 -63 286 200 234 -127 469 408 609 170 -383 -169 101 -217 -39 -454 -118 -16 25 -424 -476 -45
2473 -45 -155 -424 -283 -426 -331 -20 -326 -401 -835 -696 -424 -620 -788 -474 -184 -140 -313 -619 -358 -383 -228 -600
2495 -600 -1150 -645 -466 -432 -819 -644 -59 -533 -358 -583 -699 -768 -439 -485 -603 -362 0 -301 -684 -751 -909
2516 -909 -657 -11 -588 -440 -660 -159 10 -289 -626 -829 -464 -80 -571 -628 -236 6 53 -453 -821 -322 -461
2537 -461 -431 -814 -307 -49 57 -24 -218 -276 -187 -287 -463 -306 -108 126 326 353 -291 79 46 -87 -402 -197
2559 -197 274 329 374 368 482 395 415 446 293 390 325 203 574 533 569 676 709 600 279 192 726 561 555 385 844
2584 844 831 1241 633 526 289 692 802 1027 858 853 778 1010 872 562 618 711 522 268 235 848 852 727 804
2607 804 388 659 397 394 475 268 453 748 627 72 52 395 173 -202 -158 11 -1 90 -22 -297 -109 -194 -221
2630 -221 -306 -648 -711 -259 -191 -349 -512 -587 -402 -443 -841 -884 -859 -707 -785 -335 -545 -770 -626 -517 -883 -632 -690
2653 -690 -653 -156 -304 -696 -337 -355 -747 -910 -695 -473 -615 -599 -582 -636 -470 -432 -394 -459 -932 -565 -291 61 -268
2676 -268 -93 74 -157 -336 -113 -412 -118 -257 -216 82 372 56 -286 -38 -242 -144 -146 147 157 107 504 697
2698 697 579 151 281 316 169 157 310 299 193 823 702 593 440 537 605 765 350 503 858 925 638 487
2720 487 785 714 632 435 544 671 962 637 542 882 341 570 347 355 -77 118 426 601 307 42 447 643
2742 643 261 -202 56 -53 -48 -371 4 13 -340 -130 -85 -266 -599 -496 93 48 -489 -320 197 73 -634 -419
2764 -419 -252 -317 -315 -151 -247 -160 -439 -244 -7 -289 -368 -169 -258 -464 -469 -380 163 -263 -169 -112 -129 -363 -259 -305 -37
2789 -37 -440 -265 -126 -290 -313 -397 -130 -626 -640 -627 -549 -91 -477 -411 6 -166 -779 -702 -391 -435 -589 -265 -168
2812 -168 -319 -490 -325 -301 -428 -788 -689 -203 -304 -572 -570 -345 -226 -685 -340 89 80 -278 -239 268 208 5 -144
2835 -144 363 238 151 -117 99 336 282 465 375 383 374 430 537 558 377 767 769 354 541 496 720 538 387 659
2859 659 743 235 414 975 670 481 408 718 349 190 696 435 750 467 507 553 649 470 450 599 -75 58
2881 58 335 442 350 33 205 473 94 -140 182 470 170 97 217 268 241 -226 34 161 94 140 -92 -397
2903 -397 -311 119 166 213 -190 -183 162 -224 -412 -220 -206 22 -486 -435 35 -16 -616 -373 -178 -117 -423 -552 -413
2926 -413 -187 -214 -378 -375 -454 -516 -459 -313 89 -449 -372 27 -256 -478 -353 -421 -365 -323 -383 -224 -226 -197 -155 -91 -134 -202
2952 -202 -278 -157 -212 2 186 -97 66 31 16 -61 -135 -103 39 -18 -43 290 173 128 29 203 69 121 -51 -22
2976 -22 189 223 408 285 32 399 98 -34 94 169 -114 27 42 -57 27 96 252 -102 -297 -321 -169 -85 -185
2999 -185 -226 -40 -384 -276 -346 -445 -6 -159 -94 -244 -97 -369 -188 -361 -147 -369 -449 -225 -313 -679 -241 -216
3021 -216 74 -329 -443 -139 -109 -441 -22 -325 -84 -160 32 -128 -533 -201 -161 -55 -372 -79 84 98 -48
3042 -48 -180 83 163 -216 53 207 14 369 67 395 41 152 329 67 315 210 337 136 366 418 270
3063 270 283 462 305 409 496 523 35 457 582 447 547 177 486 367 206 212 80 777 636 605 586 567 393
3086 393 517 145 481 630 687 433 201 292 596 75 352 162 362 496 242 57 153 152 317 51 49 20 -30
3109 -30 95 309 62 125 -35 403 117 -135 -112 -16 -36 -85 -223 -147 91 13 -321 -600 -463 -381 -243 -334 -321 -393
3133 -393 -76 -298 -113 -366 -151 53 -315 -883 -479 -269 -329 -302 -434 -623 -420 -320 -683 -565 -708 -267 -20
3154 -20 -282 -607 -437 -628 -536 -334 -538 -344 -491 -579 -305 -432 -564 -342 -417 -484 -285 -224 -583 -290 -405 -434
3176 -434 -5 -196 -218 -256 -255 -248 284 -225 -120 -91 450 32 -327 -75 40 29 529 142 112 178 594 533 -103 23
3200 23 486 697 516 429 306 579 438 565 -112 267 463 562 460 480 341 522 379 420 351 535 607 439
3222 439 155 271 137 139 356 306 245 150 384 579 208 87 426 274 366 157 -55 -104 405 165 81 -134 114
3245 114 249 27 51 -102 -93 43 -168 -205 -368 39 -93 -287 -79 -198 76 -220 -96 -115 -159 185 -156 -285
3267 -285 52 -326 -166 -47 -86 -354 -304 -129 -329 -283 -733 -215 -95 -355 -691 -203 -392 -231 -167 -462 -160
3288 -160 -173 -276 -543 -225 -448 -563 -254 -427 -512 -499 -400 -60 -509 -526 -161 -328 -326 -338 -300 14 -226 -253 -438
3311 -438 -124 -143 -377 -6 -158 -384 -121 130 383 4 68 -123 58 104 -103 52 481 248 164 135 -228 152
3333 152 395 120 347 131 284 308 330 169 139 279 478 638 5 507 370 384 381 471 108 252 585 239
3355 239 466 587 371 -57 123 182 133 319 483 326 331 275 720 733 174 491 401 593 41 211 256 168 721
3378 721 462 34 120 356 547 390 269 425 588 290 201 -13 339 722 538 -40 -140 114 534 576 38
3399 38 44 103 468 -317 -634 -174 162 42 -99 -314 -347 40 -201 -113 -221 -596 -354 -34 -477 -233 -451 -349
3421 -349 -317 -890 -636 -559 -236 -88 -165 -443 -200 -255 -668 -343 -578 -144 -663 -360 -405 -393 -415 50 -111 -611
3443 -611 -331 -258 251 -171 -421 -221 56 -139 -125 -250 -439 -47 101 110 -14 92 344 231 8 -70 235 271
3465 271 363 -90 230 405 228 27 -133 261 134 -152 88 152 218 179 134 -36 24 53 -87 168 -255 -320 189
3488 189 23 82 8 -460 -53 -197 -157 45 -281 -376 -247 -85 -124 -272 152 47 -32 -498 -709 -212 22 72
3510 72 -302 -527 -13 -350 -42 -220 -496 -190 -98 -345 -92 -57 -155 -40 -89 -603 -238 -124 208 -299 -188 7
3532 7 256 133 -258 -436 -314 -36 -107 106 8 -56 224 267 -219 -178 20 12 87 30 -166 190 44 -19 -290 205
3556 205 156 71 132 140 285 154 465 566 -51 -2 429 -3 28 493 433 744 580 503 209 367 444 572 437
3579 437 216 264 442 284 519 494 343 237 315 352 380 207 516 316 352 276 746 385 347 186 17 261 364
3602 364 151 -39 284 53 258 192 -163 86 25 282 -144 -212 -20 86 -292 -81 67 77 151 -297 -181 41
3624 41 -20 -318 18 -242 -259 -200 -243 108 -347 -118 76 -45 -428 -347 -314 -78 -284 -527 -128 -293 -141 17
3646 17 104 -122 -282 -352 -349 -313 -501 -345 -29 -203 -327 -357 -234 -189 -206 -333 -317 -118 -306 -221 26 -350 -476 -181
3670 -181 -369 -71 -470 -163 -180 -219 -220 -275 25 -236 -78 -187 -359 -33 -212 135 -465 -275 89 -289 -34 -335
3692 -335 -112 60 -74 137 -5 79 180 -40 -43 -46 133 74 492 89 65 372 368 307 249 207 427 201 156 -173
3716 -173 460 191 399 236 164 368 305 315 -43 354 217 341 121 14 291 231 35 469 17 258 92
3737 92 337 277 -109 -176 355 412 81 41 -251 26 -11 13 91 -214 -359 11 -238 -318 -245 346 -107 -153 -273 85
3761 85 20 -230 -279 -302 -502 18 -476 -384 -251 -464 -238 -405 -305 -455 -168 -296 -315 -375 -176 -223 -14 -497 -286
3784 -286 -523 -206 -233 -402 -353 -247 -42 -64 -412 -390 -256 -410 -112 -334 -443 -18 130 25 -315 -222 -155 23
3806 23 343 -12 -7 -71 45 -217 57 7 218 -43 -119 -85 58 6 151 -98 126 300 -12 164 166 197 263 226
3830 226 333 544 9 467 349 259 190 329 148 477 311 104 361 271 290 75 368 485 477 203 378 367
3852 367 179 115 415 119 462 328 4 88 350 66 169 168 314 -8 110 167 -26 95 371 4 369 322
3874 322 125 9 294 12 -93 226 362 50 -61 258 -80 124 -121 -1 -46 -170 -228 -144 -194 -29 10 -47
3896 -47 141 -72 -2 -231 -222 -126 85 57 -84 59 -191 -264 18 7 -188 -506 -335 -125 -98 21 -211 -130 -198 -431
3920 -431 -109 49 174 87 -43 -145 -321 -38 -342 -44 -18 -292 -221 -136 -5 -248 -237 81 -112 -273 -157 -252
3942 -252 -78 -309 -418 -199 -84 48 -171 -116 147 -255 -8 -132 -398 -111 26 -191 -125 -122 -79 -47 3 -211
3964 -211 -8 9 93 -65 222 9 -81 -176 194 -15 194 298 187 207 65 482 279 39 -13 35 190 321
3986 321 103 9 -33 324 -23 -8 -22 244 -226 -14 224 117 -155 112 378 -64 -172 107 43 -15 -188 100
4008 100 38 -247 123 -73 198 -364 35 19 -234 -181 -392 -76 -162 -2 47 -41 -172 -358 -7 -368 120 -106
4030 -106 -255 -46 -111 -14 -75 -143 -303 -430 -34 -71 13 -220 -109 -176 -81 -162 -9 -43 -195 353 244 -68 -187
4053 -187 -36 -93 128 255 17 -42 -71 131 -139 25 64 16 -135 50 -67 168 -106 -107 213 1 325 581
4075 581 97 318 198 26 176 -47 259 -11 196 317 455 283 -64 132 151 277 595 129 155 231 84
4096 84 426 -82 191 -13 278 -149 222 342 347 392 112 -4 114 52 121 263 -169 -43 259 417 354 -70
4118 -70 190 96 129 199 -65 -139 144 -65 35 -137 -243 9 210 -198 -455 -222 -8 -206 -272 -176 -119 -150 -92
4141 -92 -87 -110 -211 -509 -197 -38 3 -240 -168 -267 -498 -210 -85 -309 -259 -235 -59 246 -265 -211 -344 -188 3
4164 3 -104 -205 269 -92 73 74 110 -88 -24 258 129 4 -122 110 124 -181 21 -126 -133 106 -240 -62 229
4187 229 -146 28 309 -82 185 40 146 21 -81 13 149 224 5 -144 217 259 -74 258 3 157 206
4208 206 63 172 163 307 215 525 198 248 104 511 145 42 506 165 303 181 297 504 204 256 122 85
4230 85 141 263 371 229 64 -22 108 15 106 -60 -153 198 103 215 -11 160 -52 25 62 -242 -29 -316 -8
4253 -8 82 -93 -6 13 115 160 -289 -79 116 -154 51 -68 -165 -307 181 -215 -123 -195 -251 -126 -210 -73 -161 -213
4277 -213 -374 -116 -376 -34 -255 91 -61 -117 -368 -442 -298 -197 -189 -280 -334 -404 -269 -411 -12 81 -86 -233 -7
4300 -7 -137 -10 -104 -122 -66 -3 -166 -171 227 -99 85 24 -197 14 -116 -64 141 -37 -6 277 348 -266 -230 379
4324 379 82 -171 36 -13 227 278 274 155 112 371 293 661 174 160 328 299 250 13 40 356 421 52 102 252
4348 252 213 86 -169 497 138 26 81 366 38 -68 282 270 200 117 -68 136 166 206 140 -103 460 441 131
4371 131 -9 -125 258 231 141 59 65 -160 76 -208 125 128 44 74 -154 30 -170 -30 -241 55 -78 24 61
4394 61 -153 -95 -95 191 -111 -609 -19 -358 112 81 -216 209 129 242 -220 0 -26 277 -121 -356 -283 -320 -86
4417 -86 -31 -267 -169 -169 278 -208 -168 -307 -281 55 -428 -211 -213 -81 -163 53 77 209 -232 -89 -33 59 -137 32
4441 32 -43 87 -212 -99 20 -218 25 -49 93 128 226 -103 148 -25 23 -64 112 56 -37 266 326 247 96 228
4465 228 62 -129 164 -12 302 252 -124 44 -160 -192 51 123 51 219 241 74 201 50 -143 454 77 360
4487 360 -37 -159 -5 -18 121 84 80 97 -143 -86 28 -158 -104 96 26 -86 -216 257 84 -47 -59 155 0
4510 0 -2 18 -93 276 37 -176 112 33 -88 433 -197 -117 -95 -4 273 -303 -169 -3 76 -72 -183 -108 -103 -5 -116
4535 -116 -59 -208 1 248 -249 36 -143 -62 274 65 -23 -147 -382 58 -39 -132 -62 -250 28 -97 2 -345
4557 -345 -144 -25 196 51 -163 -128 168 -8 -76 36 -24 341 100 71 -162 150 304 188 71 -101 136
4578 136 413 20 106 261 -104 380 102 27 -73 156 425 247 24 380 125 179 191 -270 59 160 134 201
4600 201 248 0 126 79 124 25 303 152 129 193 -36 159 25 3 120 302 -43 214 -87 -159 -71 -49 -161
4623 -161 -354 -41 -131 248 -95 -59 -20 -162 -42 140 -27 -129 -6 53 -181 -95 -70 -51 168 -270 -19 -182
4645 -182 -222 160 -180 -304 -162 67 6 -184 -270 -387 -168 -323 -300 -328 -363 -75 -291 -226 -367 -84 68 -90
4667 -90 -34 37 -44 -101 -255 -96 -44 -311 101 -387 -236 -209 116 -172 47 -68 -266 -97 312 23 -373 45
4689 45 232 338 21 -123 14 90 119 47 -205 100 333 269 410 27 305 148 170 60 -414 112 467 223
4711 223 97 143 464 141 308 276 -7 349 49 290 18 -69 18 95 162 -40 169 -103 115 15 153 267
4733 267 65 206 97 -89 275 190 128 10 166 -30 -141 -119 123 62 41 -22 51 -70 -4 131 180 -37 -279
4756 -279 -5 46 -37 -90 -297 -167 171 -179 -128 -272 21 -256 -9 -143 -306 -80 71 -286 -128 -372 172
4777 172 -166 -226 1 177 -148 -85 9 54 -34 -222 -185 -387 -186 -267 174 -12 -420 -370 -153 -75 -253 -136 142
4800 142 152 -186 -168 18 -182 -111 -57 -48 83 -206 37 246 112 14 217 -93 111 71 -77 114 -19 -43 162
4823 162 269 -232 95 0 2 245 -35 234 297 52 35 422 -82 237 185 149 240 248 461 173 224 64 31 70
4847 70 56 207 277 489 -24 -78 145 412 141 312 283 -40 151 105 17 -44 49 -12 274 266 243 134 10 121
4871 121 -155 28 -173 63 7 -53 -100 12 81 33 -332 -114 -417 -86 -177 15 -176 -55 -76 -12 -199 -116 -189
4894 -189 -143 -317 -194 -377 -83 39 -372 -81 68 -215 -347 -178 -405 -489 -28 17 -36 -209 -248 -205 -202 -109 -127
4917 -127 -308 -107 -110 -83 -168 7 35 -88 39 -29 -62 -73 -159 -260 -4 91 284 -342 -41 -217 -178 86 -6 62
4941 62 -67 -147 23 132 225 302 -186 -25 -26 -262 34 57 132 -89 -298 269 -2 -124 -8 306 -53 138 197
4964 197 248 -133 -17 -326 131 103 251 28 213 111 -90 171 236 24 -89 -131 354 101 176 -131 -163 17
4986 17 179 343 -182 -36 320 -86 268 132 -253 5 422 -194 143 -10 -100 -137 129 -177 -136 -35 149
5007 149 30 -97 -12 -147 178 0 87 -74 140 272 -151 -339 -65 27 -231 -72 -269 -417 -242 25 -120
5028 -120 243 -270 -51 -125 14 187 -114 19 -18 -542 -200 137 -23 -104 -52 -311 135 74 -430 154 27 104
5050 104 -326 -142 60 -51 -460 36 -84 80 -387 260 248 -48 -133 -216 145 -112 -78 -39 208 -30 -23 -284
5072 -284 -13 -39 -34 -113 3 60 131 17 69 151 -44 335 219 -11 172 381 -54 -20 197 452 36 51 177
5095 177 453 150 314 22 25 23 215 150 300 -77 65 176 353 71 -4 139 325 -169 2 302 103 10
5117 10 -269 99 -45 -124 -206 -135 333 91 40 93 -376 -64 41 -40 10 -69 -58 -261 -163 64 236 -170 -343 -19
5141 -19 -246 -39 -289 -236 -386 8 292 -277 -109 -78 -162 29 -106 -424 -181 -49 119 47 -42 30 -100 -271
5163 -271 -82 -96 -350 1 -286 249 146 -203 -188 -268 92 -244 127 -150 121 -2 -26 61 -27 199 -49 50
5185 50 93 -58 266 188 139 230 -17 -3 -69 81 122 27 198 -30 111 264 98 60 159 -37 243 244 62 -1 283
5210 283 152 100 54 134 217 103 309 211 54 -18 -63 -76 149 -81 206 37 209 201 -44 249 232 220 178 133 171
5235 171 -82 220 228 141 -92 71 28 211 -91 -276 218 -97 55 -42 230 -168 -53 -62 -102 -148 -24 -158 -349
5258 -349 -248 -45 -108 -53 57 73 189 -406 79 40 -49 -148 -132 -84 110 -50 9 63 49 87 -203 -166 -114 17 -177
5283 -177 -61 164 -53 -62 -398 50 -129 -168 -242 -250 41 -1 -152 -53 -151 -165 -30 -36 -220 -137 178 -129 -198 -331 -179
5308 -179 -162 342 244 -172 14 -131 107 81 276 65 75 200 120 -55 -32 -194 96 183 305 -30 160 98 204
5331 204 51 315 330 -164 0 111 403 335 122 111 245 364 12 13 65 335 227 255 34 25 -104 -164 136
5354 136 111 152 114 166 279 -76 -131 -42 215 178 100 108 181 -133 -71 263 256 -33 -31 95 268 -64 40 351 -56
5379 -56 96 10 97 -98 216 -187 79 -49 -264 155 -223 -342 -117 -223 -190 64 -325 -49 -416 -285 -304 -438
5401 -438 -68 -44 -95 -194 89 -132 -39 -50 -309 -164 -233 253 -51 -194 -164 -248 -172 -239 -201 -131 46 149 -176 -392
5425 -392 -16 -74 39 1 -126 39 56 185 -186 -81 -202 71 77 -263 -19 -57 10 -16 276 102 103 36 145 -75
5449 -75 40 -6 239 326 -3 177 -204 116 -23 270 89 -161 133 -93 284 82 -197 221 -31 29 17 116
5471 116 310 -41 -15 63 147 347 177 -156 216 -49 151 26 293 -182 135 315 145 176 -23 267 -98
5492 -98 124 59 -174 -34 -11 -171 205 -71 305 54 76 110 -125 -433 21 139 -340 151 70 6 35 119 -183
5515 -183 -289 39 -126 -342 -70 33 -89 -372 2 -153 -148 -47 -18 73 15 7 -252 220 -111 -90 -119 36 -314
5538 -314 -127 123 -394 -187 156 -101 -200 -97 -27 -16 -146 -337 48 225 -142 -173 143 178 188 -168 -5 187
5560 187 131 104 118 178 -59 59 -11 -227 -157 -3 34 287 -293 151 24 -12 44 162 368 -295 108 344 183
5583 183 449 -31 240 116 49 206 -58 -68 152 46 216 60 -68 153 38 -85 -17 6 130 274 196 246
5605 246 192 217 241 17 -135 56 -39 55 0 47 0 86 -369 -78 -123 -203 -177 196 -1 50 112 4 18 -1 7 -333
5631 -333 -78 127 -18 -185 -231 -83 249 -70 -50 -48 95 -116 83 -103 -191 149 -90 -36 -14 -28 -240 152 -121
5654 -121 101 -83 162 142 -279 -17 64 159 37 -126 -77 -132 -76 -149 56 224 127 -129 47 -157 -130 -99 93
5677 93 -57 -134 -17 -138 -7 -113 104 43 -24 -196 -256 -69 113 18 245 -164 -82 -119 4 8 428 -81 -31 -156
5701 -156 -126 114 -21 -88 93 166 -181 -35 169 329 92 187 -79 250 295 179 141 -106 266 -97 -63 12 323
5724 323 164 249 380 158 179 52 50 -40 61 -50 -60 84 10 -99 67 121 29 36 -246 155 121 -59 -151 -330
5748 -330 70 104 -114 8 -376 32 -9 92 113 -177 183 -176 -85 -230 -52 -169 -243 -23 -246 -94 117 -102
5770 -102 -1 -123 34 -11 -202 -162 -236 -213 32 -3 -183 -168 -122 196 -275 -347 35 -449 -11 -111 -276 30 -39
5793 -39 -216 -25 -47 -96 -84 22 -188 -12 113 63 67 85 74 133 71 -25 12 51 47 24 123 213 -59 -77 53 -52 -37
5820 -37 -53 230 156 223 194 -154 63 88 222 -1 150 53 -40 -100 28 16 69 270 144 5 122 -89 -4 182
5844 182 142 333 -33 166 -87 204 -18 -149 328 169 89 183 341 114 46 -30 30 105 -142 133 -151 -3
5866 -3 -26 -16 -113 140 -53 156 145 148 131 -258 -52 247 -206 -312 134 -122 212 -214 -19 5 72 97 -296 -169
5890 -169 102 -179 31 -401 153 -164 -180 -251 68 -22 -176 49 -162 -193 26 -195 -106 -25 -256 -275 282 -118
5912 -118 -200 -100 -223 -138 -163 -152 158 75 -274 -152 95 243 90 -154 174 -176 -67 -63 178 172 -121 -59 34 -94
5936 -94 175 22 -140 -4 -92 -145 -102 138 -45 -74 256 -48 119 -252 228 126 -162 208 -94 82 104 18
5958 18 -11 49 -11 321 147 -18 94 130 -34 -133 -56 -1 -255 251 -85 160 78 -161 -142 -19 117 -43 17 137
5982 137 -22 22 -53 -39 63 28 -185 -142 -30 157 115 47 108 215 114 -35 301 12 -153 15 167 260 7
6005 7 -20 -237 239 60 -132 20 5 -126 -101 -367 41 274 -191 77 9 61 -183 -22 -32 -10 -244 -23 -290
6028 -290 -208 -185 -68 -82 80 37 150 201 45 -2 -309 63 33 0 -123 85 -433 -42 -108 -58 -181 -18 -111 -136
6052 -136 -191 132 -234 -240 68 54 159 31 191 -21 159 -171 36 223 157 -24 156 -18 174 -130 -198 84
6074 84 -36 183 31 -35 239 158 -111 110 -8 77 -32 88 -172 224 -119 167 179 119 -122 111 64 -199
6096 -199 90 6 265 -38 -209 326 -50 -141 98 -98 263 -139 -76 254 305 -285 239 216 124 160 -267 25
6118 25 139 -49 -161 27 -115 -17 185 -46 -115 30 80 170 25 -328 109 34 -157 -37 11 105 -83 -188 -289
6141 -289 -94 -181 43 67 178 102 -168 25 -275 92 58 -97 -139 -128 -294 -147 24 -262 -350 356 -151 -277
6163 -277 -166 -245 217 114 94 -366 29 -117 6 -1 -140 -121 -87 -57 -83 -23 -34 85 -241 -126 -180 -244 -84 -88 112
6188 112 7 -96 -26 234 158 110 -82 43 -57 54 -211 151 287 209 73 31 51 9 -197 -31 -89 106 310
6211 310 221 136 -35 241 -57 236 110 211 81 272 46 23 238 -86 162 143 205 282 7 84 -176 77
6233 77 238 -37 -28 187 177 -138 167 -294 103 -51 66 129 150 303 -148 -119 -181 -69 -172 133 -93 -110 352
6256 352 -124 -152 -182 140 -51 -238 172 -68 -209 -291 -187 100 61 16 -72 -12 -185 -347 183 -63 -108 -100 -49 69
6280 69 -96 -231 -85 -76 241 -137 25 211 -156 -41 30 -199 -100 84 -112 -123 41 229 87 6 -245 -38
6302 -38 -211 42 -121 -89 22 -26 187 -9 62 -70 127 154 168 98 353 184 -294 -279 66 64 -74 160 143 -77
6326 -77 26 -4 144 -69 -21 -170 -87 300 300 -22 310 -226 96 220 31 164 190 253 -246 7 -128 -135 52
6349 52 59 64 67 117 119 192 86 -74 -1 -183 -40 70 17 -4 -102 20 147 -311 -122 -227 125 28 24 186 22 295
6375 295 -37 12 110 57 -109 51 -54 -128 -80 128 59 -68 -25 116 -109 -69 159 91 123 21 -127 82 -150
6398 -150 197 376 -225 -9 -238 -1 -101 -146 29 26 -221 68 -95 -31 31 65 112 -227 -161 -249 -81 183 -61
6421 -61 296 44 -149 -131 -365 -148 67 -106 -300 30 118 43 -40 341 91 -133 141 -115 79 -67 27 44
6443 44 -232 -109 36 194 79 106 42 -117 261 255 -4 22 -130 199 133 186 152 -1 20 -130 193 -71 -4 -6
6467 -6 -20 40 161 -82 -122 249 74 109 59 286 95 32 -61 -26 120 -230 -87 104 287 -58 315 -101 101
6490 101 174 97 -22 -158 49 -110 10 293 21 -44 -30 163 -65 -130 6 -333 -2 -151 -196 92 288 -44
6512 -44 65 102 -172 65 -41 -125 -144 -461 -111 -136 110 -155 -36 2 -94 44 48 -54 -190 -3 33 253 92
6535 92 -162 -186 -36 66 -110 -22 -186 161 -112 -17 217 276 -11 113 -170 -166 -22 117 214 -79 83 24 81
6558 81 -187 104 94 -50 -317 213 287 -25 357 -18 -24 -1 254 125 -180 87 -106 -37 248 -29 -36 84 58
6581 58 -26 167 -118 173 204 134 -31 -280 -167 9 121 184 -49 43 107 -162 195 83 52 112 72 148 32 210
6605 210 95 92 0 -171 38 20 -84 60 18 109 -106 45 65 -225 20 29 -139 245 43 -1 -30 -25 -170 -256 -53
6630 -53 -263 31 120 -94 202 117 -56 -213 81 -253 -242 -15 9 365 -28 -65 152 -96 -40 -111 -313 90 -113
6653 -113 87 -156 -315 145 -118 213 56 -210 42 -3 24 133 -33 12 -142 -387 -167 -195 296 38 32 -99
6675 -99 79 20 159 51 133 -86 -195 236 -110 -21 2 376 42 -231 184 -121 138 20 212 -269 180 199
6697 199 -139 36 -148 -10 -105 -162 -263 -275 181 -64 58 158 -155 -91 364 130 107 134 140 221 165 247 -67 99
6721 99 72 79 49 -53 274 -37 198 304 189 364 174 -155 -46 16 13 -87 232 -136 -40 -2 141 -132 -7
6744 -7 199 -13 -13 -179 0 -222 124 45 -174 -105 -28 -106 64 -260 -85 -17 -166 -112 -1 -431 -209 -23 123
6767 123 -25 -28 -178 70 61 -59 -126 -54 -106 209 299 -90 21 -214 121 -251 -52 -275 -139 -82 -258 -21 -140
6790 -140 20 201 97 48 168 -49 -164 -154 60 137 164 -350 96 332 -33 -110 54 71 -124 79 -50 11
6812 11 -240 -168 -38 69 -255 -51 -130 8 15 66 208 221 146 258 196 -102 60 96 -221 10 171 238 27 161
6836 161 153 -23 42 -107 39 109 -146 -331 24 -4 109 52 197 150 0 220 -257 330 32 -154 75 201
6858 201 179 -359 67 191 -1 33 50 178 -77 394 -126 -135 74 137 -7 -133 -25 30 335 23 19 -34 159
6881 159 36 237 60 -11 80 -62 59 -190 269 -102 -209 -235 248 -142 -219 -76 -59 -251 209 238 -99 -254
6903 -254 -64 -71 -97 155 -56 -191 44 173 61 -4 144 14 196 87 -229 -106 87 171 -104 -237 -28 3
6925 3 -3 12 -240 123 -108 121 -183 27 -107 61 -24 -100 197 67 87 19 149 -97 -230 216 519 -112 -111 166
6949 166 113 91 169 246 150 14 117 -290 159 198 142 123 194 -15 249 301 -65 -134 -171 108 92 279 72 -36
6973 -36 -50 63 174 215 89 133 -313 -48 86 -159 -26 -95 10 -143 51 -127 187 -109 -36 150 -218 -8
6995 -8 -76 130 63 57 -122 -225 172 276 105 -23 -42 93 220 -350 -62 -138 -227 -176 -140 -75 -253 118 16 75
7019 75 -334 176 175 -232 58 141 -47 -146 56 -334 -239 -266 -181 91 300 122 -74 226 -41 -119 53 -215 -87
7042 -87 -38 91 -39 -77 22 -95 -187 -23 -19 -297 147 -20 -203 -136 196 228 144 120 -74 32 43 300 -41 -251
7066 -251 91 -36 -4 63 124 156 176 140 268 -180 85 135 -123 -116 -174 -10 182 169 98 152 -101 15 -57 62 75
7091 75 -107 -59 207 127 52 21 32 68 -192 74 27 213 -238 -94 -12 295 160 36 -96 180 297 190 -69
7114 -69 28 133 143 -137 -80 -159 74 -79 -41 63 -67 -40 295 -10 209 -46 41 90 -321 330 43 -59 -355
7137 -355 106 -251 -83 1 -6 -124 110 -35 6 15 -43 21 -174 46 308 -7 268 -54 -218 -145 213 103 -11
7160 -11 106 26 102 125 -142 199 -58 59 239 57 7 -133 247 -100 163 -97 -196 -171 -63 267 11 -173
7182 -173 70 -244 51 -1 -212 252 -142 -12 128 -334 294 -7 16 -70 -363 146 233 304 268 -166 131 10
7204 10 78 124 161 -155 115 153 210 -4 103 135 -284 -59 59 -105 64 234 -243 22 5 98 50 -126 -365
7227 -365 -101 235 211 233 -25 -176 83 -89 141 59 -101 -78 40 61 34 -216 77 -57 -99 -123 -194 82 279
7250 279 -161 -118 0 -64 -4 -104 208 -43 -292 45 -43 -49 -543 64 -21 114 121 11 39 242 -130 28 -375
7273 -375 -407 -110 170 72 -313 -179 79 4 221 -51 60 21 161 -262 -8 -32 -61 -107 -221 -13 -118 -78 -100
7296 -100 114 -63 -5 -228 -69 51 -183 181 256 -59 -218 -34 207 139 -80 79 -23 -254 97 81 -135
7317 -135 -63 -127 -130 84 -75 -32 -191 -35 109 -124 -158 -250 119 -21 -45 198 94 22 191 -267 47 109 -21
7340 -21 131 182 101 124 28 -104 26 -442 201 34 -329 171 57 -208 -131 -190 136 -65 117 182 -287 5 -56
7363 -56 135 -5 -68 -58 191 101 -121 -46 -88 106 38 -80 68 28 92 -23 -326 -41 1 149 101 -275 -285 -138
7387 -138 -100 -188 -446 -37 215 -131 -263 -164 149 -70 438 -180 -276 6 125 -95 96 -202 -119 -230 -31 38
7409 38 -159 4 -20 127 306 355 113 33 201 -68 -71 186 -201 -193 18 -208 -166 119 -191 23 -266 -158 -49
7432 -49 -95 -1 123 43 -4 -63 -11 200 -61 100 -93 -25 279 -150 232 233 0 -60 -94 -70 -63 246 450 84 39
7457 39 306 56 238 108 -234 -9 37 219 64 -112 -200 134 -75 -30 216 -114 101 297 272 -129 144 197
7479 197 -259 -89 -107 -54 -25 -354 327 -57 368 5 -56 -53 -225 -180 136 -101 0 69 39 -195 61 -215 -320
7502 -320 253 -184 -7 -39 -104 -187 27 -320 -62 -2 -131 -11 32 -172 -23 -182 -157 -494 56 -57 188 94
7524 94 142 -149 -35 -81 -281 -300 135 -229 -74 11 -301 158 1 96 -11 -267 -100 73 251 70 -20 -74 -200
7547 -200 37 5 -75 -158 -43 -112 81 9 -199 -87 -54 122 -38 -139 -38 -170 -96 10 71 170 -39 -182 40
7570 40 -101 -72 -178 -64 163 119 200 288 174 -93 396 -68 50 150 -42 -265 37 15 120 -6 27 55 466
7593 466 134 64 18 109 -206 -248 102 27 250 -218 4 -265 50 38 -15 -101 -71 -82 40 29 8 -82 57 178
7617 178 -201 150 -47 253 256 -99 267 148 -418 322 289 142 160 197 306 -345 200 124 79 221 -179 105
7639 105 -11 -171 -244 91 -333 48 25 -66 118 95 -51 -246 -40 145 -1 -202 -63 139 82 227 72 -252
7661 -252 -46 -139 70 -188 64 144 68 36 -125 -71 41 -197 110 -161 91 -123 288 52 38 -51 213 123 -103
7684 -103 -356 -255 22 54 -145 -210 93 17 158 -17 327 -207 -18 166 212 187 22 107 25 -70 -16 133 304
7707 304 14 -185 46 57 319 79 123 387 -5 54 108 207 149 -70 -67 12 91 237 -153 300 -155 -242 41 28
7731 28 129 -141 -55 -92 -85 -170 -161 77 226 131 -11 85 56 4 -97 -117 23 69 7 -1 -84 30 108 -69 -92 -90 -35 -222
7759 -222 32 186 -136 -167 -85 158 77 -196 -192 -109 156 -147 50 281 -302 -69 -38 3 31 -217 -97 97 -164
7782 -164 -60 130 -65 7 137 0 -115 91 73 330 80 -174 -122 155 -9 65 7 122 19 74 71 19 18 -137
7806 -137 -79 66 286 70 125 298 140 -158 76 99 24 48 58 -59 220 68 -135 -61 195 -20 45 157 185
7829 185 -23 42 27 -51 -155 220 164 -28 -57 -115 221 -4 72 222 143 46 -44 -180 183 -55 20 268 41 325
7853 325 -188 -276 141 219 -106 55 -107 -80 197 -52 -120 42 187 -90 63 -134 229 -277 -33 162 -8
7874 -8 225 109 -219 -229 -112 161 -105 -258 -177 -104 194 4 -144 -60 -54 381 60 -238 -119 -172 225 46 -250
7897 -250 35 53 62 -12 -131 -75 -115 -115 204 43 -220 53 102 -60 -295 -104 -174 161 179 -29 -217 36 95 -53
7921 -53 -75 -158 -8 -2 321 -75 -58 37 -3 164 47 -115 115 -36 20 311 331 109 65 -73 -7 -82 -66 75 -23
7946 -23 181 -100 -17 176 -46 -106 -390 99 -4 67 -145 -93 -272 117 9 39 229 -13 211 226 -73 -5 -10
7969 -10 144 26 -182 8 15 -86 358 111 -41 101 221 -3 -8 -28 -115 70 30 -386 29 123 -13 -166 228
7992 228 -91 -5 126 100 21 122 67 -287 -38 81 -167 139 155 -222 48 -258 -118 -200 -212 -147 1 149 -101
8015 -101 85 -115 -287 -170 -14 0 -143 203 -126 -267 -68 82 -43 27 0 78 96 54 150 -125 -78 -181 109
8038 109 244 119 138 228 38 347 5 -31 241 62 58 75 -94 53 -144 88 91 -196 -93 -142 32 -155 -1
8061 -1 105 62 -139 64 -60 138 -95 -44 -189 -254 -78 122 -118 129 -6 -86 175 -208 -55 -38 -152 -37
8083 -37 2 98 -15 -44 -47 296 -17 279 -54 -108 25 -14 -68 315 124 7 20 -232 -9 -7 -188 88 47 58 299
8108 299 63 73 -219 -237 30 120 -12 342 -49 2 -255 3 -196 -121 -4 -72 215 52 -62 -90 121 -63
8130 -63 140 40 -174 -170 -189 71 -30 240 19 -48 8 76 -1 -78 -93 -81 209 9 137 108 -159 -170 27 -34 329
8155 329 -92 -80 -107 69 31 -13 2 -105 -68 -479 -148 7 159 -89 154 74 88 101 26 -104 9 -267 86
8178 86 -118 366 -31 41 105 -194 38 -151 -206 -105 -92 14 154
8191A54
$$ Imaginary data points
##PAGE= N=2
##DATA TABLE= (X++(I..I)), XYDATA
0 0 0 0 0 0 0 0 0 -8 8 -8 8 -16 16 -16 24 -32 33 -40 48 -56 67 -80 91 -105 122 -139 159 -179 203 -230 259
31 259 -291 328 -366 408 -455 508 -563 624 -692 767 -848 940 -1039 1152 -1278 1421 -1581
48 -1581 1768 -1985 2240 -2547 2924 -3400 4023 -4877 6131 -8154 11976 -21796 103842 191788
62 191788 53332 52581 70871 74122 36055 57804 93229 116145 97789 84185 69781 69065 70329
75 70329 79069 61160 31795 28505 69178 90269 75627 61334 62019 37312 623 -7668 13690
88 13690 30078 41218 58330 67935 45179 6086 -7444 10635 14324 -10342 -19185 5796 22783
101 22783 15966 10826 13190 4077 -9756 -17668 -25387 -27641 -9380 19493 26228 3797 -21516 -27370
115 -27370 -26319 -39155 -44870 -22425 -1738 -8966 -15061 -2960 -5868 -30569 -38083 -26713 -33612
128 -33612 -53024 -47577 -19963 -5843 -15225 -26254 -32053 -44049 -58850 -59587 -45766 -36816 -31485
141 -31485 -17554 -13572 -35784 -56960 -52420 -45217 -56632 -63674 -51197 -35380 -33207 -35859 -32817
154 -32817 -31578 -43087 -58286 -60011 -53712 -53853 -49061 -28431 -15365 -26981 -43194 -45471 -44619 -49502
168 -49502 -49264 -39679 -28744 -21675 -19232 -20190 -24507 -30911 -33523 -30863 -33167 -39013 -31831 -12076 -4611
183 -4611 -11580 -13972 -10666 -15508 -25751 -26089 -17771 -9801 -3023 2227 2964 -3221 -9657 -11215 -8864
198 -8864 -10024 -12287 -5299 5318 6795 3939 5721 6658 2800 -1021 -2221 -2299 1728 9604 15340 15745
214 15745 13417 10471 8665 7029 4720 6349 15031 21624 21032 19103 19496 19175 17004 15693 15620 16679
230 16679 20307 23929 25641 27252 28763 28245 26108 23514 20163 20606 25097 29006 28551 28217 28120 26415
246 26415 23350 20464 19489 22803 27055 26969 24165 23971 25066 23162 19707 17383 15625 15516 16241 16077 14931
263 14931 14847 15378 14238 10238 5881 5034 8321 9840 7336 5881 6873 5511 1366 -677 -965 -1018 -205
280 -205 1605 1462 -1087 -2573 -1651 -1763 -4682 -8368 -7728 -4241 -3606 -5604 -5459 -3071 -3794 -6375 -8349
297 -8349 -9464 -7646 -3906 -1914 -3399 -4712 -4204 -3810 -7494 -11120 -10457 -5967 -3155 -4703 -4970 -2555
313 -2555 -1556 -4074 -7012 -8572 -8093 -6593 -4341 -3427 -3363 -1851 -809 -3789 -8621 -10864 -7996 -5727
329 -5727 -5548 -4772 -1423 54 -3205 -6527 -7470 -8547 -9883 -8072 -3806 -2279 -2560 -868 685 -2084
345 -2084 -8127 -10432 -7306 -5276 -5593 -4127 592 3323 870 -3427 -5285 -5433 -5551 -4187 -2183 829
361 829 4123 6194 5011 1206 -2025 -2698 -1979 -2002 -1265 3541 8396 9768 7232 4479 2716 1083 -617
378 -617 -670 1756 6154 10785 12010 10306 8247 6315 3470 1533 1753 4478 8064 10372 12481 12398 9468
395 9468 5319 3234 2319 1548 1617 5864 11682 13813 10940 8708 7850 4833 -60 -1609 1506 5827
411 5827 7805 8841 9859 8691 4990 1592 -1007 -2413 -1754 2055 6124 6617 6139 5595 3960 -490
427 -490 -5518 -6277 -3492 -763 296 2796 4928 4073 -279 -4255 -7264 -9106 -8953 -7050 -3746 -787
443 -787 762 0 -2441 -6589 -10164 -12079 -11604 -10380 -7299 -4114 -2874 -3777 -5837 -9112 -12848 -15327
459 -15327 -15302 -12856 -10586 -7746 -5464 -4703 -6631 -10084 -13458 -15911 -15967 -14264 -11861 -8806 -6392 -5302
475 -5302 -6297 -9852 -13399 -15068 -14848 -14037 -12495 -9323 -5946 -4605 -5827 -8262 -10663 -12107 -12743 -12431
491 -12431 -9640 -6184 -2789 -1297 -2088 -4728 -7225 -8786 -9458 -9492 -7204 -3512 157 1929 1127 -674
507 -674 -2172 -3533 -4569 -4908 -2628 1425 4267 5680 6014 4988 3285 899 225 952 2305 4686
523 4686 8243 10571 10365 8359 6511 5838 4429 3637 5638 9170 11928 12985 13448 13133 10968 8870
539 8870 8283 8503 8035 9720 13765 15992 15162 12940 12859 12464 9743 7847 9610 12833 14411 14614 15334
556 15334 15653 13262 10631 9776 9528 9222 10251 13198 15147 14052 12911 13035 10675 6734 5982 8693
572 8693 9862 9009 10090 12760 12173 8241 5487 5787 5401 3520 4501 7001 7934 6920 6377 6095 2775
589 2775 -1028 -942 826 556 198 2624 4527 2626 -1187 -2309 -2721 -5273 -6245 -3861 -1716 -3598 -4581
606 -4581 -2415 -2540 -7014 -10763 -9484 -7809 -9962 -10577 -7418 -4674 -6648 -9956 -11074 -11755 -13375 -13773
622 -13773 -11468 -9690 -10256 -10193 -7899 -9448 -13574 -14875 -12402 -12906 -15340 -13757 -9654 -7989 -10471 -10987
638 -10987 -9111 -11474 -15275 -14886 -10778 -8524 -9737 -8892 -5839 -6639 -10452 -11660 -9863 -9396 -9669 -7253
654 -7253 -5623 -5767 -5749 -3765 -3647 -6663 -8908 -6720 -4252 -4978 -5311 -1067 2083 -15 -3488 -2831 -2235
671 -2235 -3230 -3405 -472 1908 1070 732 2557 2491 -234 -1252 1020 1813 1421 1809 5201 6213 5229 4725
689 4725 4771 2659 334 2025 6276 6252 5031 6792 9847 7661 3163 2795 6657 7170 4578 5262 9481
706 9481 10116 7724 7745 8321 6832 4670 5655 7945 7783 7343 10030 11666 8421 5083 6141 7434 5333
723 5333 4251 7866 10780 8382 6370 8291 9112 5329 2469 4387 6797 5244 4188 6798 8514
738 8514 5796 3130 3281 3619 1373 1008 3837 5382 3148 2291 3866 3121 316 -1590 627 1396 -403
755 -403 -431 1583 2352 -147 -1084 -95 -1318 -4819 -3817 50 25 -2609 -2737 260 -732 -4888 -6023 -3254
773 -3254 -2593 -3637 -3326 -2297 -2556 -3955 -3352 -3366 -5955 -7042 -4497 -2626 -4795 -5841 -3448 -1268 -3878
790 -3878 -7061 -6141 -3899 -5037 -6078 -4323 -2759 -3764 -5063 -4395 -4033 -6208 -6767 -4018 -3300 -5195
806 -5195 -5253 -2377 -2174 -4701 -5950 -4115 -3451 -5215 -5285 -2094 -1364 -3001 -3125 -1427 -1905 -4852 -4137 -1399
824 -1399 -1131 -3328 -2250 672 8 -3110 -2531 -174 -551 -2497 -1270 1394 1402 -323 469 1601 210
841 210 -1347 413 2098 1005 266 2501 4348 2256 -23 1256 3122 1310 21 2102 4500 3268
857 3268 2233 3578 3873 2042 1330 2757 3684 2376 2600 5006 5666 2984 1622 3349 3235 1636 1168
874 1168 3558 5048 3732 3583 4479 3704 1791 1808 3417 2665 1694 3417 6099 5006 1829 2373 3871
891 3871 2511 383 1114 3779 3973 3478 3493 3958 2510 1306 1653 2020 633 907 3474 4682 3482
908 3482 1596 2268 2433 41 -1159 57 1754 1655 1683 2651 2406 1032 -364 260 -352 -2184 -1367 1294
926 1294 2454 813 -70 368 -57 -2151 -3790 -2526 -1486 -1219 -636 4 -552 -1478 -2077 -2935 -4795 -5242
944 -5242 -3410 -1803 -2458 -3249 -2232 -1547 -3341 -5851 -6350 -5161 -4676 -4969 -3713 -3108 -2983 -3545 -4284 -5716
962 -5716 -7138 -6962 -5485 -4526 -4893 -4073 -2743 -2662 -4527 -6103 -6115 -5618 -5871 -5350 -4168 -2675 -2510 -2436 -2953
981 -2953 -4594 -5229 -4442 -3899 -3666 -3266 -1703 347 -202 -2117 -2566 -2114 -2352 -2782 -2162 -658 956 1555
999 1555 1464 487 -321 -470 -394 -701 -863 -9 2641 3544 2906 1744 1958 1838 853 377 145 1839 3425
1018 3425 4116 3996 3172 3238 2863 1999 783 857 2597 4537 4506 4415 4275 4531 3727 2605 1760 1901 3354
1037 3354 5024 5268 4677 4729 5613 5186 3366 2220 2926 4852 5105 5247 5454 6481 6137 5059 4241 3587
1055 3587 3627 4662 5637 5336 5485 6156 6433 5904 3867 3067 3771 4533 4152 4267 4906 5655 5458 4118 3078
1074 3078 2141 2507 2904 2901 2269 2527 3505 3772 2258 674 99 968 732 -754 -1054 531 1525 501 -613
1093 -613 -1437 -1822 -1602 -2249 -3253 -3123 -2066 -1472 -2166 -3318 -3453 -3879 -3961 -4558 -4765 -4681 -4067 -3658 -3837 -4843
1113 -4843 -5287 -5219 -4854 -5057 -6054 -5690 -5052 -4507 -4722 -5317 -5289 -5062 -5487 -5479 -5788 -5959 -5159 -4738 -4515 -5403 -5226
1134 -5226 -4611 -4274 -5348 -5927 -5142 -4085 -4159 -4697 -4775 -3902 -3652 -4414 -4475 -4587 -3908 -3548 -3334 -3728 -3335 -2823
1154 -2823 -2342 -2657 -3268 -2562 -1803 -1765 -1861 -2022 -1216 -714 -1049 -746 -500 -257 -285 412 427 254 378 1504 1944
1175 1944 1037 1213 2039 2759 2690 1885 2315 3223 3153 3110 3187 3423 3828 4528 4536 3884 3374 4098 4655 3923 3419 3837
1197 3837 5304 5111 4083 3694 4490 4667 4031 3598 3808 4166 4360 4457 4089 3091 2989 3343 3417 2332 1935
1216 1935 3239 3950 3128 2228 2164 2564 1943 1212 1416 1331 1403 2017 2663 1833 355 912 1957 858 -1035
1235 -1035 -866 1531 2433 877 -42 1000 1434 331 -340 -557 -92 229 1246 948 222 145 1186 1135
1253 1135 -790 -2075 -730 1003 431 -901 -42 1154 402 -946 -1605 -1421 -1513 -1162 -331 -24 -1002 -1210
1271 -1210 99 -682 -2715 -3337 -1791 -909 -2092 -2826 -1160 -229 -1283 -2557 -2961 -2584 -3411 -3492 -2490
1288 -2490 -1710 -2402 -1758 -918 -2486 -3881 -3915 -2222 -2526 -3844 -2867 -945 -929 -2026 -2648 -2163 -2095 -3443
1306 -3443 -3041 -1830 -1696 -1146 -481 -67 -1088 -1893 -1589 -1000 -1762 -2360 -686 551 543 -377 -153 856 -83
1325 -83 -1087 -1259 -221 287 797 1662 1771 613 601 1210 333 -1067 -635 1207 2374 1256 924 2093
1343 2093 2752 797 -204 162 678 912 1119 2126 2079 1589 1752 2084 389 -958 -147 1835 1592 796
1361 796 1772 2999 2243 533 180 611 485 312 1066 1941 1766 1122 2152 2210 369 -1206 -24 1638
1379 1638 779 211 1449 2942 2016 394 369 801 282 -16 438 1076 1048 1336 2472 1661 201 -652 634
1398 634 850 -303 -403 1508 2706 940 -78 855 1270 -302 -776 373 814 420 576 1557 1211 -191
1416 -191 -319 83 181 -1710 -1333 774 1426 450 -350 520 -278 -1321 -1402 -1030 -1070 -1020 -342 442 -510 -1104
1436 -1104 -1024 -627 -1791 -3330 -2428 -553 -684 -1588 -884 -474 -1204 -2537 -2396 -2267 -2393 -2342 -952 -690 -1819
1455 -1819 -1957 -1179 -1075 -2545 -3463 -2319 -1468 -2289 -2152 -952 -337 -1097 -2031 -1691 -1982 -2965 -2215 -1083
1473 -1083 -491 -1718 -1430 -4 -512 -2719 -2509 -928 -776 -1632 -1818 102 530 -479 -813 -573 -1030 -1576
1491 -1576 -1231 -560 -691 -589 396 1034 60 -1335 -424 362 -550 -1420 100 1425 1149 211 427 1114 554
1510 554 -246 472 822 602 639 1453 2221 1388 868 1821 1929 871 606 1687 2571 1994 1491 2256 2722 1922
1530 1922 1740 2361 2246 1618 1781 2924 2884 1878 2587 3433 2980 1502 1424 3058 2512 1796 2001 3157 3125
1549 3125 2215 2177 2273 1626 1471 1745 1810 1758 1452 2196 2450 1662 927 1662 2251 1088 26 762 1705 1578
1569 1578 1104 1063 1212 907 337 683 241 191 488 1053 1058 -6 -17 712 562 -214 -756 -14 397 198 -208
1590 -208 311 521 -5 -279 -388 -330 -840 -774 222 -216 -997 -274 152 -530 -1254 -1521 -898 -975 -1592 -1441 -837
1611 -837 -1199 -1467 -1604 -1776 -2110 -2479 -2435 -2154 -2629 -2546 -2171 -2048 -2481 -3167 -3197 -2933 -3254 -3374 -2961 -2617 -2709
1632 -2709 -2858 -3021 -3125 -3172 -3364 -3516 -3387 -3255 -3029 -2161 -2500 -2440 -2471 -2404 -2548 -2994 -2889 -2147 -1580 -1397 -1298
1653 -1298 -848 -718 -1310 -1046 -790 -885 -618 -153 213 171 509 575 894 807 264 539 1079 1118 1129 1612 2120 2199
1675 2199 1832 1586 1781 1451 1614 1681 2239 2259 2325 2456 2484 1997 1458 1472 1655 1636 1781 2236 2621 2194 2011 1855
1697 1855 1294 1405 1301 1299 1591 2094 1559 1696 2100 1671 1617 788 940 823 807 1388 1553 1332 1465 1288 833
1718 833 370 622 611 593 435 729 1072 1130 796 366 108 267 -64 258 7 465 592 236 45 -244 -464
1739 -464 -599 -699 -604 -509 -900 -3 -480 -754 -895 -701 -1371 -1361 -1115 -757 -953 -1302 -1048 -822 -1097 -1389 -1234
1760 -1234 -1520 -1553 -1699 -1116 -1121 -782 -764 -1430 -945 -1262 -1405 -1189 -943 -909 -632 -289 -774 -814 -771 -592 -670 -699 -418
1783 -418 -46 230 189 160 183 366 -193 -295 -110 579 139 196 311 514 505 510 403 -50 323 361 392 463 513 502
1807 502 651 225 56 -63 -90 -131 -76 257 511 125 -74 -265 -295 -329 -255 -326 -64 177 -46 92 -378 -577
1829 -577 151 -232 -237 -325 114 443 168 402 94 567 415 -55 90 234 613 1068 1180 1073 919 1421 728
1850 728 847 451 836 1192 1512 1363 1257 1417 1324 954 789 634 1064 1273 1250 1473 1130 1090 1226 926 481
1871 481 509 328 723 868 620 303 469 683 -56 -239 -185 -53 27 -87 345 -149 -231 -355 -256 -807 -1065 -1067
1893 -1067 -686 -337 -611 -422 -401 -690 -1052 -1009 -1009 -893 -791 -690 -575 -465 -917 -562 -870 -1227 -950 -1237 -837
1914 -837 -962 -717 -267 -190 -343 -781 -463 -652 -703 -570 -321 -135 19 -674 -346 -326 -737 -1071 -857 -848 -414 -407
1936 -407 -69 -8 -739 -732 -822 -383 -693 -1074 -854 -268 -323 -237 -373 -64 -465 -675 -888 -1246 -898 -218 3 -472
1958 -472 -1185 -830 -196 81 -1304 -1243 -487 202 -125 -745 -151 413 24 -889 -738 -452 -265 -226 132 -156
1978 -156 -185 183 450 -367 -999 -427 224 152 -308 -128 1087 787 -103 -20 577 -192 -319 124 410 227 9
1999 9 852 581 66 -542 -526 536 -59 -193 309 646 710 -11 505 276 -155 1 615 280 -164 98 1156
2020 1156 1214 266 203 1100 494 -30 219 1470 1543 904 666 1452 1203 729 791 1417 1161 829 1275 1988 1389
2041 1389 1061 1513 2094 1371 255 1190 1797 1448 923 1601 1783 1621 1010 1352 1518 998 959 1386 1800 1031
2061 1031 587 1213 1856 513 185 984 1212 372 218 615 1273 687 68 436 107 -630 -121 615 37
2080 37 -557 -410 618 -7 -1065 -942 -41 -74 -1416 -1034 -186 -592 -942 -676 -569 -978 -1587 -1176 -521 -1401
2100 -1401 -1709 -608 -484 -1036 -1732 -1193 -557 -1496 -2007 -1265 -871 -1411 -1355 -655 -1100 -1735 -1266 -667 -989 -2043
2120 -2043 -1587 -689 -840 -1145 -1478 -459 -584 -1451 -1922 -921 -888 -1445 -1014 -648 -732 -1375 -613 -539 -840 -1504
2140 -1504 -872 -471 -714 -921 -651 230 -465 -1254 -643 -309 -623 -1096 -395 -24 -357 -229 -120 177 -378 -505
2160 -505 555 786 -313 -379 477 742 263 144 321 812 178 264 528 936 853 999 1151 1031 521 503 1093
2181 1093 666 68 1167 1757 1763 891 946 1520 1926 873 522 960 1048 1329 1242 1529 1668 1625 1524 1227 759
2202 759 550 960 1936 1196 1205 1050 1560 1109 433 515 782 798 693 505 824 815 877 1031 229 -39 65 406
2224 406 471 -179 -22 617 655 209 -330 -823 -10 -255 -696 -636 -486 -286 -384 -318 -716 -971 -983 -577 -740 -1394
2246 -1394 -953 -209 39 -915 -1377 -803 -531 -937 -1551 -1305 -788 -653 -555 -767 -976 -790 -797 -794 -1330 -1436 -783
2267 -783 -435 -554 -1147 -778 -331 -377 -1072 -1381 -709 -363 -565 -676 -363 -183 -405 -305 -542 -871 -493 -713
2287 -713 -162 -94 -406 -1 507 -57 -390 -639 -189 -293 -76 37 248 151 68 213 -107 -16 -81 343 302 -105
2309 -105 441 422 890 406 35 181 120 515 357 193 538 1095 776 636 475 113 485 727 52 210 498
2330 498 1133 1046 631 461 836 653 278 386 643 1002 1006 779 824 531 482 581 382 180 171 606 817 835 499
2353 499 603 581 376 108 157 164 805 275 650 286 276 268 196 -231 -220 33 419 405 181 -58 276 750 69
2376 69 10 -224 105 498 199 95 110 529 734 235 -260 -510 -14 158 -140 -196 -25 471 463 -26 -162 -272
2398 -272 193 -127 77 -204 -40 -45 352 -82 -575 -392 -367 -109 -547 -549 -204 19 115 -93 -511 -719 -524 -468
2420 -468 -716 -808 -307 87 107 -267 -466 -312 -59 -402 -806 -592 -373 -6 -167 -288 -345 -368 159 -204 -677
2441 -677 -434 -118 211 -273 -250 -98 46 -391 -557 -603 -444 -148 -394 -247 22 265 -24 -63 -352 -519 -14
2462 -14 -157 45 -465 -280 -118 432 206 -380 -368 -251 -222 -290 -577 -705 -81 205 -60 -672 -630 -379 -468 -657
2484 -657 -579 -372 101 144 -606 -517 -221 -74 -434 -602 -735 -313 53 41 -775 -370 -131 -224 -262 -604 -458 -209
2506 -209 145 -120 -266 -111 145 391 -250 -494 -164 204 237 9 281 309 625 452 305 -208 140 603 377
2527 377 552 261 807 821 1041 494 397 821 893 469 252 803 1147 1025 770 694 494 528 688 521 533 906
2549 906 1368 1250 814 694 921 573 732 374 760 868 832 530 552 798 546 620 436 456 234 456 492 885
2571 885 557 453 607 576 369 -189 -6 95 323 -22 -54 -147 -54 135 -365 -501 -505 -289 64 46 -242 -353
2593 -353 -14 95 -419 -684 -117 -146 -285 -493 -494 -109 -187 -298 -661 -568 -418 -714 -401 -974 -335 -256 -120 -258
2615 -258 -584 -885 -378 -151 -699 -350 -304 -188 -314 -429 -808 -707 -696 -635 -496 -659 -624 -313 50 -33 -787 -388
2637 -388 -495 -571 -786 -827 -631 54 -44 -505 -324 -454 -307 -457 -284 -510 -82 116 -33 -182 168 -16 105
2658 105 -354 -123 -142 131 150 318 450 206 57 156 283 370 -223 -145 581 528 604 408 891 933 256 450 350
2681 350 576 351 754 887 628 831 300 526 372 353 454 400 802 566 608 889 577 342 342 584 223 -2
2703 -2 79 475 647 659 343 299 327 13 86 81 118 175 173 459 -13 -10 127 225 -160 -131 -101 380 158 364 229 58
2729 58 -190 -258 -162 9 -429 -72 103 -142 -273 -353 7 -97 -105 -371 -126 -464 -409 -719 -536 -328 -385 -427 -665
2752 -665 -951 -968 -608 -615 -547 -966 -826 -609 -670 -1145 -945 -740 -568 -691 -773 -883 -654 -884 -542 -541 -750 -848 -801
2775 -801 -474 -655 -617 -262 -452 -685 -539 -248 -35 -454 -394 -125 126 -55 -11 237 323 277 46 133 234 390
2797 390 340 490 682 306 421 567 401 26 606 711 842 546 773 685 949 750 825 917 634 545 843 1251
2819 1251 292 576 695 897 431 257 578 501 709 443 693 195 561 411 121 361 34 278 337 54
2839 54 148 299 168 415 96 59 118 244 56 -132 432 265 32 -150 -57 410 -63 -383 170 183 -68 53
2861 53 212 306 -284 -125 83 -176 45 -244 -31 32 -136 78 -62 272 -245 -54 -94 -482 -178 -188 -115 -323
2883 -323 -137 -215 141 -276 -526 -491 -331 -407 -349 -133 80 -354 -500 -496 -364 -179 -392 -342 -206 -131 -262 -16 27
2906 27 -301 -470 -316 -108 -424 -408 184 217 -284 -90 2 226 28 -263 89 -152 108 30 196 -25 -317 91
2928 91 -12 -379 3 132 -195 -75 -68 265 5 -257 -303 -168 -201 -66 69 -55 242 -212 -185 -41 -125 -196 -543
2951 -543 169 -45 -430 -230 145 -238 -218 -404 -196 -74 45 -32 113 17 -372 212 352 -114 -403 -2 -14
2972 -14 -87 -39 -119 260 225 272 -69 275 -207 186 55 144 503 95 299 407 83 83 169 236 435 -52 115 -8
2996 -8 94 155 14 -169 200 352 -124 186 217 395 300 43 -21 10 208 90 -177 -26 100 307 53 263
3018 263 89 182 67 -177 224 192 88 280 -29 162 -112 -106 80 198 234 121 54 193 399 145 361 230
3040 230 16 197 103 -5 417 198 399 115 82 114 233 235 55 212 297 154 303 328 292 301 219 289 211 182 292
3065 292 211 23 81 259 339 137 -59 -13 -200 -83 -365 231 111 1 77 69 -160 -37 22 45 161 -293 79
3088 79 50 162 -195 -397 -193 -150 -182 -392 -264 10 -147 -141 -253 -186 -181 -354 -240 -414 -436 -315 -338 -197 -290 -431
3112 -431 -189 -534 -753 -311 -302 -404 -195 -756 -599 -309 -114 -286 -386 -664 -626 -428 -416 -509 -497 -444 -224 -181 -431
3135 -431 -659 -569 -211 -128 -443 -540 64 245 -275 -149 -176 -47 121 -208 -195 -144 274 125 -250 41 121 237
3157 237 -68 -252 226 72 406 176 62 143 554 224 226 172 202 453 85 317 -2 185 376 342 -6 86
3179 86 483 584 461 324 299 350 390 449 303 78 103 466 332 267 113 244 487 412 -31 169 464 805 374
3202 374 50 355 582 587 52 135 -26 391 469 222 147 215 356 234 400 -230 199 34 562 -41 -195 210
3224 210 -150 -81 -41 -346 128 -41 45 -379 -170 -369 -228 -294 -375 -707 -335 -126 -239 -503 -451 -344 -433 -433 -673
3247 -673 -582 -698 -605 -619 -505 -659 -485 -463 -921 -1043 -702 -391 -537 -605 -363 -469 -384 -400 -814 -262 -254 -239 -241 -251
3271 -251 -68 -142 -100 -154 -550 -272 -385 200 -120 -214 134 55 50 -50 75 41 268 182 217 139 9 168 408 238
3295 238 426 86 214 313 471 165 328 552 420 73 255 263 175 324 400 265 627 463 463 304 540 495 170
3318 170 513 518 398 494 721 754 206 355 649 987 293 313 549 750 623 142 450 344 320 485 581 26
3340 26 463 550 244 37 358 406 481 503 -318 -54 226 523 192 212 -43 230 -95 -321 -17 -625 -168 -30
3362 -30 10 -303 -399 -121 -237 -465 -257 -256 -269 -413 -308 -425 -24 -119 -62 -298 -556 -704 -408 -61 -333 -488 -301
3385 -301 -520 -251 -538 -523 -286 -14 -514 -636 16 -217 -114 22 -340 -498 -104 -120 -473 -416 -380 169 177 -270
3407 -270 -408 -179 -149 -114 -77 -174 67 -135 24 24 137 44 -294 -120 -35 -397 -59 449 176 -231 52 25 -250
3430 -250 -199 -415 -97 -138 -95 -237 -231 -213 -308 -43 51 -311 -389 -221 70 -282 -254 -5 268 41 -288 -224 -134 -133 62
3455 62 151 -323 -33 91 -58 40 -418 82 80 130 -154 -138 -56 151 -44 -48 -23 118 228 -42 -54 164 161 102 271
3480 271 142 -61 304 215 -138 -163 -107 250 197 38 -8 309 148 -129 -117 -89 43 28 286 -28 77 11 78
3503 78 165 -156 -209 202 -87 -114 -123 -99 56 181 86 -260 -149 161 123 137 -54 -35 258 525 -76 -111 91 65
3527 65 53 14 55 391 288 116 284 -240 321 324 619 418 121 389 293 274 224 -15 -112 275 210 5 452 207
3551 207 348 143 321 1 248 -44 249 141 158 395 181 -35 -146 11 127 262 -39 -108 356 110 228
3572 228 92 116 189 112 16 129 -57 358 202 313 225 -14 -170 112 13 -148 -9 149 155 161 391 -13 -167
3595 -167 -213 -91 -76 -162 -120 78 1 -134 -178 -218 -94 -278 -611 -97 74 24 -269 -595 -312 -74 -402 -524 -349
3618 -349 -481 -291 -463 -316 -483 -489 -169 -551 -891 -502 -595 -253 -408 -340 -579 5 -570 -446 -462 -568 -211 -518
3640 -518 -222 -598 -432 -30 -134 -320 -82 -36 -164 -204 26 -288 -151 -84 -66 -74 -140 25 7 146 -33 14 224
3663 224 335 162 229 359 199 410 97 325 43 37 194 276 429 9 423 397 390 174 135 576 459 341 258
3686 258 572 378 391 81 45 21 287 288 -4 138 368 437 205 204 55 303 18 115 -204 26 193 58 149
3709 149 11 -289 129 397 -68 124 206 514 -8 -69 144 134 -50 -19 -163 79 199 114 -89 -31 -117 -246
3731 -246 28 -68 -121 -130 -93 -199 -17 -181 -209 -84 -152 -156 -300 -250 -212 64 -227 -428 -176 -362 -146 -256 -293 -208
3755 -208 -316 -152 -212 -400 -49 -184 -71 -288 -173 15 -177 -222 -204 -163 -111 -195 -327 -61 -222 -137 11 101 -370
3778 -370 345 264 -25 52 228 -112 278 272 -99 -134 182 273 26 197 -95 221 217 -60 240 152 548 334 120
3801 120 460 396 329 504 297 125 40 308 479 416 187 174 395 402 312 572 328 168 484 417 229 459 170
3824 170 351 214 33 355 341 630 259 260 356 100 264 -16 117 131 122 224 255 -39 102 231 -146 -73 -172
3847 -172 136 143 70 -102 245 -83 -115 -311 -366 1 -247 7 -92 -159 -219 -437 -146 -199 -286 -82 -24 -166 -189 2
3871 2 -38 -434 -280 -54 -125 180 -212 -254 -268 -221 -491 -292 -331 -335 -391 -536 -401 -401 -59 -467 -276 -389 -399 -259 -116
3896 -116 -275 -133 -110 -469 -312 -62 31 -94 -200 -316 -225 -159 -184 -303 -289 -218 60 18 -214 -253 211 -150 -144 -97
3920 -97 -65 124 148 249 168 297 -69 76 317 -9 233 253 100 293 -53 228 275 104 97 106 -183 163 237 84
3944 84 171 236 271 305 -62 123 191 95 221 92 65 102 227 -52 495 292 17 98 155 -64 -32 243 -8 -164
3968 -164 41 -121 5 -225 -93 183 -122 44 -189 51 -331 -5 -140 -238 -154 125 -72 49 -231 -110 -7
3989 -7 149 -382 -305 73 156 94 14 -9 -195 146 4 -171 285 -27 114 237 -26 118 130 -18 117 170 -193
4012 -193 126 -33 154 -36 -126 156 -62 -12 -144 146 -173 9 -161 12 231 337 -128 133 198 390 387 153
4034 153 347 204 71 -41 133 48 93 170 78 218 -99 161 -169 -36 139 -68 0 248 -235 308 38 132
4056 132 185 -56 101 -67 103 277 172 256 114 149 196 -7 110 95 251 331 108 80 239 54 96 1 -181
4079 -181 176 50 167 231 6 191 -102 136 -10 184 203 158 8 -222 12 -159 -58 -463 136 -219 -184
4100 -184 -307 -283 -217 -182 -215 -246 0 -84 -189 -29 -73 -120 84 -33 -71 -439 -164 -101 63 -240 -345 -115 -270
4123 -270 6 -17 -95 -328 -269 195 -63 -258 -227 -31 -273 -133 -194 -74 -181 -21 -508 -261 -17 -37 -309 -169
4145 -169 68 -139 -309 -331 -204 -519 -24 -99 -282 -211 -262 -57 155 -163 139 -98 181 -105 13 -31 -32 61 97
4168 97 94 4 -44 332 198 246 261 345 146 464 224 243 229 332 134 81 526 60 138 249 325 109 -46 332
4192 332 302 -12 174 149 159 60 -205 184 110 168 304 32 -54 -115 43 101 242 53 136 176 355 -209 137 83
4216 83 170 -188 -42 -247 196 148 -203 -171 -200 -119 -38 -118 -52 -93 -246 69 -87 -220 22 -19 -218 -338 -213 101
4240 101 14 -116 -302 -142 -236 -352 -119 -114 -363 -310 -45 -182 -414 -322 -260 -307 -237 -276 -158 -3 -74 -328 -459 -108
4264 -108 -429 -358 -95 -110 -251 -272 -139 -289 180 54 67 -96 -8 -85 -116 85 119 -344 -116 222 316 46 165
4287 165 -64 95 127 163 167 115 -100 -50 -46 50 346 93 187 -9 140 92 241 102 300 -73 -60 111 332 162
4311 162 449 334 212 210 251 176 246 555 111 59 81 9 295 352 2 246 347 293 291 208 51 240 153 84 328
4336 328 231 146 367 250 118 357 464 324 27 15 167 188 63 -8 -31 132 111 -318 -53 -236 -61 -151 186
4359 186 -224 -252 -84 92 -7 -518 -76 -142 -180 -366 -151 -19 -206 -97 -235 -180 -289 23 67 -396 -138 -106
4381 -106 -154 -485 -271 -162 -147 -57 124 -503 7 28 47 -21 -376 -363 -192 -152 -242 -257 -413 -63 -39 -132 -94 -425
4405 -425 89 117 -364 -212 108 121 15 288 -400 142 -28 116 -225 188 59 291 193 -203 -93 195 16
4426 16 -124 400 -164 314 322 251 276 207 222 22 247 318 227 375 -135 102 157 186 -56 272 67 -89 254 120
4450 120 216 207 -1 -259 246 -102 86 -126 134 -4 -70 142 -285 -105 32 -215 121 20 285 310 262 -117
4472 -117 4 113 187 162 52 -216 21 -80 -57 254 185 -243 184 79 -228 -45 -122 4 -172 -262 -146 -168
4494 -168 200 -129 -437 -155 -230 -215 -313 -219 -309 -251 -260 -330 -217 -207 -315 -44 -88 -256 -140 42 -152 -9 60 -106
4518 -106 -75 78 -177 200 75 -99 -54 155 133 62 -22 -106 37 184 121 88 69 34 47 243 439 -75 70 -82
4542 -82 192 173 -68 264 98 173 431 -64 164 105 10 49 200 184 169 407 294 -265 233 212 281 87 69 259
4566 259 -44 261 65 -163 -158 94 23 30 -131 117 51 100 77 -21 -229 322 308 -24 -270 108 -182 139 121 -94
4590 -94 -91 -341 -65 -170 -104 111 156 48 -201 -293 4 -3 -235 -247 71 147 -47 -358 78 -62 226 -71 -189
4613 -189 -94 -257 152 -102 -146 -377 -301 -43 -100 -222 -181 -166 64 67 -73 -306 -123 -289 -41 11 42 109 -75 -14
4637 -14 -294 27 -78 -176 -177 -231 -213 111 -231 -65 101 -337 50 2 -360 -23 177 115 63 -53 169 0 80
4660 80 -246 76 -89 306 262 141 -98 168 279 358 130 46 131 256 150 203 176 119 156 366 127 -180 176
4683 176 -10 168 24 111 189 329 201 -75 -46 385 155 224 0 137 53 108 143 41 -30 72 162 273 -92
4706 -92 -15 16 115 127 -33 -82 177 141 -13 217 85 142 200 202 -71 78 227 251 25 -160 187 74 226 -136
4730 -136 -30 106 41 -149 -265 -183 338 -214 -368 172 -66 -309 -289 -37 52 -113 -179 69 53 54 -95 -95 -196
4753 -196 -364 -160 -213 114 -103 8 -48 -247 159 -51 -225 -292 -108 -2 -128 -362 -261 135 78 -97 65
4774 65 -119 -274 17 -439 87 68 22 26 -148 -99 -125 373 98 116 -83 75 250 86 -40 326 53 152 151 2
4798 2 161 179 -61 78 81 103 -64 651 377 197 271 -45 7 222 165 21 227 98 -150 285 325 32 260
4821 260 97 62 153 130 278 46 82 112 218 150 -230 -17 210 337 288 155 208 103 -314 93 282 -5 -50
4844 -50 20 11 254 -55 100 -43 10 -330 265 117 -184 -380 -348 -23 -130 -264 -370 49 -137 -64 -10 -274 -314
4867 -314 -179 -44 -261 -6 -412 -12 -386 -543 -179 -261 88 9 -195 -185 163 -83 -322 -62 18 -216 -422
4888 -422 -126 -330 -184 -95 -65 16 208 -77 108 267 -255 238 -69 -33 -294 -26 -227 -45 175 14 162
4909 162 -352 -230 -149 143 -99 148 -193 341 65 -8 -34 -14 218 227 -1 46 -184 10 -103 -227 -137 70 534
4932 534 345 50 -122 254 216 126 52 78 175 3 12 235 111 474 54 175 24 284 203 294 -58 -20 -113 159
4956 159 184 124 -12 -309 -94 -232 -73 14 -324 -32 -37 195 -169 -142 -211 64 -135 -148 -128 -210 -20 -11 98 -166
4980 -166 -59 -180 202 15 -172 30 -20 14 -431 -162 4 -101 -40 -71 -111 -151 39 -398 -324 34 264 212 -180
5003 -180 0 -351 -18 -288 29 -229 -264 -84 -163 -33 -66 27 -15 -46 -89 -222 144 145 -37 120 2 419 37
5026 37 227 -11 -27 -177 58 -4 -90 55 50 -7 112 -98 216 112 -8 19 119 225 155 -34 -10 50 270 307
5050 307 38 34 -125 252 126 65 -115 158 -35 -67 194 86 77 185 -87 398 131 244 -174 292 141 -36
5072 -36 350 208 199 -126 -110 -159 -2 -20 -64 -134 -33 64 -128 42 68 -107 11 140 -67 11 237 -1 166 -214
5096 -214 66 -192 -82 -179 361 -20 176 -23 98 -106 -215 197 -133 -56 -300 -120 -168 42 -37 -287 -447
5117 -447 -173 -42 -135 -220 25 -28 151 105 -112 -60 -130 69 -96 -100 173 -16 -86 -23 -215 -203 32 -12 -97 -39 -41
5142 -41 -50 157 -131 10 -2 26 208 -156 18 8 -124 83 -39 133 -1 90 122 248 352 -63 20 263 -11
5165 -11 -27 -4 -160 151 150 303 102 217 322 97 -207 79 65 280 3 -113 116 -42 -256 -137 123 46
5187 46 -102 -27 -176 102 -37 -94 175 53 -155 94 49 121 123 13 325 -7 103 155 75 315 135 287 -39
5210 -39 -271 -71 -28 -47 -123 -26 392 94 43 108 98 -50 113 -128 -243 152 -42 -17 -85 -204 34 -141 -6
5233 -6 -270 -54 128 -198 60 -84 -119 -37 -390 98 -176 -427 -250 -289 -334 -238 -333 24 -152 -216 -92 -181 -60
5256 -60 -164 92 -581 -144 -78 -338 -126 -101 215 32 -2 4 111 -146 -157 -176 200 237 351 39 5 56 105 3
5280 3 94 6 -19 134 80 352 68 82 33 -41 9 6 -121 -13 107 -24 98 124 285 -123 253 351 200 215 -33
5305 -33 301 181 179 143 6 466 -3 -59 170 184 17 132 -43 16 106 -195 -75 104 333 111 112 402 199
5328 199 -72 239 387 115 -54 114 297 33 -150 52 185 2 -485 -45 -381 103 -15 32 -80 -154 -83
5349 -83 -80 -135 121 77 -122 35 35 104 171 -142 -199 -174 268 -192 34 -153 -179 -83 -26 -165 -184 -202 -48 -33 -257 -169
5375 -169 -172 91 95 -207 -112 -169 81 -257 -46 184 -62 52 -233 -119 -92 -15 -132 -160 -205 -243 -20 -131 -184 -165
5399 -165 7 138 -274 -69 -135 -249 202 -273 -12 -150 -67 132 279 73 -177 88 224 -10 254 -51 -20
5420 -20 61 -1 289 116 185 78 11 122 84 203 71 162 146 261 150 -182 284 22 -16 -140 186 23 -89
5443 -89 62 -155 165 104 108 24 39 439 -26 -46 79 182 20 50 267 88 172 209 6 -149 -24 16 -62 17
5467 17 -98 78 -77 -64 26 -26 306 -70 43 49 -121 16 -23 50 163 -89 21 -36 60 224 -105 -147 -198 -262
5491 -262 -28 -52 22 2 -42 -340 -348 -27 -152 -265 142 -90 -434 -227 -39 -76 -138 93 -152 -351 8 -133 -52
5514 -52 82 -204 -356 -29 30 -31 -110 -274 101 17 -149 169 -190 5 -205 -17 -148 -23 42 212 -245 129
5536 129 -130 213 264 256 240 456 199 -360 176 -10 -222 81 93 -324 56 -74 30 19 174 -145 74 63
5558 63 64 3 -1 -13 -82 323 532 5 -100 160 226 19 202 -19 265 22 232 26 144 -80 458 70 -95
5581 -95 -12 -74 286 -48 -69 74 121 75 87 -56 213 -142 198 -195 -370 110 -235 -59 -212 -232 187 -254 -91
5604 -91 63 -234 118 5 8 -210 34 -216 118 -30 -202 -97 -152 -140 -191 -73 141 -100 117 -491 -387 -60
5626 -60 -132 81 -178 122 -1 -123 -245 -277 -83 -61 139 -138 -150 166 131 151 -165 117 138 304 55 97 65
5649 65 -387 62 223 -76 4 203 208 201 -26 29 -9 132 57 44 -262 -100 -16 142 -122 -73 206 57 164 -24
5673 -24 -41 35 240 -171 90 116 -148 -161 7 384 -66 216 161 -90 156 28 -16 286 74 141 -73 236 386
5696 386 380 -109 83 390 217 -21 -3 199 -149 315 141 -87 -118 -61 111 328 -57 53 -107 122 72 -179
5718 -179 41 -78 -83 83 64 137 165 -75 -146 -308 203 -286 20 -264 -203 137 -186 -187 22 -161 69 -3 -255
5741 -255 -264 23 -160 -299 -50 43 -191 29 283 102 -75 -21 -52 219 -216 -150 -236 -209 133 -234 -115 -142 -323
5764 -323 -216 120 167 334 -75 -100 -285 -33 -80 100 72 -102 -7 109 -146 -412 8 -151 -8 157 -41 87
5786 87 249 46 47 -46 -54 280 33 132 -206 212 358 321 88 -116 238 106 127 207 -286 24 74 -52 112 -89
5810 -89 196 151 26 100 83 -65 375 141 58 267 43 -73 -61 -29 -212 114 97 206 -178 -123 -54 158 105 67
5834 67 259 -31 74 44 126 58 168 -35 -297 -50 -187 -148 100 -200 41 194 149 -178 -47 -176 82 -24
5856 -24 -99 10 -61 -126 264 -179 39 240 -362 38 -318 249 23 -100 -177 -53 -53 -194 -193 -215 46 -16 -170 22
5880 22 70 -24 -121 -267 -103 -31 -167 31 -29 -140 -52 -112 -251 -68 -69 9 -210 -145 -137 249 -74 -97 -59 -170 15
5905 15 152 -108 -156 -81 -90 118 30 102 147 139 -154 51 322 279 210 228 -55 170 134 160 42 319 165 168 117 349
5931 349 47 -46 288 105 -167 -99 -120 40 -44 108 -103 12 139 -49 63 171 -23 28 -83 -143 -28 208
5953 208 216 -1 102 -56 -84 93 159 -49 -218 -43 30 -204 76 -215 557 130 -321 106 -407 18 -87 179
5975 179 -297 64 310 -38 23 -155 -188 16 -216 91 -60 -245 106 -25 -205 -64 -134 -200 88 -10 -149 41
5997 41 2 -168 -129 -99 50 -12 25 -178 -118 -29 -91 -235 -312 -84 -59 -31 -203 -27 -132 -36 -139 4 -72 21 37
6022 37 117 -50 133 -51 40 -158 -93 -110 -223 -38 -129 297 12 118 147 194 91 -109 -73 12 -96 22 -9 -47
6046 -47 66 -91 215 245 131 -175 22 305 199 189 109 181 81 155 288 318 36 -17 325 282 -4 5 292 191
6070 191 137 30 137 125 80 105 135 150 16 -43 29 3 -101 131 -20 116 -160 92 -27 -19 -172 119 8 246
6094 246 68 -26 47 -3 -241 88 -127 -68 50 62 12 -85 -324 -33 51 70 -229 -87 -45 -236 -10 -146 -104 -345
6118 -345 -96 -208 -96 43 -149 7 5 -63 -174 -58 49 -137 -100 -58 127 -25 -256 -113 70 -309 -198 82
6140 82 -231 28 -168 -204 -151 -259 5 -179 104 29 -56 -178 355 62 -141 170 347 -82 85 195 12 15
6162 15 -54 228 -291 -34 122 302 373 230 62 -221 151 30 -204 236 44 19 -105 -66 255 107 63 231
6184 231 -4 -140 85 255 81 113 210 -15 83 -12 69 -358 18 -303 -8 -161 70 137 178 37 -90 -147 -299
6207 -299 189 90 -63 -79 -93 -48 -114 151 -30 128 -70 3 150 -119 -428 -20 1 -149 252 88 -72 -45 -50
6230 -50 -157 -201 -312 -219 -13 -128 -174 -33 91 -79 -16 14 -189 142 -189 -104 -87 -335 -43 21 59 99 -2 -145
6254 -145 389 -71 -213 -208 77 79 230 -170 23 -20 -303 -41 51 107 192 58 86 -42 106 0 -108 39 -10
6277 -10 -103 -8 -76 -135 37 4 -20 191 -55 166 -93 133 -215 89 45 -172 -14 -165 157 170 198 127 9 81
6301 81 202 8 -150 16 266 208 40 339 117 135 102 165 330 -396 267 104 76 172 -114 -31 216 121 -283
6324 -283 121 31 9 -145 -60 207 133 -31 48 88 81 7 -73 171 39 187 140 -22 23 68 -141 197 -271 134
6348 134 114 -5 -31 -122 23 -259 -67 -258 -281 -210 -248 21 -34 22 -51 -41 -60 -50 -197 193 -245 -153 155 -192
6372 -192 -7 92 -87 -55 143 152 -212 -1 231 143 22 -218 -337 -87 -166 -125 -115 43 112 268 18 116 86 -45
6396 -45 76 -5 -178 21 -348 285 242 96 231 81 -106 101 170 -71 -5 -83 180 156 34 263 -87 -88 -258
6419 -258 -86 92 -89 81 19 -56 -195 35 195 -175 -22 150 -136 -41 -347 181 65 401 167 -15 -151
6440 -151 125 -114 161 -92 162 196 100 12 201 69 -63 -1 27 169 -43 -54 3 72 -198 208 -170 229 -190
6463 -190 150 225 -50 -50 -249 93 -339 -232 -110 -260 187 187 -40 72 176 169 319 35 -247 -108 50 -207
6485 -207 -115 264 -79 -48 167 -224 69 -190 19 -34 -160 -73 88 132 -305 20 -443 20 73 143 -165 -7
6507 -7 69 -92 121 97 -198 -3 -18 -58 -78 -92 10 -12 -216 59 -336 124 -75 187 7 102 258 -133 239
6530 239 -224 140 -133 242 -129 -250 53 41 41 175 158 -236 77 59 49 -204 221 -191 -266 190 53 76 55
6553 55 184 229 61 70 33 168 169 -181 69 183 90 142 -63 112 171 31 129 -24 -45 -103 -293 152 -98 186
6577 186 171 -79 387 132 105 98 271 -135 -59 0 145 273 -73 -180 46 241 144 210 362 -329 -11 159 -47
6600 -47 242 -5 -220 261 -55 -332 -265 -203 54 -107 -39 -20 -160 -108 24 12 -94 20 -73 -160 -81 -166 -55 -201
6624 -201 -41 21 -147 -41 -60 -200 85 49 167 100 -183 206 -25 -124 -13 233 -2 77 54 -38 115 98 229
6647 229 -88 -195 -2 -249 136 -123 71 -146 86 2 262 302 -7 168 -93 -217 -67 66 16 225 90
6668 90 -288 215 151 160 -261 -88 23 -14 358 -121 103 -66 300 70 -32 99 135 200 -68 132 -52 159
6690 159 -172 364 56 -209 3 161 -24 103 219 391 172 90 -218 94 290 280 94 -107 -40 6 -74 -226
6712 -226 -177 91 -42 -104 -322 -251 186 -103 108 16 76 -1 -68 -97 -118 -44 -137 -198 158 -329 -198 252 -169 237
6736 237 -151 -177 -48 -13 -80 -249 51 -61 -252 229 177 -173 -10 -97 -120 -320 101 54 232 65 -93 -65 -316
6759 -316 116 -63 -116 -40 -69 7 13 7 -169 20 200 -77 -54 338 3 -111 -278 -189 -291 100 -99 -135 105 -121
6783 -121 306 196 203 125 -176 49 63 -208 185 -46 133 -57 335 73 193 58 25 4 -44 53 134 36 -46 -14
6807 -14 -256 162 156 126 172 151 93 -84 163 19 51 372 182 214 211 116 -77 270 121 -26 -45 -1 88 -11 -3 41
6833 41 254 -43 -102 0 60 184 171 1 -303 -53 -94 -281 30 243 -70 -209 -130 -132 75 -156 -181 -43 59
6856 59 176 -183 -15 46 -2 119 115 -87 42 14 55 71 -57 -284 181 110 -121 74 -147 35 70 228 87
6879 87 -41 -217 -63 -118 115 139 -144 64 -136 -37 -49 -22 248 205 -122 104 -79 -71 14 -63 233 24 127 -150
6903 -150 177 -182 -13 -140 -68 6 -99 86 -170 -135 318 -202 14 18 -56 245 283 77 -142 -97 2 -199 175
6926 175 38 170 45 -213 -2 329 107 -115 274 -162 145 346 427 342 -6 -123 62 125 -81 164 170 227
6948 227 85 -131 156 -90 0 -191 -139 47 251 -158 457 130 30 -89 22 -153 -12 19 199 -412 -229
6969 -229 60 -125 250 172 -57 3 41 90 135 109 89 92 161 -116 -37 -34 -168 -102 -217 -173 -160 226 34 -181 -22
6994 -22 238 -65 -103 -49 342 43 151 -285 -244 -14 -126 268 43 66 -267 -238 -18 -196 36 -27 -334 -30
7016 -30 226 -319 -96 -48 64 76 38 -43 -155 237 -85 -1 193 -140 80 224 145 7 -80 154 -79 81 25
7039 25 -78 -251 -287 -79 -42 -5 -103 25 170 -77 49 -144 15 171 -233 365 -61 -260 144 22 -66 55
7061 55 67 21 -160 83 -27 61 124 236 -72 115 -125 -215 -111 -147 172 168 157 155 -57 286 213 198 -115 -227 21
7086 21 179 -252 98 -298 43 -220 11 -79 -170 -78 -104 25 35 166 336 -34 72 -232 -263 -59 107 74 -459
7109 -459 88 185 -113 43 -35 -114 -186 48 -229 -188 -74 -165 -48 133 -151 -221 -243 15 315 -82 82 226 -102
7132 -102 -149 95 14 -141 127 -121 77 -42 10 -134 -97 -79 -32 -27 -287 -14 -140 -127 394 0 -8 -381 -184 -85
7156 -85 34 515 -88 48 -141 -51 32 360 124 -22 103 -125 11 249 44 101 78 -15 -66 -138 159 169 -9
7179 -9 57 75 -84 18 14 321 156 64 -84 343 87 3 -135 5 -132 328 61 182 164 75 87 -210 72 -134
7203 -134 -112 282 147 126 99 90 -160 339 65 -112 161 -99 -118 249 -156 -299 -200 -79 150 31 -129 -140 49
7226 49 -110 185 234 83 -152 -112 -102 -309 80 112 -53 -25 -139 -206 -37 16 140 -199 -4 -49 -3 173 140 -136
7250 -136 101 -76 98 -318 -83 -93 -174 233 293 -143 187 189 -75 -99 -116 -196 30 -196 90 202 -28 -241 252
7273 252 91 98 199 -133 -106 -1 87 -209 152 119 126 10 211 -146 -60 -70 -111 94 -177 -145 -8 136 -148 14
7297 14 -58 14 73 -84 -77 -184 24 -23 306 234 -40 334 214 208 -97 9 479 81 -97 2 289 210 -33 -165
7321 -165 -58 13 -149 -87 -56 89 6 30 96 164 -162 43 96 292 144 57 -4 -24 -76 137 -101 -271 -39 52
7345 52 312 -50 -189 -82 30 -68 32 -290 -368 -173 -96 105 -89 -144 -114 -302 -57 -13 219 -75 -183 -184 -16
7368 -16 -78 -137 -54 180 -63 -135 104 225 -340 -158 106 266 -11 -80 121 44 78 33 -184 34 174 68 -25
7391 -25 25 89 178 235 33 -98 2 -66 -108 -147 55 74 -98 109 -94 112 92 91 -292 143 -42 106 354 -94
7415 -94 182 53 230 0 -39 341 69 10 58 -185 -65 -52 108 314 -183 -89 141 133 17 231 190 158 91 -168
7439 -168 -393 72 96 -330 82 134 148 213 -27 12 -155 14 92 202 125 135 -159 23 150 35 -97 -334 153
7462 153 138 -152 -176 -62 -48 -7 81 93 -88 -107 75 148 -58 96 -26 219 99 24 68 -27 -112 206 -295 -118
7486 -118 108 -93 142 -15 -215 -89 -79 -62 -83 203 -84 -1 82 218 17 -283 43 -163 232 -93 -226 75
7508 75 -281 89 -17 -5 9 -144 347 -231 -10 -115 39 -74 106 56 31 -97 39 111 144 -72 -3 -433 -156
7531 -156 -40 325 -52 166 103 5 9 -125 -29 357 38 -50 -173 127 116 87 -100 -11 48 92 -48 103 -10 -69
7555 -69 109 80 -226 5 17 177 -19 -165 263 -6 172 -98 361 -64 -188 -129 -70 -262 91 84 -197 -160 -84
7578 -84 -236 -116 -10 -389 387 -2 122 160 -35 53 106 123 -14 -90 -24 -148 59 -202 128 329 -203 -109 58
7601 58 82 -246 -9 -5 -166 -35 -65 -113 -266 60 -47 4 -187 -30 -26 41 186 276 236 -165 -235 -62 -194 -183 43
7626 43 -201 252 -178 -12 21 60 -50 -202 -30 -59 -54 82 105 334 -359 0 -8 58 -114 37 -37 5 -95 -50
7650 -50 169 14 -14 33 244 -258 -8 -157 53 30 -1 93 465 120 -94 -290 75 -149 127 91 -5 -37 151
7673 151 148 -5 -127 -293 94 -132 -1 -26 -116 236 14 255 -13 247 196 10 -45 255 198 157 -24 160 1
7696 1 -12 149 -373 -79 7 1 -18 128 -26 17 34 -176 -122 -182 61 1 128 360 35 120 -13 154 27 55 -181
7721 -181 -122 15 144 -52 -299 140 101 33 43 20 -263 138 -174 155 -138 -95 -129 201 61 185 -187 132
7743 132 212 50 -311 90 -50 14 115 -153 169 -78 54 60 -45 -232 74 -83 -280 -47 -155 -272 -284 -112
7765 -112 89 -320 -27 87 157 -165 -167 -197 -148 -150 229 -82 -110 131 168 78 131 -118 -22 170 80 -319 -244 181 -164
7790 -164 212 178 275 83 -78 90 36 -67 -31 -163 359 68 -5 108 80 -203 -256 24 22 160 245 179 63 139
7814 139 178 -99 49 105 23 72 56 22 -45 114 -41 39 -25 98 -217 -34 -2 109 -97 44 -190 -89 -101 83
7838 83 -151 -140 8 81 143 -182 146 -120 -79 212 164 -358 -187 73 58 183 23 16 -271 -66 141 74 -183
7861 -183 -166 63 -228 107 3 214 -118 79 -331 79 -89 17 -47 -322 -47 43 2 -80 180 -195 10 -88
7883 -88 -57 -386 82 -30 -29 274 -181 -251 88 -26 -35 -230 -63 -80 -118 28 47 -223 105 54 63 -23 -374 66 183
7908 183 -8 23 62 302 39 -3 -33 67 41 113 28 -169 -80 -65 -182 19 174 -37 164 81 63 55 149 -43 0
7933 0 237 -121 11 248 103 -21 71 87 267 -130 -10 -42 -60 -116 -210 -235 17 -53 -196 -30 -33 2 171 -155
7957 -155 50 29 -319 -50 107 205 75 -269 -192 -301 71 -139 348 -165 -108 180 324 -22 -264 -12 -43 -39
7979 -39 -189 -231 83 -267 235 106 -58 -189 68 -70 17 130 142 159 -19 27 -419 87 -195 132 2 -10
8001 -10 86 -52 56 328 -72 -411 17 -13 -45 73 -1 -93 232 -91 330 -305 -229 -233 26 130 -157 -12 51
8024 51 -189 -321 -204 -137 44 -101 -87 27 -25 -50 3 -4 -125 -250 -90 -79 -4 180 3 60 -171 -54 -104 86
8048 86 -79 -34 40 -167 185 55 74 196 -132 45 -154 -58 19 -98 -153 41 69 8 -31 108 22 -55 255 0
8072 0 -27 105 -119 -229 104 -61 -154 -123 220 36 -82 84 114 -291 50 200 230 32 1 113 234 -97 -81
8095 -81 -85 134 72 169 -72 23 27 240 -77 163 -78 -121 -129 102 -36 -93 -34 -223 -20 100 115 -30 -20 -74 -141 102
8121 102 -64 109 8 185 -44 -197 -313 -205 -172 -106 299 -371 -167 98 95 -260 -199 332 9 144 376 -62
8143 -62 -47 -121 364 10 -40 59 114 187 50 -18 141 -255 104 21 -12 -43 -219 298 147 -77 -120 82 -217 183
8167 183 44 7 -23 -379 -170 -385 241 216 21 -238 -154 -154 -50 -226 164 -83 -11 -105 -2 390 5 133 293
8190 293 254
8191B54
##END NTUPLES=NMR FID
##END=
