##TITLE=1H_LR-695-i
 CDCl3, 8 sc, 
 18.10.2019
##JCAMPDX= 6.0         $$ Bruker NMR JCAMP-DX V2.0
##DATA TYPE= NMR FID
##DATA CLASS= NTUPLES
##ORIGIN= UXNMR, Bruker Analytische Messtechnik GmbH
##OWNER= root
$$ XWIN-NMR		Version 3.5
$$ Fri Oct 18 16:07:10 2019 Russian Standard Time (UT+4h)  she@DPX200
##.OBSERVE FREQUENCY= 200.1315
##.OBSERVE NUCLEUS= ^1H
##.DELAY= (6, 6)
##.ACQUISITION MODE= SIMULTANEOUS
##.ACQUISITION SCHEME= undefined
##.AVERAGES= 8
##.DIGITISER RES= 18
##SPECTROMETER/DATA SYSTEM= spect
##.PULSE SEQUENCE= zg30
##.SOLVENT NAME= CDCl3
##.SHIFT REFERENCE= (INTERNAL, CDCl3, 0, 15.7039)
##AUDIT TRAIL= $$ (NUMBER, WHEN, WHO, WHERE, WHAT)
$$ ##TITLE= Audit trail, XWIN-NMR		Version 3.5
$$ ##JCAMPDX= 5.01
$$ ##ORIGIN= Bruker BioSpin GmbH
$$ ##OWNER= she
$$ F:/spectra/data/she/nmr/H-F/1/audita.txt
$$ ##AUDIT TRAIL=  $$ (NUMBER, WHEN, WHO, WHERE, WHAT)
(   1,<2019-10-18 16:05:53.75 +0400>,<she>,<DPX200>,
      <created by zg, POWCHK disabled, PULCHK disabled
       configuration hash MD5:
       00 E9 B6 7A A2 85 ED C7 34 08 36 98 17 FE 4E 26
       data hash MD5: 16K
       EF 85 6D 08 CF E3 FF 56 1F A6 6E F4 87 0B AF 1F>)
$$ ##END=
$$ 
$$ hash MD5
$$ DE D2 43 F1 E8 DF 14 66 1B 75 D6 FB A5 4A AD 29
##$RELAX= 
##$RELAX= 
##$RELAX= 
##$RELAX= 
##$RELAX= 
##$RELAX= 
$$ Bruker specific parameters
$$ --------------------------
##$DU= <F:/spectra>
##$EXPNO= 1
##$NAME= <H-F>
##$PROCNO= 1
##$TYPE= <nmr>
##$USER= <she>
##$AMP= (0..31)
100 100 100 100 100 100 100 100 100 100 100 100 100 100 100 100 100 100 
100 100 100 100 100 100 100 100 100 100 100 100 100 100 
##$AQSEQ= 0
##$AQ_mod= 1
##$AUNM= <au_zg>
##$AUTOPOS= <>
##$BF1= 200.13
##$BF2= 200.13
##$BF3= 200.13
##$BF4= 200.13
##$BF5= 200.13
##$BF6= 200.13
##$BF7= 200.13
##$BF8= 200.13
##$BYTORDA= 1
##$CFDGTYP= 0
##$CFRGTYP= 5
##$CHEMSTR= <none>
##$CNST= (0..31)
1 1 145 1 1 1 1 1 1 1 1 1 1 1 1 1 1 1 1 1 1 1 1 1 1 1 1 1 1 1 1 1 
##$CPDPRG= <>
##$CPDPRG1= <>
##$CPDPRG2= <>
##$CPDPRG3= <>
##$CPDPRG4= <mlev>
##$CPDPRG5= <mlev>
##$CPDPRG6= <mlev>
##$CPDPRG7= <mlev>
##$CPDPRG8= <mlev>
##$CPDPRGB= <>
##$CPDPRGT= <>
##$D= (0..31)
0 1.2 0 0 0 0 0 0 0 0.06 0 0.03 0 0 0 0 0.0002 0 0 0 0 0 0 0 0 0 0 0 0 
0 0 0 
##$DATE= 1571400353
##$DBL= (0..7)
120 120 120 120 120 120 120 120 
##$DBP= (0..7)
150 150 150 150 150 150 150 150 
##$DBP07= 0
##$DBPNAM0= <>
##$DBPNAM1= <>
##$DBPNAM2= <>
##$DBPNAM3= <>
##$DBPNAM4= <>
##$DBPNAM5= <>
##$DBPNAM6= <>
##$DBPNAM7= <>
##$DBPOAL= (0..7)
0.5 0.5 0.5 0.5 0.5 0.5 0.5 0.5 
##$DBPOFFS= (0..7)
0 0 0 0 0 0 0 0 
##$DE= 6
##$DECBNUC= <off>
##$DECIM= 24
##$DECNUC= <off>
##$DECSTAT= 4
##$DIGMOD= 1
##$DIGTYP= 9
##$DL= (0..7)
0 120 120 120 120 120 120 120 
##$DP= (0..7)
150 150 150 150 150 150 150 150 
##$DP07= 0
##$DPNAME0= <>
##$DPNAME1= <>
##$DPNAME2= <>
##$DPNAME3= <>
##$DPNAME4= <>
##$DPNAME5= <>
##$DPNAME6= <>
##$DPNAME7= <>
##$DPOAL= (0..7)
0.5 0.5 0.5 0.5 0.5 0.5 0.5 0.5 
##$DPOFFS= (0..7)
0 0 0 0 0 0 0 0 
##$DQDMODE= 0
##$DR= 18
##$DS= 0
##$DSLIST= <SSSSSSSSSSSSSSS>
$$ [...]
##$SUBNAM2= <"">
##$SUBNAM3= <"">
##$SUBNAM4= <"">
##$SUBNAM5= <"">
##$SUBNAM6= <"">
##$SUBNAM7= <"">
##$SUBNAM8= <"">
##$SUBNAM9= <"">
##$SW= 24.0689530833862
##$SWIBOX= (0..15)
0 0 2 0 0 0 0 0 0 0 0 0 0 0 0 0 
##$SW_h= 4816.95568400771
##$TD= 16384
##$TD0= 1
##$TE= 0
##$TE2= 300
##$TE3= 300
##$TEG= 300
##$TL= (0..7)
0 120 120 120 120 120 120 120 
##$TP= (0..7)
150 150 150 150 150 150 150 150 
##$TP07= 0
##$TPNAME0= <>
##$TPNAME1= <>
##$TPNAME2= <>
##$TPNAME3= <>
##$TPNAME4= <>
##$TPNAME5= <>
##$TPNAME6= <>
##$TPNAME7= <>
##$TPOAL= (0..7)
0.5 0.5 0.5 0.5 0.5 0.5 0.5 0.5 
##$TPOFFS= (0..7)
0 0 0 0 0 0 0 0 
##$TUNHIN= 0
##$TUNHOUT= 0
##$TUNXOUT= 0
##$USERA1= <user>
##$USERA2= <user>
##$USERA3= <user>
##$USERA4= <user>
##$USERA5= <user>
##$V9= 5
##$VALIST= <valist>
##$VCLIST= <CCCCCCCCCCCCCCC>
##$VD= 0
##$VDLIST= <DDDDDDDDDDDDDDD>
##$VPLIST= <PPPPPPPPPPPPPPP>
##$VTLIST= <TTTTTTTTTTTTTTT>
##$WBST= 1024
##$WBSW= 4
##$XGAIN= (0..3)
0 0 0 0 
##$XL= 0
##$YL= 0
##$YMAX_a= 36707
##$YMIN_a= -36252
##$ZGOPTNS= <>
##$ZL1= 120
##$ZL2= 120
##$ZL3= 120
##$ZL4= 120
##$ABSF1= 10
##$ABSF2= 0
##$ABSG= 5
##$ABSL= 3
##$ALPHA= 0
##$AQORDER= 0
##$ASSFAC= 0
##$ASSFACI= 0
##$ASSFACX= 0
##$ASSWID= 0
##$AUNMP= <proc_1d>
##$AZFE= 0.1
##$AZFW= 0.1
##$BCFW= 1
##$BC_mod= 2
##$BYTORDP= 1
##$COROFFS= 0
##$CY= 11.3945322036743
##$DATMOD= 1
##$DC= 2
##$DFILT= <>
##$DTYPP= 0
##$F1P= 20.1720416913024
##$F2P= 0.152960286110954
##$FCOR= 0.5
##$FTSIZE= 0
##$FT_mod= 4
##$GAMMA= 1
##$GB= 0.15
##$INTBC= 1
##$INTSCL= 1
##$ISEN= 128
##$LB= 0.24
##$LEV0= 0
##$LPBIN= 0
##$MAXI= 10000
##$MC2= 0
##$MEAN= 0
##$ME_mod= 0
##$MI= 1.114404
##$NCOEF= 0
##$NC_proc= 0
##$NLEV= 6
##$NOISF1= 3.799351
##$NOISF2= 2.8
##$NSP= 1
##$NTH_PI= 0
##$NZP= 0
##$OFFSET= 15.70392
##$PC= 1
##$PHC0= -9649.554
##$PHC1= 13.80089
##$PH_mod= 1
##$PKNL= yes
##$PPARMOD= 0
##$PSCAL= 0
##$PSIGN= 0
##$REVERSE= no
##$SF= 200.130013532006
##$SI= 16384
##$SIGF1= 3
##$SIGF2= 2
##$SINO= 400
##$SIOLD= 16384
##$SREGLST= <1H.CDCl3>
##$SSB= 0
##$STSI= 0
##$STSR= 0
##$SW_p= 3612.71676300578
##$SYMM= 0
##$S_DEV= 0
##$TDeff= 0
##$TDoff= 0
##$TI= <>
##$TILT= no
##$TM1= 0
##$TM2= 0
##$TOPLEV= 0
##$USERP1= <user>
##$USERP2= <user>
##$USERP3= <user>
##$USERP4= <user>
##$USERP5= <user>
##$WDW= 1
##$XDIM= 8192
##$YMAX_p= 0
##$YMIN_p= 0
$$ End of Bruker specific parameters
$$ ---------------------------------
##NTUPLES= NMR FID
##VAR_NAME=  TIME,          FID/REAL,        FID/IMAG
##SYMBOL=    X,             R,               I
##VAR_TYPE=  INDEPENDENT,   DEPENDENT,       DEPENDENT
##VAR_FORM=  AFFN,          ASDF,            ASDF
##VAR_DIM=   8192,          8192,            8192
##UNITS=     SECONDS,       ARBITRARY UNITS, ARBITRARY UNITS
##FACTOR=    0.0002076,     1,               1
##FIRST=     0,             0,               0
##LAST=      1.7004516,     0,               0
##MIN=       0,             -36252,          0
##MAX=       1.7004516,     36707,           0
$$ Real data points
##PAGE= N=1
##DATA TABLE= (X++(R..R)), XYDATA
0@%%%%%%%%%%%%%%%%%%%%%%%%%%%LrJ4j6J6j6J6j6J6j6J8k4K9l1L2l4M0m5M9n4
47b8O0o8P7q8J01j18J40j69K10k74L86o14J261o341k9031J818L2598L2228J344
66C3492k9874l2717m708K6758L2484P721k3153l1440j0419J9060K9672J2787j4736
79A4927k7314j4622J0318K4261J5770n710k0500j6593J049J6448J6925L406j2106
92F259j6697p537P444J5892J1390k560j4690j4849k272J3046J7702P041j0759
105I410k0073j1806Q197K2006J6219n386k3248k0185K275K3807K3794J061k3797
118B274k6893m340K3233K9274P555k1924l1003j0730K0173L2108J3596j8016l2380
131a7073j6058J5420L1878J8164j2452l0725j9851R381K8949K0964o237k6507
$$ plain form
0 0 0 0 0 0 0 0 0 0 0 0 0 0 0 0 0 0 0 0 0 0 0 0 0 0 0 0 0 3 -6 8 -8 8 -8 8 -8 8 -8 10 -14 15 -16 16 -18 22 -23 26 -28
47 -28 32 -36 41 -47 54 -64 76 -93 117 -157 229 -385 876 -5465 -34496 -32678 -80 32148 33492
66 33492 3618 -29099 -33807 -7049 25435 33156 10003 -21437 -31856 -12796 16876 29663 14927
79 14927 -12387 -27009 -16691 7570 23340 17630 -2870 -19463 -18414 -1966 14959 18365 6259
92 6259 -10438 -17975 -10531 5361 16751 14191 -499 -15348 -17620 -4574 13128 20169 9410
105 9410 -10663 -22469 -14272 7734 23953 18567 -4681 -24866 -22591 1216 25010 26071 2274
118 2274 -24619 -28959 -5726 23548 31103 9179 -21824 -32554 -12381 19727 33323 15307 -17073
131 -17073 -33131 -17711 14167 32331 19879 -10846 -30697 -21316 7633 28597 22360 -4147
143d147k1500L035K3533K1526R9k0142k0961l045J6342J9837N827j2262j8290
156a0148q292Q026J6263J0394l752j3803j2017n94J0890J3275M868p727j4109
169f726q859M283J4398J2597o19j4277j5989l121J3706J8882O808j2602k1287
182a2806j0454J1055K3194J3949r247k4565j7055P132K5222J9810m774k5305k2154
195b5998K242K4822K3954K82k3714k5177k836K2064K5839N300j9992k5962p499
208b6675J7579K5347R408j4698k4198j1121J1642K2556J2432q481k0367j3334
220a9910N191J7767J3842j903j4785j3946j272J1552J3599M223p997j2802p018
233a3459M256J1717R526n07j0226j1626l240Q374J3343O972o196j4693j0495L812
$$ plain form
143 -4147 -25647 -22612 921 22447 22546 2404 -18557 -21602 -5260 14577 20404 8142 -10148
156 -10148 -18440 -10414 5849 16243 12491 -1312 -13329 -13923 -3033 10242 15110 7383 -6726
169 -6726 -15585 -11302 3096 15693 15074 797 -15192 -18313 -4607 14275 21083 8481 -12806
182 -12806 -23260 -12205 10989 24938 15691 -8874 -25929 -18797 6425 26235 21461 -3844 -25998
195 -25998 -23756 1066 25020 25302 1588 -23589 -26425 -4361 21478 26778 6786 -19176 -26675
208 -26675 -9096 16251 25659 10961 -13237 -24358 -12716 9840 22272 13791 -6576 -19910
220 -19910 -14719 3048 16890 14987 202 -13744 -15016 -3464 10135 14358 6361 -6441 -13459
233 -13459 -9203 2514 12040 11533 1307 -10319 -13559 -5185 8158 15130 8934 -5759 -16254 -12442
247a2442J5591J3722j185j5973j6663j601J5979J9252M344j5501k1345p024J4595
260h251K2886R634j3283k3927j2029J1652K4433J4139r764k4349j5912P658K3752
273F639J7311n466k2651j8223L194K1041J8698r14j8985j8752j316J6583J8399
286A5558L382j3920j7542n277J0977J6262O948p851j4632q335M632J2591R454
299A2247j345j0293j0271j853P733J0697M937m959j0790p809J973J0508J0426
312A1201J117r894j2775m209Q939J4726P233p656j6287j0146O120J7392J2815
325A8576m333j8073j5199K358J8285J7244l13j8041j8911j777J7401K0145L772
338B1134j6339k0900n693J4948K1197P430j3244k1016q941J1258K0359J0271r114
$$ plain form
247 -12442 3149 16871 15686 -287 -16950 -18551 -2572 16680 21024 5523 -15822 -22846 -8251
260 -8251 14635 24269 10986 -12941 -24970 -13318 11115 25254 15490 -8859 -24771 -17113 6639
273 6639 23950 18484 -4167 -22390 -19196 1845 20543 19629 644 -18108 -19424 -2841 15558
286 15558 18940 5020 -12522 -17799 -6822 9440 16388 8537 -6095 -14430 -9798 2793 12247
299 12247 10902 609 -9662 -11515 -3782 6915 11852 6893 -3897 -11706 -9733 775 11201
312 11201 12318 2424 -10351 -14560 -5621 9105 16338 8682 -7605 -17751 -11631 5761 18576
325 18576 14243 -3830 -19029 -16671 1614 18858 18545 504 -18407 -20184 -2783 17362 21134
338 21134 4795 -16105 -21798 -6850 14347 21777 8533 -12483 -21424 -10166 10193 20464 11350
351A1350j9275j1289O846J7785J1987m483j5916j2343K117J3729J2356K24j1210
364A878j2057k484Q517J1420M591n648j0456o467K663R210Q088L56p652r398l378
379a0817N836J0454O275l816j1132r021J631J1496J1476O79j1477j3627l048J1116
393c975J5473N395j0404j6948p661R418J8022R761q193j8667j1624O765J8881
406F243J3203n170j8668j4495L480J8035J5466j717j7063j6070l6J5724J6339
419A5271J689j4092j6187l267J2168J5654M719j0006j4788o013P677J3573P086
432A3484n241j2054p951K741J0246Q520k50q166q823k213N891Q823M536l439q565
447b461o700Q83Q009Q606J726p180j0238m292O074J1552O790m733j2581r111L205
$$ plain form
351 11350 -7925 -19214 -12368 5417 17404 12921 -2995 -15338 -13221 508 12864 13088 1878
364 1878 -10179 -12663 -4146 7274 11865 6217 -4239 -10706 -8043 1167 9255 9611 1959 -7439 -10817
379 -10817 -4981 5473 11748 7932 -3200 -12221 -10590 906 12382 13061 1584 -12043 -15091 -3975
393 -3975 11498 16893 6489 -10459 -18120 -8702 9320 19081 10888 -7779 -19403 -12638 6243
406 6243 19446 14276 -4392 -18887 -15407 2628 18094 16377 -686 -16756 -16792 -1068 15271
419 15271 16960 2868 -13319 -16586 -4418 11236 15955 5949 -8839 -14852 -7175 6398 13484
432 13484 8243 -3811 -11762 -9021 1225 9745 9495 1329 -7494 -9707 -3816 5007 9543 6104 -2461
447 -2461 -9161 -8278 -269 8337 10063 2883 -7355 -11647 -5573 5979 12769 8036 -4545 -13656 -10451
462a0451J3215J1256j544j3517j3149j73J3485J4717J920j3102j5943l636J2403
475d519J6807N305j1425j7324o829J0229J7457Q193q814j7218r335P249J6622
488F398J0231n568j5622j0878L782J4303J1266j943j2705j1377J58J0848J1181
501A0074J568q788j0646l193O508R859M682m096q775n976J620P459P031Q72n915
516B284p825l310M196Q368N601k293q612p712K44Q588R641J828q284j1313l881
531a2480P755J2661N851o951j3679p729N915J4411R457m785j4778j0955L456J4827
545B976J2243k070j4572j3246O79J3976J3945P18j3098j4360k092J1934J4420
558A1453L413j0565j4198m579Q958J3649N637p234j2767o521N339J1622P178l392
$$ plain form
462 -10451 2764 14020 12476 -1041 -14190 -14363 -878 13839 15759 2657 -13286 -16922 -4519
475 -4519 12288 17593 6168 -11156 -17985 -7756 9701 17894 9080 -8138 -17473 -10224 6398
488 6398 16629 11061 -4561 -15439 -11657 2646 13912 11969 -736 -12113 -11955 -1107 10074
501 10074 11642 2854 -7792 -10985 -4477 5382 10064 5968 -2807 -8783 -7163 296 7327 8199 2284
516 2284 -5541 -8851 -4655 3713 9314 7021 -1591 -9303 -9059 -471 9170 10998 2714 -8599 -12480
531 -12480 -4725 7936 13787 6836 -6843 -14572 -8657 5754 15211 10426 -4352 -15307 -11851 2976
545 2976 15219 13149 -1423 -14669 -13990 -14 13931 14649 1551 -12809 -14901 -2967 11453
558 11453 14866 4301 -9897 -14476 -5518 8131 13768 6534 -6233 -12754 -7415 4207 11385 7993
572G993j0199p591J397Q493P795N90o615p779k465M559P478M220k373o933n836
587g266J65O169P188K081n172q316m279L988R194O378k650r834q259J214J0119
602G20R986L35j0148j1495j896R951J2685L441r452j3659m913Q762J4314O294
616A4925p874j4620p549O835J4614Q611n589j4319r505M255J3762J0167k907j2849
630b043j0567J485J1697J0705n4j0282j0615j285Q671J0198K589o851r532l764
644i648M907Q662M762k910p523n533Q50O121O159J206m587o579l156K936O733
659B400M972j131o648o693p16O387Q175K557n941r381m347N189J0383O093m339
674F960j1129p703L347J1600R105k239j1780j0344J033J1711J1403J55j1404j2136
$$ plain form
572 7993 -2206 -9797 -8400 93 7888 8478 1863 -5916 -8381 -3822 3656 7876 5503 -1430 -7266
587 -7266 -7101 -932 6256 8337 3165 -5151 -9430 -5442 3752 10130 7480 -2354 -10613 -9399 720
602 720 10706 11041 893 -10602 -12498 -2547 10138 13579 4127 -9532 -14445 -5683 8631 14925
616 14925 7051 -7569 -15118 -8283 6331 14942 9353 -4966 -14471 -10216 3546 13713 10806 -2043
630 -2043 -12610 -11125 572 11277 11223 941 -9674 -10959 -2288 7910 10499 3648 -5884 -9648
644 -9648 -4741 3921 8683 5773 -1750 -7283 -6433 -312 5847 7053 2466 -4113 -7269 -4333 2400
659 2400 7372 6241 -407 -7100 -7816 -1429 6746 9303 3362 -6019 -10366 -5177 5206 11299 6960
674 6960 -4169 -11872 -8525 3075 12180 9941 -1839 -12183 -11150 561 11964 12119 715 -11421
688a1421j380J0779J2665K573r966j2953l683Q961J2926M697p808j2587n552O428
702f321J1981O308m974j1132o852L446R983P214j833q631p370K57P088P264J252
717G680n352o944k664L475O387M006j534n687n145l82M752O076K313l649o824
732c492m172K442P358N902j137p635p477k69P712Q904J688p600j0108l053P279
747c658J1034M409o740j1740n691O047J2220O858n222j2400p896M270J2345Q763
761A2599l201j2042r437K123J1452R878r61j0607j0110k17R565J0109J324q317
775B158r830k369O880R336L297n310q604m089L685P605M727j956o435n193K34
790e864N068N504J410l588n632k978K040N471M473l84n222n786j265M756O923
$$ plain form
688 -11421 -12801 -2022 10643 13216 3250 -9703 -13386 -4425 8501 13198 5390 -7197 -12749 -6321
702 -6321 5660 11968 6994 -4138 -10990 -7544 2439 9653 7820 -811 -8181 -7924 -836 6428 7680
717 7680 2328 -4616 -7280 -3805 2582 6588 5054 -633 -5778 -6160 -1408 4668 6981 3332 -3492
732 -3492 -7664 -5222 2136 8038 6901 -734 -8211 -8480 -768 8136 9824 2224 -7884 -10937 -3658
747 -3658 7376 11785 5045 -6695 -12386 -6339 5881 12739 7517 -4883 -12779 -8509 3836 12599
761 12599 9398 -2644 -12081 -9958 1494 11372 10411 -196 -10306 -10523 -958 9151 10475 2158
775 2158 -7672 -10041 -3161 6175 9472 4162 -4442 -8531 -4846 2759 7486 5530 -905 -6098 -5864
790 -5864 -796 4708 6118 2530 -3102 -6080 -4040 1431 5904 5520 298 -5488 -6753 -1997 4926
805D926K893m138p862m506L392Q620O001k555r165p332J608R415Q543n30r498
820a88r628n08R349J0477J562q999j1069k632Q427J1464L639p692j1606m527O768
835e163J1463N344n679j1102o052M529J0506O559l327r630o865K024Q561O990
849H158p45p294o916m96N865O625J671m280o175k745K645N526L693r95m667m509
865d639o62L681N159K321k592n638l889J426N920N357k02o001o697j079N988P836
881F289K356n739q803l621N365R581M817m831j0134n949M193J0492O920l410j0604
896c078p777K546J0476Q489j626j0129q988O49R553R311L36q804r437j240P847
911a872R288K141o749q942k902N474Q366L580m109p616m124K705O660M526j303
$$ plain form
805 4926 7819 3681 -4181 -8687 -5295 3325 9326 6771 -2394 -9726 -8118 1297 9840 9310 -188
820 -188 -9816 -10324 -975 9502 11064 2065 -9004 -11636 -3209 8255 11894 4202 -7404 -11931 -5163
835 -5163 6300 11644 5965 -5137 -11189 -6660 3846 10405 7078 -2552 -9417 -7393 1168 8158
849 8158 7413 119 -6797 -7293 -1428 5197 6868 2588 -3587 -6332 -3687 1839 5532 4537 -130 -4639
865 -4639 -5301 -1620 3539 5860 3268 -2370 -6259 -4833 1087 6444 6242 241 -6456 -7535 -1547 6289
881 6289 8645 2906 -5897 -9518 -4153 5428 10245 5414 -4720 -10669 -6476 4016 10936 7526 -3078
896 -3078 -10855 -8309 2167 10656 9030 -1099 -10087 -9438 115 9426 9762 958 -8479 -9719 -1872
911 -1872 7416 9557 2808 -6134 -9036 -3562 4804 8384 4275 -3341 -7465 -4760 1900 6426 5123
926E123n520m777j05M237M872J445k858m770k740J424M498L939M8m114m983j526
942e807L570N891K965k929o608m357K174P128N695j333p520o878M23P705P923
957H042N22p707q795j472P502R453K460p122r969l372O580J0238M224n883j0307
972e606m979N060J0144N611m144r737o117L155R125O453k091q321o622J043P341
987C15O595k5o167o380r64M895O031J850l518n492k643K102M776L363o79l897
1003A62l965p42K949M416K129j911m688l481Q34M805M740L08m787n863j496M658
1019a932O831K656m365p641l788L955Q280M862l442q722n833K774Q950O740k044
1034G281r006p464J242Q834Q058m11q490q446m22P929Q636J255p209q666k009
$$ plain form
926 5123 -397 -5174 -5279 -1042 3830 5275 2417 -2353 -5093 -3669 829 4768 4816 702 -4281 -5807
942 -5807 -2237 3654 6619 3690 -2918 -7275 -5101 2027 7722 6389 -1131 -8009 -7586 119 8042
957 8042 8564 857 -7938 -9410 -1908 7545 10005 2883 -7086 -10458 -3878 6360 10584 4701 -5606
972 -5606 -10585 -5525 4619 10230 6086 -3651 -9768 -6613 2512 8965 6874 -1447 -8069 -7026 315
987 315 6910 6885 718 -5662 -6626 -1731 4300 6150 2632 -2860 -5503 -3401 1375 4738 4059 162
1003 162 -3803 -4545 -1596 2820 4949 3038 -1650 -5131 -4297 508 5248 5556 769 -5094 -6590 -1932
1019 -1932 4899 7555 3190 -4451 -8239 -4284 3996 8858 5416 -3306 -9139 -6365 2585 9325 7281
1034 7281 -1725 -9189 -7947 887 8945 8534 44 -8402 -8824 -895 7741 8996 1787 -6879 -8888
1049h888O332Q450K724n321q087l315M230P516L784l100o729m128J905N811M327
1064E511p26m739m422m06L555M353J498k294m159k521J020L758L490K81l271m336
1080c408j574K658N029K903k037n541m150J277N919N283m33o140o336m16O198
1095g68P229J327o132p943k226N862Q523L097n461q892l909M916R087M635m259
1110E086r054n266L506Q850N757k689q422o118J843P806O332r44p066o355J03
1125f631O139O243O93n088n946j452L942N538K116k760m931k706J539M187L213
1140D096l34l320l608q62K387L823K064j379l926l203L28L893M270P29l766n173
1156c981j836L498N987K903l138o614l946K669P098M918k109p411n786J470P530
$$ plain form
1049 -8888 -2556 5894 8618 3297 -4790 -8105 -3875 3641 7425 4325 -2404 -6532 -4627 1184 5511
1064 5511 4785 46 -4376 -4782 -1227 3126 4624 2330 -1829 -4350 -3330 428 3918 4199 928 -3408
1080 -3408 -4982 -2324 2705 5608 3571 -1970 -6120 -4843 1076 6359 5926 -214 -6550 -6966 -768
1095 -768 6461 7788 1656 -6287 -8513 -2651 5872 8969 3508 -5384 -9293 -4377 4710 9345 5086
1110 5086 -3968 -9234 -5728 3122 8879 6190 -2232 -8350 -6507 1299 7631 6687 -379 -6734 -6631
1125 -6631 -492 5751 6444 1356 -4590 -6042 -2100 3438 5554 2794 -2137 -4843 -3304 883 4096
1140 4096 3762 442 -3166 -4028 -1641 2182 4246 2867 -1059 -4262 -3934 -41 4229 4958 1192 -3981
1156 -3981 -5817 -2319 3668 6571 3433 -3181 -7127 -4458 2640 7558 5449 -1962 -7748 -6278 1252
1171A252O543p64p500p153M2P252P627O95o889p871j436O348Q010K096n679p947
1187e374k699M891P680L224m027p257l633L093O662L948k142n931m149J172N052
1202E10M230k16m104m174o59K993M008J559j907l672k404P63L228L157M11k698
1218A025l775j577K063M268K730j379m623l825O11M859M857J99m979n751j010
1233f307M950O502J857m760p122k695M474P579L471m068p834m177L520P953M821
1248H164k918p882n330K253P627N708j552p189n961Q19O627O066r4n917o034o02
1264f215N105N862J231m191n536j818L221N099K268k191m463k722J155L739L082
1279C626j08k943l288r42K047L395J944j094l358k889R3L208L769Q97k934m507
$$ plain form
1171 1252 7795 7031 -469 -7622 -7580 -328 7299 7994 1105 -6766 -8202 -1854 6156 8252 2573 -5374
1187 -5374 -8073 -3182 4498 7722 3695 -3562 -7195 -4102 2560 6508 4366 -1565 -5714 -4542 510
1202 510 4740 4524 420 -3754 -4413 -1420 2588 4147 2240 -1432 -3836 -3073 155 3312 3723 1025
1218 1025 -2750 -4327 -2264 2004 4734 3355 -1268 -5093 -4482 377 5234 5433 454 -5297 -6307
1233 -6307 -1357 5145 7002 2242 -4880 -7575 -3101 4478 7949 3881 -3953 -8130 -4610 3343 8164
1248 8164 5246 -2636 -7966 -5713 1914 7622 6070 -1119 -7080 -6261 366 6432 6338 421 -5613 -6215
1264 -6215 -1110 4752 5983 1792 -3744 -5562 -2341 2758 5026 2835 -1628 -4350 -3195 544 3626
1279 3626 3518 575 -2713 -3655 -1608 1787 3731 2637 -721 -3610 -3517 -309 3460 4357 1423 -3084
1295c084j950K599N141K956k187n638l876J664N962M748j076o152n537M33O201
1310B04O190K09o090o674q98N801P054J576n431p281k155M920P276K732m310p165
1326d042l211L611O887L627k873o475l920K109N898M095j294n223m185N20M402
1341g4M172K24l496m008r75K540L735J709j543l376k333N32K870K862N35k247
1357A127l353j563J607L655K579q85l854l528J16L947M408O64l924n167j475L798
1373a848N806K276l540o297l067L215O646L764k768o840m389K262O856M926j701
1388E301o731n324J080O450N646m86o037n816j27N512N880O98m883n753j256M153
1404a693N525J758l356n186k161K489M712K532j624m102k840P60L400L028J36
$$ plain form
1295 -3084 -5034 -2435 2706 5662 3475 -2163 -6039 -4375 1587 6335 5259 -893 -6430 -5997 204
1310 204 6394 6603 513 -6161 -7059 -1258 5796 7372 1941 -5340 -7495 -2575 4701 7433 3123 -4042
1326 -4042 -7253 -3642 3245 6872 3999 -2476 -6396 -4287 1611 5706 4412 -811 -4996 -4476 -74
1341 -74 4098 4322 826 -3182 -4157 -1617 2118 3827 2284 -1092 -3425 -2893 -23 2839 3374 1127
1357 1127 -2226 -3789 -2182 1473 4052 3167 -687 -4215 -4099 -152 4256 4920 996 -4171 -5646 -1848
1373 -1848 3958 6234 2694 -3603 -6670 -3455 3191 6955 4187 -2653 -7042 -4780 2076 7002 5301
1388 5301 -1430 -6754 -5674 776 6422 5936 -101 -5917 -6044 -532 5348 6046 1163 -4590 -5846 -1693
1404 -1693 3832 5590 2234 -2952 -5113 -2624 2088 4620 2996 -1106 -3946 -3186 214 3242 3378
1419C378k621l106j018J749L076J872q27k953k661r9K668L381J043k334l957k008
1435d417J917M414K918j423m752l778Q52M967M576k67n073n250l53N031N784R70
1451F116m850o186j605M559O476K193m188o601k716L710O579L194l163o439l571
1466f492K565O162L853j930n733m060J271N198M177n98m567m178l4L827M070O43
1482D174k983l870j254K159L524J813j262l075k292L12K547K678O47j947k988
1497a817j524J251L149K433n03l237l246k60L182L995J011l027m607j815K819
1512b196N128K563k524n495l267K159N731L895j706n831m464J214N844M911p15
1527E247n703n241J99N418N482L19n029n585q48M565N559J326l989n429j752L316
$$ plain form
1419 3378 757 -2349 -3367 -1618 1458 3330 2503 -450 -3111 -3210 -542 2839 3882 1548 -2409 -4417
1435 -4417 -2500 1914 4832 3409 -1343 -5121 -4269 698 5274 5007 -66 -5316 -5669 -638 5146 6116
1451 6116 1266 -4920 -6525 -1966 4510 6703 2515 -4086 -6802 -3092 3487 6681 3518 -2921 -6492
1466 -6492 -3927 2235 6088 4158 -1575 -5635 -4364 834 5011 4413 -154 -4332 -4366 -539 3531 4174
1482 4174 1191 -2679 -3933 -1774 1750 3563 2301 -774 -3066 -2754 -207 2471 3118 1171 -1817
1497 -1817 -3341 -2090 1059 3492 2989 -248 -3494 -3754 -572 3423 4434 1407 -3200 -5015 -2196
1512 -2196 2932 5495 2971 -2524 -5791 -3632 2099 5994 4288 -1543 -6007 -4793 1051 5962 5247
1527 5247 -456 -5697 -5498 -80 5402 5721 692 -4893 -5741 -1176 4383 5709 1720 -3709 -5461 -2145
1543b145N190K139k638m821k449J909M323K698j145l724k898L78L050K984L81
1558C232k316k944j113J479K798J815o21k577k439k48K235K976J140j802l456
1573a841j989J338L753K822p97l968l599K25M084M264L48m054m847r40L969N299
1589D067J551l763n662k115L489N872K614l111n950l089K667N920L474k174n745
1604a955l797J669N452M012j120n044m150N53M561M182j8l944m122n14L257L966
1620B988J036k531l696j513J761L325J912r45k837k250J17K281K506P03j633k669
1636a445j502R33K736K273k25k695k971n19K584L548J278k342m068j992K066M457
1652B116K692j733m733l332J327M913L897q88m985m381M51M908M779K7m768n046
$$ plain form
1543 -2145 3045 5184 2546 -2275 -4724 -2815 1508 4206 3061 -663 -3561 -3183 -133 2851 3232
1558 3232 916 -2028 -3141 -1662 1136 2951 2330 -247 -2686 -2934 -699 2277 3417 1615 -1841
1573 -1841 -3830 -2492 1261 4083 3286 -682 -4281 -4056 28 4292 4640 586 -4261 -5201 -1232 4067
1589 4067 5618 1855 -3807 -5922 -2433 3439 6053 2942 -3008 -6097 -3430 2490 5964 3790 -1955
1604 -1955 -5752 -4083 1369 5381 4261 -783 -4933 -4380 181 4363 4345 401 -3721 -4235 -978 2988
1620 2988 4024 1493 -2203 -3716 -1955 1370 3282 2337 -500 -2750 -2633 -352 2154 2857 1224 -1445
1636 -1445 -2947 -2014 722 2995 2770 75 -2896 -3415 -831 2717 3995 1653 -2415 -4407 -2341 2116
1652 2116 4808 3075 -1658 -4990 -3663 1250 5147 4259 -726 -5107 -4656 252 5031 5058 290 -4756
1668d756m94M471N243R57m136n302j400L698N258J801l195n116k118K609M810
1683B330K441j988m438k678J358L944K845p12l370k943N6K727K915N91k005k778
1699a705j209J218K581J768m40k263k253l79J883K661J172j415k996j948R16L213
1715H04K690l77l337l346j71L340L936P28l292m415j295L146M811J858k948n109
1731b977k343K651N281K799k297n338l219J927N270L552j481n106l822J032M830
1746G59L999n49m448m087P8L970M105L89l414m004q49K810L802J270k142l496
1762a807j662J453L073J976o88k602k212l7K037K362P64j400k433j466P49K387
1778D94K106m4k264k679o80K073L188J371j820l593k046J496L911K654j139m086
$$ plain form
1668 -4756 -5250 -779 4464 5421 1285 -4017 -5417 -1719 3539 5340 2145 -2971 -5089 -2480 2330
1683 2330 4771 2783 -1655 -4333 -2975 969 3814 3102 -268 -3211 -3155 -428 2487 3078 1073 -1705
1699 -1705 -2914 -1696 885 2653 2213 -50 -2303 -2682 -799 1862 3034 1619 -1377 -3325 -2409 804
1715 804 3494 3117 -220 -3566 -3737 -397 3539 4267 975 -3440 -4735 -1589 3222 5080 2132 -2977
1731 -2977 -5320 -2669 2612 5411 3114 -2224 -5443 -3516 1754 5306 3825 -1281 -5103 -4071 759
1746 759 4758 4209 -239 -4326 -4248 -278 3827 4216 802 -3202 -4051 -1241 2561 3831 1689 -1807
1762 -1807 -3469 -2016 1057 3033 2345 -257 -2469 -2506 -469 1893 2657 1257 -1176 -2642 -1893 494
1778 494 2600 2556 292 -2387 -3067 -994 2194 3565 1745 -1848 -3894 -2398 1513 4167 3028 -1058
1794a058l251P44M194L768l30m218m205j02M133M533N51l957m806r78L710M938
1810C666J388l363m970j777K968M903K131k514m729k418J989M450K633j438m036
1825a117k839R06L573K907l24l017k917k53K398K814Q01j723k641j289J010K368
1841F57J721k55k026k108m52J582K408J188j138k622j883O26K768K518p6k832
1857G6l094m52K779L600R96k669m018j513K480M352K037k261m580k496J966M727
1873A930K919j653m738l296J284M674L595q71m498l807M46M218L973l4l843m025
1889c726l78L396L994P80k888l824j201K338L587J546j739l245j829J083K821
1904G15K036m27k334k170k29J773K242Q34j165k214j451N65K113J950J16j926
$$ plain form
1794 -1058 -4309 -3565 629 4397 4067 -151 -4356 -4458 -325 4208 4759 802 -4004 -4982 -1272 3666
1810 3666 5054 1691 -3279 -5056 -2088 2815 4946 2432 -2297 -4715 -2726 1724 4357 2919 -1117
1825 -1117 -3956 -3050 523 3430 3106 89 -2828 -3081 -683 2131 2932 1209 -1432 -2721 -1711 657
1841 657 2378 2123 97 -2011 -2463 -881 1527 2715 1577 -1045 -2928 -2302 466 2984 2908 76
1857 76 -3018 -3470 -691 2909 3905 1236 -2782 -4295 -1815 2537 4574 2313 -2267 -4763 -2797 1930
1873 1930 4849 3196 -1542 -4838 -3554 1120 4715 3844 -654 -4461 -4015 203 4176 4142 299 -3726
1889 -3726 -4104 -708 3286 4066 1178 -2646 -3847 -1509 2078 3624 1885 -1360 -3189 -2106 715
1904 715 2751 2324 -10 -2180 -2409 -636 1606 2440 1275 -939 -2390 -1825 288 2238 2354 428
1920D28k442p70J701K833J415j412l162k041J090L378K626p19l533l107K94L614
1936A93L561Q6l567l949n15L457M259R25l260m470j334L004M595J692k674m608
1952b605k045K315M491K355j887m307k595J429L992K793r47l605k915M56L159
1967H4K905N4k640k840n15K043K684R72j417k465j354P64K133J716j09j778j979
1984a742n34J347K180J179q66k317j788L87K367K341J50k356k846o57K267L273
2000B385J195k126l629j677J915L879K156j652m060k608J367M156L003j049m161
2015i06l300O81M052L563k99l848l788o9L592L863M40l232l880p90K812L780J174
2032C845k362l629j482J876L331J736j312k987j919P40K567K054j86k063k120
$$ plain form
1920 428 -2014 -2784 -1083 1750 3165 1753 -1409 -3450 -2360 1018 3644 2925 -608 -3715 -3421 193
1936 193 3754 3840 273 -3676 -4191 -734 3525 4450 1190 -3280 -4614 -1610 2985 4677 2003 -2605
1952 -2605 -4650 -2335 2156 4511 2624 -1683 -4278 -2849 1143 3936 2989 -616 -3531 -3075 84
1967 84 2989 3043 403 -2437 -2952 -909 1775 2747 1330 -1135 -2489 -1725 408 2124 2015 237 -1742
1984 -1742 -2276 -929 1251 2430 1564 -753 -2541 -2154 213 2554 2704 348 -2498 -3155 -888 2385
2000 2385 3580 1454 -2175 -3852 -1937 1942 4098 2446 -1614 -4222 -2855 1301 4304 3255 -906
2015 -906 -4206 -3525 527 4090 3791 -57 -3845 -3914 -322 3541 3981 749 -3131 -3921 -1109 2671 3845
2032 3845 1483 -2146 -3628 -1752 1579 3315 2003 -984 -2903 -2163 404 2458 2272 209 -1911
2047a911l87J546K105R04r67k022j394L82J858J831K26j649k208q26J382K528
2063A398J410j069k772j960P09K938K500l60l027k977k5L042L349M51k961l715
2079c069q61K843L970J232k639m136j615K385M213J958k068m201k268J730M060
2094A534K543j322l870k743R11L574K881m91l224k895N7K774K861L65k273k745
2110b063p48J738K556J088j166k287j389N67J962J670Nj580j860n74J160J963
2126A042J150o89k045j675K25K046K140K92j992k574p73J852K948J277j697l237
2142a710j751J466L451K211j190l584k638Q83L668K963n73l599l265K00L492L510
2158C534J41l299l659m87L024L735Q24k709l680j181K342L573J446j911l365j669
$$ plain form
2047 -1911 -2298 -752 1353 2257 1290 -732 -2126 -1744 114 1945 2171 522 -1686 -2512 -1130 1398
2063 1398 2808 1739 -1033 -2993 -2284 654 3154 2794 -233 -3210 -3235 -193 3156 3607 646 -3069
2079 -3069 -3930 -1087 2883 4115 1476 -2660 -4275 -1890 2323 4281 2213 -1988 -4256 -2526 1534
2094 1534 4077 2755 -1115 -3858 -2947 627 3508 3017 -207 -3102 -3045 -271 2590 2955 682 -2063
2110 -2063 -2811 -1073 1483 2571 1405 -882 -2271 -1704 258 1928 1933 353 -1507 -2081 -921 1042
2126 1042 2192 1503 -542 -2217 -1992 54 2194 2486 494 -2080 -2853 -1001 1947 3224 1527 -1710
2142 -1710 -3461 -1995 1456 3667 2477 -1107 -3745 -2862 806 3769 3196 -403 -3668 -3468 24 3534
2158 3534 3675 376 -3283 -3770 -746 2989 3813 1104 -2576 -3757 -1415 2158 3604 1693 -1672 -3341
2174c341J435L107J832r38k752j972M63K339K032J0j860k036m87J352J973R23
2190B080q25j849j314K62J656J681K89j416k003q20J125K240J360q05k417j878
2206b634M45K525K353p1k563k769l48K542L145P40k454l438j126K297L636J520
2222C800k067l785j864J811L819K178j491l778k458J178L648K681q25l444k810
2237c407M30L181K867n9k814k862k85K387K794O23j938k651r13J457K411J184
2253B405r24k139j424M11J798J608J04j416j731o06R99J782J099n47j790j538
2269a909N9J738J959M17j617k334r10J482K630J365j243k874j828J009L031K240
2285C215p29l100k632M06L130K944o5l089l186k78K948L384N99k744l474r30K482
$$ plain form
2174 -3341 -1906 1201 3033 2095 -657 -2629 -2166 173 2205 2215 355 -1681 -2168 -816 1157 2080
2190 2080 1255 -594 -1908 -1646 10 1691 1980 564 -1439 -2259 -1134 1106 2466 1661 -756 -2634
2206 -2634 -2189 336 2689 2618 55 -2714 -3062 -520 2625 3365 911 -2527 -3653 -1356 2280 3800
2222 3800 1733 -2052 -3916 -2105 1714 3892 2401 -1377 -3835 -2657 991 3672 2847 -597 -3407
2237 -3407 -2977 204 3071 3012 198 -2664 -2949 -562 2232 2855 917 -1734 -2647 -1190 1221 2405
2253 2405 1481 -658 -2082 -1671 127 1735 1839 423 -1308 -1914 -915 867 1966 1419 -371 -1909
2269 -1909 -1850 -112 1847 2264 647 -1687 -2597 -1115 1515 2880 1637 -1237 -3065 -2056 975 3215
2285 3215 2486 -614 -3246 -2840 290 3234 3169 80 -3106 -3384 -436 2948 3547 803 -2671 -3601 -1119
2302a119L514J213k166l456j483J812L329J685j427l125j851J029K828J964o09
2317B138k496k015J85K088K023K18j644j974o00J165J864R46o76j678j272J62
2333a566J453J568L52j199j793q42Q69J965J343n17k095j799J66K128K223K33
2349B489k121k588o27K039K909J016j893l166j391J736L312J760j507l417k067
2364c516J230L423K353r31l358k557O05L221K722k98k990k843oK727K846L15k378
2381E65k815o11K027K672Q88j611k502j104J154K273J300p13j971j451K47J646
2397fJ556J80j230j608o36Q21J602J065l74j563j455o4J444J789N40j282k088
2414a309r97J073K339J442q63k484j862N71K605K259k83k655k577m0K615K857
$$ plain form
2302 -1119 2395 3608 1442 -2014 -3497 -1685 1644 3329 1902 -1223 -3074 -2045 783 2747 2138
2317 2138 -358 -2373 -2188 -100 1923 2141 497 -1477 -2077 -912 952 1898 1222 -456 -1728 -1566
2333 -1566 -113 1455 1807 608 -1185 -2027 -1158 807 2150 1633 -462 -2261 -2095 33 2256 2489
2349 2489 368 -2220 -2847 -808 2101 3117 1224 -1942 -3333 -1597 1715 3475 1968 -1449 -3516
2364 -3516 -2286 1137 3490 2559 -799 -3356 -2751 470 3192 2894 -96 -2939 -2945 -218 2628 2943 565
2381 565 -2250 -2861 -834 1838 2726 1115 -1387 -2491 -1337 936 2236 1523 -448 -1899 -1652 -6
2397 -6 1550 1730 500 -1108 -1744 -923 679 1744 1370 -193 -1648 -1712 -268 1521 2061 779 -1309
2414 -1309 -2306 -1233 1106 2548 1685 -799 -2661 -2090 515 2774 2491 -164 -2741 -2781 -166 2691
2430B691L54k531l054o87K391L202R70k174l274j276J936L275J509j649l201j702
2446c220J315L052J862r85k839j975O52K553K041l01k214k045n3J845J998L77
2462B063j440j896o83R96J737R76n22j540j230N6J294J438M01r84j594q73O58
2479a143J718J300k96j774j705o3J744K074M66j706k383q41J587K643J199j411
2495A409k841j562J231K946J889r97l005k170P42K986K408m73k896k593J92K765
2511C1K706Q5k552k752l64K309K735O04j979k688q35J656K564J029j291k354j217
2528b313R23K102J362n38j808j436J32J462J481K77j082j510o49O84J454R98k60
2545A279j352j334j82J219J629N90j006j873j021P79K049J445n41k164j842K85
$$ plain form
2430 2691 3045 514 -2540 -3227 -836 2366 3336 1162 -2112 -3388 -1452 1823 3332 1683 -1518 -3220
2446 -3220 -1905 1147 3009 2024 -815 -2790 -2138 415 2456 2155 -59 -2104 -2157 -312 1686 2063
2462 2063 623 -1273 -1956 -960 777 1753 1231 -309 -1539 -1483 -189 1249 1650 666 -928 -1801 -1143
2479 -1143 575 1875 1579 -195 -1900 -1963 -219 1855 2321 615 -1768 -2609 -1022 1621 2820 1409
2495 1409 -1432 -2994 -1763 1183 3072 2075 -930 -3100 -2358 628 3036 2563 -333 -2926 -2734 31
2511 31 2737 2822 270 -2482 -2846 -537 2198 2802 823 -1865 -2700 -1044 1520 2549 1258 -1096 -2313
2528 -2313 -1390 712 2074 1536 -272 -1708 -1576 -114 1367 1644 562 -948 -1597 -913 541 1539 1279
2545 1279 -73 -1407 -1589 -370 1259 1849 843 -1030 -2051 -1272 777 2222 1681 -483 -2325 -2040
2561b040K219K144L7k223k455l28K165K686O44k070k859r17J896K972J189j716
2577A344k991j440J497K971J629j219k901j790R51K736J932o66k539j995L67K276
2593A62K024p1j980j982k20J623J920M96j258j783p50Q43J621R62l99j417j159
2610a368jJ121J319M34q30j431q37M77J499J233j50j499j579k15J449J900N92
2627B114j355k171r36J235K359J297j072k515j588Q54K604J895o46k629k135M23
2643b266K592K324j67k500k475r2K372K567L36k174k599n67J942K568P76j677
2659I60k493r73J382K360J132j055k174j267P16J924J368l66j650j406MJ321J425
2676A208L17r59j390o42N81J290R60j82j178j245k03J007J456O35q32j624j011
$$ plain form
2561 -2040 179 2323 2360 137 -2318 -2646 -481 2205 2849 779 -2080 -2997 -1101 1871 3060 1344
2577 1344 -1647 -3087 -1590 1381 3010 1791 -1110 -2900 -1949 787 2719 2053 -486 -2481 -2114 162
2593 162 2186 2115 135 -1847 -2067 -444 1476 1972 714 -1069 -1819 -976 645 1607 1208 -209 -1368
2610 -1368 -1369 -248 1071 1505 675 -756 -1593 -1116 383 1616 1466 -33 -1612 -1827 -378 1522 2114
2627 2114 759 -1412 -2348 -1113 1246 2543 1471 -1044 -2632 -1778 826 2721 2075 -554 -2689 -2266
2643 -2266 326 2650 2483 -17 -2492 -2584 -212 2355 2691 517 -2082 -2649 -707 1861 2637 960
2659 960 -1533 -2506 -1124 1236 2368 1313 -861 -2128 -1412 512 1880 1514 -136 -1542 -1538 -217 1208
2676 1208 1525 566 -824 -1466 -885 405 1365 1183 5 -1240 -1443 -436 1020 1655 823 -801 -1812
2693a812N61J799J379l38j845j731N7J878K023K31j868k261n06J797K465P72j687
2710I14k595j020J504K694J286j344k709j492J108K689J652q85k595j794O52K444
2726E09J892m02k238j945J28J997J978J24j730j930l60J411J831N82j055j678
2742h86q07O90J501R78l08j267j121o8R94J226M65p18j286q08L85J315J134l8
2760A381j264j461l08J210J712O47j085j923r82R27K102J283p54k203j587N82
2776a723K258J825l57k271k033J40K217K199R0k136k321l16J991K400N12j801
2792F74k411p41J600K383R13j366k291j066J073K171J223q23j973j304M88J764
2808C14J359j94j472j384j18J164J372M16q33j304o75M63J189R39r4j059j136
$$ plain form
2693 -1812 -1251 548 1927 1589 -256 -1987 -1930 -52 1971 2202 334 -1927 -2433 -636 1829 2601 914
2710 914 -1681 -2701 -1197 1497 2783 1439 -1270 -2762 -1654 1035 2687 1802 -793 -2587 -1935 509
2726 509 2401 1999 -239 -2184 -2056 -59 1919 2043 313 -1617 -1977 -566 1265 1847 792 -886
2742 -886 -1693 -1003 498 1476 1168 -99 -1220 -1288 -294 932 1397 679 -607 -1415 -1030 285 1419 1381
2760 1381 117 -1344 -1652 -442 1270 1917 832 -1091 -2073 -1146 956 2239 1485 -718 -2305 -1723
2776 -1723 535 2360 2003 -268 -2301 -2161 56 2255 2345 209 -2112 -2428 -437 1963 2475 674
2792 674 -1737 -2478 -878 1505 2418 1052 -1239 -2305 -1232 939 2162 1339 -634 -1938 -1450 314
2808 314 1673 1479 7 -1377 -1495 -331 1041 1457 624 -680 -1355 -892 297 1236 1142 83 -1053
2825a053k80Q62J324O35o44j438r96L99J547J302j58j568j608j10J577J846L67
2842B004j515k068o25J437K217Q82j307k330j129J179K387J328j013k385j509
2857b447P97K338J676n70k266j789L57K117J872j21j939j899j11J719J890L25
2873A949j456j826n17J142J741P05q37j572q75N30J362J004j78j131j100j53Q59
2890c53J160M82n85j172p76K55J148J063O8j077j326l73R78J517O83q26j707r82
2908a823O89J810J257n08j893j522L24J913J739r3j919j915j06J839K069L10j739
2925D32k162n16J605K219P20j440k236q93J240K184J059j016k080j192P53J970
2941F47J280n04j768j357K52J521J409j0j276j374k45R73J312N01o62j227p12
$$ plain form
2825 -1053 -1333 -471 853 1488 844 -594 -1590 -1191 356 1658 1500 -68 -1676 -1786 -209 1637 2004
2842 2004 489 -1579 -2204 -767 1450 2332 1025 -1305 -2434 -1255 1132 2460 1447 -938 -2447
2857 -2447 -1650 688 2364 1794 -472 -2261 -1904 213 2085 1964 25 -1874 -1985 -266 1624 1949
2873 1949 493 -1333 -1850 -708 1033 1738 901 -671 -1546 -1016 346 1350 1172 41 -1059 -1212 -353
2890 -353 807 1289 704 -468 -1244 -989 159 1222 1290 213 -1113 -1486 -508 1009 1692 866 -841 -1823
2908 -1823 -1134 676 1933 1425 -468 -1990 -1666 247 1986 1893 -26 -1941 -2047 -208 1861 2171 432
2925 432 -1730 -2246 -641 1578 2298 858 -1378 -2271 -1031 1153 2212 1196 -884 -2076 -1323 647
2941 647 1927 1423 -345 -1702 -1450 71 1480 1470 194 -1180 -1425 -452 860 1361 699 -528 -1240
2958a240L34J084R14j4r05j079l25P26J173O44m99j263r19K42J294J225rj309
2976G4j462k48J290J671M73j189j838p49J112J983R59r89k053j175Q31K092J369
2993B151o52k085j533M73K040J660k72j937j763P3J802J809J33j604j843l27J411
3010d64J798N18j168j713p05R16J597Q17o23j418r46L35J222J041o1r97j073k48
3028a172P52J068N18m59j051p73J82R96R77J25r13j171m21P98J335O87o20j471
3046f13r60M71J544J205k77j608j423J00J605J619J02j566j784l01J500J897N01
3063B012j396j992o84J262K034Q44j104k004j010Q92J963J170p22j855j267M85
3079a372J718J340k57j564j360L4J318J371J85j082j325l81Q12J239N82n30j138
$$ plain form
2958 -1240 -906 178 1092 1078 173 -906 -1231 -505 668 1312 813 -450 -1369 -1127 167 1392 1383 74
2976 74 -1388 -1636 -346 1325 1798 609 -1229 -1978 -866 1117 2076 1087 -966 -2141 -1310 782 2151
2993 2151 1499 -586 -2119 -1646 394 2054 1782 -155 -1918 -1845 -43 1766 1899 295 -1548 -1875 -464
3010 -464 1334 1852 684 -1029 -1734 -818 779 1596 973 -445 -1391 -1056 166 1207 1146 149 -924 -1172
3028 -1172 -420 648 1166 707 -344 -1117 -935 61 1038 1163 250 -921 -1342 -544 791 1478 858 -613
3046 -613 -1573 -1102 442 1647 1370 -238 -1661 -1561 44 1663 1765 199 -1585 -1886 -386 1511 2012
3063 2012 616 -1376 -2060 -798 1236 2080 976 -1028 -2038 -1146 817 1987 1265 -590 -1857 -1372
3079 -1372 346 1686 1429 -135 -1495 -1461 -143 1228 1413 331 -994 -1375 -563 676 1258 728 -410
3096d10p28K49R78Q71L7p85r91l32O21J039O18l95j089q68J52J111J089R6j092
3115A71j280l38J029J491N56r58j625p83Q62J715R97p17j799j177N54J825J358
3132A881l84j810j489K06J740J605l5j624j698j56J515J726L24j325j735m98J134
3149f23J688O55r26j595p86O81J476Q84m40j308r68J98J112J012M4q88j017k82
3167a083O39J004N19m04r49p02J19Q82Q70J60p78j041m12O44J174O51n02j243
3185d52q86K97J317J124j31j353j322o2J350J502K22j286j643m22J235J725O09
3202A824j117j803p79R82J822R43q36j812j063O60J747J173m79j646j262K98J512
3219A64J307p6j358j326r8J153J311K75r17j268m25O82J151O01m51j029p17J95
$$ plain form
3096 -410 -1138 -889 89 960 997 212 -779 -1111 -490 549 1167 772 -317 -1185 -1033 78 1167 1263 171
3115 171 -1109 -1447 -418 1073 1629 671 -954 -1737 -875 840 1837 1120 -679 -1856 -1302 523 1881
3132 1881 1497 -313 -1802 -1596 144 1749 1714 90 -1608 -1764 -249 1477 1801 476 -1259 -1757 -623
3149 -623 1065 1720 794 -801 -1587 -906 570 1454 1014 -294 -1262 -1064 48 1060 1104 216 -801 -1083
3167 -1083 -444 560 1079 675 -274 -976 -857 25 895 1055 277 -764 -1176 -532 642 1293 791 -452
3185 -452 -1338 -1041 276 1400 1269 -84 -1406 -1468 -118 1384 1606 320 -1323 -1745 -510 1215 1824
3202 1824 707 -1096 -1875 -893 929 1872 1036 -776 -1839 -1179 568 1741 1262 -384 -1646 -1348 164
3219 164 1471 1395 37 -1289 -1387 -234 1077 1352 435 -833 -1258 -576 575 1176 725 -304 -1021 -826
3237h26Q98Q09O5p10q96l28N29R32N55l12r49p68R1R41R71J29r03j157l55Q39
3257d45J296N87p38j429p96O32J504R93n10j551j160L49J566J314j90j543j435
3274a556J6J477J545J51j395j587l14J246J625M72j090j607o05R20J545P26p31
3291H38j452q25N10J333R05l04j169r44R1R93R67J04p84r70k95N69R33M67l41
3310F26q54o38R0P64P84J40o43r15l93N16J014O17l62j085q40K11J111J035k9
3329A149j112j225j59J100J371L51j056j488n24R81J570O87q56j636q29P32J647
3346G03R71o01j617j085M48J549J177k77j456j238J27J311J273O1j179j279j92
3363a304R88J230L47p79j178m79N79J079N86l58r55o84J45Q02P46R4o38p96l16
$$ plain form
3237 -826 72 881 946 236 -660 -988 -459 473 1028 716 -233 -1001 -910 31 1002 1131 228 -929 -1284 -445
3257 -445 851 1438 700 -729 -1525 -893 611 1604 1094 -457 -1617 -1268 298 1612 1422 -121 -1556
3274 -1556 -1540 -63 1482 1633 238 -1349 -1663 -417 1208 1680 590 -1017 -1622 -702 843 1569 838
3291 838 -614 -1439 -929 404 1309 1005 -164 -1108 -1017 -24 943 1047 263 -707 -1002 -433 500 967 626
3310 626 -228 -866 -776 -12 772 912 269 -646 -1039 -523 491 1108 746 -339 -1179 -968 143 1178 1149
3329 1149 37 -1188 -1347 -247 1124 1475 419 -1069 -1593 -612 958 1645 789 -847 -1676 -944 703
3346 703 1674 1073 -544 -1629 -1181 368 1545 1268 -188 -1426 -1299 12 1285 1346 167 -1112 -1304
3363 -1304 -316 914 1261 482 -696 -1175 -596 483 1069 711 -244 -928 -783 19 765 859 221 -575 -891
3382h91M47Q40M92k36q30o99L7Q04Q64J84p56j022l64O53J163N74n65j246p83
3401a334M58J308R62k95j356j142J76J346J278k9j323j360j48J258J462K94j172
3418C83j502m10J034J502N38q80j489o62P42J413P53n64j328q28L69J211Q97k10
3436I69j070r16L0Q89R21J44p03q90l20M96Q57M60k94p57n96N8O61P22J52n48
3456B65q09l71M17Q73N94k61r41p65R2R50R79N5r54j110k47R18J244M12q32j375
3476h66n75P85J421P32o72j471q61N60J461R88m28j419j093K69J373J157j43j255
3494c7j202k1J166J207J45j014j201k84Q53J166L94o72j086m98M85R82N88k86
3512F85q55o62P3P53O90J18n62p44k87L97P21M82k00p23o40j3O88P89K14o08r18
$$ plain form
3382 -891 -444 396 888 652 -178 -877 -840 -36 828 1012 256 -766 -1130 -477 686 1260 695 -551 -1334
3401 -1334 -876 432 1394 1099 -257 -1399 -1223 123 1401 1372 49 -1311 -1459 -201 1261 1555 383
3418 383 -1119 -1529 -495 1007 1545 665 -824 -1486 -744 669 1422 858 -470 -1298 -929 282 1179 969
3436 969 -101 -1017 -987 -98 823 967 264 -626 -946 -450 407 867 573 -184 -780 -722 -61 661 813 265
3456 265 -544 -915 -498 375 969 708 -233 -998 -906 44 1023 1078 124 -986 -1233 -315 929 1341 509 -866
3476 -866 -1441 -656 765 1497 825 -646 -1507 -947 514 1502 1074 -345 -1438 -1169 204 1361 1218 -37
3494 -37 -1239 -1260 -94 1113 1258 244 -957 -1241 -388 778 1172 500 -586 -1084 -599 383 971 685
3512 685 -170 -832 -759 -6 684 802 240 -504 -791 -394 327 809 609 -114 -754 -767 -79 710 924 316 -602
3533f02m26N29J035N96m19j098p69K90J143R48j81j163j092L0J162J210R0j104
3551A79j298k52J054J360L75r56j384n01Q33J387O13p17j357p13N88J277P92m30
3569H50j201q36K77J075Q74j18r39q83l5P88Q55K01o22q20l26M18P77M50k18o95
3589a28n56K5N79O52J87m67p22l84L22P82N59j49q31p29J5Q01R01J45p88j023
3609h09l25P26J154M89o75j225o29N79J280P59m63j312q82L61J292R88k41j249
3627a82j064J12J188J123kj094j130j31R80J138K49q52j104l61P06J062M50n36
3645E52r92n32L63R10N93k12p69o42M2O25O72J50m83o88l19L26O50M77j24o41
3665d2o05p4N86P30K50n11q23m50M12R10O08k87r60p78J63J001R10m1j001j024
$$ plain form
3533 -602 -1028 -499 536 1132 713 -385 -1154 -864 279 1227 1046 -117 -1209 -1179 -17 1193 1283 179
3551 179 -1119 -1371 -317 1043 1418 462 -922 -1423 -590 797 1410 693 -664 -1377 -789 488 1280 850
3569 850 -351 -1187 -910 165 1039 921 -18 -901 -936 -148 707 908 286 -534 -860 -442 335 785 567 -128
3589 -128 -684 -659 -80 572 759 292 -430 -814 -492 290 849 700 -131 -860 -845 -44 857 1002 214 -809
3609 -809 -1134 -408 746 1235 560 -665 -1294 -715 565 1324 861 -451 -1333 -972 320 1308 1067 -182
3627 -182 -1246 -1134 54 1177 1175 81 -1049 -1180 -200 938 1187 335 -769 -1130 -424 638 1088 552
3645 552 -440 -972 -609 301 894 682 -87 -729 -687 -62 610 760 277 -411 -730 -404 246 723 599 -42
3665 -42 -647 -721 -135 595 845 334 -489 -939 -527 383 991 704 -256 -1034 -871 130 1040 999 -2 -1026
3685a026j01R78J131K07r12j198l44Q48J247M65p60j262n72O51J267O55n41j219
3703d86p37M36J148P85k86j062q31J54R55Q41rq17q55j12O62Q19K53n28p60l65
3723g95L47O96M71j53o35n42l0N18O02K09l80o68l71K33O89N62j08o90o95m8O67
3744a21Q26K18o48r40l54N89J010N21n05j086o56M36J115P69l25j119q82K05J123
3763A76R58j11j059j018j6J014J072J00r27j069k22Q13J083L06o82j042m21N65
3781d80R84M91m16r10n56K74Q03N99j20o89o30m6N52O42K05m29o16l23K36O01
3801A72M55p2n57n67r6M94O60K69l94p38m44L06P97N80j82q34p23P4Q36Q42N1
3822I29q17r55j75P85J043K92p37j104m09O83J120N12n92j135n95M92J119O79
$$ plain form
3685 -1026 -1127 -149 982 1189 277 -921 -1265 -417 830 1295 535 -727 -1299 -648 619 1274 733 -486
3703 -486 -1223 -787 361 1146 860 -202 -1033 -879 76 917 908 91 -764 -876 -214 605 858 330 -430 -795
3723 -795 -448 248 719 566 -69 -611 -641 -123 479 688 308 -360 -731 -498 191 753 645 -45 -740 -788 -121
3744 -121 705 923 275 -665 -1019 -430 580 1101 596 -490 -1146 -710 405 1174 849 -270 -1152 -947 176
3763 176 1134 1023 -36 -1054 -1070 -56 1016 1116 189 -880 -1102 -289 794 1100 418 -624 -1045 -480
3781 -480 504 995 579 -331 -887 -613 190 789 669 -20 -650 -696 -144 498 703 274 -342 -665 -429 172
3801 172 627 555 -2 -569 -665 -171 489 758 364 -374 -818 -512 285 865 683 -151 -874 -800 36 878 929
3822 929 112 -843 -1018 -233 810 1102 365 -739 -1148 -465 655 1167 575 -560 -1155 -663 456 1135
3840A135l84j086p51K84J015P88j67r28q11L2Q30Q07R0p07q07j91N72P74K92m23
3860C64p20l80K46O59M63q9n53n35n5M32N97K16l30o01l82J99N97N31l6o09o24
3881f10j00N65P34K59n25q25l93M60R01N19l86r37o39K70R73P61j99r68q38P9
3901h99R60R18mq98r76j01Q43R84J95p49j002l10O80R93L86n67r43m81M41R02
3921C72N17k92q22n79J61P28O06k5o14o15j15M87O29K21l39n86l53J94N40M51
3941E66l2m76n38j36M20N95K79l11o67m14K04O92N57j03p11o76JP06P78J11o85
3962A60q57k48O48R38L32n90r73m37N13J000N50m49j002o19L54R80O80k39r51
3981b10p49J72Q78P83n1q06p93n6P04Q06J55n98p74k57M74P37L33l18o70m17J82
$$ plain form
3840 1135 751 -335 -1086 -802 213 1001 834 -94 -905 -873 -43 764 854 147 -660 -851 -279 495 787 364
3860 364 -356 -736 -490 169 632 543 -10 -545 -600 -168 429 645 315 -286 -668 -469 128 659 623 14 -610
3881 -610 -710 -145 589 848 323 -502 -895 -435 466 985 599 -338 -977 -707 266 1027 828 -140 -978 -899
3901 -899 61 979 975 77 -899 -1000 -157 827 1022 273 -729 -1039 -359 634 1020 453 -490 -971 -530 372
3921 372 889 597 -225 -804 -643 85 691 666 52 -563 -678 -191 438 659 320 -266 -619 -425 115 566
3941 566 534 58 -480 -616 -196 399 678 367 -300 -714 -510 182 739 636 -75 -751 -750 -44 734 845 160
3962 160 -697 -945 -297 641 973 383 -590 -1027 -514 486 1036 587 -415 -1034 -680 300 980 741 -210
3981 -210 -959 -787 91 874 823 17 -776 -832 -128 678 833 235 -539 -796 -322 415 748 430 -240 -657 -475
4002d75N83M86m3n06n13j05L91N47K45k75n48l72J46N43M75k1m96n94j29M70O80
4023D89K51m26p23l95L54P68N14k78q17n89J72Q30P08q7q27p91J1P81Q64Q9p52
4044A46q82j98O90R24K73o07r33l61N25R22M40m37q57n14L13Q14N66k08p48n82
4064g14R3O38O05K9n45o00j57M28N88K45k89n63l34J50N16M15j3m31m95j39L67
4085b06N49K48k66n88l80J77O05M91o6n97o15l7O07O74J63n65p62k60N31Q05L80
4106H88m87q58m50M05Q86N38l29q70o16K30Q62O80j33q23p37O1P60P55N2o98p67
4127f51j46O13P47K34n08p30k89L64O90L63k40o26m48J27N59M70jm61m89j38L71
4148a89N06K38k47n15l19J02M85M32J8m41n33j18L93N97K48l50o38l69K71O83
$$ plain form
4002 -475 108 594 551 45 -468 -573 -182 365 610 335 -213 -585 -439 104 579 558 62 -532 -661 -191 489
4023 489 740 314 -409 -804 -450 318 832 554 -263 -852 -680 150 858 771 -56 -847 -836 -55 809 898 146
4044 146 -736 -934 -244 680 953 346 -587 -948 -423 499 939 502 -355 -869 -556 258 824 616 -132 -714
4064 -714 -621 17 622 651 106 -494 -651 -223 365 610 321 -242 -576 -426 90 505 492 61 -434 -573 -206
4085 -206 343 591 325 -263 -643 -466 139 630 564 -33 -648 -685 -78 596 759 194 -568 -828 -297 508 888
4106 888 401 -457 -907 -502 384 922 593 -277 -893 -663 199 879 746 -77 -814 -753 7 762 814 116 -651
4127 -651 -797 -184 563 797 289 -441 -730 -366 324 687 447 -179 -627 -500 59 529 528 67 -422 -560 -189
4148 -189 317 555 308 -207 -526 -424 61 493 511 70 -463 -581 -188 409 657 307 -331 -700 -429 254
4168B54M73j81p16n65J06P15O53k1o93p15o7O53P80J69o29q31k46N66Q49L25m88
4189C91q64m00M11Q23M83l15q03n31K23P32N78j12o87n71J2N73N86J09m77o03
4209d42j70L51N65K64k35n25l39J08M62M15J1l96m53j24K98N00K57k30n10l59
4229e52J21N23M72l5n16n28j01N13O14J79m61o89k86M13P49L74l48p68m69K82
4249e13P90N23j96p76o17J30P50O68l6p24p04m6O55P42J20n76p49k03M91P30K79
4270G38m04o86l63L19O37L96j89n80m19O1N03M60K8l93m78j48L17M78K36k09m37
4291a33l17O4M32M11K3l89m75j32L30N19K72k90n66l68K16O00M49j28o19n37M6
4312e92N95O27M4o00o72j47N72P17K28n22p62k99M48P76L85l85p75m54L08P73
$$ plain form
4168 254 727 546 -170 -735 -629 86 739 718 25 -690 -757 -104 676 845 216 -615 -861 -295 554 879 391
4189 391 -473 -873 -462 361 844 529 -274 -805 -582 150 728 616 -71 -642 -630 -57 529 638 161 -442
4209 -442 -612 -261 304 568 333 -192 -531 -423 39 454 465 69 -384 -508 -210 290 547 317 -193 -552
4229 -552 -431 92 564 529 13 -515 -616 -103 511 690 229 -460 -746 -333 416 790 442 -326 -795 -513
4249 -513 277 800 604 -172 -789 -659 91 759 723 -1 -705 -751 -96 646 766 190 -559 -762 -271 459 738
4270 738 334 -352 -715 -396 241 637 448 -132 -551 -490 13 473 501 108 -370 -518 -201 277 513 304 -133
4291 -133 -450 -386 46 457 480 91 -384 -516 -186 333 605 315 -251 -619 -403 197 646 518 -101 -638 -592
4312 -592 3 630 674 74 -598 -745 -173 544 772 250 -512 -811 -363 413 798 413 -362 -816 -508 265
4332B65M96k19p21n47J32O59N81m1n88n83m7M97N78J39m10n56k20K94N46K85j91
4353C49m80l54R4M11M01L5l69m29j21K48M64K31j71m52l48Q6M61M14J8m33n10
4374d55j19M33N61K07l83o23l04L23O76L89k72o97m51J89P00N47j21p02n92N3
4394f41O57O48M1o17o83j10N52P01J89m99o87k53L98O90L20l27o42l66K27N88
4414A86M07j32n28m23L5M61M25O4l63m46j54K67M34K37j85m01l26O9L78L81L9
4435D25l36m36j54K97M73K51k19n02l53J45N34M30p3n27n11k6N45N66P8m89o29
4456e11j69M61O73K57m13o93l43L67O97M01k80o96m48K21O64N09j53o40n17N5
4476e58N77N46K8n16n55r9M45N30J60l53n17k12K47M76L01j70m34l41N9L81L65
$$ plain form
4332 265 761 542 -179 -726 -594 65 646 605 17 -566 -613 -116 462 601 191 -365 -585 -291 255 540 349
4353 349 -131 -485 -391 20 421 456 87 -342 -463 -215 249 480 309 -143 -491 -405 56 470 488 55 -455
4374 -455 -574 -141 420 627 244 -379 -683 -360 316 705 433 -264 -715 -526 174 721 600 -102 -694 -641
4394 -641 16 664 705 88 -595 -705 -153 548 737 238 -449 -702 -304 386 706 379 -263 -629 -402 186
4414 186 593 461 -67 -490 -455 6 431 495 132 -314 -468 -201 233 470 285 -116 -442 -373 5 386 425
4435 425 89 -347 -501 -204 269 520 301 -201 -554 -409 125 555 482 -45 -556 -582 -37 529 607 118 -511
4456 -511 -680 -219 454 711 298 -395 -738 -371 326 727 447 -249 -697 -476 188 697 544 -96 -613 -558
4476 -558 19 565 593 77 -478 -577 -132 398 558 205 -312 -524 -277 199 500 330 -104 -445 -386 -5 360
4497C60M3l01m02j27K23M20K02j28m15l11P2L82M17K2l97m48j31L64N22K18l22
4518B63n67k92K73N86L98k07o20m58J27O32N01n1o12n63nN58O12R2n42o23j64
4539f62M86O38K07m01o40k81L32O25L24k50n97l61J74N22M03q4m82m07j2M13M20
4560C67Q0l10m30j42K24M09K12j32l79k85L1L50L54N5k94m04j44K33M45K33j82
4581B91m49l24R8M76L95j2m72m66n3M35N48J21m29n75k16L97O19K71l50o23l43
4602f61K79O34M04k21o31m40J50N92M92p7n61n06ON14N06O9m54n24j18L73N13
4623C39J78l00m77k44K09M55K91j16m16l07K7L45L44P0k78l70j35J96L78K33j29
4644B93l74l10M1L58L71N4l35m18j47K98M84K20k62n09k98K04N29L57j17n51m42
$$ plain form
4497 360 403 102 -300 -427 -204 216 418 290 -125 -436 -364 18 435 457 60 -388 -519 -155 367 585 263
4518 263 -304 -596 -323 263 661 454 -166 -624 -497 135 636 585 -27 -590 -595 -37 575 667 125 -498 -662
4539 -662 -176 462 669 268 -372 -653 -321 304 628 378 -219 -580 -406 116 519 435 -47 -454 -466 -53 367
4560 367 447 137 -293 -435 -211 198 410 278 -101 -386 -355 -5 349 404 110 -294 -438 -205 240 473 291
4581 291 -158 -482 -384 92 487 475 3 -463 -516 -81 467 588 159 -416 -632 -235 384 655 305 -318 -661
4602 -661 -382 252 656 435 -196 -636 -486 106 598 521 -40 -546 -540 -26 480 549 95 -429 -547 -174 339
4623 339 517 217 -260 -504 -295 160 451 335 -81 -388 -361 -16 328 398 120 -250 -385 -189 189 422 293
4644 293 -81 -391 -350 8 379 433 98 -320 -467 -169 315 535 273 -236 -534 -330 199 556 439 -112 -554
4665e54O9N31M96rn12n44o1M96N55J25m26n98k04M07N92K36l18n82k88K70N37
4686B18L44j85n18l78J10M79M11o1m19m02l5L51M08J07k80l92j67J94L81K27j02
4707B91l51k91J8L06L50O0k59l70j60K09L81K43j17m24l22O6M16L75Pm16m42o0
4729d90L81M99J29l40n31k24L16N58K72k49n75l30K17N49L87j49n47m26Q8N25
4749F0M57j9m86m93l4M40M98Q9l66m89j59L25M65K05k41m37k53J61M01K93q9l54
4771b6l11lL02L34P3k39l42j66J82L32K50j13l34l01J9L27L40P1k82m07j36K51
4793a79M14K25j98m59k91J56M60L55p8m81m16K6M66M67L3m48m94q2M12N12J56
4814E56l63n36j98K89N49K50k51n24k99K06M85L56j48m72l51O3M19L86nl65l90
$$ plain form
4665 -554 -485 46 542 533 21 -523 -584 -88 467 592 166 -432 -636 -229 363 599 281 -301 -589 -319 218
4686 218 562 377 -141 -519 -409 70 481 420 1 -401 -436 -85 323 430 150 -242 -409 -215 166 393 291
4707 291 -60 -351 -333 -27 323 383 124 -246 -406 -197 184 427 310 -114 -436 -370 46 421 428 12 -430 -490
4729 -490 -109 390 519 179 -352 -576 -260 298 570 321 -254 -584 -367 182 569 420 -127 -553 -465 60
4749 60 517 498 12 -481 -515 -75 423 512 146 -343 -502 -177 288 493 252 -185 -438 -277 124 417 328 -26
4771 -26 -337 -340 -38 296 369 130 -212 -378 -196 136 386 273 -61 -362 -343 -16 324 395 113 -294 -430 -179
4793 -179 235 460 262 -197 -488 -332 128 483 405 -76 -492 -466 0 467 500 52 -442 -524 -112 400 556
4814 556 193 -343 -541 -252 297 547 296 -228 -527 -321 164 520 372 -100 -451 -388 31 417 412 47 -343
4835c43o8K97L96J11k20l79j74J55L55K19p6l17k90RK79L22P6k29l48j54J62L71
4857A54K19j08l63k92M8L48L67L6l47m03j07L24M52J59k88m86k27K57M90K83j93
4878C23m83l58J56N04L73j01m78m04L7M50M33K1m14m59p0L76M47J31l19m65j74
4899d74K61M33K28k03m15k43J30L70K82n4l22l18j7K71L25R3k22l29j54J49L17
4920A08K29p7l00k82jK85L17P1k33l64j46J97L86K17j55m01k78J19M06L33n4m02
4942b5l99PL94M23O3l72m52j21L39M79J58k90m90k25K45N02K57j99m84k95J50
4963c35M59L20q3m32l37K1L73L62L4l19l69r2K75L50J48k14l36k02J48L26K38
4984C35o6k82k82lK63K86P4j86l22j52J51L18K17r1l11k77L0K98L23M7k78l79
$$ plain form
4835 -343 -411 -114 282 393 173 -206 -380 -225 130 349 273 -44 -334 -325 -46 276 352 123 -225 -379 -217 154
4857 154 373 265 -98 -390 -342 6 373 409 62 -341 -448 -124 328 487 199 -287 -514 -257 233 516 323
4878 323 -160 -518 -362 142 515 414 -64 -468 -431 19 452 473 59 -400 -470 -94 353 484 165 -300 -474
4899 -474 -213 220 448 245 -170 -413 -283 87 369 315 -7 -325 -342 -71 254 347 125 -204 -358 -209 108
4920 108 337 260 -40 -322 -323 -38 279 350 117 -247 -393 -196 190 407 252 -149 -427 -308 98 431 377 -25
4942 -25 -424 -417 -23 400 463 91 -361 -482 -143 336 494 204 -286 -511 -266 236 493 294 -190 -485 -335
4963 -335 124 444 361 -71 -408 -387 -14 348 382 63 -306 -398 -123 227 375 161 -175 -377 -229 97 335
4984 335 269 -13 -295 -298 -35 251 325 139 -183 -335 -184 134 351 260 -51 -328 -298 0 323 370 92 -287
5006b87j18K73L96J87k52m24k18J94M21K80j39m34l24Q3M32L67n1m14l96nM13
5027a6L94O1l53m37j06L08M43J43k61m13k04K04M21K30j42l79k65Q1L42K96l1
5048C16k92l11m4K44L16R8j86l01j70J43K91K06m9k78k66j0K44K94R4k30l14j43
5070c48J52L51K13j17l72k50P1L40L21j5l43l72k4L17L94R9l05m26j42K68M47
5091B59J86k41m40k29J89M39K78j52m16l08R7M02L28l5l55l65pL23L60N9k64l67
5113b59r8K13L35J62j56l33j85Q9K97K46m6k44k69k6K01K89Q7j67k94j42J12K83
5135I5K13o5k68k66OK59L05O2k38l36j30K17L49J71j60l90k26J35L86K79q6l75
5157f3l31N2L65L56kl55l80l2L27L89R9k99m10j22K51M14J69k20l99k04J79L58
$$ plain form
5006 -287 -405 -132 264 451 199 -225 -443 -249 172 452 313 -121 -445 -362 70 437 386 -28 -424 -429 -16
5027 -16 378 439 86 -351 -457 -149 294 437 176 -237 -441 -237 184 414 272 -107 -372 -291 51 347 316
5048 316 24 -287 -331 -87 229 327 141 -160 -330 -187 104 310 261 -17 -283 -293 -49 245 339 109 -205 -348
5070 -348 -196 155 368 251 -121 -371 -300 40 361 346 3 -369 -393 -76 318 417 112 -314 -456 -188 259
5091 259 445 204 -236 -465 -276 163 441 289 -127 -435 -338 64 392 357 2 -363 -370 -47 313 372 108 -259
5113 -259 -357 -144 191 353 197 -136 -321 -232 65 311 265 21 -248 -274 -73 216 303 136 -158 -300 -188 95
5135 95 308 243 -25 -291 -285 -26 279 341 103 -233 -363 -146 203 374 214 -176 -402 -267 119 398 312 -63
5157 -63 -394 -342 23 379 377 22 -358 -390 -63 326 425 126 -284 -406 -155 259 428 208 -191 -395 -216 142
5179A42K27j07l27k67L9L02K90J9k61l06o6K23K82J10j54k78j65R9K66J92l1k32
5201ck37l0J90K76R6j78k92j39J23L04K10q7k96k50K9K89L03J3k89l25o6K67L73
5224B81J01k49l60j73K29L98J99j84l88k56J51L90K68q5l77l12M2L68L11k1l05
5245B8l28m1K77L24R4k31l30j28J78L23J70j44k97j99Q6K52K37k7k33k27m7J96
5267f7K43Q8j39k59j41R5K54J88l6k46k27j5K27K58Q4j98l00j23J69L20J73j38
5289B10l26k18R7L42K62o2l42k91J0L21L28M0l24l54o5K93L54J16k61l67j57K19
5311a75L66J83j66l45k13J12L36K36p7l18k37kK81K73L2k38k64p2J80K70J23j48
5333A37k37j67R1K26J88pk29k07m1K00K33P3j44k51j29J01K57J94n3k70k26JK67
$$ plain form
5179 142 369 262 -65 -332 -293 9 299 318 57 -249 -315 -92 190 300 146 -132 -297 -198 68 260 229 -3
5201 -3 -240 -270 -80 196 292 114 -178 -317 -194 110 320 233 -63 -313 -284 5 308 321 32 -293 -359 -92 281
5224 281 382 133 -227 -400 -171 227 426 242 -146 -402 -251 139 407 322 -55 -367 -325 43 354 333 28
5245 28 -300 -341 -64 260 354 123 -207 -335 -157 166 336 192 -105 -304 -218 34 271 244 11 -216 -263 -67
5267 -67 176 264 125 -134 -275 -180 74 262 226 -20 -247 -262 -35 223 307 109 -191 -314 -145 175 348 210
5289 210 -116 -334 -237 105 367 305 -37 -328 -318 3 331 371 47 -307 -372 -79 275 391 130 -237 -394 -175
5311 -175 191 374 208 -137 -350 -238 98 334 257 -61 -298 -300 -19 254 286 48 -216 -288 -108 162 285 137
5333 137 -100 -267 -176 50 238 231 2 -205 -246 -46 187 260 116 -135 -264 -163 94 288 235 -35 -261 -260 7
5356GK75J9k44k86q7K16L35J11j99l53j40J76L42K10j56l56k35R9L62K62o9l24
5378c5k96K7L07K99J2k70l11n7K31L20J01k03k93j45J42K87J79r9k71j89M4K45
5400B5K15pk05k16m2J61K30Q3j04k33j33O7K20J82l0k04k24k3J91K49O9j71k72
5423a72j09J39K80J61j01k95k17Q9K93K29l3k85k90NK74L15K3k50l16q6K40L36
5445B30J28k03l52j51J74L24J88j35l13k15R2L07K25n6k57k35pK28K58M7k04k52
5467a79o5J42K46J10j15k19j44O0K03J65Jj71k28k1J58K10Q1j22k20j36Q2K31
5489F9J74m3k26k23NK36K26N0k11k81p5J83L02J09j55l12j56J48L00J95r6l04
5511h5k37O7K99K58k5k90k62nK74K83L0k27k82q2J98K79J16j56k91j39J32K46
$$ plain form
5356 7 282 301 57 -229 -316 -100 235 346 147 -206 -346 -170 172 382 226 -130 -365 -266 96 358 289 -35
5378 -35 -331 -304 3 302 314 44 -267 -324 -93 227 328 125 -168 -313 -171 116 295 196 -75 -264 -220 25
5400 25 240 233 28 -188 -230 -69 161 244 140 -93 -226 -159 61 243 213 9 -215 -238 -47 202 271 100 -172
5423 -172 -281 -142 138 299 198 -97 -314 -225 68 297 264 -21 -311 -306 -32 283 306 56 -260 -346 -106 230
5445 230 358 155 -197 -348 -174 150 338 203 -110 -325 -233 74 299 243 -14 -249 -256 -28 230 277 73 -179
5467 -179 -244 -102 144 254 139 -80 -224 -164 39 204 205 34 -194 -215 -57 153 234 112 -108 -244 -162 69
5489 69 243 200 -26 -249 -244 -8 218 268 57 -224 -299 -116 186 295 140 -172 -328 -180 120 315 219 -85
5511 -85 -322 -255 44 302 277 -13 -275 -280 -6 277 307 80 -202 -284 -86 193 309 153 -138 -277 -145 101
5533A01J71o9k27k01L8K04J98J1j81k04n8J42K09Q9j02k05j26M8J95J78j8j90
5555Cj91l2J51K35P4j43k44j13J20K43J61p6k59j98L4K73K18pk38k64k0K32K78
5578B37O4k10k94r5K05K83J22j55l01j59J32K88J82r1k73k00M7K56K13jk35k41
5600b26pJ82K41N9j65k38q3J12K35J25r6k13j39M0J80J74jj63j77m1J39J96Q0
5623B14j09k09j26P8K12J66m4j97j93%J97K16M5j83k34q7J59K60J15j32k67j61
5645b80J15K67J95p4k76k18M0K63K41j0k41k58k1K20K55O5k01k71q1J61K54J20
5667B65j27k45j43Q5K42J53m7k13j76J8J71J92L2j59k03o7J44J85R5q8j93j35
5689b14O0J75J54Oj63j82l7J34K11P9j25k11j17R4K25J62p9k15j97M4K05K22%
$$ plain form
5533 101 272 203 -24 -225 -187 17 215 226 45 -159 -217 -75 134 223 121 -84 -210 -162 33 211 193 3
5555 3 -188 -220 -69 166 240 97 -147 -260 -140 103 264 188 -71 -269 -235 38 256 249 11 -253 -273 -41 237
5578 237 301 91 -203 -298 -93 190 312 157 -144 -303 -171 117 299 208 -65 -265 -218 38 251 250 15 -226
5600 -226 -233 -51 190 249 84 -154 -237 -125 110 235 139 -74 -213 -173 7 181 180 17 -160 -201 -62 134 214
5623 214 105 -104 -230 -152 60 226 182 -15 -208 -208 -11 205 250 67 -167 -254 -95 165 280 148 -119 -280
5645 -280 -165 102 297 223 -53 -271 -231 32 273 263 22 -236 -257 -37 218 283 82 -189 -270 -109 145 265
5667 265 138 -107 -250 -165 77 230 183 -30 -206 -188 -17 175 207 48 -155 -222 -78 107 202 114 -79 -214
5689 -214 -154 21 175 181 18 -164 -201 -67 144 223 98 -113 -230 -136 89 251 172 -43 -240 -196 9 231 231
5712B31k20k09n4J91K56O3j80k46r8J41K66J34j25k74j63R9K62J78m7k66j89K1
5734b29K29K10Kj96k09l9J65K20N7j27k01r6J04J94J24p1j72j50J0J91J49J6j46
5757C5j70o3J37J84P5q9j86j17N7J72J60k1j84j75j4J80J94M8j47k14r4J32K24
5780A24J28j07k44j54P3K42J79m2k41j88NK23K34Jk21k23k0J71K30P8j56k48j05
5803b61J42K34J15r0k25j41P3K10J54m2j78j66KJ59J69N6j46j85o7R4K00Q3o6
5826A24j70j34M3J58J53Pj45j73n4J26K07O0j03k01j09R4J72J64n0k12j75J7K05
5849DJ85J4j75k08n6J66K34P0j33k56r6J30K40J28r3k26j67O8K24J78m6k02j89
5872b06J5J88J95L7j89k04m7J53J95Q3j21j92r4P5J90J24n7j81j35J2J70J36L3
$$ plain form
5712 231 11 -198 -252 -61 195 258 78 -168 -266 -125 141 275 150 -124 -287 -188 74 252 205 -61 -250 -229
5734 -229 0 210 212 16 -193 -232 -67 153 210 83 -118 -214 -110 84 208 137 -35 -185 -175 16 165 181 35
5757 35 -135 -198 -61 123 198 109 -77 -194 -137 35 195 174 -10 -185 -199 -19 175 223 76 -138 -232 -100 124
5780 124 252 145 -99 -253 -180 62 241 199 -42 -230 -225 -2 232 233 12 -211 -231 -60 170 248 92 -156 -261
5803 -261 -119 115 230 140 -85 -226 -153 57 211 169 -9 -175 -173 -14 155 211 65 -120 -187 -93 107 190 124
5826 124 -46 -180 -137 21 174 181 36 -137 -191 -65 142 202 99 -102 -211 -117 55 219 169 -43 -218 -201 4
5849 4 189 203 28 -180 -236 -70 164 234 101 -155 -251 -121 119 247 154 -72 -239 -171 53 231 185 -17 -206
5872 -206 -191 -3 192 229 40 -164 -211 -58 137 220 99 -93 -187 -112 78 202 145 -36 -171 -159 11 147 180
5895A80j39j70m8R4J80Q1p8j69j17M8J71J32j0j55j72j7J49J80O1j25j98r1J04
5918a09K08J21q3k13j50O2K01J77j7k12j90nJ94J95L2j56k27n2J63K22O7j16k29
5941a17j04J14K07J16p2j84j62M9J97J42mj88j60jJ34J73L6j17j79o7P9J86R6
5964A74o1j53j27K2J47J42kj22j56l5J06J73O3q7j50j28Q2J54J41k9j85j47J7
5987a61J64J78J2j47k02n3J47K10Q2j27k01j20J11K01J37o8k03j58M0J99J73l2
6009A82j81j80qJ73J89K8j65j81m7J12J92R3j12j78j02N9J86J15m6j71j28J8J50
6032bJ41K5j26j49m9Q9J53Q4o2j46j10K3J52J47j6j36j52l1J24J72N4r7j90q7
6056a89R7J71J19o7j69j49L5J83J64j3j89j68nJ58J90L6j48k02p3J39J90R2r9
$$ plain form
5895 180 41 -129 -177 -83 97 178 100 -69 -186 -138 33 165 155 0 -172 -189 -40 140 201 76 -122 -213 -109
5918 -109 99 220 137 -76 -226 -164 37 214 197 -15 -205 -210 -16 179 211 55 -172 -224 -61 161 228 112 -117
5941 -117 -221 -107 100 216 144 -40 -202 -153 44 186 182 -6 -166 -167 -33 140 176 59 -120 -187 -108 78 174
5964 174 113 -40 -167 -145 2 144 142 20 -136 -171 -65 108 171 84 -66 -194 -112 42 183 154 -31 -178 -161
5987 -161 3 181 193 46 -156 -209 -62 148 230 103 -98 -218 -107 94 231 163 -40 -198 -158 41 214 182
6009 182 1 -179 -187 -14 175 203 38 -143 -190 -78 114 207 95 -83 -185 -126 60 175 129 -42 -170 -152 -2
6032 -2 139 164 38 -111 -160 -71 82 166 104 -42 -152 -129 23 170 154 18 -134 -165 -41 131 185 88 -102 -189
6056 -189 -92 79 198 131 -38 -187 -152 31 195 182 -7 -175 -180 -22 168 204 56 -146 -219 -80 110 202 103
6079A03k13j08Q4K16J17p6j69j56M3J71J47Mj58j55k7J39J54M5r7j71o5P6J55
6102E9J03n8j23j15%J37J40J8j21j53l5R6J48P8p7j41j11N0J40J41k9j45j36j9
6126a53J39J51M2j16j90n4J03J93Q3j02j80j12O7J96J24n9j87j34J6J77J65Rj66
6149A2j79j7J49J85L1j24j67p7J06J78R5p7j87j05N7J63J14j1j43j40mJ22J46
6172A27L2j09j34o5Q3J31R3m4j59r9M0J15J36qj20j49k8J06J54N8q6j55r0O9J61
6197E9J16m9j59j39K2J53J56rj39j63k9J40J80M5j29j71p0R7J89R2q7j66j13N3
6221a21J75J22l6j60j33NJ47J55J5j36j52l8J16J53O7r5j54p2N4J50Q5l1j20j15
6245a19kJ11J29K5j05j27n1P0J42P5n7j34j08L6J44R8Pj28j37k7J27J47M5j00
$$ plain form
6079 103 -110 -218 -134 82 199 123 -46 -202 -159 12 159 163 5 -150 -177 -38 116 161 64 -107 -172 -96 59
6102 59 162 104 -19 -134 -134 3 143 161 40 -113 -148 -52 96 174 97 -44 -155 -105 35 176 147 2 -134 -153
6126 -153 -14 137 179 63 -127 -181 -78 115 198 96 -84 -196 -129 67 191 132 -55 -189 -173 4 169 178 12
6149 12 -167 -184 -35 150 181 57 -110 -187 -81 97 192 115 -72 -177 -120 43 157 146 3 -137 -141 -19 127
6172 127 159 50 -84 -149 -66 65 158 114 -45 -144 -104 11 147 139 19 -130 -158 -52 102 160 74 -81 -171 -102 59
6197 59 175 126 -33 -172 -150 3 159 150 11 -152 -181 -41 139 184 55 -116 -186 -89 100 192 105 -61 -174 -121
6221 -121 54 176 140 -20 -153 -148 -1 154 169 33 -119 -157 -41 112 179 84 -70 -142 -88 62 147 116 -4 -119
6245 -119 -121 -10 119 144 39 -88 -139 -69 73 148 91 -43 -151 -115 29 127 134 6 -131 -158 -31 116 161 61
6269F1j70p2J06J60R2q3j60j10N5J74J25l9j63j32OJ62J56Rj46j51m7J31J54N6
6293A74j00j68p0Q1J60J08p9j57j05L6J53J08lj30j19j8Q8J44L6p6j38p0O8J20
6317D3R3l9j26r6J5J08J20Rj03j16n5R5J25P6o6j48r0L9J52J05k1j35j47J9J45
6342BJ42J3j32j45m9J36J62N2j06j62p7Q4J65R9p8j57j15M9J62J11j6j57j29L
6366a43J37J36J6j05j42n7J03J35P2q4j27p7L2J30R6k2j06j11mJ05J10K9q8j07
6390g2n6O1J14Q2l7j21r2OJ38J07J7j20j32k6R6J50M7r5j30r1Q5J39J05o9j50
6415d4j12M8J45J19qj56j20j6J28J54J9j17j54l7J05J43O6r5j40q7O7J45R9n7
6439I5j24j08MJ32J23j3j01j15k9J04J10O0p7j13p0N6J05R0l2j00r4jQ4J12L8
$$ plain form
6269 61 -109 -181 -75 85 177 94 -66 -176 -121 53 178 139 -24 -156 -150 12 168 177 31 -120 -167 -36 118 174
6293 174 74 -94 -164 -83 77 185 106 -51 -156 -120 33 141 138 8 -111 -129 -41 103 139 63 -75 -145 -77 43
6317 43 136 97 -29 -125 -110 -2 118 127 24 -92 -147 -52 73 149 83 -65 -155 -116 36 141 120 -15 -162 -143 2
6342 2 144 157 25 -120 -169 -33 129 181 75 -87 -164 -80 85 184 106 -51 -166 -117 45 156 140 -17 -146 -143
6366 -143 -6 130 146 41 -101 -158 -55 80 152 68 -59 -136 -104 26 122 100 -6 -117 -121 -16 94 123 35 -72
6390 -72 -128 -67 47 129 92 -29 -121 -115 23 130 147 27 -105 -131 -35 115 162 67 -63 -154 -69 70 175 106 -44
6415 -44 -156 -108 37 156 148 -8 -128 -144 -16 138 157 40 -114 -151 -46 97 163 68 -72 -159 -92 53 152 95
6439 95 -29 -137 -133 -1 122 109 8 -107 -136 -32 78 138 61 -52 -122 -66 39 129 97 -3 -97 -98 -14 98 136
6464A36q5j27m4P0J21N7m8j27q8L6J35R7Mj39j26J0R8J34K9j02j51m7R8J46P2
6489A59q7j39r2O4J53Q4l3j57j05J2J46J37j7j39j02k2J12J36L0r7j21n4P5J20
6513F3O5m4j20o9L1J07R7j6r3j01k0R1J07L7p5j14n4M0J21P0k1j12r8J3R5J09
6539A09J5r9j32k6R2J20N7o8j38q1O9J35P9l6j38r3PJ36J23j1j07j36k1J07J45
6564A08K7r9j27n8Q5J40O6p1j45o6N2J20R6k5j11j10J6R2J18J8r6j14l2P9J15
6589G8M7n9j04o1K0J04Q9k1r6q9nQ4R5L9p4j15l0M2J08O9m7j04r8K9J14R3%j16
6617hj17JR9J19M5r6j12o7P2J37P0n4j44p6L7J31J16m2j24j03jJ18J19Kr4j30
6643a02k1Q7J19N7q1j22o3N9J13Q1l8j17q5K0R3J02op3j02l4Q0R5N4o9j00n0L7
$$ plain form
6464 136 51 -76 -120 -50 71 128 80 -47 -135 -99 36 133 137 -2 -128 -118 -20 114 143 41 -110 -157 -59 87 159
6489 159 72 -67 -159 -95 58 142 109 -48 -153 -141 5 142 125 -14 -116 -138 -26 110 140 43 -78 -132 -57 63
6513 63 128 84 -36 -105 -74 33 130 114 21 -80 -100 -9 98 135 60 -54 -108 -68 53 123 102 -10 -108 -95 0 109
6539 109 124 25 -107 -133 -41 79 136 68 -70 -151 -82 53 132 96 -42 -135 -128 8 131 120 13 -123 -144 -37 108
6564 108 135 36 -91 -149 -64 76 142 71 -74 -140 -88 32 128 103 -8 -118 -102 -10 108 126 30 -84 -116 -37 78
6589 78 125 66 -38 -99 -79 25 114 93 -3 -92 -97 -13 82 121 47 -68 -98 -56 52 121 74 -30 -128 -99 15 108 108 -8
6617 -8 -125 -124 -25 94 139 43 -69 -136 -64 73 143 89 -55 -131 -94 37 153 111 -13 -116 -117 1 120 122 28 -102
6643 -102 -123 -36 83 140 59 -63 -126 -67 46 127 89 -28 -113 -93 0 102 96 23 -79 -113 -33 62 116 47 -53 -103 -66
6670f6R1Q4k3j09p4j0R0J05K0p5j08m8P5J17M9m2j33o8N2J04J07n4q6j07oJ18
6696CJ02K0j06j00m1P8J25N0p9j27m8O1J29O4l6j41p2K7J06Q0Rr4j06rQ2J04K8
6723A09p5j02o2O7J16N6n2r1p0J5J04Q0mr0r8mQ4Q5L2o9q3o3O0J15M5k4r7j00
6751a16K5J09R0pr0j02k0Q3J15L9p0j18n5O7J10Q2o0j03q2J3J15R9j7j21q4j1
6777a09J02J02L0r9j10l2N7J31M3n6j10o3M8R5P0j9q9r2J2Q6Q9Rq3q7j7M1J15
6804F4L8m9q5o1K7Q7Q3j1j01q8MQ6Q8J8o1j03m3O2J07M8l5j16o7J8J12Q0k6q1
6832ej01pR9J02K0q0j15l1O9J04N3n8j02q4M8J23P2l7j03p1K2Q5Q0Nq7q8j7Q3
6860b1Q8K9o3r7m3O8P6O9l9q6p7K5O8J03oq0p7j9O5Q3L3n7r0m9M2Q1Q2l5r0p2
$$ plain form
6670 -66 25 109 86 -23 -97 -107 -17 88 108 33 -75 -123 -48 69 118 76 -57 -125 -73 31 138 84 -2 -109 -115 3
6696 3 105 125 19 -81 -122 -44 81 131 52 -75 -123 -62 67 131 95 -46 -118 -91 15 95 104 10 -96 -105 -23 81 109
6723 109 34 -68 -130 -63 53 109 57 -34 -104 -89 15 95 91 1 -97 -101 -17 68 100 31 -52 -115 -55 60 105 81 -16 -116
6751 -116 -91 18 108 101 11 -91 -111 -28 87 126 56 -62 -117 -50 60 142 82 -21 -103 -90 25 124 107 -14 -98 -109
6777 -109 -7 95 125 26 -84 -116 -59 72 115 59 -51 -114 -66 29 99 80 -9 -101 -89 -3 86 95 12 -75 -92 -51 64
6804 64 102 53 -32 -93 -66 21 104 93 -8 -96 -92 -6 82 100 39 -64 -107 -45 62 110 75 -41 -108 -90 22 102 76 -5
6832 -5 -106 -113 -14 88 108 28 -87 -118 -49 55 108 50 -52 -136 -88 35 107 70 -33 -104 -82 3 83 88 1 -87 -104 -21
6860 -21 67 96 33 -64 -107 -39 37 106 67 -19 -96 -71 -3 100 94 14 -63 -82 -17 66 99 42 -48 -97 -55 26 108 73 -17 -89
6890h9KR9R4qo8j02k4N4J11N3p6j04n9N6R5P5k9j11p5K1R0J02j1r5r5qQ1J04L2
6919A15o9j17l3N9J07L9m3r2p3L7R6P0k2p4p7lQ1Q5Mn3q7m4O5R4L6m8q5o4K6R1
6949B1O6j4o7r2JP3P6K9n9q8n1M7R1O3m1q7o8J5R0Q3jq3q2l2R4R3L7p9j00m1O6
6980d0R6M7m7j06m3K0J10P1k1r1p9RQ7P7J2q7q3k9Q6Q1L6m7j07m4M3Q4N4k1p9
7009a1o7QP3Q3Lp4p9k5O0P6L7m0q7m0K1R0P3l1q0o5oP8P3J8n6r9k4M5J00M4m1
7040E7r9n9M2Q4Q0j4r9q5J7Q9P9J4r7p8k1O4R9K6n8r7l7N4R0M5k8r8n9J0R8P7
7070I6j9q2p3oN6Q8J6m9p3m3M1Q6M0k4p7o3J7P8P8k5m9q4%N0Q4J9m6q8l4L1Q2
7101B7N8k4p0q0OR5O1J6o7r4qO6R1J7n1r0m9O0Q8N3m5r4o1L4R2N7j8p1q1kP8P4
$$ plain form
6890 -89 -87 12 106 98 30 -72 -96 -42 69 122 46 -58 -117 -61 34 109 80 -31 -106 -85 5 107 96 1 -94 -102 -21 83 115
6919 115 46 -71 -104 -45 62 101 58 -34 -107 -70 26 96 74 0 -77 -80 1 86 90 37 -50 -94 -29 65 101 53 -32 -96 -70 21
6949 21 87 73 6 -86 -85 -12 64 93 34 -54 -105 -58 33 96 55 -32 -100 -85 5 88 87 4 -78 -110 -16 77 114 35 -65 -106 -40
6980 -40 56 103 56 -50 -93 -73 37 108 87 -4 -83 -74 13 90 102 15 -68 -97 -11 70 106 59 -48 -92 -49 35 89 68 -11
7009 -11 -78 -70 3 86 89 15 -64 -89 -29 47 84 44 -43 -83 -62 28 101 70 -10 -75 -81 -3 70 88 32 -67 -91 -46 54 98 57
7040 57 -42 -101 -59 25 105 91 -8 -93 -76 13 92 106 9 -69 -90 -26 73 99 41 -56 -93 -39 51 96 68 -30 -89 -79 19 96
7070 96 77 -5 -78 -84 -28 60 76 27 -46 -89 -48 38 78 54 -23 -86 -69 9 87 62 13 -71 -71 -21 63 82 36 -52 -86 -55 27
7101 27 85 61 -9 -89 -83 12 73 89 22 -72 -80 -14 77 94 43 -47 -96 -36 52 105 60 -34 -95 -61 31 88 70 -1 -82 -84 -6 68
7133F8J4o9q2j5N2Q8L2n3q3l3K2O9O5j1o2o6j4P3O4K4n2q2l4M1Q2N1m4p2m6K4
7163d9P5N6Kp5p9QN3Q2J5n7q0m1N7P5M8l2r4m9L4O8P2rq6p7nQ5P1Rm6r7k0O4P3
7196E1M1m8q7m3L4Q3N0j6r4o0J9P6O4mo0o3k0O1Q5J3m4q4k9L9O9M6k3o5n4J1N4
7227BP3nn9m9l2M9P8K7m4o8l4J0Q2N2qq6o1%P4Q0no5o8k6O3Q1J6l6p4m8M1R2L4
7260H6j1r4o0J4P7O1Kp0o6j2N6P9Rl9q7j4M2Q1K7l5p0n3K1Q6M1Pp7o8K2L8P1Q
7292G2m3o9k9M1O9L6k9o2o3K1N9O5pn1o3j9N9N4M0m5p0l6K6P8L4j2q5n2K7O6N7
7323F9j0o8o4jP0N8J5n9n8l2L9Q1L6l7p6l9K4P9M6j3o3p1J5O0N1J8n5o3k4N1N8
7354C7M0m9m6n7L0P7L8k0n9n0jN9N9Pm1p7j0L1N8M9m0n7n0K7O6M4mo7m9j5P0O2
$$ plain form
7133 68 82 13 -69 -84 -32 56 88 35 -48 -81 -59 10 75 64 2 -64 -78 -5 59 83 31 -51 -85 -44 38 89 45 -27 -73 -49
7163 -49 26 82 84 9 -70 -62 -9 73 88 31 -49 -90 -33 42 90 58 -36 -85 -51 17 89 80 -6 -83 -88 -3 68 77 31 -66 -86 -22 51
7196 51 92 44 -43 -86 -52 31 81 65 -29 -89 -70 6 70 66 6 -57 -77 -16 69 82 38 -46 -75 -36 33 79 56 -9 -63 -52 2
7227 2 75 70 11 -38 -70 -21 57 84 40 -28 -62 -52 30 82 74 -12 -73 -73 1 81 76 11 -57 -83 -20 61 77 41 -33 -81 -40 52 86
7260 86 75 -19 -79 -65 12 73 75 5 -61 -73 -17 62 71 32 -55 -69 -27 54 81 46 -24 -77 -56 30 71 78 1 -67 -45 -7 64 72
7292 72 29 -40 -69 -28 41 77 48 -14 -77 -56 3 68 61 10 -53 -72 -13 41 81 36 -34 -70 -44 34 68 56 -29 -81 -54 12 69
7323 69 59 -9 -73 -74 -4 54 69 10 -48 -80 -41 40 76 39 -37 -76 -52 27 73 60 -3 -74 -59 1 52 70 15 -48 -72 -21 37
7354 37 77 28 -18 -75 -45 32 70 50 -9 -59 -60 -1 58 65 24 -53 -63 -32 26 75 35 -22 -72 -45 21 65 61 -6 -55 -70 0 62
7386F2Qn5o3k6N3N9L1l0o6m9L5P1N0k5n7o7JR2N5Oo6p0pN2O0L1o7n2l2M1O0M3
7418G8k5q5l4MP3M4On1n7kL4O0J5k6p6k4L6N1L3j7n1m1LM8N2Lm6o3KM6N7K3m9
7451B1m9l9L0O9M6j8o3n9PP4N0ko2p2KN5P3Jm2o1k8L5P4L3l1o8m7K5P5M9k3n6
7483am5%L8N7Rm3m9k6L7N8K8l7m5k7MN0N0Lo3m9NM5M4J5m4n9j2K7O0L5k0n9l8
7516e2J5O3L6nn5n7NM6P4ln5n0j5J7P1L9k7p5m0K8O1N0ro5n1kO8M2J9n5p0rM4
7549a7N7L3m2o8k9K8N9L6j8m6l8j7O4N1j0l5m6rL0O9Ok2n2m2L4M9L9j7l9n2jL8
7581gO3ll2o4JL2N1L0l6n1l9K9N5K7j2n6m7J5M6N4Mm3n6j1L6O0J7k8o9k4K8N5
7613B5M1j5o3m2lO5M6kl9m8pK7O3J3m7m7j4K2N6M0l6n6k4%O7L6%o0l6j7O4L8J4
$$ plain form
7386 62 70 15 -48 -74 -21 38 69 39 -27 -76 -41 30 80 55 -2 -69 -68 24 79 85 19 -51 -58 -6 54 85 18 -34 -66 -25 35 78
7418 78 53 -32 -66 -62 11 55 61 10 -47 -49 -15 45 60 34 -42 -66 -30 21 54 37 -14 -55 -52 -4 48 51 5 -58 -56 -10 47 70 21
7451 21 -28 -67 -37 32 78 60 -3 -62 -55 19 69 67 5 -67 -65 -10 63 64 22 -39 -67 -32 42 75 44 -24 -71 -46 29 78 55 -1
7483 -1 -46 -46 -8 49 58 15 -34 -60 -23 35 63 26 -19 -46 -42 8 58 61 -2 -51 -46 -1 43 58 14 -45 -57 -30 30 65 45 -14 -52
7516 -52 -37 26 62 57 2 -55 -50 -4 70 67 12 -38 -53 -36 35 74 47 -28 -68 -40 21 71 62 -3 -54 -56 12 54 73 18 -52 -61 -17
7549 -17 40 73 31 -37 -66 -38 21 57 39 -7 -45 -62 2 53 43 8 -38 -47 -17 52 58 36 -16 -58 -24 25 64 47 8 -44 -45 -7
7581 -7 56 53 21 -43 -42 -10 41 71 35 -16 -55 -26 29 56 44 -12 -59 -44 2 56 60 17 -39 -50 -14 46 63 35 -34 -58 -30 25
7613 25 66 51 -12 -54 -57 8 54 52 13 -35 -42 -15 48 61 14 -33 -47 -25 31 71 35 -21 -45 -45 22 58 58 -2 -38 -55 9 47 61
7646F1m5m5qJ5N2K1j7m8l4NM5N5mn8l5j1M8N6Ql8n6k5K2O0L8k0n4m2K2M1N2rm8
7679Dn1j3N8O4J1m8o8j7M0O4J2k5m9k9J3N4M1j5m4m7J0L9N9ol9n5qK9N1K6m4l8
7711b1l1J6M8L4ol7m5kM6L1Pk6n1l1L2P1K4k6o2l7J7N9M0j9l8m7ON3N0%l9m8j7
7744d9M4M4K3m1m0k8J8M8L8qn6m4J0N3N0nm0n2j7K9O3J7l3o2j5L6M6K5j4n3l0
7775d3%M0N2j5l1m4kK3N3J5k5n5j8K2M3L5k3l3o1K9M1L2Pm5m0rM6L5K2k7m9l3
7807e8L4M2M2k7m1m1K1L4M5ol4m4rM3M7J7l7n2k4L0M1L1l1l1l8jN4M1om6l8nM5
7840bL7Nl5m6j3K2N7J9k9m2k0J5M2L8Km5m3jM4K8K6l6n0j5K0N2L2k9l0m3J1M0
7872A1K0K4m4o1J4M1L2J7m2l7j6J9M8K8k5m1m2K3M8L6j0m4m3%L9L6Pk9m3j6L4
$$ plain form
7646 61 16 -29 -37 -22 30 51 34 -14 -48 -43 2 57 53 -5 -40 -51 -3 53 61 23 -33 -58 -36 24 62 42 -12 -54 -32 9 61 52 4
7679 4 -47 -60 -2 62 73 25 -43 -60 -20 44 56 31 -18 -47 -34 20 61 46 2 -45 -35 4 63 57 18 -37 -45 -16 35 61 17 -21
7711 -21 -52 -36 12 46 40 3 -42 -44 2 33 40 14 -37 -68 -36 35 59 33 -29 -66 -49 10 50 31 -7 -54 -48 5 55 55 16 -32 -49
7744 -49 -5 39 62 21 -19 -47 -29 19 57 49 -7 -51 -41 12 62 57 17 -35 -52 -23 40 57 24 -38 -53 -17 29 54 40 -13 -43
7775 -43 -43 -3 49 34 3 -41 -43 -20 33 48 23 -32 -50 -28 15 50 27 -6 -67 -38 3 35 42 -3 -43 -52 -6 29 51 24 -25 -58
7807 -58 -24 18 60 33 -8 -49 -28 6 51 45 11 -33 -42 1 48 65 28 -24 -48 -18 23 54 23 -8 -46 -47 7 48 42 -4 -42 -47 -2
7840 -2 35 40 5 -41 -54 -32 25 44 15 -27 -47 -32 10 48 50 5 -38 -39 5 33 59 23 -27 -42 -22 30 62 33 3 -40 -29 11
7872 11 31 55 11 -50 -36 5 37 54 12 -25 -41 -22 26 54 29 -12 -54 -31 17 53 43 -1 -44 -44 -5 31 38 9 -34 -50 -16
7903a6M3J8k8m4k7M0K6L5j2m5m2J6K6M9Pl2n0j5L9N6J5l3l6l6J9M9K3j0l0m9J7
7934b7L1M0Lm5m4OJ7N1J3k4m4k4J9M0M7j2m6m4JL5N8j5l4l5k3M4M0K0l0n0k9M0
7966b1M9K3l7k7k4J2L3L0j0k1m7LL3L0L0k5m5l0K5L7K9j2m0l1J0K5M6%l7m6RK2
7998gM5J6l6m6j7L2L9K0j5l9l0J6K3L8lk9m4jK9M0Jj5m8j3K6L3K6om9l5K0L6L3
8031D0j3k3l5nK5M3mj0m8rK1M8J4j2l0m6L5K1L4j1l4k4mK7L8Nl5l1rK0L7J3j3
8064B5m1j7J1K6L1ml4l8J2K4L1K0k8m0j0K9J5K0Mo1j1kN0K6mm6l1%M7K8Jj9n4
8097d0j3L4N0Jj9k3k8J0L0M2j1l9k6ML4J8J8l5m5JL8L4Kk0l4j4J7L2J6jm9k1%
8130c7M5L6j5j5n0%K9L1Pk0k2k9J9L0J8Ol4m4J3L7K9j5pl8j5K6M3Qk7l9j0J5M4
$$ plain form
7903 -16 27 45 17 -27 -54 -14 12 47 35 -10 -52 -36 -10 39 46 14 -36 -51 -12 44 59 26 -10 -46 -27 22 45 35 5 -44 -27
7934 -27 4 44 47 2 -42 -36 -19 32 45 21 -23 -47 -28 12 59 47 1 -43 -42 -7 51 36 2 -33 -56 -12 28 48 18 -32 -61 -21
7966 -21 28 51 14 -13 -37 -25 8 38 28 7 -40 -37 -4 26 56 31 -14 -44 -19 18 47 35 -5 -36 -26 -1 45 45 8 -38 -29 -7
7998 -7 38 54 18 -28 -45 -13 26 46 31 -8 -38 -22 1 39 36 7 -37 -38 -9 31 32 17 -31 -44 -18 15 41 35 -14 -49 -29 7 40
8031 40 27 4 -31 -36 -11 32 28 18 -30 -39 -18 30 44 32 2 -44 -9 12 46 35 1 -23 -27 0 38 43 8 -23 -32 -12 25 38 25
8064 25 -16 -33 -22 4 35 31 -3 -41 -29 -5 26 46 18 -22 -32 -3 12 32 36 -25 -36 -38 12 38 34 -12 -43 -43 4 32 33 14 -40
8097 -40 -53 -19 31 32 13 -10 -38 -28 2 44 33 -6 -32 -28 6 24 42 7 -38 -37 1 35 37 17 -17 -31 -14 18 34 33 -16 -37 -37
8130 -37 8 44 29 14 -36 -36 -7 24 31 11 -11 -40 -21 9 27 33 -1 -45 -32 5 34 19 12 -26 -41 -15 28 36 9 -30 -40 -25 19
8163A9L7j9l9k0j0L0M1jl5l1JK1M2Rk9l7j6K4M2Pqm1k2PL1K1kk3
$$ plain form
8163 19 56 37 -2 -22 -32 -2 39 38 3 -28 -27 -6 36 45 16 -21 -37 -13 29 36 28 -13 -35 -28 3 24 22 -1
8191a
$$ Imaginary data points
##PAGE= N=2
##DATA TABLE= (X++(I..I)), XYDATA
0@%%%%%%%%%%%%%%jRj6J6j6J6j7K5l2L2l8M6m9N7o5P3q1R0j05J18j31J45j61J80
38I5k00K20k44K71l00L32l67M08m54N04n61O28p09Q03r15J058j243J489j838K377
58A354l333N534j9456n019M3087J4540j5825l8350j8784J3364L6011K1267j0100
71B4290l3390k2775O538L0172K3550k810k6428k3703p70K2333K3088M062j7748
84F409k1649p229J2749J9818J0159p669j7500j2608K621J4685J4521K446j1365
97E388j6022p379P809J7042J1944l979j7386j6143j71J7246K0048M342j6670k3347
111a7278q417J5524K6026J2417j3837k8120j6261J1831K9579J9638r484l0225
123h607k2587O765L0144K5155l933k9481k7045J107K8053K8252J772k6022k8831
$$ plain form
0 0 0 0 0 0 0 0 0 0 0 0 0 0 0 0 -1 8 -8 8 -8 8 -9 16 -16 16 -22 24 -25 32 -33 40 -41 49 -56 62 -69 76 -85 95
38 95 -105 115 -129 142 -158 174 -193 215 -239 265 -296 332 -377 426 -489 569 -674 815 -1023 1354
58 1354 -1979 3555 -15901 -20920 22167 36707 20882 -17468 -36252 -22888 13123 34390 24290
71 24290 -9100 -31875 -25337 4835 28385 25575 -853 -24556 -25326 -2993 20095 24157 6409
84 6409 -15240 -22469 -9720 10098 20257 12588 -4912 -17520 -14899 -214 14307 16753 5388
97 5388 -10634 -18013 -10204 6838 18782 14803 -2583 -18726 -18897 -1651 18397 22739 6069 -17278
111 -17278 -25695 -10171 15855 28272 14435 -13685 -29946 -18115 11464 31102 21618 -8607
123 -8607 -31194 -24429 5715 30870 26937 -2544 -29589 -28482 -429 27823 29595 3573 -25258
136b5258m572K3464K8795P124k0531k8037r366J7152K6583J1368j3535k4635j2908
149b4356R738K2073J4037n847j9051j4752J919J5662J5013J833j1960j4790n345
162a5826P929J4062Q616l689j2937j1615n47J1370J4135M812r413j6222q995P113
176a1207J7855J2895m527j8910j6499J674J9400J9765J361j9412k2634m322J8913
189e648K4866P263j7844k6541j0124J6364K7622J2729j4508k7996j5010J2258
201a6569K7762J6985r789k6914j8523P207K5521J9519m535k3502k0008J806K1006
214c4K0050Q53j8141j9574l311J4940J8617N573j1475j7131p607P828J5309R276
228A5173m140j3008j0574L74J0399J1537L322p540j2110o786M440J2257J0007
$$ plain form
136 -25258 -29830 -6366 22429 29553 9022 -19015 -28381 -11229 15354 26722 13187 -11448 -24356
149 -24356 -14618 7455 21492 15645 -3406 -18158 -16239 -577 14436 16269 4309 -10481 -15826
162 -15826 -7897 6165 14781 11092 -1845 -13460 -14007 -2637 11498 16310 6897 -9325 -18320 -11207
176 -11207 6648 19543 15016 -3894 -20393 -18719 681 20446 21807 2395 -20239 -24561 -5648
189 -5648 19218 26481 8637 -17904 -28028 -11664 15958 28687 14179 -13817 -28827 -16569
201 -16569 11193 28178 18389 -8525 -27048 -19841 5680 25199 20664 -2838 -22846 -21040 -34
214 -34 20016 20869 2728 -16846 -20157 -5217 13400 18973 7498 -9633 -17240 -9412 5897 15173
228 15173 11033 -1975 -12549 -12175 -1776 9761 13083 5543 -6567 -13353 -8913 3344 13351
241A3351j113j2008j2963k271J1380J5541N622j0330j7661q952Q893J9369J2134
254B0992p212k0598j5000N269K1280J7521l142k1377j9702Q65K1005K1400J416
267B2717k0150k2613l650J8822K3333N774j7162k3502p678J5109K3106R341j2764
280A0683k2208j0776J0220K0804J1896p515j9037j2663M799J6819J3041k054j4253
293b44j3068o55J1379J2730L237q295j2011n651N023J1003P778j680r606r672
307i732j663P935J1139N010n947j2328q221L757J3123J1178j333j3515j3877j166
321a5640J3509J6233L704j3086j8178o221J2281J9709Q641j1143k0764j0884R741
334a2098K1357J2856q080k1433j4546O274K1080J5860m366k0205j6802K385J8934
$$ plain form
241 13351 12238 230 -12733 -15004 -3624 11917 17539 7209 -10452 -19404 -10511 8858 20992
254 20992 13780 -6818 -21818 -16549 4731 22252 19110 -2267 -21969 -21104 -99 21301 22717
267 22717 2567 -20046 -23696 -4874 18459 24233 7071 -16431 -24109 -9000 14106 23447 10683
280 10683 -11525 -22301 -12081 8723 20619 13104 -5933 -18596 -13797 3022 16063 14009 -244
293 -244 -13312 -13967 -2588 10142 13379 5084 -6927 -12578 -7555 3448 11226 9546 -60 -9732
307 -9732 -11395 -3460 7679 12689 6742 -5586 -13807 -10050 3073 14251 12918 -597 -14474 -15640
321 -15640 -2131 14102 17806 4720 -13458 -19679 -7398 12311 20952 9809 -10955 -21839 -12098
334 -12098 9259 22115 14035 -7398 -21944 -15670 5410 21270 16904 -3301 -20103 -17718 1216
347A216J7355m17j7248j7510j516J5276J7257L309j2999j6562m960J0496J5479
360I176O427p802j4056p625M978J2290Q603k133j0242r272o92P938R629L445n441
375E223r651o002K711R379Q371Q3q800j0470k924P922J2259N692o734j3717q335
390a4993N287J4742J0849l658j5393j3104J853J5658J5059K1j5549j6675j913
403a7816J5055J7894L762j4218j8726n496J3030J9107P129j1607j9104q566R969
416i587J8691R757q152j7873j0713O221J6651J1351m177j5092j1722K111J3211
429F77J1787o7j1069j1540j902Q714J0967L752o162j0113n417L512Q943O848p45
444H185p523q059j979N883Q984M625m003r617p117J974R923R414J74r894j1454
$$ plain form
347 1216 18571 18154 906 -16604 -18120 -2844 14413 17722 4723 -11839 -16799 -6303 9176
360 9176 15603 7801 -6255 -13880 -8902 3388 11991 9858 -384 -9656 -10348 -2410 7219 10664 5223
375 5223 -4428 -10430 -7719 1660 10031 10114 1314 -9156 -12080 -4158 8101 13793 7059 -6658 -14993
390 -14993 -9706 5036 15885 12227 -3166 -16270 -14417 1241 16300 16321 772 -15903 -17816
403 -17816 -2761 15133 18895 4677 -14049 -19545 -6515 12592 19721 8114 -10990 -19556 -9587
416 -9587 9104 18861 10709 -7164 -17877 -11656 4995 16346 12169 -2923 -14645 -12534 677
429 677 12464 12397 1328 -10212 -12114 -3400 7567 11319 5157 -4956 -10373 -6861 2082 8930 8185
444 8185 662 -7397 -9376 -3493 5491 10116 6113 -3504 -10621 -8647 1276 10690 10864 970 -10484
459a0484k387R584J3203M578q957j4625o694Q078J5710Q661o970j6381j0456N701
473a1439J6688J2020m268j6615j3305K739J6182J4305j179j5421j4965l85J4343
486a300J5311J901j2993j5274l299J1326J4896M634r466j4195n802P457J3169
499F365O778n333j1840p510L120J0187Q025q70q350q254j313O249Q224L426m014
514D890p940n363J635P409P110P38o603q582l147N541R800N474m282j0741p698
529a1759K868J1379R706j328j1709j1475k99J1693J3002J949j1428j4225l563
542a5189J0847J5146N108j0024j5740o559R000J5996P841p797j5888q930O415
555i774J5441R820m927j4674j0490L395J3603J0854j793j2220j1013K06J0629
$$ plain form
459 -10484 -12871 -3287 9916 14494 5537 -9088 -15782 -7704 8006 16667 9697 -6684 -17140 -11439
473 -11439 5249 17269 13001 -3614 -16919 -14180 2002 16307 15128 -293 -15258 -15643 -1300
486 -1300 14011 15912 2919 -12355 -15654 -4328 10568 15202 5736 -8459 -14261 -6804 6365
499 6365 13143 7810 -4030 -11540 -8420 1767 9792 8922 572 -7682 -8995 -2746 5478 8904 4890
514 4890 -3050 -8413 -6778 631 7741 8479 1876 -6706 -9853 -4312 5488 10962 6680 -4061 -11759
529 -11759 -8891 2488 12194 10866 -843 -12318 -12617 -924 12078 14027 2599 -11626 -15189
542 -15189 -4342 10804 15912 5888 -9852 -16411 -7411 8585 16426 8629 -7259 -16189 -9774
555 -9774 5667 15487 10560 -4114 -14604 -11209 2394 13248 11455 -765 -11778 -11572 -943
568i43J0846J340q803j0398k763O769R664M100m598q710n226K368P483O173j03
583G199o031o897k110M396P378M229k614p562o232P22P532Q031J248p256r613
598g580l175O744J0913N061n992j1923o860N066J2652Q526l970j3094r998K780
612a0850J3218J1287j536j3063j2291K31J2624J3043J053j1882j3493k366J0913
625c112J3692L569r741j3558m656Q368J3112N610o818j2404o408N179J1373O988
639A1194l418j0089p387J636Q554P560J22o863p494j780M975P142L360k937o620
654b045m807Q74N864O066J175m894p084l249L748P916N220k515q487p022J140
669h100Q762Q668L50q834j0118j861Q678J1344L284q284j2258m694P639J2967
$$ plain form
568 -943 9903 11243 2440 -7958 -10721 -3952 5712 9812 5214 -3496 -8722 -6354 1129 7302 7199
583 7199 1168 -5729 -7839 -3443 3935 8164 5550 -2012 -8244 -7522 10 8041 9289 2033 -7580
598 -7580 -10755 -4011 6902 11963 5971 -5952 -12812 -7746 4906 13432 9462 -3632 -13630 -10850
612 -10850 2368 13655 12119 -944 -13235 -13004 -380 12663 13716 1834 -11659 -14025 -3112
625 -3112 10580 14149 4408 -9150 -13806 -5438 7674 13284 6466 -5938 -12346 -7167 4206 11194
639 11194 7776 -2313 -9700 -8064 490 8050 8172 1309 -6185 -7965 -2990 4152 7512 4575 -2045
654 -2045 -6852 -5978 -114 5952 7127 2233 -4851 -8100 -4352 3564 8784 6269 -2218 -9240 -8100
669 -8100 662 9330 9680 846 -9272 -11133 -2455 8889 12173 3889 -8369 -13063 -5424 7543
683G543O041o879j3386p223N950J3485Q242m847j3267r170L668J2863R827k456
697A0391j2150j0244J202J1173J0401J00r947j0355j306Q527J0040K408o884r438
711f082l503N153Q649M381l338p571n091J466O297N628M18m806n998k239L245
726c391O130L928j574n991n515j72N707O919J925n250q083l630M572R029N320
741I924l751r783o873K848J0286Q240j828j0517r465P33J0516J0486M10j0303
755I23j1291j550R847J1866K657r168j2214l702Q310J2264M662p264j2054n493
769a2207O059J1551O209m748j0859o729L388R844P064j961q631p186N39P236P081
784F650Q21n644o784k123L928O281L292k136n581m368L59M693N228J437l642n949
$$ plain form
683 7543 13584 6705 -6681 -13904 -7954 5531 13773 8926 -4341 -13511 -9843 3020 12847 10391
697 10391 -1759 -12003 -10801 372 10773 10873 926 -9429 -10735 -2208 7832 10240 3356 -6082
711 -6082 -9585 -4432 4217 8598 5260 -2311 -7402 -5936 361 5989 6407 1601 -4397 -6636 -3391
726 -3391 2739 6667 5093 -898 -6413 -6585 -878 6041 7966 2716 -5367 -8997 -4425 4604 9924
741 9924 6173 -3610 -10483 -7635 2651 10891 9063 -1454 -10919 -10186 330 10816 11226 923
755 923 -10368 -11918 -2071 9795 12452 3284 -8930 -12632 -4322 7942 12604 5340 -6714 -12207
769 -12207 -6148 5403 11612 6864 -3995 -10724 -7336 2508 9572 7611 -1020 -8206 -7667 -431 6650
784 6650 7471 1827 -4957 -7080 -3152 3129 6421 4285 -1296 -5664 -5305 -612 4616 6053 2411 -3538
800c538l175K508O421M836j278o707o343o5O813P735J389o728q935k696O474R865
816F576M018o021j0611n261N397J1158O406m666j1419p412L789J1457Q276k825
830H862j1254q975J834J0788R439p64j0068r713l20R178R792J313q056r616k243
845i803O813R135L115n384q483l842L887P615M426k370o525m816P78N277N131
860D954P20l913n193k171K432N067L558q68m810m812o84M365N932K200l779o828
876c830l748L106P551N199k305q105o518J409Q419P727m46q559q763n68Q502R633
892H704J539q242j0245k552P754J0702L511p130j0925m367O320J0906N141n403
906E713j0640n812M363J0148O322l268r427o640K123Q469O767r29p348o750j82
$$ plain form
800 -3538 -6713 -4205 2216 7052 5774 -933 -7276 -7341 -528 7207 8596 1868 -7067 -9763 -3289 6576
816 6576 10594 4573 -6038 -11299 -5902 5256 11662 6996 -4423 -11835 -8046 3411 11687 8862
830 8862 -2392 -11367 -9533 1255 10694 9930 -138 -9851 -10171 -993 8799 10112 2056 -7560 -9803
845 -9803 -2990 6145 9260 3876 -4607 -8449 -4562 3053 7479 5109 -1416 -6232 -5454 -177 4954
860 4954 5674 1761 -3432 -5603 -3171 1896 5454 4586 -224 -5036 -5720 -1355 4577 6777 2998 -3830
876 -3830 -7578 -4472 3079 8278 5973 -2132 -8650 -7241 1178 8905 8459 -100 -8863 -9431 -929 8704
892 8704 10243 2001 -8244 -10796 -3042 7660 11171 4041 -6884 -11251 -4931 5975 11116 5713
906 5713 -4927 -10739 -6376 3772 10094 6826 -2601 -9241 -7118 1351 8118 7189 -159 -6909 -7091
921g091O066O504J261m652o103k241L150N492L098j572m730l867M1L788M506J492
937E142k763m975k977J670N254M380n17n346n685p02N326O822J943n151p787l161
953h527M830Q591M322m350r199n412L765R593O384l047r763p258K254R728P991
968I902j394r477q539N06R027Q906L81q366r058j251P542Q998K072o559q715k800
984h825N426Q254L429m227p574l928K953O714M302j675n694m503L97M516M587
999D152Q48l235m537k042J905M307L160n53l906m173q42L392N051K232k811n756
1015b808l565K112O298M842j323o711o018M81O932P061M11o979p950j345O840
1030a722Q695K261o546r223l159O065R571L988n465r698m736M726R602N384l901
$$ plain form
921 -7091 -1025 5479 6740 2088 -4015 -6256 -3106 2386 5484 3912 -818 -4685 -4644 -856 3650 5142
937 5142 2379 -2596 -5573 -3903 1351 5731 5214 -132 -5817 -6519 -1193 5629 7572 2421 -5366 -8527
953 -8527 -3697 4894 9216 4866 -4333 -9745 -5980 3613 9997 6950 -2813 -10071 -7817 1911 9902
968 9902 8508 -969 -9508 -9002 25 8931 9312 946 -8112 -9363 -1821 7177 9249 2690 -6025 -8825
984 -8825 -3399 4855 8284 4057 -3517 -7445 -4492 2222 6524 4849 -845 -5348 -4951 -435 4152
999 4152 5000 1765 -2772 -4814 -2909 1398 4558 4005 99 -4074 -4916 -1524 3527 5759 2948 -2808
1015 -2808 -6373 -4261 2037 6879 5556 -1155 -7173 -6692 240 7301 7712 733 -7217 -8562 -1722
1030 -1722 6973 9234 2688 -6535 -9694 -3629 5942 9930 4465 -5233 -9969 -5243 4359 9743 5842
1045E842r301n882K986Q786O222k003q109o427J052P224O457j16o196o324p49
1060f538N047N983J584l789n502k315K471M857K973j155m053l529j54L133L964
1075B977J444k136m198k749J099M310L950J2m303n035j117M146N980K263l885
1090B758o767l384L507P414M422k987p879n400K378Q159O297j706q251p038R68
1105g509Q160P621j87p853q043o16P379Q293J384o753q342k103N973Q228K729
1120H361n089p882l298M114P414L727l103o702m048K019N865M249r41m915m322
1135d551q4L822M267J071k658m056k031J458L687K920k26l228l698r97K625M360
1151B681K258k007m869l444J262N247M562m88n470n586l46N541O505J206n505
$$ plain form
1045 5842 -3459 -9341 -6355 2431 8653 6650 -1459 -7886 -6834 390 6847 6731 535 -5789 -6538
1060 -6538 -1491 4492 6076 2287 -3215 -5530 -3059 1798 4771 3616 -437 -3966 -4120 -987 2977
1075 2977 4421 2285 -1913 -4662 -3563 747 4697 4709 406 -4629 -5746 -1600 4380 6643 2758
1090 2758 -4009 -7393 -3886 3528 7950 4963 -2916 -8316 -5938 2221 8518 6812 -1439 -8477 -7509
1105 -7509 651 8272 8085 232 -7811 -8427 -1048 7245 8629 1876 -6466 -8569 -2596 5632 8361
1120 8361 3272 -4610 -7908 -3794 3620 7347 4244 -2458 -6506 -4487 1378 5627 4686 -229 -4551
1135 -4551 -4635 -813 3454 4525 1867 -2189 -4220 -2762 925 3845 3619 391 -3307 -4304 -1679 2681
1151 2681 4939 2932 -1937 -5381 -4119 1128 5690 5202 -268 -5854 -6200 -659 5846 7052 1547
1166A547p240k084N302P829K918m938q261l715M472Q464M439l886q496n056L191
1181e514Q363N566k455q043n941J697P529O146q97o849o225J21O040O154O27n132
1197A187n916j319M135N524J925l030n027k439J909M365K914q14l534l296l10
1212c726K671L529J435j736l629k527P52L612L519K90l458m420j341L226N209
1227C406K371k863n859l411K454O349M360j913o691n240J312O863O021o76o858
1242c75o631l4O698P107P48o383p454j430N945P616K074n374p589k674M692P399
1258D335L168l891p086l564L041O600L874k177n935m088J283N166M188m36m293
1273A85m145l82L269L981J220k230l710k013J204L266K703j00k758l267j036K130
$$ plain form
1166 1547 -5693 -7777 -2475 5354 8272 3334 -4927 -8642 -4170 4294 8733 4847 -3649 -8705 -5514
1181 -5514 2849 8415 5960 -2083 -8024 -6327 1202 7348 6451 -398 -6623 -6502 -462 5692 6319 1187
1197 1187 -4729 -6048 -1913 3611 5536 2506 -2521 -4960 -3051 1314 4228 3414 -120 -3416 -3726
1212 -3726 -1055 2474 3909 2173 -1456 -3983 -3231 381 3900 4190 732 -3688 -5029 -1803 3406
1227 3406 5777 2914 -2945 -6356 -3902 2447 6807 4894 -1797 -7037 -5725 1138 7159 6483 -375
1242 -375 -7006 -7040 -342 6765 7513 1130 -6324 -7754 -1809 5807 7881 2507 -5082 -7756 -3064 4335
1258 4335 7503 3612 -3474 -7038 -3997 2603 6477 4300 -1635 -5723 -4440 726 4914 4478 185
1273 185 -3960 -4342 -1073 2908 4128 1898 -1812 -3825 -2621 645 3348 3248 490 -2777 -3813 -1683
1289a683L765K129j470m084l190P22M300M175Q2m410n080q79M392N801J719m216
1305B073o444k539L942O911L340l572p238m024L092P362M656k511p338n192J898
1320e584P179N565j254o815n824N79O307N996O7n702n984p05N002N837J261m163
1336A762n548j791L283N146K241k354m607k610J404L934K922m36l183l147n03
1351c487K349L215J447j425l184k344M62L073L170M81k797l892j461K442M512
1366B561K430k018m996l381J542N353M228r82n547n014L67N626N684K74n570o220
1382e663r08N359O611J549n045o864k143M595O943K697m047o886l181L438O674
1397C129L568k756o341l854K057N842M048j321n236m155N82M524M154J04l698
$$ plain form
1289 -1683 2082 4211 2741 -1343 -4533 -3811 489 4664 4746 336 -4744 -5623 -1231 4570 6289 2073
1305 2073 -4371 -6910 -2968 3943 7283 3711 -3527 -7551 -4459 2903 7559 5048 -2290 -7482 -5584
1320 -5584 1595 7160 5906 -909 -6733 -6154 153 6149 6216 514 -5470 -6175 -1173 4664 5925 1762
1336 1762 -3786 -5577 -2294 2852 5093 2739 -1868 -4478 -3074 860 3782 3346 163 -2984 -3487
1351 -3487 -1138 2077 3524 2099 -1085 -3429 -2967 106 3276 3757 960 -2932 -4393 -1951 2561
1366 2561 4991 2973 -2023 -5404 -3862 1491 5719 4737 -810 -5824 -5457 169 5853 6127 557 -5663
1382 -5663 -6571 -1212 5399 6948 1903 -4961 -7104 -2509 4434 7131 3084 -3802 -6983 -3545 3129
1397 3129 6697 3941 -2400 -6254 -4197 1645 5693 4372 -864 -5019 -4437 87 4241 4345 647
1412F47m045p75K800L811J445j899l433k063R42K975K532R2k415k978j078J778
1428a664L302K031j057l502k946K95L575L792M87l511m568j279L375N190K096
1443E616l137n720k859K833O066L551k428o257m181J921O350M745j400o282n175
1458f357Q68O060N479k80n726n678k94N284N759Q12m720n677j313M046N514J781
1474E558l346n196k179K567M788K501j771m236k770R75L562K967j47k849l016
1489b592o74K030K990J469j160k856k218K82K619K863O40k265l426j575J838L907
1505A872K445j362m238l276Q11M446M070k41m565m741l55M545N301R42m382n747
1521d475j560M147O079K131l857o244k646L438O275L097k956o183l483K409N967
$$ plain form
1412 647 -3398 -4173 -1373 2438 3883 1984 -1449 -3512 -2570 405 2937 3029 614 -2364 -3442 -1664
1428 -1664 1638 3669 2612 -890 -3836 -3541 34 3826 4313 802 -3766 -5045 -1670 3520 5616
1443 5616 2479 -3241 -6100 -3267 2799 6350 3922 -2335 -6516 -4595 1755 6500 5100 -1182 -6357
1458 -6357 -5489 571 6050 5770 44 -5634 -5928 -644 5115 5927 1207 -4470 -5783 -1737 3777 5558
1474 5558 2212 -2984 -5163 -2596 2192 4693 2922 -1314 -4084 -3109 453 3420 3273 424 -2592
1489 -2592 -3266 -1236 1754 3223 2063 -793 -3011 -2729 -110 2753 3393 1128 -2298 -3873 -2035 1872
1505 1872 4317 2955 -1283 -4559 -3748 698 4768 4527 -38 -4779 -5134 -589 4712 5654 1272 -4475
1521 -4475 -6035 -1888 4191 6322 2465 -3779 -6425 -2987 3288 6385 3429 -2754 -6237 -3828 2139
1536B139L794j830n625m003J226N140M150o28m583m169L3L902M116N23l154l920
1552b889j084K366L604J642j556l218k058O81K681K435K19k104k714j079J431
1567a643K885J935p07k951k745l2K913L460P84k765m065j547K531M569K298k252
1583B668m949k996J895N211L640j463n368m206J004N400M681n29n293n023K5N061
1599b42N285M85m749n425r60M317N466J416l809n375j822L229N182K165k600m844
1615b281k470J926M398K732j258l832k905N45L229K952J69k534k922q43J756K789
1631A451J483r43k546k085R9K238K589P52j837l027j582J362L357K376q49l561
1647g23l122K86L668L806K74l691m375q65L598M866J448l439n254j970L197N474
$$ plain form
1536 2139 5933 4103 -1522 -5525 -4299 841 4991 4363 -220 -4389 -4356 -454 3662 4185 1031 -2889
1552 -2889 -3973 -1607 1997 3639 2083 -1135 -3193 -2512 169 2604 2823 719 -1995 -3074 -1643
1567 -1643 1242 3177 2470 -481 -3226 -3258 -345 3115 3899 1134 -2931 -4478 -1947 2622 4920 2668
1583 2668 -2281 -5277 -3382 1829 5469 4006 -1362 -5568 -4564 836 5517 4988 -305 -5328 -5303 -242
1599 -242 5043 5528 779 -4646 -5606 -1289 4177 5593 1784 -3591 -5413 -2184 2998 5163 2563 -2281
1615 -2281 -4751 -2825 1573 4305 3047 -785 -3690 -3145 84 3036 3205 671 -2251 -3094 -1338 1451
1631 1451 2934 1991 -555 -2640 -2541 -303 2286 3038 1201 -1826 -3408 -2046 1311 3687 2838 -723
1647 -723 -3845 -3559 109 3915 4189 498 -3877 -4742 -1144 3722 5170 1731 -3523 -5493 -2296 3178
1663C178K497k854n637k947K476N623L366k049n536l667J572N290L917j071m959
1678h01m065N45M528M138n5l976m107m50L357L986R12k659l767j384J988L403
1694A593J772j209k966k102M26K452K325L64j828k490j127J176K557J850m77k526
1710b10k499k52K409L094R69k186l613j678J919M022K329j576m302k990J226M512
1726A174L552q18m594m063M06M571M460N6m449m786n05M247N005R43l949n106
1742c856j369L552N135J749l119n000k093K590M797K379k047m455k627J444M015
1757A095K833q43l505k922K39K894K894L98k235k804r58J509K601J498p58k311
1773c75j961l3J953K343Q12j515k668j565J021K892K277m99l028k929o5L078L512
$$ plain form
1663 3178 5675 2821 -2816 -5763 -3287 2336 5702 3653 -1883 -5550 -3978 1312 5229 4158 -801
1678 -801 -4866 -4321 207 4345 4290 314 -3793 -4243 -886 3100 4012 1353 -2414 -3798 -1810 1593
1694 1593 3365 2156 -810 -2912 -2486 -34 2291 2655 827 -1663 -2790 -1614 943 2793 2316 -210
1710 -210 -2709 -2961 -552 2542 3511 1325 -2288 -3966 -2047 1975 4304 2728 -1574 -4564 -3338 1174
1726 1174 4726 3908 -686 -4749 -4343 228 4688 4744 295 -4491 -4996 -749 4256 5199 1250 -3856
1742 -3856 -5225 -1673 3462 5211 2092 -2908 -5001 -2411 2386 4765 2718 -1737 -4364 -2920 1095
1757 1095 3928 3085 -420 -3342 -3103 -209 2685 3083 848 -1956 -2914 -1405 1196 2694 1936 -375
1773 -375 -2336 -2369 -416 1927 2739 1224 -1444 -3009 -1988 904 3181 2682 -346 -3275 -3340 -262 3250
1790C250O01l006m012j156K877M413J708k684m727k220K417M940K690k098n036
1805b043l112J735N012L487j355m885l749R13M668L933m66m335m062J9L919M085
1821C764M32l418m023q33K846L848J227k238l556j597J589L166J901q79k725k121
1837b617J97K184K282M64j592k313j128R45K306J740k94k188k299l94K004K801
1853B098J069j755l213j712J444L545K333j117l730k924P32L869L428l22l905
1868a60l883r7L853M264N12l727m521r34L504M706J334l218m783j711K849M778
1884B766K059k443m642k345J966M392K594j475m038k809R62L619K892m10l113
1899b5k906j27K544K830O41j909k674j103J233K414J507n36k076j907j61J707
$$ plain form
1790 3250 3851 845 -3167 -4323 -1446 2967 4675 1991 -2736 -4956 -2539 2401 5091 2993 -2043
1805 -2043 -5155 -3420 1592 5079 3724 -1161 -4910 -3997 671 4604 4138 -197 -4259 -4240 -321 3764
1821 3764 4196 778 -3245 -4078 -1232 2616 3843 1605 -1951 -3548 -1959 1207 3108 2229 -496 -2617
1837 -2617 -2420 -236 2046 2510 918 -1395 -2523 -1578 728 2468 2174 -14 -2313 -2707 -703 2098
1853 2098 3167 1412 -1801 -3513 -2069 1476 3809 2692 -1038 -3962 -3230 639 4067 3745 -160
1868 -160 -4043 -4140 -287 3977 4489 762 -3759 -4693 -1189 3517 4851 1633 -3150 -4861 -2012 2766
1884 2766 4825 2382 -2260 -4605 -2639 1753 4347 2872 -1166 -3975 -3013 606 3498 3088 -25
1899 -25 -2931 -3058 -514 2316 2957 1048 -1626 -2729 -1496 918 2425 1889 -187 -2094 -2255 -548
1915e48K177Q40j235k377j523P43K537K145k51k585k718k78K550L212Q33k463
1931A059l643j344K280M010J833k076m220k339J804M387K777j492m451l158J137
1946c436M413L478p61m280l725L85M031L895K2l707l963m32L335L928Q19k853
1962A149l822j184K346L605J520j793l305j770J176K926J993n93k467k103mJ934
1978c92K152N99j349k150j163P53K064J663j35j881k122m95J665K515J122j387
1994A459k833j714J048L066K294o95l212k835L25L297L268R6l296l668m88L198
2010f90L995Q85l040m227j299K820M369J664k528m414k019K192M366K317j818
2025B573m203k548J380L944K758r41l624k869M80L199K907j6k718k859m38K180
$$ plain form
1915 -548 1629 2469 1234 -1143 -2666 -1923 614 2759 2508 -77 -2795 -3073 -523 2689 3522 1059
1931 1059 -2584 -3928 -1648 2362 4195 2119 -2101 -4440 -2636 1751 4528 3036 -1415 -4573 -3436
1946 -3436 977 4455 3694 -586 -4311 -3926 105 4000 4022 315 -3648 -4080 -745 3183 4002 1149
1962 1149 -2673 -3857 -1511 2094 3614 1821 -1484 -3254 -2078 848 2841 2248 -219 -2322 -2326 -392
1978 -392 1760 2359 1010 -1140 -2303 -1550 514 2177 2042 161 -1961 -2456 -791 1724 2846 1459
1994 1459 -1374 -3088 -2040 1026 3320 2625 -587 -3422 -3097 200 3468 3564 268 -3400 -3888 -690
2010 -690 3305 4190 1150 -3077 -4376 -1556 2813 4477 1949 -2465 -4484 -2292 2074 4391 2573
2025 2573 -1630 -4178 -2798 1146 3904 2963 -661 -3530 -3050 149 3056 3040 322 -2537 -2975 -795
2041g95K727Q45j597k512j202R69K217J546l50j885j813k51J462J990Q77j008
2057A220k131j446N28K202K002m7k196k485m59K099K927R94j995l285j474J787
2073a759L574J938j541l753k391J252L878K803r42l911l150O20L832L423k47l665
2089c9l658j13L455L782M64l128l818q39K768L757J177k349l614j463J888L362
2105A632J725j392l037j885Q35K679K006l16k222k062k06J713K058O96j156k013
2121i45j132O05J851J544qj660j921n69J394K273J103j110k491j659P70K665K180
2138B890m09k771k638%K803L075L77k761l424p87K658L703J187k498l883j564
2154d042K241L996J923j962m024k232J636L935K488j255l779k698Q97L514K828
$$ plain form
2041 -795 1932 2777 1180 -1332 -2534 -1565 652 2198 1848 -37 -1850 -2101 -639 1351 2228 1220
2057 1220 -911 -2357 -1829 373 2375 2328 132 -2353 -2812 -713 2214 3208 1213 -2072 -3546 -1759
2073 -1759 1815 3753 2212 -1541 -3932 -2680 1198 4001 3059 -852 -4002 -3382 450 3873 3626 -39
2089 -39 -3697 -3810 -355 3427 3891 763 -3055 -3894 -1126 2631 3808 1459 -2155 -3618 -1730 1632
2105 1632 3357 1965 -1072 -2957 -2122 557 2563 2247 25 -2037 -2243 -530 1528 2224 1068 -945
2121 -945 -2077 -1472 379 1923 1915 255 -1666 -2235 -841 1432 2535 1425 -1066 -2725 -1955 710 2890
2138 2890 2481 -290 -2928 -2928 -125 2950 3327 566 -2858 -3645 -987 2716 3903 1405 -2478 -4042
2154 -4042 -1801 2195 4118 2156 -1868 -4100 -2464 1471 3959 2704 -1075 -3773 -2876 638 3466
2169C466m78l208k893R2K816K847L04k359k770o61J874K590R96j345k353j285
2185b367P93K058J507k19j707j706l16J305J840Q55q62j920j361M13J892J842
2201B047R4j848k261n78J741K616J085j585k925j559J362L155K021j091l327k430
2217c483Q10L385K808m81l382l109J40L293L356J95l102l543n54K902L601Q88
2233C724k587l629j188K257L531J465j856l360j707J450L113J859r89k815j971
2248b703N47K424K034q8j997k037l39J507J972P50j001j853j114M70J673J472
$$ plain form
2169 3466 2988 -220 -3113 -3021 -205 2642 2946 587 -2183 -2844 -970 1620 2616 1271 -1082 -2367
2185 -2367 -1574 484 1991 1772 65 -1641 -1957 -652 1188 2043 1181 -739 -2100 -1687 205 2047
2201 2047 2141 293 -1968 -2546 -805 1811 2896 1311 -1614 -3173 -1811 1344 3365 2274 -1053 -3483
2217 -3483 -2673 712 3520 3039 -343 -3452 -3312 -19 3337 3532 430 -3113 -3667 -765 2836 3724
2233 3724 1137 -2492 -3680 -1423 2108 3573 1717 -1643 -3350 -1900 1213 3072 2083 -732 -2703
2248 -2703 -2156 268 2302 2214 217 -1820 -2159 -652 1320 2070 1069 -784 -1898 -1428 245 1717
$$ [...]
8191c0
##END NTUPLES=NMR FID
##END=
