##TITLE=1H_LR-695-RM2
 CDCl3, 8 sc, 
 21.10.2019
##JCAMPDX= 6.0         $$ Bruker NMR JCAMP-DX V2.0
##DATA TYPE= NMR FID
##DATA CLASS= NTUPLES
##ORIGIN= UXNMR, Bruker Analytische Messtechnik GmbH
##OWNER= root
$$ XWIN-NMR		Version 3.5
$$ Mon Oct 21 14:07:20 2019 Russian Standard Time (UT+4h)  she@DPX200
##.OBSERVE FREQUENCY= 200.1315
##.OBSERVE NUCLEUS= ^1H
##.DELAY= (6, 6)
##.ACQUISITION MODE= SIMULTANEOUS
##.ACQUISITION SCHEME= undefined
##.AVERAGES= 8
##.DIGITISER RES= 18
##SPECTROMETER/DATA SYSTEM= spect
##.PULSE SEQUENCE= zg30
##.SOLVENT NAME= CDCl3
##.SHIFT REFERENCE= (INTERNAL, CDCl3, 0, 15.7039)
##AUDIT TRAIL= $$ (NUMBER, WHEN, WHO, WHERE, WHAT)
$$ ##TITLE= Audit trail, XWIN-NMR		Version 3.5
$$ ##JCAMPDX= 5.01
$$ ##ORIGIN= Bruker BioSpin GmbH
$$ ##OWNER= she
$$ F:/spectra/data/she/nmr/H-F/1/audita.txt
$$ ##AUDIT TRAIL=  $$ (NUMBER, WHEN, WHO, WHERE, WHAT)
(   1,<2019-10-21 14:06:13.73 +0400>,<she>,<DPX200>,
      <created by zg, POWCHK disabled, PULCHK disabled
       configuration hash MD5:
       00 E9 B6 7A A2 85 ED C7 34 08 36 98 17 FE 4E 26
       data hash MD5: 16K
       3F 3D AF 37 04 44 70 A7 11 A5 8B 98 D0 E3 6F CE>)
$$ ##END=
$$ 
$$ hash MD5
$$ 1A B9 13 14 F6 F0 08 DB 9E F6 56 B7 3D 4C 34 D9
##$RELAX= 
##$RELAX= 
##$RELAX= 
##$RELAX= 
##$RELAX= 
##$RELAX= 
$$ Bruker specific parameters
$$ --------------------------
##$DU= <F:/spectra>
##$EXPNO= 1
##$NAME= <H-F>
##$PROCNO= 1
##$TYPE= <nmr>
##$USER= <she>
##$AMP= (0..31)
100 100 100 100 100 100 100 100 100 100 100 100 100 100 100 100 100 100 
100 100 100 100 100 100 100 100 100 100 100 100 100 100 
##$AQSEQ= 0
##$AQ_mod= 1
##$AUNM= <au_zg>
##$AUTOPOS= <>
##$BF1= 200.13
##$BF2= 200.13
##$BF3= 200.13
##$BF4= 200.13
##$BF5= 200.13
##$BF6= 200.13
##$BF7= 200.13
##$BF8= 200.13
##$BYTORDA= 1
##$CFDGTYP= 0
##$CFRGTYP= 5
##$CHEMSTR= <none>
##$CNST= (0..31)
1 1 145 1 1 1 1 1 1 1 1 1 1 1 1 1 1 1 1 1 1 1 1 1 1 1 1 1 1 1 1 1 
##$CPDPRG= <>
##$CPDPRG1= <>
##$CPDPRG2= <>
##$CPDPRG3= <>
##$CPDPRG4= <mlev>
##$CPDPRG5= <mlev>
##$CPDPRG6= <mlev>
##$CPDPRG7= <mlev>
##$CPDPRG8= <mlev>
##$CPDPRGB= <>
##$CPDPRGT= <>
##$D= (0..31)
0 1.2 0 0 0 0 0 0 0 0.06 0 0.03 0 0 0 0 0.0002 0 0 0 0 0 0 0 0 0 0 0 0 
0 0 0 
##$DATE= 1571652373
##$DBL= (0..7)
120 120 120 120 120 120 120 120 
##$DBP= (0..7)
150 150 150 150 150 150 150 150 
##$DBP07= 0
##$DBPNAM0= <>
##$DBPNAM1= <>
##$DBPNAM2= <>
##$DBPNAM3= <>
##$DBPNAM4= <>
##$DBPNAM5= <>
##$DBPNAM6= <>
##$DBPNAM7= <>
##$DBPOAL= (0..7)
0.5 0.5 0.5 0.5 0.5 0.5 0.5 0.5 
##$DBPOFFS= (0..7)
0 0 0 0 0 0 0 0 
##$DE= 6
##$DECBNUC= <off>
##$DECIM= 24
##$DECNUC= <off>
##$DECSTAT= 4
##$DIGMOD= 1
##$DIGTYP= 9
##$DL= (0..7)
0 120 120 120 120 120 120 120 
##$DP= (0..7)
150 150 150 150 150 150 150 150 
##$DP07= 0
##$DPNAME0= <>
##$DPNAME1= <>
##$DPNAME2= <>
##$DPNAME3= <>
##$DPNAME4= <>
##$DPNAME5= <>
##$DPNAME6= <>
##$DPNAME7= <>
##$DPOAL= (0..7)
0.5 0.5 0.5 0.5 0.5 0.5 0.5 0.5 
##$DPOFFS= (0..7)
0 0 0 0 0 0 0 0 
##$DQDMODE= 0
##$DR= 18
##$DS= 0
##$DSLIST= <SSSSSSSSSSSSSSS>
$$ [...]
##$SUBNAM2= <"">
##$SUBNAM3= <"">
##$SUBNAM4= <"">
##$SUBNAM5= <"">
##$SUBNAM6= <"">
##$SUBNAM7= <"">
##$SUBNAM8= <"">
##$SUBNAM9= <"">
##$SW= 24.0689530833862
##$SWIBOX= (0..15)
0 0 2 0 0 0 0 0 0 0 0 0 0 0 0 0 
##$SW_h= 4816.95568400771
##$TD= 16384
##$TD0= 1
##$TE= 0
##$TE2= 300
##$TE3= 300
##$TEG= 300
##$TL= (0..7)
0 120 120 120 120 120 120 120 
##$TP= (0..7)
150 150 150 150 150 150 150 150 
##$TP07= 0
##$TPNAME0= <>
##$TPNAME1= <>
##$TPNAME2= <>
##$TPNAME3= <>
##$TPNAME4= <>
##$TPNAME5= <>
##$TPNAME6= <>
##$TPNAME7= <>
##$TPOAL= (0..7)
0.5 0.5 0.5 0.5 0.5 0.5 0.5 0.5 
##$TPOFFS= (0..7)
0 0 0 0 0 0 0 0 
##$TUNHIN= 0
##$TUNHOUT= 0
##$TUNXOUT= 0
##$USERA1= <user>
##$USERA2= <user>
##$USERA3= <user>
##$USERA4= <user>
##$USERA5= <user>
##$V9= 5
##$VALIST= <valist>
##$VCLIST= <CCCCCCCCCCCCCCC>
##$VD= 0
##$VDLIST= <DDDDDDDDDDDDDDD>
##$VPLIST= <PPPPPPPPPPPPPPP>
##$VTLIST= <TTTTTTTTTTTTTTT>
##$WBST= 1024
##$WBSW= 4
##$XGAIN= (0..3)
0 0 0 0 
##$XL= 0
##$YL= 0
##$YMAX_a= 156747
##$YMIN_a= -136674
##$ZGOPTNS= <>
##$ZL1= 120
##$ZL2= 120
##$ZL3= 120
##$ZL4= 120
##$ABSF1= 10
##$ABSF2= 0
##$ABSG= 5
##$ABSL= 3
##$ALPHA= 0
##$AQORDER= 0
##$ASSFAC= 0
##$ASSFACI= 0
##$ASSFACX= 0
##$ASSWID= 0
##$AUNMP= <proc_1d>
##$AZFE= 0.1
##$AZFW= 0.1
##$BCFW= 1
##$BC_mod= 2
##$BYTORDP= 1
##$COROFFS= 0
##$CY= 11.3945322036743
##$DATMOD= 1
##$DC= 2
##$DFILT= <>
##$DTYPP= 0
##$F1P= 20.1720416913024
##$F2P= 0.152960286110954
##$FCOR= 0.5
##$FTSIZE= 0
##$FT_mod= 4
##$GAMMA= 1
##$GB= 0.15
##$INTBC= 1
##$INTSCL= 1
##$ISEN= 128
##$LB= 0.24
##$LEV0= 0
##$LPBIN= 0
##$MAXI= 10000
##$MC2= 0
##$MEAN= 0
##$ME_mod= 0
##$MI= 1.114404
##$NCOEF= 0
##$NC_proc= 0
##$NLEV= 6
##$NOISF1= 3.799351
##$NOISF2= 2.8
##$NSP= 1
##$NTH_PI= 0
##$NZP= 0
##$OFFSET= 15.70392
##$PC= 1
##$PHC0= -9568.245
##$PHC1= 9.000889
##$PH_mod= 1
##$PKNL= yes
##$PPARMOD= 0
##$PSCAL= 0
##$PSIGN= 0
##$REVERSE= no
##$SF= 200.130013532006
##$SI= 16384
##$SIGF1= 3
##$SIGF2= 2
##$SINO= 400
##$SIOLD= 16384
##$SREGLST= <1H.CDCl3>
##$SSB= 0
##$STSI= 0
##$STSR= 0
##$SW_p= 3612.71676300578
##$SYMM= 0
##$S_DEV= 0
##$TDeff= 0
##$TDoff= 0
##$TI= <>
##$TILT= no
##$TM1= 0
##$TM2= 0
##$TOPLEV= 0
##$USERP1= <user>
##$USERP2= <user>
##$USERP3= <user>
##$USERP4= <user>
##$USERP5= <user>
##$WDW= 1
##$XDIM= 8192
##$YMAX_p= 0
##$YMIN_p= 0
$$ End of Bruker specific parameters
$$ ---------------------------------
##NTUPLES= NMR FID
##VAR_NAME=  TIME,          FID/REAL,        FID/IMAG
##SYMBOL=    X,             R,               I
##VAR_TYPE=  INDEPENDENT,   DEPENDENT,       DEPENDENT
##VAR_FORM=  AFFN,          ASDF,            ASDF
##VAR_DIM=   8192,          8192,            8192
##UNITS=     SECONDS,       ARBITRARY UNITS, ARBITRARY UNITS
##FACTOR=    0.0002076,     1,               1
##FIRST=     0,             0,               0
##LAST=      1.7004516,     0,               0
##MIN=       0,             -136674,         0
##MAX=       1.7004516,     156747,          0
$$ Real data points
##PAGE= N=1
##DATA TABLE= (X++(R..R)), XYDATA
0@%%%%%%%nJ3j6J6j7K5l2M0m8N6p1Q3r5J13j35J54j77K07k36K68l06L47l92M42
$$ 0 0 0 0 0 0 0 0 -5 8 -8 8 -9 16 -16 24 -24 32 -39 44 -51 62 -73 81 -96 111 -125 143 -163 184 -208 234
31B34m98N60o27P01p81Q69r67J072j188J317j459J615j789J981k195K438k712
$$ 234 -264 296 -331 370 -411 458 -509 563 -625 692 -767 848 -941 1040 -1155 1283 -1429
48a429L027l390L815m321M934n697O681q002R879j2784J7938k9883J08373O7606
$$ -1429 1598 -1792 2023 -2298 2636 -3061 3620 -4382 5497 -7287 10651 -19232 89141 156747
62A56747j07321J8112J9358N671l5944J0856K8135K3472j7354j3825o587L300
$$ 156747 49426 67538 86896 92567 56623 67479 95614 119086 101732 87907 81320 84620
74H4620j9426k8754k0946J9648M0474K7266j7708l4383j6156J1481J773j9793
$$ 84620 65194 36440 15494 35142 75616 102882 85174 50791 34635 46116 47889 28096
86B8096k2216O134K3176J2614j0500o938Q703J48l1881l7323j908L3083K4424
$$ 28096 5880 12014 35190 47804 37304 30366 39069 39217 7336 -29987 -31895 1188 25612
99B5612r149j8613M095J9241J306k3820k5095q393M167Q774J0302O492K439K429
$$ 25612 16463 -2150 1945 21186 22492 -1328 -26423 -34816 -30649 -21875 -11573 -5081 -2642 -213
113b13l300k0456k6479j903K2761Q242k3198j3651L1013L9509q154m4627k2853
$$ -213 -3513 -23969 -50448 -52351 -29590 -21348 -44546 -58197 -27184 12325 4171 -40456 -63309
126f3309J3828J2249j2360j0313J6733K5868L209k0396j3489J1551J4628j2309
$$ -63309 -49481 -37232 -49592 -59905 -43172 -17304 -14095 -34491 -47980 -36429 -21801 -34110
138c4110l0891j1182K4776L3967N569k2221j4393Q413R973r594j7806J190K0028
$$ -34110 -65001 -76183 -51407 -17440 -11871 -34092 -48485 -40072 -30099 -39693 -57499 -56309 -36281
151c6281J0586j1490j1775J4138K4975l691l5150k2241J8123K9985K583j8097
$$ -36281 -25695 -37185 -48960 -34822 -9847 -13538 -48688 -70929 -52806 -22821 -20238 -38335
163c8335l032J9140R665j5414j6597L922J0622l501r877J775J5454J4674K589
$$ -38335 -41367 -22227 -12562 -27976 -44573 -40651 -30029 -33530 -43407 -41632 -26178 -11504 -8915
176h915j0872j5593l430J0906Q266p473j1464P546K1534O770j4246j1287P156
$$ -8915 -19787 -35380 -38810 -27904 -19638 -27111 -38575 -31029 -9495 -2725 -16971 -28258 -21102
189b1102Q163r038j5136J088J8541J3184n924j4206J456J5294N633j5322j6625
$$ -21102 -12939 -21977 -37113 -36025 -17484 -4300 -10224 -24430 -22974 -7680 -2047 -17369 -33994
202c3994L988J7881Q194r776r423P407J3604m20j6694r928R182J4394k281j6486
$$ -33994 -30006 -12125 -3931 -13707 -23130 -15723 -2119 -2539 -19233 -29161 -19979 -5585 -7866 -24352
216b4352l532J9988J6910j2537k5523q01K2748R163j8918j5404J4221K3202j664
$$ -24352 -27884 -7896 9014 -3523 -29046 -29847 -7099 2064 -16854 -32258 -18037 5165 3501
229C501k0549o414J5573R542j2814j6246J726J6664R805o300j1245J304J2972
$$ 3501 -17048 -23462 -7889 1653 -11161 -27407 -25681 -9017 788 -5512 -16757 -15453 -2481
242b481M206j3594j4655M537J7177N259j1702p577J0941J4736k962j6609q019
$$ -2481 1725 -11869 -26524 -21987 -4810 449 -11253 -18830 -7889 6847 3885 -12724 -20743
255b0743Q225Q999l697q894L498J6035Q463j0521j5100N83J2993L625j0906r997
$$ -20743 -12518 -3519 -7216 -16110 -12612 3423 11886 1365 -13735 -13152 -159 3466 -7440 -17437
269a7437O493J6040Q609n915r096q18M946o54q788n489R939J7164J231j5491o283
$$ -17437 -10944 5096 13705 7790 -1306 -2124 2822 2168 -6620 -12109 -2170 14994 16225 734 -5549
284e549J5182J4282j1913k4768m326K0314J6456o150j0622N417J2653j961j6630
$$ -5549 9633 23915 12002 -12766 -17092 3222 19678 13528 2906 8323 20976 19015 2385
297B385r681Q994J3448k021j2715j515J8926J7914q482k4493j0175J1675J2461
$$ 2385 -7296 1698 15146 13125 410 -1105 17821 35735 27253 2760 -7415 4260 16721
310A6721m690j0716M920J7003O828j1854j1514M138Q856n853j6806l844J9458
$$ 16721 12031 1315 6235 23238 30066 18212 6698 10836 19692 13839 -2967 -6811 12647
323A2647K2472j650j9572q690R993Q294r697j3723j8J2893R036j360k318M047
$$ 12647 35119 33469 13897 5207 15200 23494 13797 74 56 12949 21985 20625 18307 22354
337B2354L728o949j5201r198P889J6769P289r678r948P719J5273m79j9167j4899
$$ 22354 26082 19133 3932 -5266 2623 19392 26681 17003 7055 14774 30047 29568 10401 -4498
351d498M040J1801L211k709M316J1642J884j4385j5473Q75J3252N071j1685j1308
$$ -4498 -458 11343 14554 11845 16161 27803 29687 15302 -171 704 13956 19027 7342 -3966
365c966R015K3043Q700j4897j8842k956P038M97o636P27J3364J1447o667j3871
$$ -3966 5049 28092 36792 21895 3053 97 7135 7632 996 1723 15087 26534 19867 5996
379E996j544J2254L716j7296j9352N510K5238J5995r046j5066K07Q064m030j4043
$$ 5996 4452 16706 20422 3126 -16226 -10716 14522 30517 21471 6405 6612 14676 10646 -3397
393c397l802J1133R447l836o649N362J3515K176j6303j9669k249J4455J3947j915
$$ -3397 -7199 3934 13381 9545 2896 8258 21773 23949 7646 -12023 -14272 183 14130 12215
407A2215q936R91J0379K941j0142j0431J62M094k457m706M663J5192R742q332
$$ 12215 3279 4270 14649 17590 7448 -2983 -2821 1273 -1184 -5890 -1227 13965 23707 15375
421A5375j7744p845P306R112l195j0954j552J2388J1663j521r457m310P60k842
$$ 15375 -2369 -10214 -2908 6204 3009 -7945 -9497 2891 14554 13033 3576 -734 26 -2816
435b816q755j745J0758J3847J382j2498q859O973J1071l887j7768j0491J0692
$$ -2816 -11571 -13316 -2558 11289 12671 173 -8686 -1713 9358 5471 -12297 -22788 -12096
448a2096J6895L245q496j264O587p76j3647r740O921J3413P70j1131m267J1823
$$ -12096 4799 8044 -452 -1716 4871 4095 -9552 -19292 -12371 1042 1812 -9319 -13586 -1763
462a763J4137l192j8290j2268M920J0555J062n631J101J0008M049r242j0243K943
$$ -1763 12374 9182 -9108 -21376 -16456 -5901 -4839 -10470 -9369 639 4688 -4554 -14797 -11854
476a1854Q101k868j1601n094J2076J5573K521j1885j0208K152O130j899q182j894
$$ -11854 -3753 -6621 -18222 -23316 -11240 4333 6854 -5031 -15239 -13087 -6957 -8856 -17038 -18932
490a8932Q223P084j565n016K079O296k609j1354q505M187J1775O671m490p192
$$ -18932 -10709 -3625 -5190 -10206 -8127 -1831 -4440 -15794 -24299 -20112 -8337 -1666 -6156 -13348
504a3348R66Q248K283r385r802J293Q581L306m886j60Q904N941p601j2978k642
$$ -13348 -12382 -4134 -1851 -11236 -21038 -19745 -11164 -7858 -12744 -12904 -4000 1941 -5660 -18638 -21280
519b1280R791O922o187q701L098J3268P251q173j2018k7P842O78q948l290J0903
$$ -21280 -11489 -4567 -10754 -19455 -16357 -3089 4162 -4011 -16029 -16056 -8214 -7536 -16484 -19774 -8871
534h871J2291l077j2133k589J0110N025r530j2484J478J4136Q891n993q500K881
$$ -8871 3420 343 -11790 -14379 -4269 756 -8774 -21258 -19780 -5644 3247 -2746 -11246 -8365
548h365R327r27j3019o714P419J0674r88q286O29J1257N980q790j1919j073Q234
$$ -8365 962 35 -12984 -19698 -12279 -1605 -2593 -10879 -10250 1007 6987 -1803 -13722 -14795 -6561
563f561M751m417m557L796R801L141p666q978O95O019M01o415j932Q099J0114
$$ -6561 -1810 -6227 -10784 -6988 2813 5954 -1712 -10690 -9995 -3976 -3575 -9990 -11922 -3823 6291
578F291m33q550m434L927L913m576p385p70R763J0081j387r385k630O616K982
$$ 6291 5858 -2692 -7126 -3199 714 -3862 -11247 -12017 -2254 7827 6440 -2945 -5575 1041 4023
593D023p720r126J809J1420O081n313n091N002P656l413j2573o506P940J1456
$$ 4023 -3697 -12823 -11014 406 6487 1174 -3917 1085 8741 5328 -7245 -13751 -5811 5645
607E645N18r873j838J1151Q943p683j4577k518R916N283o092m906Q426J2080j161
$$ 5645 6163 -3710 -5548 5603 14546 6863 -7714 -10232 -316 4967 -1125 -6031 2395 14475 13314
622A3314j3115o781P354Q285m278j0805j250J3392J1278k803j1421l480O425J824
$$ 13314 199 -6582 772 9057 4779 -6026 -7276 6116 17394 14591 3170 -310 6115 7939
636G939o932n725O252J0964J577p070l009O480N980n158j1816m830P552J1114
$$ 7939 1007 -4718 1534 12498 14075 7005 3996 10476 16456 11298 -518 -5348 2204 13318
650A3318K659n554l017M284M079m455p380j137N347L007k379j616N254Q635L33
$$ 13318 15977 10423 7406 11690 15769 11314 3934 2797 8144 11151 8772 7156 12410 21045 21378
665B1378r480j0112O12Q907N223m624o498L554J0350K462q380o613J790L821l302
$$ 21378 11898 1786 2398 11305 16528 11904 5406 8960 19310 21772 13392 6779 8569 12390 9088
680I088o068K864J2350O748p737j1653j85R289L728r341j0551L168J2612O594
$$ 9088 3020 5884 18234 24982 17245 5592 5407 14696 18424 9083 -1468 1700 14312 20906
694B0906n972o602L310L992o439j0360J41J1972O961o824r242L227J2051L264
$$ 20906 14934 8332 11642 15634 9195 -1165 -1024 10948 17909 11085 1843 5070 17121 20385
708B0385j1333j2613QQ774N071l715k412N121M630m817r527j018P324K425p422
$$ 20385 9052 -3561 -3553 5221 10292 6577 4165 9286 13916 9099 -428 -1446 5878 8303 881
723H81p045L610J2037N849o202j0146l540L552K641k352k961J930M962J078l770
$$ 881 -6164 -2554 9483 15332 9130 -1016 -4556 -1004 1637 -715 -3676 -1746 3216 4294 524
738E24j944L163J508n412q517j503Q740R306M89p830m985L512N092k549p124l498
$$ 524 -1420 1743 3251 -2161 -10678 -12181 -3441 5865 6354 -1476 -6461 -2949 2143 -406 -7530 -11028
754a1028M209N332l28k553K878N768k045j1117p118N740R973J509q736m488P075
$$ -11028 -6819 -1487 -1815 -4368 -1490 4278 2233 -8884 -16002 -10262 -289 1220 -7516 -12004 -4929
769d929J0046j009j0871o055L574M664k860m152M618J0341J138j0610p535N629
$$ -4929 5117 4108 -6763 -12818 -9244 -4580 -7440 -11592 -6974 3367 4505 -6105 -13640 -8011
783h011R177k457j1549m547Q828J1418J106p621m139L502J794n337n639L592Q772
$$ -8011 1166 -1291 -12840 -17387 -8559 2859 3965 -3656 -7795 -4293 -2499 -7836 -13475 -9883 -1111
798a111J634o766m029O517Q424k789j1734o210M980Q378J618l120j778L684K522
$$ -1111 523 -6243 -10272 -3755 4669 1880 -9854 -16064 -11084 -2706 -1088 -4208 -5986 -2302 220
813B20l171n232r73L544R04l584k707M646Q769K151p222q469j17N543K349k949
$$ 220 -2951 -8183 -9156 -5612 -4708 -8292 -10999 -6353 2416 4567 -2655 -11124 -11241 -5698 -3349 -6298
829f298l449K198O290K928l629m505N82K230l024o219rR121P909k987q817j660
$$ -6298 -9747 -7549 -1259 1669 -1960 -6465 -5883 -3653 -6677 -12896 -12905 -3784 4125 1138 -7679 -9339
845i339P377L317o960q699P29R060N721l242m448K913N778l021j0568l928P747
$$ -9339 -1962 1355 -5605 -14304 -13575 -4515 1206 -2036 -6484 -3571 2207 -814 -11382 -15310 -7563
860g563P964k527p975N87J1099N617q084j0749q40P579K923m732l020N924Q499
$$ -7563 401 -2126 -10101 -9514 1585 7202 -882 -11631 -12471 -4892 -1969 -6701 -9721 -3797 4702
875D702r11q879m502M840M832m001p724J437J0137P300l721p918p46M485M15n555
$$ 4702 3791 -5088 -9590 -4750 82 -3919 -11643 -10206 -69 7231 3510 -4408 -5154 -669 -254 -5809
891e809m021L512P249K951k785l066K283L285k968p148l373N421P364J323m181
$$ -5809 -9830 -6318 931 3882 1097 -1969 314 3599 631 -6517 -9890 -4469 2895 4218 37
906C7j267M273L601m142p512k454M700N516P4l386J305N828K636o431p655L37
$$ 37 -1230 3043 6644 2502 -5010 -7464 -2764 2752 2826 -560 745 6573 9209 2778 -4877 -4540
922d540O197K313m845k626O607Q757q42r418n776M027N636k419o281j57R068P070
$$ -4540 1657 3970 -875 -3501 3106 11863 11021 1603 -4173 -146 5490 3071 -3210 -3367 5701 12771
938A2771m127p789K1N915j91q357m319O429J0298J250q008l611N582M935m180
$$ 12771 8644 855 876 6791 6600 -1757 -6076 353 10651 11901 3893 282 5864 10799 6619
953F619r050j844O715O187j281m139J899N451k46p891o076L502O917N99m818j225
$$ 6619 -2431 -4275 2440 8627 7346 3207 5106 10557 10311 2420 -3656 -154 6763 7362 2544 1319
969A319N820O208k303p780m342J694L920l3k030Q63N212K468l022n019o34L260
$$ 1319 7139 13347 11044 3264 -1078 616 4536 4503 2473 3336 8548 11016 7994 2975 2341 5601
985E601L58m384l547L723Q421L509m825o215o11L885M43m204l026L040O014J282
$$ 5601 5959 1575 -1972 1751 10172 13681 8856 2641 2030 5915 6358 2154 -872 2168 8182 9464
1001I464l621j596M092J557o233p644N99R186N804l572o286J019O908J238o697
$$ 9464 5843 4247 8339 9896 3663 -3981 -3382 5804 11608 8036 1750 2769 9677 10915 4218
1016D218o067J346N000J433l513N72O241M153o083r581p90P486M277n114o367
$$ 4218 -1849 -503 4497 5930 2417 2989 9230 13383 7300 -2281 -3071 4415 8692 3578 -2789
1031b789L088Q394L379n114n850l9K226j358l903J071O505M608l554o047o10M982
$$ -2789 299 8693 12072 6958 1108 1069 3295 1937 -1966 -895 5610 10218 6664 617 7 4989
1047D989K296n732o479K16O803N495j086l830p48J392q06l522k427K548L859l62
$$ 4989 7285 1553 -4926 -4710 2093 7588 6502 2672 1924 3316 2510 -1012 -3439 -891 2968 2606
1063B606l523k40M920M200l263q657l902L966N974K08l502j436L766K794k561
$$ 2606 -917 -1157 3763 7963 4700 -3957 -7859 -3893 2081 2289 -1213 -2649 1117 3911 1350
1078A350m970k45K582M1m165k101N658P826p07q562n988L619O183r15o608k089
$$ 1350 -3620 -3865 -1283 -1242 -5407 -7508 -1850 5976 5269 -3293 -9281 -5662 521 -394 -7002 -9091
1094i091N282N438p52m927j1K992l89o911l842N023Q683J147p424m617M626O308
$$ -9091 -3809 1629 877 -4050 -4061 -1069 -1458 -8369 -12211 -7188 1495 2642 -4782 -9399 -4773 1535
1110A535j633p740l811M036M364m04k055J087L994K77n950m707K563N822K46n330
$$ 1535 -98 -7838 -11649 -7613 -3249 -3653 -5708 -4621 -627 -350 -6300 -11007 -8444 -2622 -2376 -7706
1126g706l159M254P235J228o470n077J251L181L8k334kL965K608k069l840K67
$$ -7706 -10865 -6611 624 1852 -4618 -9695 -8444 -5263 -5225 -7559 -7561 -3596 -988 -3057 -6897 -6630
1142f630M020J157m923n089J598P555M566l309n400k61M446P23m043l522K408
$$ -6630 -2610 -1453 -6376 -11465 -9867 -2312 2254 -1055 -6455 -6716 -2270 -1547 -5590 -9112 -6704
1157f704M519R43l642k22M761L436m904p501j148O788N810k768o140J007O741
$$ -6704 -2185 -1242 -4884 -5106 -345 3091 -1813 -9314 -10462 -3674 2136 -632 -6772 -5765 976
1172I76L210n310n828R49M136L90m130l15N723N498k767p104k133N553L838l744
$$ 976 4186 -1124 -6952 -6003 -1867 -1477 -5607 -5922 -199 5299 2532 -4572 -6705 -1152 2686 -1058
1188a058o588J056P377M525l051m927O11L032o82n032j804M293N124l08m187j422
$$ -1058 -7646 -6590 787 5312 2261 -2666 -2055 977 295 -4737 -6541 -2248 2876 2568 -1619 -3041
1204c041M465L279l696n999j828M621M653l67l282O78L170O63l820l862N45L553
$$ -3041 1424 4703 1007 -4992 -6820 -2199 2454 2087 -1195 -517 2653 3316 -504 -4366 -3821 -268
1220b68J175k162j578L372M995k99n547m543J422N040j12l972j222M668N216j624
$$ -268 907 -1255 -2833 539 5534 5235 -312 -4855 -3433 1607 1495 -2477 -3699 969 6185 4561
1236D561n254k133L227J572k931m109K636O592K956m639m706J566N426j207o441
$$ 4561 -693 -2826 401 1973 -958 -5067 -2431 4161 7117 2478 -2228 -662 4764 3557 -2884
1251b884l202N235O651k58m694r78M195K186m296n742O69N693K627l213k550L469
$$ -2884 -6086 -851 5800 5542 848 -130 4065 6251 1955 -3787 -3118 2575 5202 1989 -561 2908
1267B908N850j243o248m534L016N133l30l856J01N153L422k863m838n81K292O84
$$ 2908 8758 7515 1267 -3267 -251 4882 4552 696 797 5950 9372 6509 1671 1090 3382 4066
1283D066k513j839L614N319J270l909l624P83L010j154l817j564L574N097J140
$$ 4066 1553 -286 3328 8647 9917 6008 2384 3167 6177 5023 1206 -358 3216 8313 9453
1298I453k789j789Q16J021k706l441N64L800L442j103k828N45L851Q29n346n689
$$ 9453 6664 4875 5691 6712 4006 565 1129 4929 8371 7268 4440 4985 8836 9665 4319 -1370
1314a370Q90N660L297k006k455K041L312j410n342k786K687L284j432l502J227
$$ -1370 -480 5180 8477 6471 4016 6057 9369 7959 2617 -169 2518 5802 4370 868 2095
1329B095O738L215n058p790l78N080J811l792k758L431N519Q9n146k166K458J191
$$ 2095 8833 12048 6990 -800 -1178 3902 5713 1921 -837 2594 8113 8202 3056 890 3348 4539
1345D539m140m767J536P494M175l602n546k84M387L39m789l836K132M118J762
$$ 4539 399 -4368 -2832 4662 8837 5235 -311 -595 3792 4131 -658 -4494 -2362 1756 3518
1360C518j822k90K088P66m004n108n84M477L474j705l076N21M311J788l251n094
$$ 3518 1696 1406 3494 4260 256 -4852 -5436 -959 2515 810 -2266 -1745 2566 4354 1103 -3991
1376c991j481J936K060r4k60J859K446o70l950k733J321K347l49l939j069M842
$$ -3991 -5472 -3536 -1476 -1570 -1830 29 2475 1805 -2145 -4878 -3557 -1210 -1559 -5498 -6567 -1725
1392a725N343Kn416l967J110K600o05l134N36M494K279k516l394J708L547j221
$$ -1725 3618 3620 -1796 -5763 -4653 -2053 -2658 -5792 -5256 -762 1517 -999 -4393 -2685 862 -359
1408c59o492l631M188P856J312n368l197L077L803k650n453p57M417K465k412
$$ -359 -6851 -10482 -6294 1562 2874 -2494 -5691 -2614 1189 -1461 -6914 -7671 -3254 -789 -3201
1423c201k400L540M996j172p216m601L328O025P38m632j982M088M422j365m988
$$ -3201 -5601 -2061 2935 1763 -5453 -10054 -6726 -701 37 -4595 -6577 -2489 1933 568 -4420
1438d420j341J911Q88k804j344L167N219M62m776l685K100L210l8l928k576K529
$$ -4420 -5761 -3850 -2962 -5766 -7110 -3943 1276 1738 -3038 -6723 -4623 -1413 -1451 -5379 -7955 -5426
1454e426M331J681k142j985L34Q38k018k525M42L713K370j749l126P65L582J513
$$ -5426 -1095 586 -1556 -3541 -3207 -2369 -4387 -6912 -6470 -2757 -387 -2136 -5262 -4497 -915 598
1470E98l373n204p65M151M422j227k918K09L363M42m026k452J682L469p25l846
$$ 598 -2775 -7979 -8744 -4593 -171 -1398 -4316 -4107 -744 -302 -4328 -6780 -5098 -1629 -2354 -6200
1486f200l81N548M531k836o688j978M716L640k526m124J108N381J712l947k637
$$ -6200 -6581 -1033 3498 662 -6026 -8004 -3288 352 -2174 -6298 -5190 191 1903 -2044 -4681
1501d681K118L640k305n377m63N709M617k093n027p87M431K857l486m270K74M339
$$ -4681 -2563 1077 -1228 -6605 -7068 -1359 3258 1165 -3862 -4649 -218 2639 -847 -5117 -4843 -504
1517e04J887k248j461K807K842j972m648j136L536L109j235l330J89L833K906
$$ -504 1383 -865 -2326 481 3323 1351 -3297 -4433 -897 2212 977 -2353 -2164 1669 4575
1532D575j926l669j453J742J944p68r82Q95K846Q50k568k061J277K361n08l054
$$ 4575 2649 -1020 -2473 -731 1213 445 -537 358 3204 4054 1486 -575 702 3063 2555 -499
1548d99j671K440M211J415l149k692J148K487n77l222j037K850L346j081k557
$$ -499 -2170 270 4481 5896 2747 55 1203 3690 3113 -109 -1146 1704 5050 3969 1412
1563A412K86L423R55m237m036J555M583J899l314k981L206M306o87m862k486K286
$$ 1412 1698 5121 6076 1839 -2197 -642 3941 5840 2526 -455 2751 7057 6370 1508 -978 1308
1579A308L128j057l431J355M599J836l896m190J158L717R1m105k333L705M824
$$ 1308 4436 3379 -52 1303 5902 7738 3842 -348 810 4527 4618 513 -1820 1885 6709
1594F709M45m237k087K386J367k090l411O71M107J996k056k027R48K778r31l809
$$ 6709 7154 2917 830 3216 4583 2493 -918 -247 3860 5856 3800 1773 2721 5499 4568 759
1610G59k567J519L947J281j967r48J376J935r39l431k116J787J729L82j337J047
$$ 759 -1808 -289 3658 4939 2972 2024 3400 5335 4396 965 -1151 636 2365 2747 1410 2457
1626B457K520J015k468l439q89K669J420j230k277J186M367J529l051l925o8K039
$$ 2457 4977 5992 3524 85 -804 1865 3285 2055 -222 964 5331 6860 3809 -116 -184 1855
1642A855L78k588o40L712L341r06l895j151K802J431l259m187Q04N204L577k402
$$ 1855 2233 -355 -995 2717 6058 5152 1257 106 2908 4339 1080 -3107 -2303 2901 6478 4076
1658D076l345N25K655p10m152k181K863L983o79k657J08M258J514m280n262n19
$$ 4076 731 1256 3911 3201 -951 -3132 -269 3714 3035 378 486 4744 6258 1978 -3284 -3803
1674c803M701K509j510k589J362L601K26l554l290J220K018j113k229J068M313
$$ -3803 898 3407 1897 -692 670 4271 4497 943 -2347 -1127 891 -222 -2451 -1383 2930
1689B930K727k478m528j310K123J365j487k535J87L908K198p90k284r42L88q07
$$ 2930 5657 3179 -1349 -2659 -536 829 -658 -3193 -3006 902 3100 2310 26 -916 -528 -1335
1705a335k358l85K122L642L92l161j502J489K501j477m460k028K492M264O22k219
$$ -1335 -3693 -4078 -1956 1686 2078 -1083 -2585 -1096 1405 -72 -4532 -6560 -4068 196 818 -1401
1721a401q71J969M96l318l177R76L559J307l052j708L060M423p19n673l887J853
$$ -1401 -2272 -303 193 -3125 -6302 -5326 -1767 -460 -3512 -5220 -2160 2263 1544 -4129 -8016 -6163
1737f163L923M25k516m76L050K494k597l549M40J899M10l294j873L619N179J196
$$ -6163 -2240 -1815 -4331 -4807 -1757 737 -1860 -5409 -4969 -3070 -2660 -5954 -7827 -4208 971 2167
1753B167m919l470J199K941p65k645j094K684L295p05k088M52J796j60l702k941
$$ 2167 -2752 -6222 -5023 -2082 -2847 -5492 -6586 -3902 -607 -1312 -3400 -2948 -1152 -1312 -5014 -7955
1769g955J835M885J811k725k436J133K877O25l117k709M78K319J371j061J27K082
$$ -7955 -6120 -1235 576 -2149 -4585 -3452 -575 50 -3067 -5776 -5298 -2979 -1608 -2669 -2542 -460
1785d60J425k037l530l05L250J624j355k713P22L872K345k035l788j249K028J633
$$ -460 965 -1072 -4602 -4907 -1657 -33 -1388 -4101 -3379 493 2838 803 -2985 -4234 -2206 -573
1801e73j755n16J957K966l83l218j536K805K363k629l437m43M292L889j180l537
$$ -573 -2328 -2844 -887 2079 1696 -1522 -3058 -253 2110 -519 -3956 -4399 -107 3782 2602 -935
1817i35q51K564J131k846k349J513L259L15k623n29L448J927k051m768j162L625
$$ -935 -1786 778 1909 -937 -3286 -1773 1486 1801 -822 -1351 2097 4024 1973 -2795 -3957 -332
1833c32L127j076k848J58K580J424k059k237L30J667j61j717m07K618L161j197
$$ -332 2795 1719 -1129 -971 1609 3033 974 -1263 -933 734 573 -1144 -1551 1067 4228 3031
1849C031l348j496J756J899q94k354l38J960K505K71k301r21J172K69j651j526
$$ 3031 -317 -1813 -57 1842 948 -1406 -1744 216 2721 2992 691 -230 942 1211 -440 -1966
1865a966J277K669P93j800j881J370K443Q3l614k003J544K815J275k227p74J529
$$ -1966 -689 1980 2773 973 -908 462 2905 2988 -626 -2629 -1085 1730 3005 778 4 1533
1881A533K067j380l190l62K688J302j896k096J565M081Q21l756k741J494K568
$$ 1533 3600 2220 -970 -1332 1356 2658 762 -1334 231 4312 5133 1377 -1364 130 2698
1896B698k37k785m71K818K552p78k587n76K188R73l140k593K335L423J435k469
$$ 2698 2461 -324 -795 2023 4575 3797 1210 634 2822 3795 655 -1938 397 3820 5255 2786
1912B786k573J846K614r30l319j049J752K433j92j143K94J715Q67k458k597J53
$$ 2786 213 2059 4673 3743 424 -625 1127 3560 3368 2225 2519 4234 5101 2643 46 199
1928A99K583J179j605j479J259L042N01k863k226J19J993K81r35p87J589J816
$$ 199 2782 3961 2356 877 2136 5178 5679 2816 590 709 2702 2983 2048 1261 2850 4666
1944D666r0k113j805J367J140j665j828O08K846K444j570k830o50K136O35k314
$$ 4666 4576 2463 658 2025 3165 1500 -328 280 3126 5570 4000 1170 520 2656 3291 977
1960I77k610J319L395J309k102j501J135K044j680l796r27K859L402j506k726
$$ 977 -1633 -314 3081 4390 2288 787 1922 3966 2286 -1510 -2437 422 3824 2318 -408
1975d08M24L060J648l888l743N66K803J205j856q86K278K272r73l783j519K181
$$ -408 16 3076 4724 836 -2907 -2341 462 1667 -189 -1075 1203 3475 2502 -1281 -2800 -619
1991f19J617j698k543P21M211J966k598k953o39J853K87j543j064J252K426N47
$$ -619 998 -700 -3243 -2522 1689 3655 1057 -1896 -2535 -682 -395 -1938 -3002 -1750 676 1223
2007A223j806j032J020J116j632l157r4K726K948J3k593p80J210J113j427k103
$$ 1223 -583 -1615 -595 521 -1111 -4268 -4362 -1636 1312 1325 -1268 -2048 -838 275 -1152 -3255
2023c255j103J940K211j60j072Q10J688n32l095k503J410L184P51k074j509K178
$$ -3255 -4358 -2418 -207 -367 -1439 -629 1059 527 -2568 -5071 -3661 -477 274 -1800 -3309 -1131
2039a131L199l45l712k405J448K142r00j274O14L441J176l195l064J432K491r0
$$ -1131 2068 1723 -1989 -4394 -2946 -804 -1704 -2978 -2364 1077 2253 -942 -4006 -2574 -83 -173
2055a73l449j531K821M309N28l468k008J329J150j422k174N28L372J382k117j900
$$ -173 -3622 -5153 -2332 1977 2505 -963 -2971 -1642 -492 -1914 -4088 -3560 -188 1194 -923 -2823
2071b823J552K926p32m133k241J766M038L53j587j224J428Q96j064k055m38J566
$$ -2823 -1271 1655 923 -3210 -5451 -3685 353 706 -881 -2105 -677 219 -845 -2900 -3338 -1772
2087a772O77j061o23J648K208N09k678k930N29J799J013p81j399R02J725R36j044
$$ -1772 -1095 -2156 -2779 -1131 1077 1586 -1092 -4022 -3493 -1694 -681 -1462 -2861 -1959 -234 702 -342
2104c42j618l54Q42n59j267J36K256K309r27k968q43J838K149j643l338J15K841
$$ -342 -1960 -2314 -1472 -2031 -3298 -3162 -906 1403 476 -2492 -3335 -1497 652 -991 -4329 -4214 -1373
2121a373K436p62j803L43J433p85k549j046K619K599o89l124k14L292K297k251
$$ -1373 1063 301 -1502 -1159 274 -511 -3060 -4106 -1487 1112 423 -2701 -2915 377 2674 423
2137D23l949n52K641J958q91j571J410K430o17k701j284K214J792j316k661J8
$$ 423 -3526 -4078 -1437 521 -370 -1941 -531 1899 1282 -1419 -2703 -489 1303 -13 -2674 -2656
2153b656L921K594k049l136o16K022J065j529j344J287J798L68j407l45J436O87
$$ -2656 1265 3859 1810 -1326 -1942 80 1145 -384 -1728 -441 1357 1725 318 -27 1409 2096
2169B096j539k007m85K285K229q5j644r26J431R74o36j653q17P70J228K88m53
$$ 2096 557 -1450 -1935 350 2579 2494 850 -76 1355 2329 1693 40 -777 -7 1221 1509 1056
2186A056O57J273j47j519k194K50K629Q38j940j554J812K716M48k517j880M78
$$ 1056 1713 2986 2839 1320 -874 -624 2005 2843 903 -651 1161 3877 4325 1808 -72 406
2202D06J656m05j516l53K743J921j716k653L7K790N20l129k133J515L812Q26k558
$$ 406 2062 1657 141 -212 2531 4452 2736 83 120 2910 3430 301 -1832 -317 3495 4321 1763
2219A763j544J495J286q11k655l39K275J690j438j635J350K517j13l012k749J160
$$ 1763 219 1714 3000 2189 -466 -805 1470 3160 1722 87 1437 3954 3841 829 -1920 -760
2235g60L092M30j892r58K090J534p46k339n75R74O23r16j079R81K224R03j656
$$ -760 2332 2762 870 -88 2002 3536 2790 451 -124 850 1473 557 -522 459 2683 3586 1930
2252A930k449L97J642K18j673r06J013K355P22j205j469J67P52j010q70p37J713
$$ 1930 -519 -122 1520 1738 65 -841 172 2527 3249 2044 575 742 1494 484 -386 -1123 590
2269E90J791r6j528n90J558J049j360l000k43K174K352p10j741J51J942L25k256
$$ 590 2381 2285 757 167 1725 2774 1414 -1586 -1829 345 2697 1987 246 397 2339 2664 408
2286D08j940O06K376J96k035p3J916K819j975l496j001K645J945j764k012O88
$$ 408 -1532 -926 1450 1646 -389 -462 1454 4273 2298 -1198 -2199 446 2391 627 -1385 -697
2302f97L149J024j898k814P20J735n76k309j64K290K555r03k610n44J854J271
$$ -697 2452 3476 1578 -1236 -516 1219 643 -1666 -1830 460 3015 2112 -498 -1042 812 2083
2318B083k022k597K75K822J618j150j391K72J398m22k374o92R56J961j45j267
$$ 2083 61 -2536 -2261 561 2179 1029 -362 -90 1308 886 -1488 -2180 -1224 737 592 -675
2334f75q01K126J260j074l027j041J751J095M55r83j64J287R39j453j939m8Q13
$$ -675 -1476 650 1910 836 -2191 -3232 -1481 -386 69 -914 -1078 209 1148 -305 -2244 -2292 -1479
2351a479N65r10r23J407K256J40k424j888O01J936L6j927j033J784K055j24j799
$$ -1479 -914 -1824 -2747 -1340 916 1056 -1368 -3256 -2655 -719 -683 -2610 -3643 -1859 196 72 -1727
2368a727o60J259O10k305j819J499K504J401k320k011J381K410m43k891j670J463
$$ -1727 -2387 -1128 -518 -2823 -4642 -3143 -639 762 -1558 -3569 -2188 222 -221 -3112 -4782 -3319
2384c319K397L93j509j21J663N48k083k119O42K418O15j919j459J900K571L18
$$ -3319 -922 -529 -2038 -2159 -496 52 -2031 -4150 -3508 -1090 -475 -2394 -3853 -1953 618 936
2400I36k648j699N10J425J80r86N0J488R40p95j268J90R03L02j832j301J364K371
$$ 936 -1712 -3411 -2901 -1476 -1296 -2282 -2232 -744 196 -599 -1867 -1677 -774 -472 -2304 -3605 -2241 130
2418A30J255j359j569m01J269L62j132q94N27J610L35o19m02J234R27j505k173
$$ 130 1385 26 -1543 -1944 -675 -313 -1445 -2339 -1812 -202 133 -486 -888 346 1273 -232 -2405
2435b405j87J456K759j006j845k24K366P35j010k214q2J424K87n92l20J556J619
$$ -2405 -2592 -1136 1623 617 -1228 -1452 914 1649 639 -1575 -1657 -233 54 -538 -858 698 2317
2452B317q75k689j146K352J572j001k394pK858J828j526j746l95J345M88j881
$$ 2317 1442 -1247 -2393 -41 1531 530 -1864 -1871 987 2815 1289 -457 -852 493 981 -900
2468i00r43J966J844p58j850n95K334J321j783k410m02K106J945n64j744K66J305
$$ -900 -1843 123 1967 1209 -641 -1236 1098 2419 636 -1774 -2176 -70 1875 1311 -433 -167 1138
2485A138J46j318j012O96J167j23j344j47J968J568q24k728p80J190J642k36j259
$$ 1138 1284 -34 -1046 -350 817 694 -650 -797 1171 2739 1915 -813 -1593 -403 1239 1003 -256
2502b56l15J687Q34n00r44o26P77j20q08p50J089K295P02k100j606P96J600j05
$$ -256 -571 1116 1950 1450 506 -120 657 537 -271 -1021 68 2363 3065 965 -641 155 1755 1650
2520A650j758j090R50K252N04j489m69J286N62j464k122O17K546Q56j478j838
$$ 1650 -108 -1198 -248 2004 2508 1019 550 1836 2398 934 -1188 -571 1975 2831 1353 -485
2536d85J166K594J65k537j815Q63K076K35j349k87J893J068j394j947o1K118Q2
$$ -485 681 3275 3440 903 -912 -49 2027 2262 913 626 2519 3587 2193 246 185 2303 2385
2553B385j748j449J578K467Q01k399j409L60J673j49j594m01J393J418j69j698
$$ 2385 637 -812 766 3233 4034 1635 226 586 2259 2110 516 115 1508 2926 2757 1059
2569A059k4Q62Q87j811j552K33K036J672j250j427P6J441M22j684j650M98J932
$$ 1059 1035 1897 2784 973 -579 -346 1690 3362 2112 685 761 2202 2624 940 -710 -212 1720
2586A720J68o62j027J254J334j010k210p62J397J761n65j484l67J855J605j338
$$ 1720 1888 1226 199 1453 2787 1777 -433 -1195 202 1963 1398 -86 -453 1402 3007 1669
2602A669k342o70J291R35j024p97Q47K156P1k353j290R16J812j266k007j26K435
$$ 1669 -673 -1343 -52 883 -141 -938 -91 2065 2136 -217 -1507 -591 1221 -45 -2052 -2178 257
2619B57K221j318k409J39J425L93j800j382O14K313N66j466o32J028J334j358
$$ 257 2478 1160 -1249 -1110 315 708 -1092 -2474 -1860 453 1019 -447 -1079 -51 1283 -75
2635g5k116o82J600J609l87j349R1J330J034j516j552j4R98M62n26l93J087J012
$$ -75 -2191 -2873 -1273 336 -51 -1400 -1309 21 1055 -461 -2013 -2027 -1029 -567 -1093 -1486 -399 613
2653F13j11j306j291M37J229j78j074l62J341J569N8j877j106N05Q17l95o36k19
$$ 613 502 -804 -2095 -1658 -429 -607 -1681 -2043 -702 867 925 -952 -2058 -1553 -736 -1131 -1767 -1986
2671a986J733J009n58j646L0J821j96j950j715J541K550P12j745j493J007J663
$$ -1986 -253 756 198 -1448 -1418 403 207 -1743 -3458 -1917 633 1345 -400 -1893 -886 777
2687G77r63k012m88J915P57m17j227O40J918J99k350k074R78K288K89j764o93
$$ 777 -186 -2198 -2686 -771 -14 -431 -1658 -1018 900 1099 -1251 -3325 -2347 -59 230 -1534 -2227
2704b227J468J753q13k051m52J375L89j145p81J009K020M49j953j757P76J515
$$ -2227 -759 994 181 -1870 -2322 -947 -558 -1703 -2484 -1475 545 994 -959 -2716 -1940 -425
2720d25M1j670q06Q13K135K04j084q63O76L33q44j011N95J219P07r50q17L09J137
$$ -425 -384 -2054 -2860 -2047 88 292 -792 -1655 -979 -646 -1490 -2501 -1906 -687 20 -930 -1747 -1438 -301
2739c01O61j646j486J77J508Q57m11r19L00Q67P6q48r58N12J058k58j322L62K017
$$ -301 360 -1286 -2772 -2595 -1087 -230 -641 -1560 -1260 -393 -317 -1165 -2123 -1611 -553 -811 -2133 -1771 246
2758B46J120j260k187j56J415J344j096j293K81J810J029j672p33P62J037j132
$$ 246 1366 106 -2081 -2237 -822 522 -574 -1867 -1586 224 1253 -419 -1152 -390 647 -485
2774d85j491j43K108K473j428k319R0J673J344j411k090M32J836P97j174l90O81
$$ -485 -1976 -2119 -11 2462 1034 -1285 -1195 478 1822 411 -1679 -1247 589 1386 212 -178 503
2791E03J582j129k003j43J643J395p64j888L05K194J329j277j958mO85O76m50
$$ 503 2085 956 -1047 -1190 453 1848 1084 -804 -499 1695 3024 1747 -211 -215 470 1146 696
2808F96l56P59J494n47j212o58J101R39q28j136n81J602J509o2j196j335N72J038
$$ 696 340 1099 2593 2046 834 176 1277 2216 1388 252 -329 1273 2782 2720 1524 189 761 1799
2826A799j8j157k94R01J042l96j263L29J453l6j565j756R44K397K40j215j352
$$ 1799 1781 624 330 1231 2273 1877 614 943 2396 2360 795 -961 -17 2380 2620 1405 53
2843E3R43J921k12k008q88O01J694q39j284O40K061M13k025k100P45K212M54k040
$$ 53 996 2917 2705 697 -191 410 2104 1265 -19 621 2682 3095 1070 -1030 -285 1927 2381 341
2861C41j499J646K283N3j905j088R25R80r02j819P16J878Q26j514j377Q78J342
$$ 341 -1158 488 2771 2824 919 -169 756 1736 834 -985 -269 1609 2435 921 -456 422 1764
2878A764K06k205j102J324J284O54j279m81R35K42l89j441q9Q90P80m31r94J22
$$ 1764 1970 -235 -1337 -13 1271 1925 646 165 1100 1342 953 -488 -577 313 1093 662 -332 -210
2896b10J565N99j090j529k92Q54J410m82j041o3J530O32r79j463J71R06Q7j018
$$ -210 1355 1954 864 -665 -957 -103 1307 825 -216 -279 1251 1883 904 -559 -388 518 605 -413
2914d13m51J281J753l89k115q47J493J219j148j472l62K085J403p05j890M81J373
$$ -413 -864 417 2170 1781 -334 -1181 312 1531 383 -1089 -1451 634 2037 1332 -558 -77 1296
2931A296j16j691j270J473J849j03j765n37J798R98j196k233k99K027J038p01
$$ 1296 1180 -511 -1781 -308 1541 1438 -327 -864 934 1932 736 -1497 -1796 231 1269 568
2947E68j377N91J262L06j758j193R96J299o49j416J71J644J453j260j744j48P26
$$ 568 -809 -218 1044 1350 -408 -1601 -605 694 45 -1371 -1200 444 1897 637 -1107 -1255 -529
2964e29P04p17j060R19P34L22m11q36K73M61n08q71k93R04J079k2q22o29M90P55
$$ -529 175 -542 -1602 -683 51 373 -38 -874 -601 -140 -648 -1519 -1812 -908 171 149 -673 -1302 -812 -57
2984e7n48j178m67O46J243j65k99p88J142J41r50j064k36J642O37q56r16N27J584
$$ -57 -605 -1783 -2250 -1604 -361 -526 -825 -1613 -471 -330 -1280 -2344 -2580 -938 -301 -1157 -2073 -1546 38
3003C8R9j764j361P57J688k7j411m49J581J088j131j443j31J646P19j852j045
$$ 38 137 -1627 -2988 -2231 -543 -570 -1981 -2430 -849 239 -892 -2335 -2466 -820 -101 -1953 -2998
3020b998J322J856P58j939j272M99J650l01j674m12J286J190k00j109L13J080
$$ -2998 -1676 180 938 -1001 -2273 -1774 -124 -425 -2099 -2511 -1225 -35 -235 -1344 -1031 49
3036D9J32j804j314J304J581L59j082p86J025J249l41j249r21Q01R28l69l42J95
$$ 49 181 -1623 -2937 -1633 -52 307 -775 -1561 -536 713 372 -877 -1798 -997 -69 -438 -780 -585
3054e85J188J58j208q98K15J014L85o95k15k54J540O87r07j241K80O26J68m11
$$ -585 603 761 -447 -1345 -1130 -116 269 -426 -641 -895 645 1332 425 -816 -536 90 258 -153
3072a53o46J056R47k48j650P2R29R63q22j586O9J493J405n15j794l3J285P02j616
$$ -153 -799 257 1204 956 -694 -622 307 1270 448 -1138 -1069 424 1829 1314 -480 -513 772 1474 -142
3091a42r55N07J634J10j146n95J425J267j070k151k39J371J683j127j444N71J275
$$ -142 -1097 -590 1044 1154 8 -587 838 2105 1035 -1116 -1355 16 1699 572 -872 -301 974
3108I74R11j511p79L34Q55k88j055o2J302J479o40k096KJ286R42j024j538K37
$$ 974 1885 374 -405 -71 784 496 -559 -621 681 2160 1520 -576 -574 712 1654 630 -908 -671
3126f71J242J173n56p66l16O34q7n33q73R94J067J13r31o44N79J536k17j672j148
$$ -671 571 1744 1188 422 106 740 653 120 -753 241 1308 1421 490 -154 425 1961 1744 72 -1076
3145a076J108J083N00p07l59O57L76k48j253l77J367M22q43o76J73K101N30j799
$$ -1076 32 1115 1615 908 549 1206 1582 1334 81 -296 1071 1493 650 -26 147 2248 2778 979
3163I79j478O70J409K78j095o62Q75J234m57j268k12J413L69j316j270P68J774
$$ 979 -499 171 1580 1858 763 101 976 2210 1753 485 273 1686 2055 739 -531 237 2011
3180B011M96j038j415M35J602R7j559q70Q23J202P7j114q8J132K88j029j782R23
$$ 2011 2507 1469 54 489 2091 2188 629 -241 582 1784 1861 747 659 1791 2079 1050 -732 191
3198A91J225M35j014o82L10J357K28q79j423L61Q07Qm78k29O19O98n22j157j83
$$ 191 1416 1851 837 155 465 1822 2050 1171 -252 109 916 924 446 217 836 1534 1012 -145 -328
3217c28J112K59p39j071K97J150J191o83j654J38N16Q75j382q29O77R06M01j029
$$ -328 784 1043 304 -767 -470 680 1871 1188 -466 -328 188 1063 -319 -1148 -471 435 836 -193
3235a93m73R80M62p17j438j87J149J527q20j232j56Q76P85n49j500k13J153N15
$$ -193 -666 314 776 59 -1379 -1566 -417 1110 290 -942 -1098 -222 563 14 -1486 -1699 -546 -31
3253c1o70q03R64J263l56k005j70J084P64l04j699K55J483R14p27j587pQ53O3
$$ -31 -701 -1504 -540 723 367 -1638 -1808 -724 40 -264 -1963 -1708 -225 689 -38 -1625 -1632 -779 -716
3272g16o39l45Q76J144l04j085n09O45R33l57j448m49J384P29O6r20J63M40r3
$$ -716 -1355 -1700 -824 320 16 -1069 -1578 -933 0 -357 -1805 -2254 -870 -141 -75 -995 -832 -392 -485
3291d85j55m52n51R06L43p42L3N52P09l11j080o01N16R75R3r20j15N07R85n08
$$ -485 -640 -1092 -1643 -737 -394 -1136 -1103 -551 158 -153 -1233 -1834 -1318 -343 -250 -1170 -1285 -778 207 -301
3311c01r49k76M25P00n30l99M48J124J95j124r04lJ289K43j122q26J099J278K33
$$ -301 -1250 -1526 -1101 -401 -931 -1330 -882 242 437 -687 -1591 -1594 -305 -62 -1184 -2010 -911 367 600
3330F00j018r85J217L97r32j044L42J277P49r78j501R51J483j98j547j099J076
$$ 600 -418 -1403 -186 211 -721 -1765 -1423 -146 603 -375 -1876 -925 558 360 -1187 -2286 -1210
3347a210J279J6q55l96J116K86m68j710L91J067P1o12n89Q17J400r4j098j110
$$ -1210 69 85 -770 -1166 -50 236 -232 -1942 -1551 -484 -413 -1025 -1614 -797 603 509 -589 -1699
3365a699L38J101R6p00m50L57J143j85p18m78L78M68m09o58L35R85P16m38j455
$$ -1699 -1361 -260 -164 -864 -1314 -957 186 1 -717 -1195 -817 -349 -758 -1416 -1081 -96 620 182 -1273
3384a273K60Q25N05p23j133L16J282P36p02p66K53P85k42j124k21J100J004Jj711
$$ -1273 -1013 -188 317 -406 -1539 -1223 59 795 93 -673 -420 365 123 -1001 -1222 -122 882 883 -828
3403h28Q1J361J049j120j429k62J432P64q14o09N10J373k39j328p66J169J177
$$ -828 -747 614 1663 543 -886 -1148 284 1048 234 -375 135 1508 1269 -59 -825 344 1521
3420A521p72j229q2J674J189j026j499k26J222Q63o74r10K56J362q7m80p55N84
$$ 1521 749 -480 -562 1112 2301 1275 -224 -450 772 1635 961 51 307 1669 1582 1102 347 931
3438I31J146p88j460J23J006Q55j8j193J46L68N04l84r30M7K75P14j40l92N17
$$ 931 2077 1289 -171 -48 958 1813 1795 602 748 1116 1620 1236 306 353 628 1342 1202 810 1327
3457A327L33K16j007q25N88R45j0q12q33Q17J440j90r20j185O57N12K61o67q0
$$ 1327 1660 1876 869 44 632 1577 1567 755 -78 739 2179 1989 1069 -116 541 1053 1314 647 567
3476E67P76L79q07j016M21J068K54j299r56O60J578N76j555q47L74J301o01j124
$$ 567 1343 1722 915 -101 320 1388 1642 343 -613 47 1625 2201 646 -201 173 1474 873 -251
3494b51J94R20O40o60j093O80Q20N44j465j445Q79J155L02r88n94N41Q91j63r12
$$ -251 -57 863 1503 843 -250 430 1250 1794 329 -1116 -237 918 1220 232 -362 179 1070 907 -5
3513em69P13L50o19o01M44J188j9o15q72L00Q22r0o15o32Q09K18O75o24k91j11
$$ -5 -474 239 589 -30 -631 -187 1001 982 367 -505 -205 617 527 -88 -720 89 307 982 358 67 -44
3534d4M85l17q11K0Q15O97l09r19n3O30O91j77j245m60Q94O44N8o90n2Q06K2p20
$$ -44 441 124 -687 -667 148 845 536 -383 -436 194 885 708 -537 -997 -103 541 599 -91 -143 663 685 -35
3556c5n83M10M91J07q87k27Q88J177n31j620m40Q34J022q9j341J12J302J16q90
$$ -35 -618 -208 283 390 -497 -724 164 1341 810 -810 -1250 -416 606 517 -824 -712 590 706 -184
3575a84m45K51Q55m49j203m9J126J184m61j493j55R88P78j201j138N71P98P10
$$ -184 -629 -378 477 28 -1175 -1224 -98 1086 625 -868 -1023 -35 743 -458 -1596 -1025 -227 483
3593D83q54m73O30O51o59j050l89R40R05o73l54k46R79L69o49p00k34N63J01l49
$$ 483 -371 -844 -214 437 -222 -1272 -1661 -721 184 -489 -843 -1089 -110 259 -390 -1090 -1324 -761 -660 -1009
3613a009j68M78N80k26n09o76L84N09j80p09m9O98Q29j0r68q09O43P36q8q16l38
$$ -1009 -1177 -699 -119 -345 -854 -1530 -1146 -637 -817 -1526 -1575 -877 -48 -58 -1026 -1835 -1192 -456 -544 -1360 -1698
3634a698Q42P39j47j098J03O12J54n70r91M10J475N49q30j054P65P32j39j350
$$ -1698 -856 -117 -264 -1362 -1259 -647 -493 -1063 -2054 -1644 -169 380 -450 -1504 -739 -7 -146 -1496
3652a496n23J155N61m0p93K03J038K73j345o32J1J255N03j122l61M49J323J72
$$ -1496 -2019 -864 -303 -343 -1136 -933 105 378 -967 -1599 -1588 -333 170 -952 -1313 -864 459 631
3670F31j258o50O21N78j32n69N8R59O35j018q40O55Q31j27j110k91O58J164o6
$$ 631 -627 -1277 -656 -78 -210 -779 -721 238 873 -145 -985 -330 501 374 -736 -1027 -369 795 729
3689G29n04o27N18L20m04k99k39J31J023o99j64K20N34L49r62l76l45Q72P35l99
$$ 729 225 -402 116 436 32 -267 -506 -375 648 -51 -215 5 539 888 -74 -450 -795 77 812 413
3709D13o32q1J013K51n01p27p1O35L92o36j34O56L92l41r76k24J045P23m75j103
$$ 413 -219 -300 713 964 463 -264 -335 300 692 56 -78 578 970 629 -347 -571 474 1197 722 -381
3729c81l39J360O88l94j255m4J108k15p13l35Q57Q09J4j302k69J018P94j140p97
$$ -381 -720 640 1328 934 -321 -365 743 528 -185 -520 337 1146 1160 -142 -411 607 1401 261 -536
3748e36j14J021J075p35p71rR59K10j285K14K42L44J00o55K9P86L86k25j126n43
$$ -536 -650 371 1446 711 -60 -69 890 1100 -185 29 271 615 715 60 89 875 1261 1036 -90 -633
3768f33J169J03J40n37l4J23Q05j94n25j85O41m33k07J54J97M52M63r10m96L30
$$ -633 536 639 779 242 208 331 1136 942 417 232 873 440 233 387 584 1036 1499 589 93 423
3788D23O88no58p83N37P62L43n41k81K46P71q76p62L33P77N96j049k99J15J070
$$ 423 1111 1106 448 -335 202 964 1307 766 485 731 1502 626 -136 197 974 1570 521 222 337 1407
3808A407N81j696m33O14N29K74q52n22J184L68o72n30LJ177j22j055o78Q99O11
$$ 1407 1988 292 -141 473 1002 1276 424 -98 1086 1454 782 252 255 1432 1310 255 -423 476 1087
3827A087O89r29r86L23O65j3m93l70M88P11n69n96L86M36L01j376k04J59R36K74
$$ 1087 1776 847 -139 184 849 836 343 -27 461 1172 603 7 393 829 1130 -246 -450 -291 645 919
3847I19n25o71M16N92j46m88p24J93M42j6j29k50O88N06o86p27l63N30Q33l62
$$ 919 394 -277 139 731 585 97 -627 -434 8 -8 -137 -387 301 807 121 -606 -969 -439 394 32
3867C2o04j3L65R39p07r75n3R40p5l90m16P07O24k39p46m65P14Q48o51j105k62
$$ 32 -572 -585 -220 719 12 -963 -1016 -76 -151 -541 -957 -250 374 135 -611 -1076 -362 486 -165 -1270 -1532
3888a532J206J118n82j078m38J206J93o86p03J97P41N03j071j67J215L54n90j308
$$ -1532 -326 792 210 -868 -1306 -100 93 -593 -1296 -1099 -358 145 -926 -1093 122 476 -114 -1422
3906a422j65P61J209m43j014O0Q38L24n12p96O17K48k50m22k73P67R89k47j196
$$ -1422 -1587 -826 383 -60 -1074 -1014 -176 148 -364 -1160 -543 -295 -545 -967 -1240 -473 516 269 -927
3925i27m94J064N47m93p60k3R21M43k78n50q6N88R0o29m32M43O06J57o26l58K17
$$ -927 -1421 -357 190 -303 -1063 -1086 -165 278 0 -550 -636 -48 42 -587 -1019 -576 30 187 -439 -797 -580
3946e80N32J64p38p63O44O49N14o36l89M65M34o69p32L37L67O88j010l49j2J203
$$ -580 -48 116 -622 -1385 -741 -92 422 -214 -603 -138 296 -373 -1105 -768 -401 287 -723 -1072 -1084 119
3966A19N44j122q85N49Q99M5j012j45N99O15l30r98jQ88J30q83m23K54J492K31
$$ 119 663 -459 -1344 -795 104 149 -863 -1008 -409 206 -124 -1122 -1123 -235 -105 -988 -1411 -1157 335 566
3986E66p95r63Q7R91O2p32m77K65J276l04m31n02R30j26n52m35K6O36Q14p72m07
$$ 566 -229 -1192 -1105 -114 -52 -784 -1261 -996 280 -24 -455 -957 -27 -153 -705 -1140 -1114 -478 336 -436 -843
4007h43J37J094m5p72n02P0N39L98l25l69N64K23k6n24j44R8N39k13m91N7R10
$$ -843 -706 388 343 -429 -931 -861 -322 76 -249 -618 -54 169 143 -381 -525 -427 112 -101 -592 -535 375
4028C75M05k21j010j38N67N41m99k05j77Q36K85m84n20K64P58m54o37m20R33J055
$$ 375 780 559 -451 -589 -22 519 20 -185 -362 474 759 275 -245 19 777 323 -314 -734 199 1254
4048A254m54j037j18J138K02l06j310O92M52N05l22n14L87O74m13n83l08Q31M48
$$ 1254 800 -237 -355 783 985 679 -631 61 513 1018 696 182 569 1243 830 247 -61 770 1218
4067A218m38p20J5J294q7m55o02r9L91M62r14K34M47K54j38l18l96N92P60o52
$$ 1218 780 60 75 1369 1282 827 225 126 517 979 65 299 746 1000 862 544 148 740 1500 848
4087H48o82K24J08Q34j8o46k21K54K56j76l34o9L09K83m71P4k9N36j02n09n94
$$ 848 166 390 498 1332 1314 668 447 701 957 781 447 378 687 970 499 573 544 1080 978 469 -125
4108a25K20Q88J0n00m72K14O03Q7l66n74K52M87k04m02j86R14N36j165n16K88
$$ -125 95 983 993 493 21 235 838 925 559 -15 237 724 520 118 -68 846 1382 217 -299 -11
4128a1O79N75r26q78N64Q55P0p75m50N13N8l23o08N87N44L55q70n59P83N79J07
$$ -11 668 1243 317 -561 3 858 928 153 -297 216 274 -49 -657 -70 474 829 -41 -600 183 762 869
4149H69j253m09N42P94j58n57J27N13L1n73J27l68P62K03q11j37L33P53K56p54
$$ 869 -384 -793 -251 543 385 -172 -45 468 499 -74 53 -315 447 650 -161 -298 35 788 1044 290
4169B90j008O29L32K45l51k57r1M31R9l36r7M37k04J23n33K5M09O82m85q77J81
$$ 290 -718 -89 243 488 137 -120 -211 220 319 -17 -114 323 119 242 -291 -266 143 825 340 -537 -356
4190c56O01J51m5q18J34K16O89k88n39J69M66L00j141l79Q66P29n03o67j82P36
$$ -356 245 396 351 -467 -333 -117 572 284 -255 -86 380 680 -461 -840 26 755 252 -415 -597 139
4210A39P76p32j137k4P99O47r79k10R20L53k00q72n39O26M85k40q49n0R86L71
$$ 139 915 183 -954 -978 -179 468 -511 -721 199 552 352 -520 -1059 -433 52 -188 -1037 -1087 -101 270
4230B70n11q46J65M75K82m88o6J00N41J88r02l2O88k5j52j083M30L42O14k19p17
$$ 270 -241 -1087 -922 -447 -165 -653 -719 -619 -78 110 -792 -824 -136 -161 -313 -1396 -966 -624 -10 -229 -946
4251i46mL88L44l62l78l21O52Q9L3l57Q2N35K5n69p07L63Q65j18m64l55O56M94
$$ -946 -950 -562 -218 -580 -958 -1279 -627 -538 -505 -862 -780 -245 -220 -789 -1496 -1133 -268 -386 -850 -1205 -549 -55
4273e5N02q67o24O2N66k39k93J02K94P52l82m65o71J217K93j015k12K10Q46L20
$$ -55 447 -420 -1044 -982 -416 -655 -948 -846 -552 200 -182 -647 -1318 -101 192 -823 -1035 -825 21 341
4293C41m28q66N44M86l4o08l78N60O09o68j36K15N14N25j096n25O11L74N18o32
$$ 341 -87 -953 -409 77 43 -565 -943 -383 226 -442 -578 -363 151 676 -420 -945 -334 40 558 -74
4313g4p47O64N40J48o69m23O78K4k82k13K41O51M23p81p39K23L14Q29p16k20J71
$$ -74 -821 -157 383 531 -138 -561 117 141 -141 -354 -113 538 961 180 -559 -336 -22 807 91 -129 42
4334D2L37J22o2j71l76J87l43J92n8L50N23r3p82n6N21K40k37m34n45P65L36K25
$$ 42 379 501 439 268 -108 79 -264 -72 -130 220 743 650 -132 -188 333 573 336 -98 -643 122 458 683
4356F83q72LN48J05n18k26j26R09L5q97M3M84O97n11p66J90K88P38j86p39M6N78
$$ 683 -189 -186 362 467 -51 -277 -403 506 541 -356 -313 171 868 357 -409 -219 69 807 621 -118 -72 506
4378E06j74j18m89N1Q94j01o90l17R21L88j41j040K1Q72J26m08n14N9R12q0l98
$$ 506 332 214 -275 -224 670 569 -121 -438 483 871 730 -310 -289 583 709 301 -213 -154 758 678 280
4399B80m86K89Q29l48m94j52O78L18k83o44j29L63O34k11m11k47N91J08j1l82
$$ 280 -206 83 912 564 70 -82 596 914 631 -13 -142 221 855 644 233 -14 577 685 674 292
4419B92K63k39N20k97j98L8L72j57j32n61O18O36j37n35n77M79N46Ql97l60M37
$$ 292 555 316 836 539 341 379 751 594 462 -99 519 1155 1018 483 -94 385 931 939 542 182 619
4440F19M71l77l38k02L11O03k80q54p2J309k02n06o30K44Q62O1o29n65N44O44
$$ 619 1090 713 375 173 484 1087 807 -47 -119 1190 988 482 -148 96 958 1019 390 -175 369 1013
4460A013p19r9N6L33M77p68p22J40R73J35o40k82L4J070k32m85q26K94M17K64
$$ 1013 294 195 251 584 1061 293 -429 -289 684 819 179 -103 -69 1001 769 284 -542 -248 169 433
4480D33n21n6M71j00l35l61J36Q11m77j82n33J16Q22J85j68l52l88L47n4n8l30
$$ 433 -88 -144 327 227 -108 -469 -333 478 1 -181 -714 -598 224 409 241 -111 -499 -152 -206 -264 -594
4501e94J02M60l6m17P1N06%l19o02j41N13N86J34p21l50N42K18j23r85M04K92
$$ -594 -492 -32 -68 -485 -414 92 92 -227 -829 -970 -457 129 263 -458 -808 -266 -48 -171 -1156 -752 -460
4522d60L63l81o61M34P42M3r25j00K72P84Q1j238K4O65O37j73q78O7M23K73p23
$$ -460 -97 -478 -1139 -705 37 80 -845 -945 -673 111 192 -1046 -1022 -357 280 107 -771 -704 -281 -8 -731
4543g31l70O74Q52k38r13%K90P37l03j049J36O85M91j88m31l3L92o4m50j20K11
$$ -731 -1101 -427 425 187 -726 -726 -436 301 -2 -1051 -915 -230 261 73 -358 -391 1 -63 -513 -633 -422
4564d22N41j69o23qQ15L57m65m59j11K63K51K2l99l8K79N88k09l01l79M12j99
$$ -422 119 -50 -673 -681 134 491 26 -433 -544 -281 -30 -8 -407 -445 -166 422 213 -88 -467 -55 -254
4585b54Q1k55r1J005l43l26p17N12J11N29n92n42M78N26n9l95L4K00J7j18k03
$$ -254 -173 -428 -519 486 143 -183 -900 -388 -277 252 -340 -882 -404 122 63 -332 -298 -98 -81 -199 -402
4606d02o9M71L99p51k18J81N81L98q86n03NR62K12q40k8J63N71m95m66QP90K5
$$ -402 -471 0 399 -352 -570 -389 192 590 -296 -799 -794 168 380 -460 -488 -325 246 -249 -715 -707 83 108
4628A08p3p68K25R19k3m90p84M35K90P9o33J78K91N09m50j06l13O73J23l79j54
$$ 108 35 -733 -508 411 388 -102 -886 -451 -161 -82 -715 -537 -246 263 -187 -293 -606 67 190 -189 -343
4649c43P5K17N34k76m58J97n2O80q21j21j3K74M46k55m5L94pj59n11j20O80J09
$$ -343 -268 -51 483 207 -251 -54 -106 574 -247 -368 -381 -107 339 84 39 433 426 267 -244 -364 316 425
4671D25J32o13j61N51N25l74n42j4L22M13j38o27N54L00R9m64m02M56M55k85n53
$$ 425 557 -56 -217 334 859 485 -57 -71 251 664 526 -101 453 753 852 388 -14 442 897 612 59
4692E9k14N90P12m80m95Q7K82M7k98j69L04J39J79m59rN18P9j29m14m13M32N25
$$ 59 -155 435 1147 667 172 259 541 588 290 121 425 564 743 284 275 793 872 743 329 -84 348 873
4714H73L7m43m88P50K09k57p77L51O2J40k59J83J95L78k12n32k71N00N98n57k22
$$ 873 910 467 -21 729 938 681 -96 255 317 457 198 381 576 954 742 210 -61 439 1037 480 258
4735B58m30M83J63O7k33o8N2p0Q8k44j23K91M35n87n1K58J77j71l91m79K61J173
$$ 258 -172 311 474 541 308 240 292 222 310 66 -57 234 669 82 31 289 466 295 -96 -575 -314 859
4757H59k29n06j13j69N04po02l01P25L5j05m45j6J227n38n21j86J39O93L1l94
$$ 859 630 124 11 -158 346 339 -263 -564 161 196 91 -354 -370 857 319 -202 -388 -249 444 475 81
4778H1n07L62N60j47n37NJ96K9r9m97O15N38l9n25l83r7R20pn94n15O17K13J65
$$ 81 -426 -64 496 349 -188 -183 13 42 -57 -554 61 599 560 35 -348 -445 475 468 -126 -641 -24 189 354
4801C54l98n7Q5K19K8q93L76N14k9Qo53J91P00J34m72m28j6O14P3o8k05q7K82
$$ 354 -44 -101 -16 203 231 -662 -286 228 199 207 -446 -255 445 579 107 -321 -337 277 350 282 77 -10 272
4824B72l2n18J52J05J5K27n89j04L67R00n65p10M5M70K05k4o36k0O05L8n47j11
$$ 272 240 -278 -126 -21 -6 221 -368 -472 -105 795 230 -480 -435 35 240 216 -420 -440 165 203 -344 -455
4846d55J72N21n54l32j57N79M98J23j137mQ33L41n02n45jK15L11n3m16J07N59
$$ -455 -283 238 -316 -648 -805 -226 272 395 -742 -746 87 428 -74 -619 -620 -405 -94 -147 -563 -456 103
4867A03j70o25j24L94K89J51n31j52J36O88l26l44k10N04m3l4l81JO03j99k44
$$ 103 -67 -692 -816 -422 -133 18 -513 -665 -529 159 -167 -511 -721 -217 -260 -294 -675 -674 -71 -270 -514
4888e14L2K62mPm34O2K04J72K77j66o51k2M36k7k87J53L98j00q5k37J8N66k77
$$ -514 -482 -220 -224 -217 -651 -589 -385 -213 64 -102 -753 -775 -339 -366 -653 -500 -102 -202 -287 -524 -506 60 -217
4911b17k76n0k67O46N40l37o57K06O33p6k94o27M01M89j88j93k52M60M14l09l78
$$ -217 -493 -543 -810 -164 376 39 -618 -412 221 145 -149 -776 -375 114 -74 -267 -519 -59 355 46 -332
4932c32k2M97K17l71l33j12R54j68l36m71M92K41m13m80M21P55j99j25n80M82
$$ -332 -354 143 360 -11 -344 -456 498 330 -6 -477 15 256 -157 -637 -216 539 340 215 -365 117
4952A17O9K24n54l44M5M87K46l67o8K53L87m49j9j17L75K07n22j63K14J90K35
$$ 117 186 410 -144 -488 -443 44 290 -77 -145 108 495 46 27 -90 285 492 -30 -193 21 211 446
4973D46n73j04Q2J63L94j49k21L4K67l7k17k45L69j20K24j77n57O54L47j67m02
$$ 446 -127 -231 -149 14 408 259 38 72 339 302 85 -160 209 89 313 136 -421 233 580 413 11
4994A1l00P0N42j8k67l19M31L49n35m07L87K65J28q48M1J39O42q1k11j28K56M12
$$ 11 -289 -219 323 305 38 -281 150 499 -36 -443 -56 209 337 -511 -470 -331 311 230 19 -109 147 559
5016E59m01m27j72M27N93l36m51K86L89j4q19R8K82L56J30o17q3K64O03j96k58
$$ 559 158 -269 -441 -14 579 243 -208 78 467 453 -366 -268 14 370 500 -117 -200 64 667 471 213
5037B13k64K84J47l51j57K90L5K97j75j71J16K06Q6o94J26K91N11l17m05R7O5
$$ 213 -51 233 380 29 -128 162 197 494 319 148 264 470 556 -138 -12 279 790 473 68 165 230
5058B30J90N2k55q4j27M07J96o39R5N42N4k48n07N0M23M30n31l33K56N62l52l09
$$ 230 420 472 217 133 6 413 609 -30 65 607 661 413 -94 -44 379 809 278 -55 201 763 411 102
5080A02l14K94N98j58l10l24N66J46j06l53j84O88q5k57q40N26L14L64m14k88
$$ 102 -212 82 680 522 212 -112 454 600 494 141 -43 645 560 303 -537 -11 303 667 253 -35
5100c5Q5L53K03q03Rk2N45j49o11J03P49J6o40o22N60N31l0k48m29K16L97J19
$$ -35 50 403 606 -197 -188 -210 335 186 -425 -322 427 443 -197 -819 -259 272 242 -6 -435 -219 178 297
5122B97o02j1K36K71m70L5j57O51l7m40j4q4J06N6k87J31p7N13J42m03j16j81
$$ 297 -305 -316 -80 191 -279 -244 -401 250 213 -227 -241 -325 -219 -163 -450 -319 -396 117 259 -144 -260 -441
5144d41M47m05m8j35M25K26j38l60k21M62L23m28j12nJ57L23O6m96j82M64J20
$$ -441 6 -399 -447 -582 -157 69 -69 -429 -650 -188 135 -293 -405 -410 -253 70 136 -360 -542 -78 42
5165D2l44m92N65L4J25j74l93N04O48m50o35j96K11P33J09o70k82K78P02m10l04
$$ 42 -302 -794 -229 -195 -70 -244 -637 -133 515 65 -570 -766 -555 178 287 -383 -665 -387 315 -95 -399
5186c99J45L79k31m07k0P60L92k85n95l94O09K64k56m22L4K91L71r2n82O05r9
$$ -399 -254 125 -106 -513 -533 227 619 334 -261 -655 -46 218 -38 -460 -426 -135 236 144 -438 167 68
5207F8rl49j14N96l8M2p11M6L43J68K94l98k53m1O06n10K10j38K63m1j20O8l59
$$ 68 59 -290 -404 192 154 196 -515 -469 -126 42 336 -62 -315 -356 250 -260 -50 -188 75 34 -86 -18 -377
5230c77K97L8q4j05k56M00M86o40m48J45N19K8j46l81J04L16L7j35j24K72R6l30
$$ -377 -80 -42 -126 -231 -487 -87 399 -241 -689 -544 -25 3 -143 -524 -420 -104 -67 -202 -326 -54 42 -288
5252b88n64O64L20L06m53q29K90O97R9n40n26O90J91j39j76L6J33K05m14j18K60
$$ -288 -852 -188 132 438 -15 -844 -554 143 242 -298 -824 -134 57 -82 -258 -222 -89 116 -298 -416 -156
5273a56J51K90n72k19K69M39o1l00k58J63J35J62j13j64O47K44m55k52%K97l2
$$ -156 -5 285 -287 -506 -237 202 141 -159 -417 -254 -119 43 -70 -234 413 657 202 -50 -50 247 215
5294B15j40m86J82L80N9L27o42O6K02n0j59K2m7L66L66q24J44K38L17n47J33k04
$$ 215 75 -411 -229 151 210 537 -105 -39 163 113 -46 -24 -71 295 661 -163 -19 219 536 -11 122 -82
5316h2M44J91k12j66J2L52J68k58j98l04L62J83l17N0N9L89J72p40j47J32O12
$$ -82 362 553 341 175 187 539 707 449 251 -53 309 492 175 225 284 673 845 105 -42 90 702
5337G02k22p07M6O49J97l53n27L68M08J1k77l56J30N73k55k64l12M08N50k87o57
$$ 702 480 -227 -181 468 665 312 -215 153 561 572 295 -61 69 642 387 123 -189 219 769 482 -175
5358a75j01M42M23j90n54K33L82j55k77j32L82J2J19m84L6N20o1l1j69n32J29
$$ -175 -276 166 589 399 -155 78 460 305 28 -104 278 290 409 -75 -39 481 420 389 220 -312 -183
5379a83N41j14j43k60L52J66J7o02K01K08J67l31j29j0L99r8k7j00n26O52K92
$$ -183 358 244 101 -159 193 359 376 -226 -25 183 350 19 -110 -120 279 181 154 54 -472 180 472
5400D72n45l14L32M34K1m32k08K33K49k31o2o3N33n3j55m83l0O07M11q41j17L7
$$ 472 -73 -387 -55 379 400 -32 -240 -7 242 11 -51 -114 419 366 211 -272 -302 305 716 -125 -242 -205
5422b05M89o1l41L9J58M04j21o42K5M54L29n03o03M37L97J1j64k97p3O19j81l1
$$ -205 284 223 -118 -79 79 483 362 -280 -255 199 528 25 -578 -141 256 267 103 -194 -267 352 171 140
5444A40k28J14L49R9l35P2J56%j54m47K61J61K37j52n96O3J79K97J08n47j3K31
$$ 140 -88 26 375 474 139 211 367 367 213 -234 27 188 425 273 -323 -260 -81 216 324 -223 -236 -5
5466eJ37K90o71J76K56p6m59j39L64L71m31j77M8J68N18l08m71J17J6K87m14K53
$$ -5 132 422 -249 -73 183 107 -352 -491 -127 244 -187 -364 -316 -148 370 62 -409 -292 -276 11 -403 -150
5488a50k4N63j45m31J5l84O88O4r43j11L07O77R5q50M40J90j06k45k58L17Q5P
$$ -150 -174 389 244 -187 -172 -556 132 196 -747 -858 -551 126 221 -629 -189 1 -105 -350 -608 -291 -206 -199
5510a99o5j21R6L60k57m75j1L18K54l11O3k44M50M4l11J61k4k35L76k42M0M53
$$ -199 -264 -385 -289 71 -186 -661 -672 -354 -100 -411 -348 -592 -142 -98 -409 -248 -272 -507 -131 -373 -333 120
5532A20l1j69k43k23L40K66m44k16K89m7K53L13p87M46K43o8J85k32k5o1K35k25
$$ 120 89 -80 -323 -546 -206 60 -384 -600 -311 -358 -105 208 -579 -133 110 42 227 -5 -30 -91 144 -81
5554h1j95Q1J92J65j85n98L81M05L37n53k07O0N24m31K42k93K63M38n24K4j35
$$ -81 -276 -195 -3 162 -23 -621 -240 165 502 -51 -258 -198 326 -105 137 -156 107 545 21 45 -90
5575i0M59j3m70l64L01K14M14l58n14N81J40j60j82j04J54J73J0l98P5M99J0n51
$$ -90 369 356 -114 -478 -177 37 451 93 -421 160 300 140 -42 -146 8 181 191 -207 -132 367 377 -174
5597a74K9K00K22j95k46P5o1O66m8o49K42p0J55O6r7j4n4j08K31n52K93q8O44
$$ -174 -145 55 277 82 -164 -89 -150 516 468 -181 61 -9 146 212 115 101 47 -61 170 -382 -89 -177 467
5620D67m63M4l64J18N44j89Nj97J03J42n25o0M48J93k2l25j60J51J87J65n63j55
$$ 467 4 48 -316 -198 346 157 162 -35 68 210 -315 -375 73 266 244 -81 -241 -90 97 262 -301 -456
5642d56J36K56L93q54K58Q9K85j7l15j37L85L29o68N9L45K94l2k77k82M60J16
$$ -456 -320 -64 329 -525 -267 -178 107 90 -225 -362 23 352 -316 -257 88 382 350 73 -209 251 367
5663C67k94j30j61O59j3m45j30L47J14K52n50j8K16M61l59m14qL23N65n37j18
$$ 367 73 -57 -218 441 428 -17 -147 200 314 566 16 -2 214 675 316 -98 -106 217 782 245 127
5684A27j29Q0j25K75K4J14J44p1k34J7J7L03j19k26k49J68K03K81n09J15j66Q1
$$ 127 -2 78 -47 228 252 366 510 439 205 222 239 542 423 197 -52 116 319 600 91 206 40 121
5706A21K66l00J8j02M30l8k40j63L06j60N8Mo1n9O08n78J45p40N53L97l68l42
$$ 121 387 87 105 3 433 395 155 -8 298 138 196 200 139 80 688 110 255 -485 68 465 97 -245
5728b45J11M21k57j69K5p0P95k58n89J27M38R1l43p16J80O27m8l00m88J058l79
$$ -245 -134 287 30 -139 -114 -184 611 353 -236 -109 329 420 77 -639 -459 168 120 -180 -668 390 11
5749A1k81q0L25O2J92m48r9j51M57j24j93j84q1L37M10m06P6NJ64m3k76K14mJ02
$$ 11 -270 -350 -25 37 229 -219 -318 -469 -12 -136 -329 -513 -594 -257 153 -253 -177 -172 -8 -51 -327 -113 -117 -15
5773a5j78j35J29QJ31J05l44l33L72J04Rj56p9M13k29J18j6J03j98j48j7l6K49
$$ -15 -193 -328 -199 -191 -60 45 -299 -632 -260 -156 -147 -303 -382 31 -198 -80 -96 7 -191 -339 -356 -392 -143
5796a43J41O2r1l44K43K21j7l85l82N77M31j96l57O5L11K02n76j15R2P72l87n97
$$ -143 -2 60 -31 -375 -132 89 72 -313 -695 -118 313 117 -240 -175 136 338 -238 -353 -261 511 124 -473
5818d73j60O70M00J40q63k68Q75m07N06n19j53M42J74o42L35N0J51k07k48r8K72
$$ -473 -633 37 437 577 -286 -554 321 -86 420 -99 -252 190 364 -278 57 107 258 51 -197 -295 -23
5839b3M35q6p5m53J57J97J04k63l11L21K39k48r4J39k42K91n53J50L06K90l47
$$ -23 412 326 251 -202 -45 152 256 -7 -318 3 242 -6 -100 39 -203 88 -465 -315 -9 281 -66
5860f6q7q7j14K86J28o0k0L6l62M00o2m5j04M7J79o33K10J79L37k14l54j06O41
$$ -66 -153 -240 -354 -68 60 0 -20 16 -346 54 -8 -53 -157 -110 69 -564 -354 -175 162 -52 -406 -512 129
5883A29J02l98k38N4K61K44P2p01N30O2j70m05k8M92J67l22j55J03L55o9k99r2
$$ 129 231 -167 -405 -351 -90 154 226 -475 55 117 -53 -458 -486 6 173 -149 -304 -201 154 85 -214 -306
5905c06L7L89j01j58k80K73O55m44m49K73M23n3j56o68M61K46l6k90L3l9K88J24
$$ -306 -269 120 19 -139 -419 -146 509 65 -384 -111 312 259 103 -565 -104 142 106 -184 -151 -190 98 222
5927B22j17k48R3N13l21oj23K15k11K95l33j11K94J55k5m96K35j26L53K5k38J59
$$ 222 105 -143 -50 463 142 136 13 228 17 312 -21 -132 162 317 292 -204 31 -95 258 283 45 204
5949B04n8J61j84j14RM68j87k39j7J51J90K14q21J1K13N03k48M7l30L86J87l31
$$ 204 146 307 123 9 18 486 299 60 43 194 384 598 -223 -212 1 504 256 303 -27 359 546 215
5971B15j41m8K53o1l0k31L32R3k17j11m82L32K72P0k73j55N27l4k10k35k32Q37
$$ 215 74 26 279 218 188 -43 289 382 165 54 -428 -96 176 246 -27 -182 345 311 101 -134 -366 471
5993D71K8o81J44j47P35m45n3j98R2L20j6l16k04N69l18o2J05J44j55j6k01L0
$$ 471 499 -182 -38 -185 550 105 52 -146 -54 266 250 -66 -270 299 -19 -81 24 168 13 -3 -204 -174
6015a74j31M62L9k44J5j57L64k04j90k67N16n8O2K18n19J73J81l36n1k20N73J14
$$ -174 -305 157 196 -48 -33 -190 174 -30 -220 -487 29 -29 33 251 -268 -95 86 -250 -301 -521 52 166
6037A66l53j38MP53j05n00j67J79N2K97j39m64L21J63lr1j50K64K72n99J08j40
$$ 166 -187 -325 -321 432 327 -173 -340 -161 -109 188 49 -415 -94 69 66 -25 -175 89 361 -238 -130 -270
6059b70N41o8j52m68O62j18K79l16k53J95J59l47k0J89j8K25m57j82K01L6O15
$$ -270 271 203 51 -417 245 127 406 90 -163 32 191 -156 -176 13 -5 220 -237 -419 -218 -182 433
6080D33m58ol67Q61n17L8nj18J17J48k38l72L08L87J20o47M50n5n2j30k20r2L40
$$ 433 -25 -31 -398 463 -54 -16 -21 -139 -22 126 -112 -484 -176 211 331 -316 134 79 27 -103 -323 -415 -75
6103g5J93j56j09k40J06J48J31j51j60M03O5m54m0q2M38r1k5n9o4O13l53l97j11
$$ -75 118 -38 -147 -387 -281 -133 -2 -153 -313 90 155 -299 -339 -421 17 -74 -99 -158 -222 391 38 -359 -470
6126d70L62J66J06m85l0L51r5J5k15J51J44O2l17n3Q9K18l8p9l94M07K35j80j55
$$ -470 -108 58 164 -321 -351 0 -95 -80 -295 -144 0 62 -255 -308 -219 -1 -39 -118 -512 -105 130 -50 -205
6149b05k43M41L9j59k89L02p2N9m21K82K08J72k1l92m1M87j87q9L8qK7P0L7m70
$$ -205 -448 -7 32 -127 -416 -114 -186 -127 -548 -266 -58 114 93 -299 -340 147 -40 -129 -91 -99 -72 -2 35 -435
6173d35J01M96j59J10l00K06J83j63M9k19J38M5m1M51l24Q5k14j80L07l42J37
$$ -435 -334 162 3 113 -187 19 202 39 88 -131 7 52 11 462 138 223 9 -171 136 -206 -69
6194f9Q5J67k87k49N27j15j48l4j68O07K7l72l16L99K96M21p70K03l8J65k71J8
$$ -69 16 183 -104 -353 174 59 -89 -123 -291 316 343 -29 -345 54 350 771 1 204 166 331 60 78
6216G8l78N04L33n83J9j9L00k04m2k47L01PJ84n09K56Q5O6l45Q6j28L19J3j36
$$ 78 -300 204 537 -46 -27 -46 254 50 8 -239 62 69 253 -256 0 85 151 -194 -108 -236 83 96 -40
6239d0o3K5K37j62j54K23k26J44J68j03k61J11K01j80n3j76q7N58k77K9j51J47
$$ -40 -103 -78 159 -3 -157 66 -160 -16 152 49 -212 -101 100 -80 -133 -309 -396 162 -115 -86 -237 -90
6261i0N5J91l55o0L63R6j20j97j87M49P6l8j94K27j09J63o5k06J1L43l31j66j11
$$ -90 -35 156 -199 -259 104 200 80 -117 -304 145 221 183 -11 216 107 270 205 -1 10 353 22 -144 -255
6284b55N42P2k24n34J63K48L25P2m36p8K74o4k07R0j83O32k15l36K63k86P63j36
$$ -255 287 359 135 -399 -236 12 337 409 -27 -105 169 105 -102 -12 -195 437 222 -114 149 -137 626 490
6306D90m51L8J65K28k85k62J76R9n2j62k68O41j42l11pJ53R1J75j6q4k05L01p5
$$ 490 39 77 242 470 185 -77 99 198 146 -16 -284 357 215 -96 -103 50 141 316 300 216 11 312 237
6329B37O9l69K24j84L00m0m35N28k3j62r5Q1m7p2L39k26j20M4J87n2j64k2k36
$$ 237 306 -63 161 -23 277 237 -198 330 307 145 50 131 84 12 351 125 5 49 236 184 20 -2 -238
6352b38M80n66M35m55L90Q5l9k83K8K63L29j98n07M5L54K4j00k52J25K87k24j9
$$ -238 242 -324 111 -344 46 131 92 -191 -163 100 429 231 -276 -231 123 147 47 -205 -80 207 -17 -36
6374c6k04N3K82j01k15J9Q5K17m43j31J96L37K4k90j8L51P4k85K27k85JK16r5
$$ -36 -240 -187 95 -6 -221 -202 -117 100 -343 -474 -278 59 83 -207 -225 126 200 -85 142 -143 -142 74 -21
6397b1k87m3L91j0k70j50J71K52j90P8j20l0K22J24j28j50K67l21j81L27L7j60
$$ -21 -308 -351 40 30 -240 -390 -219 33 -157 -79 -199 -229 -7 117 -11 -161 106 -215 -396 -69 -32 -192
6419a92K55j7j22l07L76P6m1k16m8k4O06n18R4o0J24j21l0J69l71K60J22m1j25
$$ -192 63 46 -76 -383 -7 69 28 -188 -236 -260 346 -172 -78 -138 -14 -135 -165 4 -367 -107 15 -26 -151
6442a51J34N08n59l68L40J06K55K2k72l23L70L77n72o6N39m72L18l08O1K32K15
$$ -151 -17 491 -68 -436 -96 10 265 287 15 -308 62 439 -133 -199 340 -132 186 -122 -61 171 386
6463C86r4l12l56N00K55l48o60M16J34L29p4r3o1J84J4m48J36Q4L68j45k96j40
$$ 386 292 -20 -376 124 379 31 -629 -213 -79 250 176 83 22 206 220 -228 -92 -8 360 215 -81 -221
6485b21L81J72j28k35j06r2P4J08j0J64P1k19R4j98m1K24m7j21j08M6M5R0Q0k62
$$ -221 160 332 204 -31 -137 -229 -155 -47 -57 107 178 -41 53 -145 -186 38 -9 -130 -238 -192 -147 -57 23 -239
6509b39j35N24j43Lj75J71J71J87l45j63J58kN5k83j06L23L68n52j93J58K13L77
$$ -239 -374 150 7 10 -165 6 177 364 19 -144 14 12 67 -216 -322 1 369 -183 -376 -218 -5 372
6531C72k14k18L8o5N84q46n8N85P5k61k90Q5M15J05k64M2p9J67K65m38j69J47
$$ 372 158 -60 -22 -87 497 -349 -407 178 253 -8 -298 -213 202 307 43 85 6 173 438 0 -169 -22
6553b2L66p5l38N0K21J78l68K24j49J70o4j29k67K96R9J53j53J62k07j1k00L35
$$ -22 344 269 -69 -19 202 380 12 236 87 257 193 64 -203 93 192 345 192 354 147 136 -64 271
6575B71k02K45r4L8m17L76j6K23j51m13J71nM91j73r2j76K12P7l63j0J3J01Q8
$$ 271 69 314 220 258 -159 217 201 424 273 -140 31 26 517 344 252 76 288 365 2 -8 5 106 194
6598A94N0n0o5n2N4L12p14L45J03j73j92j02L90L00j74J5m22M48q5j08m16M76
$$ 194 244 194 129 77 131 443 -271 74 177 4 -188 -290 100 400 226 241 -181 267 182 74 -342 134
6620A34J95k21J15m95M88m23J62l6j55M50l38L97n15L58J15j00j45k97J02L2j4
$$ 134 329 108 223 -272 216 -207 -45 -81 -236 214 -124 273 -242 116 231 131 -14 -311 -209 -177 -191
6641a91J8P2QK32j26K4k06K40o6O2p0l69L03O9P8l68J84K60l61J18j7K7L65j86
$$ -191 -173 -101 -93 139 13 37 -169 71 5 67 -3 -372 -69 0 78 -290 -106 154 -207 -89 -106 -79 286 100
6665A00l32K18j72N9L61o9j13l07K49k54K81K83n08K63K3l06J90Q0J61k72p2J05
$$ 100 -232 -14 -186 -127 234 165 52 -255 -6 -260 21 304 -204 59 82 -224 -34 46 207 -65 -137 -32
6687c2J53K90l23j48Q1K62O3o02K00L81m9k79q8J07J62K70j57n6l54M79J2n61
$$ -32 121 411 88 -60 21 283 346 -256 -56 325 276 -3 -91 16 178 448 291 235 -119 360 372 -189
6709a89O0O0K27o4q7j61K57J36k94p0j00K01L48j53j19j72J50J61j78j99J20J31
$$ -189 -129 -69 158 94 7 -154 103 239 -55 -125 -225 -24 324 171 52 -120 30 191 13 -186 -66 65
6731F5k48M1K37j86M9LK76j41J08k26R3l37n6K25M2R2k82K82j17J71j66K9m39
$$ 65 -183 -142 95 -91 -42 -39 237 96 204 -22 71 -266 -322 -97 -55 37 -245 37 -80 91 -75 -46 -485
6754d85N52k75j09K42k40M57k28j1n16M62j86N99m83k3K28N5j6k3o62O97ln0m05
$$ -485 67 -208 -317 -75 -315 142 -86 -97 -613 -151 -337 262 -221 -244 -16 39 23 0 -662 35 32 -18 -423
6777d23K14J93K9l75J03p5P40l86k80Mo9N79n07l8k0M51j62M0kk81K31M2j64J42
$$ -423 -209 -16 13 -362 -259 -334 406 20 -260 -256 -325 254 -253 -291 -311 140 -22 18 16 -265 -34 8 -156 -14
6801a4J74R2l42j75J88K20Q7j97J62m36J16N3J85r6j07M0J94m25J58J5M58l16
$$ -14 160 252 -90 -265 -77 143 230 33 195 -241 -125 -72 113 17 -90 -50 144 -281 -123 -108 350 34
6823C4lj26p5L36R5l41m0k3L32q7o2J11j96K0r8l7O6K78O5p7m00L48K28j89q3
$$ 34 31 -95 -170 166 261 -80 -120 -143 189 102 40 151 -45 -25 -123 -160 -94 184 249 172 -228 120 348 159 76
6848G6j05j70M80Jl49l86N57J60k67k73J39J81M91n25j69l2J31L02n1j39l7L59
$$ 76 -29 -199 281 282 -67 -453 104 264 -3 -276 -137 44 535 10 -159 -191 -60 242 191 52 15 374
6870C74n01j91N09j59m9J54l18J72K88j88O0l20J01M97l50k02j1M0M5R3j52m2
$$ 374 -127 -318 191 32 -17 137 -181 -9 279 91 151 -169 -68 429 79 -123 -134 -94 -49 44 -108 -150
6892a50P0j56M78k2k03l95O32l32L6o1j68J04J1K55o38M30J82p6O8j00Rj08m9
$$ -150 -80 -236 242 220 17 -378 254 -78 -42 -103 -271 -167 -156 99 -539 -109 73 -3 65 -35 -26 -134 -183
6915a83R9jK44N0l04nK21k69L87o1n52O07J8k12j0l52M40J25J5n66K87K7P3j85
$$ -183 -84 -85 159 209 -95 -100 121 -148 239 178 -374 233 251 39 29 -323 117 242 257 -309 -22 5 78 -107
6939a07j00K85R5J06k76j99J09M36l49K3l0J93l85M41k82M6K90p2j32l95N33q8
$$ -107 -207 78 173 279 3 -196 -87 349 0 23 -7 186 -199 242 -40 6 296 224 92 -303 230 142
6961A42j9M6P0l62K28M0l17M15k17J93Kr3q2r3M4j08K52m50M35k09k5L2P2J01
$$ 142 123 169 239 -123 105 145 -172 243 26 219 221 128 46 -47 -3 -111 141 -309 126 -83 -108 -76 -4 97
6985I7m0J51n37K48J06k8m4l3j32L57k45P0j93J3M00m39Jl2L28K72l71k36J94
$$ 97 57 208 -329 -81 25 -3 -47 -80 -212 145 -100 -30 -223 -210 190 -249 -248 -280 48 320 -51 -287 -93
7008i3K32j06M1l91J43J41J28m78K67mJ08k05k14M22j1P7m7j65l89O56K46n48
$$ -93 139 33 74 -317 -174 -33 95 -383 -116 -120 -12 -217 -431 -9 -20 57 10 -155 -544 112 358 -190
7030a90j97P6L46J1j45n7J32l8K15j83O0k84M47n32K27K00J2n6k29J25q1J09M08
$$ -190 -387 -311 35 46 -99 -156 -24 -62 153 -30 30 -254 193 -339 -112 88 100 44 -185 -60 -141 -32 376
7053C76l48j10k14N43j87o0K3m1M6M5j46Q7j84N73j51k17k08O74l06K4j37l03
$$ 376 28 -82 -296 247 60 0 23 -18 28 73 -73 14 -170 403 252 35 -173 501 195 219 82 -221
7075b21L47J84k21k40L76J2N6j66QO6M6K11k20j42j03J84k65N9m66N04K13o6l99
$$ -221 126 310 89 -151 225 237 293 127 135 201 247 458 238 96 -7 177 -88 -29 -495 9 222 156 -243
7098b43L84lL3n2m53N74l28L16k07j16K69j34K78n01L7K04k7q4j6J3L05j49o3
$$ -243 141 138 171 119 -334 240 -88 228 21 -95 174 40 318 -183 -146 58 31 -53 -69 -56 249 100 37
7121C7k48K59m1K64m82K19m84N20K9nq0lr6k38M51M5Pl07K67k47L9J92k71K22
$$ 37 -211 48 7 271 -211 8 -476 44 73 68 -12 -15 -111 -349 102 147 154 -153 114 -133 -94 98 -173 49
7145D9m6L4k56J44K89m84J21N0K35k81M6k50L86j85J79k18J9L88k38n6L74o2k84
$$ 49 3 37 -219 -75 214 -270 -149 -99 136 -145 -99 -349 37 -148 31 -187 -168 220 -18 -74 300 238 -46
7168d6r1j2J98O9K02o06J02K62k46K39O1k97P4K45J03k44j86M68L2o85K0J12L23
$$ -46 -137 -149 49 118 320 -286 -184 78 -168 71 132 -165 -91 154 257 13 -173 295 327 -358 -338 -226 97
7191I7J93j80J29k0p3oo0k00O0k00K54Q8J4K92k54J01k06J42O5j00J03k57K77
$$ 97 290 110 239 219 146 140 80 -120 -60 -260 -6 82 96 388 134 235 29 171 236 136 239 -18 259
7214B59m5j0O9j58j01M89l81K2k1pK4k00K52l35J44J45j1l08P9j34M80ol23L66
$$ 259 214 204 273 115 14 503 122 144 123 116 140 -60 192 -143 1 146 135 -173 -94 -228 252 246 -77 289
7238B89j13n1kN3r0m5k85J16j02M24j16j99q9k4J95K26p8k30n7J32K73k53j60
$$ 289 176 125 123 176 86 41 -244 -128 -230 194 78 -121 -210 -234 -39 187 109 -121 -178 -46 227 -26 -186
7261a86K03R9j5l96q3L74k43R9j93O3L73j36n5J09q2k14K36n0k73L40j8l9J19
$$ -186 17 116 101 -295 -378 -4 -247 -148 -341 -278 95 -41 -96 13 -69 -283 -47 -97 -370 -30 -48 -87 32
7284C2k76J36J18j88Nj85K95J18k17j52K08j88K90K0k44K93m2R7p3P3j75k8J89
$$ 32 -244 -108 10 -178 -173 -358 -63 55 -162 -314 -106 -294 -4 16 -228 65 23 120 47 120 -55 -83 106
7307A06m23J14M49k75J58j76lq2N6L5j8j05L50m1k09J88j30k4J11m5k21MP2K49
$$ 106 -317 -203 246 -29 129 -47 -50 -132 -76 -41 -59 -164 186 145 -64 124 -6 -30 81 36 -185 -181 -109 140
7331A40J55l45j15K62J30m8j13Qm9J89m27J14L17J23l20o2o2J58J4P8l27J33J55
$$ 140 295 -50 -165 97 227 179 66 74 25 214 -213 -99 218 341 21 -41 -103 55 69 147 -180 -47 108
7354A08j13o5p5K23j35p1M4R4m2J20l5q0q0K77j35j42n6J46mP9O2n76K79j12K2
$$ 108 -5 -70 -145 78 -57 -128 -84 10 -32 88 53 -27 -107 170 35 -107 -163 -17 -21 58 120 -456 -177 -289 -267
7379b67K38N7k40Q1j92K86k10K71l4O4k59q6J98o3qk2K28K5j74j41J39K2K17%
$$ -267 -29 28 -212 -131 -323 -37 -247 24 -10 54 -205 -291 -93 -156 -164 -186 42 67 -107 -248 -109 -87 130 130
7403A30k84O2k01M18k09Q7k30K53K12k65j93j52O82k90j39R9J04J8k1k98M9L09
$$ 130 -154 -92 -293 125 -84 3 -227 26 238 -27 -220 -372 310 20 -119 -20 84 102 81 -217 -168 141
7425A41m03K91j1K2N8j16O6j83r0K43K34p6P6m02L27J64r4l92L53J49k01k27K3
$$ 141 -262 29 18 40 98 -18 48 -135 -225 18 252 176 252 -150 177 341 247 -145 208 357 156 -71 -48
7448d8j31J19J3J96j10p4j4L02P3l31Q3J9J6J4K3q9J24l64L67JK25j01l11J02
$$ -48 -179 -60 -47 149 39 -35 -49 253 326 -5 78 97 113 127 150 61 185 -179 188 189 414 313 2 104
7472A04k13J60J1j78J19k59N76j23q7j99J80L29k18m58K62K4l2L08l26K15q8J33
$$ 104 -109 51 62 -116 3 -256 320 197 110 -89 91 420 202 -256 6 30 -2 306 -20 195 107 240
7494B40k21J52k65q9M39k72j10j17O49q11M55n76L72K20r2l32Q5L54k81n9R1J23
$$ 240 19 171 -94 -183 256 -16 -126 -243 406 -405 50 -526 -154 66 -26 -358 -273 81 -200 -259 -168 -45
7516d5j2J45l03M10j03M0j7j33k9Q7J55j0j11k56N77m03L80n56J64J50r6k08K91
$$ -45 -57 88 -215 195 92 132 115 -18 -47 40 195 185 74 -182 395 -8 372 -184 -20 130 34 -174 117
7539A17m35L48J12j15l6q5j15L30q9l46K15L21m09m0R2L63J33j34m58n6M48k31
$$ 117 -318 30 142 27 -9 -94 -209 121 32 -314 -99 222 -187 -227 -135 228 361 227 -231 -287 161 -70
7561g0k4K63r8K95l8k86j95R4J2J07L24n50M24k55N0J89l22N17k56p9J41r9j48
$$ -70 -94 169 71 366 328 42 -153 -59 -47 60 384 -166 258 3 53 242 -80 437 181 102 243 144 -4
7584dK20pk71J02L59l79j08l30M87L75k22m85M32j91J46K72k32j68L04m46K03
$$ -4 216 209 -62 40 399 20 -88 -418 69 444 222 -263 169 -22 124 396 164 -4 300 -146 57
7605E7O0k40N13l46P1k97R2L22K12m92j4P3M4l49J82M0j04p5K35J38m74P06j70
$$ 57 117 -123 390 44 115 -182 -90 232 444 -48 -62 11 55 -294 -112 -72 -176 -251 -16 122 -352 354 184
7628A84j78r3j2P6P9q0k94K29k2r6L54j52q7L8L2J77n78M32L91o68j07J02K52
$$ 184 6 -87 -99 -23 56 -24 -318 -89 -111 -207 147 -5 -92 -54 -22 155 -423 9 400 -268 -375 -273 -21
7651b1J77o1o15N89K19k13%n88N3M94R1k20j65J12J36j27K46k75O4P2L6p1J56
$$ -21 156 95 -520 69 288 75 75 -513 -460 34 125 -95 -260 -148 -12 -139 107 -168 -104 -32 4 -67 89
7674H9o1k22O2k28M12k97J70J66j06q6L8K2J57j70K74j35k17K62k93K04M2j77
$$ 89 28 -194 -132 -360 52 -245 -75 91 -15 -101 -63 -41 116 -54 220 85 -132 130 -163 41 83 -94
7696i4n5j10J49K12L6R5r8J26l3l71J63K51k14j9j2j34J83K06r4J2l97J78K11
$$ -94 -149 -259 -110 102 138 233 135 261 228 -143 20 271 57 38 26 -108 75 281 187 199 -198 -20 191
7719A91k27J51Nl15K79j13L26j82K01k42L2O1k35L23J31l64j08L01j56k66K80
$$ 191 -36 115 120 -195 84 -29 297 115 316 74 106 167 -68 255 386 22 -86 215 59 -207 73
7740G3j07R2l2J39n5j19J77k76J1p0P2K69k42j25J92Q5O6k53J53l89O07n83L34
$$ 73 -34 58 26 165 110 -9 168 -108 -97 -167 -95 174 -68 -193 -1 84 150 -103 50 -339 268 -315 19
7763A9Q1l31K51j01j28J77J32l22K78l40K51N4J38l46N79m99k55L64j00p1K41
$$ 19 100 -231 20 -81 -209 -32 100 -222 56 -284 -33 21 159 -187 392 -107 -362 2 -98 -169 72
7784G2j05R8j33J63k44K9K71N3j97k8K12j38n2l71L69P5Nj94L4K78p6r9O4n64
$$ 72 -33 65 -68 95 -149 -120 151 204 7 -21 191 53 1 -370 -1 74 79 -115 -81 197 121 22 86 -478
7808d78P76m24J88j46P7K05J74l18m15K65K36j50pJ16j15J32k43K04O7Q4j9n87
$$ -478 298 -126 62 -84 -7 198 372 54 -361 -96 140 -10 -17 99 -16 116 -127 77 144 228 209 -378
7830c78L40J51j64L92n17O2L54j66q7J05j99J20j36L80k54Q2J60p8L6k98J29o
$$ -378 -38 113 -51 341 -176 -114 240 74 -13 92 -107 13 -123 257 3 85 245 167 203 -95 34 28
7852B8K05n0k97J55R7l6r2P4k0j10L19qj71j15K06L8k37r7J02o1J11j13n9J29
$$ 28 233 183 -114 41 138 102 10 84 64 -46 273 265 94 -21 185 223 -14 -111 -9 -70 41 -72 -131 -2
7876bJ13q5rk44J86L13l61J42k14K42q7q3j22J4L29k97K52m20K90J64J9o26J28
$$ -2 111 26 17 -227 -41 272 -89 53 -161 81 -6 -89 -211 -197 132 -165 87 -333 -43 121 140 -486 -358
7899c58K95K23m23J69J35JJ3m95J40j00M52Q4k45m9J59J82N6l14j26N7J5J45j79
$$ -358 -63 160 -263 -94 41 42 55 -440 -300 -400 52 136 -109 -158 1 183 239 -75 -201 -144 -129 16 -163
7922a63J34L8O7K32n37L23Nk91L32l53L23k76J45n0q2J60j80J25m5J0K15j50Q4
$$ -163 -29 9 76 308 -229 94 99 -192 140 -213 110 -166 -21 -71 -153 7 -173 -48 -93 -83 132 -18 66
7945F6J7j98l6O0Q7j65k25L63J98k97K1R5pK70l95M05k15N9K18j66ll0k74J99
$$ 66 83 -115 -151 -91 -4 -169 -394 -31 167 -130 -109 -14 -21 249 -146 259 44 103 321 155 152 122 -152 47
7969D7J87l15K93o4r1k70J58L19j75rk51q1L80j87J0J73Kmr3m23O11k96J22p1
$$ 47 234 -81 212 148 57 -213 -55 264 89 80 -171 -252 128 -59 -49 124 126 122 29 -394 217 -79 43 -28
7993b8j87m0L50j55Q8J6k73L4J99j00N0J76j36j76k83M73p1n8mj3K05K4j69J57
$$ -28 -215 -255 95 -60 28 44 -229 -195 4 -96 -46 130 -6 -182 -465 8 -63 -121 -125 -138 67 91 -78 79
8017G9k10L47l43J1L55l37j26K7K42MJ46m53J96j0m5j39K08j89K15m04J47O16
$$ 79 -131 216 -127 -116 239 -98 -224 -197 45 49 195 -258 -62 -72 -117 -256 -48 -237 -22 -426 -279 337
8039C37l55p0L3r4K46J15m10K97l28P2J80k65K07J62QJ49j53k92L77j50l0P0j38
$$ 337 -18 -88 -55 -149 97 212 -198 99 -229 -157 23 -242 -35 127 135 284 131 -161 216 66 36 106 -32
8062c2J85j92Q2r8j7Q5K66l87j69L96j1k8j16J57k08m5N50k12p5j74J33R4k71
$$ -32 153 -39 43 -55 -72 13 279 -108 -277 119 108 80 -36 121 -87 -132 418 206 131 -43 90 184 -87
8085h7M86m30j03M33j83k0L2m0J14m23M45k05L6p9n9m8L02kO4m8Oj19l6J32k85
$$ -87 399 -31 -134 299 116 96 128 88 202 -221 224 19 55 -24 -83 -131 171 169 233 185 191 72 36 168 -117
8110a17J01q3l48K53K45K1P3K0k8o6J41p4r9L9%Q9K7m39J27RJ89O7k04jj25L09
$$ -117 -16 -99 -447 -194 51 72 145 165 137 71 212 138 39 78 78 167 194 -245 -118 -109 80 147 -57 -58 -183 126
8136A26j93L4J32m34N17k38l24P36m62k6l6K61j57J52M6p5j57L1J58J0l86L60
$$ 126 -67 -33 99 -335 182 -56 -380 356 -106 -132 -168 93 -64 88 134 59 -98 -67 91 101 -285 75
8158G5J09k46j81P8J19P4r3J09mj89K66q8k09J23K50n57L80P2j65J56Q1J3l9o0
$$ 75 184 -62 -243 -165 -46 28 -65 44 40 -149 117 29 -180 -57 193 -364 16 88 -77 79 160 173 134 74
8182G4R6n7K5k30M49m28j26J20K52
$$ 74 170 113 138 -92 357 -71 -197 -77 175
8191A75
$$ Imaginary data points
##PAGE= N=2
##DATA TABLE= (X++(I..I)), XYDATA
0@%%%%%%%%%%%Nj3J6j6J6j7K2k9L2l7M5n3O1o9Q0r2J03j16J32j49J67j89K13k37
$$ 0 0 0 0 0 0 0 0 0 0 0 0 5 -8 8 -8 8 -9 13 -16 16 -21 24 -29 32 -37 43 -49 54 -62 70 -79 88 -101 112 -125
35a25K64k94L27l62M00m44M92n44O02o66P38q21R16j023J147j295J471j686J958
$$ -125 139 -155 172 -190 210 -234 258 -286 316 -350 388 -433 483 -540 607 -688 783 -903 1055
54A055k310K790l491M608o672J1753m4186j00221L8818N0114P791k6980J0735
$$ 1055 -1255 1535 -1956 2652 -4020 7733 -36453 -136674 -97856 -47742 -39951 -66931 -56196
67e6196L0295P963k9466k4089l204M080j0897j4119L965L2641L6060M838l5933
$$ -56196 -25901 -17938 -47404 -71493 -74697 -70617 -81514 -95633 -91668 -59027 -22967 -18129 -54062
80e4062l8571n326K0328Q525j3359r646J6882K6992N990j7905j2863M261k158
$$ -54062 -92633 -97959 -77631 -69106 -82465 -92111 -75229 -48237 -42247 -60152 -73015 -68754 -70912
93g0912k3164j7651K0859M3863J8898j8749k2741M096J6261m422k5220j5077R685
$$ -70912 -94076 -111727 -90868 -47005 -28107 -46856 -69597 -65501 -49240 -53662 -78882 -93959 -84274
106h4274J9632J5425Q102Q29m804n780p655j4874j1256J2747K9285R718j8726
$$ -84274 -64642 -49217 -41115 -40286 -45090 -50870 -58525 -73399 -84655 -71908 -42623 -32905 -51631
119e1631p322K9877K6946k3809m7486j0387L0711K1683p266n701J8279J9671p038
$$ -51631 -58953 -29076 -2130 -25939 -73425 -83812 -53101 -31418 -38684 -44385 -26106 -6435 -13473
132a3473k5244j0702J4959J3375j2139k1530M744L4114K7147q884k9949j3066
$$ -13473 -38717 -49419 -34460 -21085 -33224 -54754 -50010 -15896 11251 2367 -27582 -40648
144d0648J3801J2219p528j1268Q160K1622P430j4217j0638J2919J7396j1465l1673
$$ -40648 -26847 -14628 -22156 -33424 -25264 -3642 3788 -10429 -21067 -8148 9248 -2217 -33890
157c3890q331L0531L0309m393k2842l701J8210M601j8066j4207R905J5229j555
$$ -33890 -42221 -11690 18619 14226 -8616 -12317 5893 10494 -7572 -21779 -11874 3355 1800
170A800p404N761J4716P145p704j5755j1341L513J4214Q657p815q384R798J7363
$$ 1800 -5604 157 14873 22018 14314 -1441 -12782 -9269 4945 13602 5787 -2597 7201 24564
184B4564j192j9410j1006R601R327p862j0088P869J9165Q116j2533j4674K813
$$ 24564 23372 3962 -7044 2557 11884 4022 -6066 1803 20968 29084 16551 1877 4690
197D690J3887J548j6538j1032J1153J9332L670j3813r213Q007J0844n062j6069
$$ 4690 18577 20125 3587 -7445 3708 23040 26710 12897 3684 11691 22535 17473 1404
210A404m890J3691J3467n214j4925J46J8996R811j8037k2564N590K4976O288k0526
$$ 1404 -3486 10205 23672 18458 3533 3679 22675 32486 14449 -8115 -2525 22451 28739 8213
224H213j1614J7221K0419q368k3765k629J7604P291j4240j2634Q792J8304N389
$$ 8213 -3401 13820 34239 25871 2106 -523 17081 24372 10132 -2502 6290 24594 29983
237B9983j1117j1850L518J1565P26j4185r178J0651J7255J668j3828o273J1178
$$ 29983 18866 7016 10534 22099 22825 8640 -538 10113 27368 29036 15208 8935 20113
250B0113J0690q550j7352l255J2995J0384m363p940M497J2836J985j5439j3816
$$ 20113 30803 22253 4901 1646 14641 25025 20662 12722 17219 30055 32040 16601 2785
263B785N306J4407K165j1396n693J0085J4418J015j2157j1004M30O269N01o025
$$ 2785 8091 22498 24663 13267 7574 17659 32077 33092 20935 9931 10361 16630 17131 11106
277A1106q61J1381J2108m606j7249n326J4495R512j5561j9985M732K5079J2458
$$ 11106 10245 21626 33734 29128 11879 6553 21048 30560 14999 -4986 -254 24825 37283
290C7283j2660j4323L934R795n364j6645m116J4146J2770m240j2809O71J6569
$$ 37283 24623 10300 14234 24029 18665 2020 -2096 12050 24820 20580 7771 8442 25011
303B5011Q140j6562k4479k465J8903J3331o937j0163N020J3527J07j6777j1219
$$ 25011 33151 16589 -7890 -10355 8548 21879 14942 4779 9799 23326 23433 6656 -4563
316d563O015R167m546j1950L369K0847J4057j2079k4085o409J3416P878r668j0778
$$ -4563 1452 10619 6073 -5877 -2508 18339 32396 20317 -3768 -10177 3239 11117 1449 -9329
330i329O112J5681N570p100o566K77q0p744j1184J41J4036J5724N43j3691j0118
$$ -9329 -3217 12464 18034 10934 4368 4645 4565 -3179 -14363 -14222 -186 15538 16081 2390 -7728
345g728P138J1341o540j9412p977J2582J6034K124n432K05N531m206j5853j0681
$$ -7728 -590 10751 4211 -15201 -23178 -10596 5438 7562 2130 2335 7866 3660 -12193 -22874
359b2874P975J6177K966j1148p054J1558J7983k020k2256j7202M642J3677L965
$$ -22874 -14899 1278 4244 -6904 -13958 -2400 15583 13563 -8693 -25895 -21253 -7576 -3611
372c611m602K580J1218M416j1586j4623P33J1943J500j4857r700J3797K5335O406
$$ -3611 -8213 -5633 5585 10001 -1585 -16208 -15475 -3532 -2032 -16889 -26589 -12792 12543 18949
386A8949j8679j8525K081R176k216j0332J489J4173Q216o495p943L999Q138m105
$$ 18949 270 -18255 -16174 -6998 -9214 -19546 -18057 -3884 4332 -2163 -10106 -6107 2031 -2074
400b074j8031j1766Q274K0497J0725p057j1626K39Q267p17j2261p868N033Q354
$$ -2074 -20105 -31871 -23597 -3100 7625 568 -11058 -10819 -2552 -3269 -15530 -23398 -18365 -10011
414a0011N37j999N232J0157R89j4589j6908j215J3637J0008m323r140J887J2664
$$ -10011 -9474 -11473 -6241 3916 4905 -9684 -26592 -27807 -14170 -4162 -8485 -17625 -15738 -3074
428c074P484q174j3078l512L461P38l355L086J1700R551n845j5142o784Q710R444
$$ -3074 4410 -3764 -16842 -20354 -16893 -16155 -19510 -16424 -4724 4827 -1018 -16160 -22944 -14234 -4790
443d790n946j5023k356J6587J6497k375j3807m239N659j092j0823m015J2073J3442
$$ -4790 -10736 -25759 -28115 -11528 4969 2594 -11213 -15452 -9793 -10885 -21708 -25723 -13650 -208
457b08k113j1774j975J1560Q604r548j8022n904J2894J4046J26o791L41P497M23
$$ -208 -2321 -14095 -16070 -4510 4094 -5454 -23476 -29380 -16486 -2440 -2314 -9105 -8764 -1267 -844
472h44j0817q086N426R391k206q793M15J3943J1546n092j5723q230O165Q252j123
$$ -844 -11661 -19747 -14321 -4930 -7136 -15929 -15514 -1571 9975 4883 -10840 -19070 -12905 -4653 -5776
487e776n943J533R594N394m816o344J220M516l363r576k001J0066J2497K425q432
$$ -5776 -11719 -10186 -592 4802 -14 -6358 -5138 -622 -3985 -13561 -15562 -5496 7001 9426 994
502I94p353K030P457n03r325n963O481J0786K548n406j483O483K262r984j0647
$$ 994 -6359 -4329 3128 2625 -6700 -12663 -6182 4604 7152 1746 263 6746 9008 -976 -11623
517a1623L034J2470N887p042p203N240J1997J625j2331j1261L780J0080J357p208
$$ -11623 -8589 3881 9768 2726 -4477 763 12760 14385 2054 -9207 -5427 4653 6010 -1198
531a198k99J1136Q028p854j3114o94J0642L696j0299q307O864J5255M489j0167
$$ -1198 -1497 9639 17667 9813 -3301 -3995 6647 10343 44 -8263 -1399 13856 18345 8178
545H178r493L451Q269k474j1311k724J1180J0254l126r092R77R219J747j1363
$$ 8178 -1315 2136 10405 7931 -3380 -6104 5076 15330 12204 3112 4089 13308 15055 3692
559C692r995L850J1006M073n148m129M363P119j349j0030p037M029P993J067n327
$$ 3692 -6303 -2453 8553 12626 7478 3349 7712 14831 13482 3452 -3585 444 8437 9504 4177
574D177j61Q766N849n288j0425k929N358M033l526n351L507J0519N707o358j0473
$$ 4177 4016 12782 18631 13343 2918 -11 5347 9380 5854 503 4010 14529 20236 13878 3405
589C405j917P208K819o942o128O182J1796L445q263o510M459N007m905j0805j161
$$ 3405 1488 8696 11515 4573 -1555 4627 16423 19868 11605 5095 9554 14561 9656 -1149 -2310
604b310J1832J0507l338j0501j342J0178M482j0740j2659K415J3276N167p090
$$ -2310 9522 20029 16691 6190 4848 15026 19508 8768 -3891 -1476 11800 16967 9877
617I877m389Q027Q061o398j3709l739R963Q026n381q334K528J2955O471q710j3321
$$ 9877 5488 13515 21576 15178 1469 -2270 7693 15719 10338 2004 4532 17487 23958 15248 1927
632A927j596P999L082o217l044P910R134k044r462m066N954L720p142r475Q26
$$ 1927 331 8330 11412 5195 2151 10061 19195 17151 7689 3623 9577 13297 6155 -3320 -2494
647b494J1324R321k282q911m071L871K370n298n978J556P167L003l314j933L951
$$ -2494 8830 18151 15869 6958 2887 6758 9128 3830 -2148 -592 6575 9578 6264 4331 8282
662H282L622l820j1424o272N463J0561L227o435n986M203Q184j593j0315o690
$$ 8282 11904 8084 -3340 -9612 -4149 6412 9639 3204 -2782 1421 9605 8012 -2303 -8993
676h993M527N449k102l757M174R722J107j2036j0336K564J0421J383r480p010
$$ -8993 -4466 983 -1119 -4876 -702 9020 10127 -1909 -12245 -9681 740 2123 -7357 -14367
690a4367P014J2763J970j0189p753L273L698n444o762M128J2415L787r574q690
$$ -14367 -7353 5410 7380 -2809 -10562 -7289 -3591 -9035 -15797 -11669 746 4533 -5041 -13731
704a3731M586R883q82j3268r095O181J2019M026n828l523L781K267o135p799J812
$$ -13731 -9145 738 -144 -13412 -22507 -16326 -4307 -281 -6109 -9632 -5851 -3584 -9719 -17518 -15706
719a5706Q499K352o899m100O714R914O33j0533r817J82P431M285k434k164K852
$$ -15706 -7207 -4855 -11754 -15854 -9140 774 1407 -9126 -18943 -18761 -11330 -7045 -9479 -11643 -8791
734h791L940l32m775k388K962J069n028m786L831J0481O395m609r514l463M905
$$ -8791 -4851 -5183 -9958 -12346 -9384 -8315 -13343 -18129 -14298 -3817 2578 -2031 -11545 -15008 -10103
749a0103M823k838n993p38P102N788j439l849J290K799l475r011k226R838J0511
$$ -10103 -5280 -8118 -14111 -14849 -7747 -1959 -3398 -7247 -5957 -3158 -6633 -15644 -17870 -8032 2479
764B479k119r182k286P602P220m960j0929l575P071O489j380l217M467P394k929
$$ 2479 360 -8822 -11108 -3506 3714 -1246 -12175 -15750 -8679 -2190 -3570 -6787 -2320 5074 2145
779B145j1185n046Q418Q512l773j0282m47J1848R111l978j0799l499M967K409
$$ 2145 -9040 -14086 -5668 2844 -929 -11211 -11658 190 9301 5323 -5476 -8975 -4008 -1599
793a599l881k853N626P785n02p795l120O677N806o183j0414j926R843Q846l72
$$ -1599 -5480 -8333 -2707 5078 4576 -3219 -6339 338 6144 -39 -10453 -12379 -2536 6310 5938
808E938o084k218L211J539m062m336J480M236J911k856j206M761O241k206r349
$$ 5938 -146 -2364 847 2386 -1676 -6012 -4532 -296 1615 -1241 -2447 2314 8555 6349 -3000
823c000o561L265Q026K125l518k752L157N467K5o285m313K042K825j857l276K528
$$ -3000 -9561 -6296 1730 3855 337 -2415 742 6209 6234 -51 -4364 -2322 503 -1354 -4630 -2102
839b102Q865M651p056q798l0P399K521p177n645M498J0102L793o193n657K529
$$ -2102 6763 11414 4358 -4440 -4470 2929 5450 -1727 -7372 -2874 7228 11021 4828 -829 1700
854A700M430l962q364m2J0115P565m683q242J964R541J586j0518r336M032R954
$$ 1700 6130 2168 -6196 -6238 3877 11442 6759 -1483 481 10022 11608 1090 -8246 -4214 5740
869E740L010n045k552N755N384m245q941k909O800M902m084n222L777J0033L084
$$ 5740 8750 3705 1153 6908 12292 8047 -894 -3803 2997 7899 3815 -1407 2370 12403 15487
884A5487q003q551N36N889J036m476j723N460O730K27n446m063K073K076k794
$$ 15487 7484 -1067 -531 5358 6394 1918 195 5655 12385 12612 7166 3103 5176 7252 4458
899D458n472O66P330O836j551o267j827L797J248m975n666J027P150M953j664
$$ 4458 -1014 -348 6982 13818 12267 6000 4173 7970 9218 4243 -1423 -396 6754 11707 10043
914A0043m226J68M264n68p207n555L200P901J789m852j464N181N893m615j1008
$$ 10043 5817 5985 10249 9681 2474 -3081 119 8020 9809 4957 3493 8674 14567 9952 -1056
929a056k757O263O310k652n379K034Q335L174p446q197R30O196k05o531j858Q823
$$ -1056 -3813 2450 8760 6108 729 2763 11098 14272 6826 -1371 -441 5755 5550 -981 -2839 5984
945E984Q011k452j0321l473O185L878n468p317J868Q682M587l657n033M94M110
$$ 5984 13995 11543 1222 -2251 3934 7812 2344 -4973 -3105 5577 10164 6507 1474 1968 6078
960F078j989p792k736O272P333j034n618r79N245L064n057p720k018N152N075
$$ 6078 4089 -3703 -6439 -167 7166 6132 514 -465 4780 7844 2787 -4933 -6951 -1799 3276
975C276l08k073Q07K950P49n153m889Q10M079O61l674m66M745O285m32p730o009
$$ 3276 2968 895 1702 4652 5401 248 -4641 -3831 248 909 -2765 -3231 1514 7799 7367 -363 -6372
992f372J563M793O15l867j092M360M974m62n840j835L014N37n285m980M606R413
$$ -6372 -4809 -16 599 -3268 -4360 0 4974 4512 -1328 -3163 -149 388 -4897 -9877 -5271 4142
1008D142K961o207o806K152N605j24p238m356M412O646M79l800j06M504P16p327
$$ 4142 7103 896 -5910 -3758 1847 1723 -5515 -9871 -5459 1187 1666 -2134 -2240 2264 2980 -4347
1024d347p584K617R156L175n925m939M125P387j20p663n983K012M249m32k279
$$ -4347 -11931 -9314 -158 3017 -2908 -7847 -3722 3665 3545 -4118 -10101 -8089 -3840 -4272 -6551
1039f551J837N430J814m910p015R73N509J111n872m459L930Q108K590m160n368
$$ -6551 -4714 716 2530 -2380 -9395 -8422 -2913 -1802 -7674 -12133 -8203 -95 2495 -1665 -7033
1054g033n62J699p48k257l43M200K929j251l326J4M128J587n485p133l2P363N905
$$ -7033 -7595 -5896 -6644 -8901 -9244 -5044 -2115 -3366 -6692 -6678 -2550 -963 -6448 -13581 -13613 -6250 -345
1071c45j118n325p25L606J606l668l945R42L752J05k608k30N244N567m080r327
$$ -345 -1463 -6788 -7513 -3907 -2301 -5969 -9914 -8972 -5220 -5115 -7723 -7953 -2709 2858 -1222 -10549
1087a0549l192O167O723j844o323r4O397M369l189n227m67L606o80m706j062P161
$$ -10549 -13741 -7574 -851 -2695 -9018 -9112 -2715 1654 -1535 -6762 -7229 -3623 -4303 -9009 -10071 -2910
1103b910P055j857q279l275O062N314l399p602n67O397N175j120l433R53K650
$$ -2910 4145 2288 -5991 -9266 -3204 2110 -1289 -8891 -9458 -3061 2114 994 -2439 -1486 1164
1118A164j230n336k432M976N485l52n314j536N146N571j923p593l464L534M297
$$ 1164 -66 -5402 -7834 -2858 2627 2275 -3039 -4575 571 6142 4219 -3374 -6838 -3304 993
1133I93M13k072N41L148J562l173l716J368L369J59m020k973M340P204J946o138
$$ 993 1406 -666 -125 3023 4585 1412 -2304 -936 2433 2592 -1428 -4401 -61 7143 9089 2951
1149B951n524J108M651O94m062k103M002M521j35m192q24L891J339n315o090K343
$$ 2951 -2573 -1465 3186 3880 -182 -2285 1717 6238 6103 1911 1087 4978 6317 1002 -5088 -2745
1165b745Q503M106n051n854J804O572N28o640n046L184N453n1l589K63N465K530
$$ -2745 5758 9864 4813 -1041 763 7335 7863 1223 -3823 -639 4814 4763 1174 1437 6902 9432
1181I432m921p501M44O537L225m528n336L100P529J920n468n537J071L891r88
$$ 9432 4511 -2990 -2546 3991 7216 2688 -2648 452 7981 9901 4433 -1104 -33 3858 2870
1196B870l912K84N551L905k220n066o90L845J617m187n138J464O234M135k609
$$ 2870 -1042 -758 4793 8698 6478 1412 722 4567 6184 1997 -3141 -1677 4557 8692 6083
1211F083l862pK793l94m004k364K196M257Q70k200j141K847K963k130o260l020
$$ 6083 2221 2214 5007 4613 609 -1755 441 4698 5568 3368 2227 5074 8037 5907 -353 -3373
1227c373M392N169m57l755k98M531K853l883n787p42M276K266l130j936L452N711
$$ -3373 1019 6188 5731 1976 1678 6209 9062 5179 -608 -1350 2926 5192 2062 126 3578 9289
1243I289L76o411m533L155M655k211n440m36O153N932k640n969j073L961J468
$$ 9289 9665 3254 -1279 1876 6531 4320 -1120 -1556 4597 10529 7889 1920 847 4808 6276
1258F276n102m128L314O263J761m598k733L502L742k940p217j840N030N222j092
$$ 6276 1174 -2954 360 6623 8384 3786 1053 4555 8297 5357 -1860 -3700 1330 6552 5460
1273E460l700K92M112J123m570m981O78L784J023j727r01L690K956j033n540l248
$$ 5460 1760 2052 6164 7287 2717 -2264 -1586 2198 3221 1494 593 4283 7239 6206 666 -2582
1289b582K024L216j130k856k7M320L259q53m484k662J077O30j468j657J536M628
$$ -2582 -558 2658 1528 -1328 -1355 2965 6224 5371 887 -1775 -698 -68 -1536 -3193 -1657 2971
1305B971J895k984l762L52K826n67n141l195L528O112J817l836k860J254K398
$$ 2971 4866 1882 -1880 -1528 1298 731 -4410 -7605 -4077 2035 3852 16 -2844 -1590 808
1320H08k504m819o92M293L361j606k841J127N204L89p154o115K208O245J937l996
$$ 808 -1696 -6515 -7207 -2914 447 -1159 -4000 -2873 2331 2720 -4434 -10549 -8341 -2096 -159 -4155
1336d155j906L497M251j999n767k062L000J824k887k559L241P027J163n978n665
$$ -4155 -6061 -2564 1687 -312 -6079 -8141 -5141 -3317 -6204 -8763 -5522 1505 2668 -3310 -8975
1351h975J302M756j30m587k195M109N143l34k778j552J523N4l818l142K646N427
$$ -8975 -7673 -2917 -3047 -7634 -9829 -5720 -577 -911 -3689 -5241 -3718 -3664 -7482 -10624 -7978 -2551
1367b551K455k879l113Q93L778M3m392m194O42M658K674p80l99R33P17j617l907
$$ -2551 -96 -2975 -6088 -5195 -1417 -1374 -5766 -9960 -9318 -4660 -1986 -2766 -3165 -2232 -1515 -3132 -7039
1384g039j296K876L088o26l103L63N136L480k903o784k437L217M023j056j931
$$ -7039 -8335 -5459 -2371 -2997 -6100 -5737 -601 2879 -24 -6808 -9245 -6028 -2005 -3061 -4992
1399d992J283L942R27l591l266J866K994j667n077n25O471O489j341o652l335
$$ -4992 -3709 233 1160 -2431 -5697 -3831 -837 -2504 -7581 -8106 -1635 4854 3513 -3139 -6474
1414f474M116L090k927m346R42N481K143k822j895K339L684l058o855j729N437
$$ -6474 -2358 732 -2195 -6541 -5599 -118 2025 -797 -2692 -353 3331 273 -6582 -8311 -2874
1429b874O129n14n193j337M424L245k872n367m91L571J371j854o47L810L657j755
$$ -2874 3255 2741 -2452 -3789 635 3880 1008 -4359 -4850 -1279 92 -1762 -2409 1401 5058 3303
1445C303o034k312K990L979o96l886j002L821M317k57l582k456L47J716j150j279
$$ 3303 -2731 -5043 -2053 1926 1230 -2656 -3658 163 4480 4223 641 -1815 -1468 248 -902 -2181
1461b181J645L453J359k773k395L70L308L17l901l771K023N343L034k677l242
$$ -2181 -536 2917 4276 1503 -892 -522 2786 3103 -798 -4569 -2546 2797 5831 3154 -88
1476h8L33K945m46l563j547L420L170r01l766R72M370K603m689o347N20N899L361
$$ -88 245 3190 2744 -819 -2366 1054 4224 3323 -443 529 4899 7502 2813 -3534 -3014 2885 6246
1493F246l409l488J763M928P00m586k945K942K888k023l911J241N997K951m028
$$ 6246 2837 -651 1112 6040 6740 2154 -791 2151 5039 3016 -895 346 6343 9294 5266
1508E266n343L82M632J844m200l450K061M769J281l284j611K394J797k751m216
$$ 5266 -77 305 4937 6781 2581 -869 1192 5961 7242 3958 2347 4741 6538 3787 -429
1523d29P15M341K793k341l191N11L576J721l022l837n64L174J489p86q70J179
$$ -429 286 4627 7420 5079 1888 2399 5975 7696 4674 837 273 3447 4936 4150 3280 4459
1539D459J938q06k645j781J656J857q20k276l82K922L227l94m276k599J896K722
$$ 4459 6397 5591 2946 1165 2821 4678 3858 1582 1200 4122 7349 6955 2679 80 1976 4698
1555D698j181k849k23L437K365j625l186R7K809m06m114k390K767N131O18m101
$$ 4698 3517 668 445 3882 6247 4622 1436 1533 4342 3936 -178 -2568 199 5330 5948 1847
1571A847k492K660L418k260m907j520M036K979j637k963J386M126J29n181l574
$$ 1847 -645 2015 5433 3173 -1734 -3254 782 3761 2124 -839 547 4673 4802 -379 -3953
1586c953K538M301o12l530q66L700L705j781m808j904K876J578j965k516K031
$$ -3953 -1415 2886 2274 -1256 -2122 1578 5283 3502 -1306 -3210 -334 1244 -721 -3237 -1206
1601a206L994R49l378k370J431J958j566l332q81L527L287J02k803j582J754R79
$$ -1206 2788 3737 359 -2011 -580 1378 -188 -3520 -4401 -874 2413 2515 -288 -1870 -116 863
1617H63j562l251q9K375K679j64j471j6K292p57l024k513N58L259J489j187j910
$$ 863 -699 -3950 -4039 -1664 1015 851 -620 -636 1656 899 -2125 -4638 -4080 -821 668 -519 -2429
1634b429J374L294nm054l330J005L234L22j559K2K914K150k611m211n25L251R74
$$ -2429 -1055 2239 2234 -1820 -5150 -4145 -911 -589 -2148 -2126 788 2938 327 -3884 -4409 -1158 -184
1651a84k719k892K594N392J566m060m031M83K976n34l936j09L843L473j530l226
$$ -184 -2903 -5795 -3201 2191 3757 -303 -4334 -3851 -875 -1409 -5345 -5454 -1611 1862 332 -2894
1667b894k70L442l37m523l725K102N487K336k913k595J544K365o99m560j796K127
$$ -2894 -3164 278 -59 -4582 -8307 -6205 -718 1618 -1295 -3890 -2346 19 -680 -5240 -7036 -4909
1683d909K830n54j314J054L545N09m002m634N20L481J884j850j646J510L076J282
$$ -4909 -2079 -2633 -3947 -2893 652 1161 -2841 -7475 -6955 -3474 -1590 -3440 -5086 -3576 -500 782
1699G82k816l428k5J127K03j305N10L449K739j518l713j399K128J878k166l279
$$ 782 -2034 -5462 -5487 -4360 -4157 -5462 -4952 -1503 1236 -282 -3995 -5394 -3266 -1388 -3554 -6833
1715f833j4M264M225q64l234j465J524N84k918j677K581L605N70k806j178K829
$$ -6833 -6847 -2583 1642 778 -2456 -3921 -2397 -1813 -4731 -6408 -3827 -222 348 -2458 -3636 -807
1731h07K876k186n643j829L919M733Q6l096j99K827R21k887l223J058L305O27
$$ -807 2069 -117 -5760 -7589 -3670 1063 1149 -1947 -2146 681 1602 -1285 -4508 -3450 -145 482
1747D82l136l10L915M282j597n630k932L068L420n59k534j69L556K199j422k843
$$ 482 -2654 -2964 951 5233 3636 -1994 -4926 -1858 1562 1003 -1531 -1700 1856 4055 2633 -210
1763b10K73J615o80k925q82L427M293M10m094k082J704K473n25l005j678K057
$$ -210 63 1678 998 -1927 -2809 618 4911 5321 1227 -855 849 3322 2797 -208 -1886 171
1779A71L315O57j435n84J118L79k852k362J104L847J425k025k205J156L434O18
$$ 171 3486 4143 2708 2124 3242 3621 769 -1593 -489 3358 4783 2758 553 1709 5143 5761
1795E761l539l458r7L425J735j204r25J527K291j729l318p79K950J488k423k849
$$ 5761 2222 -1236 -1333 2092 3827 2623 1698 3225 5516 3787 469 -310 2640 4128 1705 -1144
1811a144J503M489K283l296m197k26L208P37k636j356K310L015n88k945l12L021
$$ -1144 359 4848 7131 3835 -362 -588 2620 3357 721 -635 1675 4690 4102 1157 845 3866
1827C866R21l451l775J134M227K484k148k892N70K529L54k741j980P71K344K6
$$ 3866 4787 1336 -2439 -1305 2922 5406 3258 366 936 3465 3819 1078 -902 -131 2213 2239
1843B239j210J74K288J384k155l416l23K469J631r18k372K30K927J456r92k645
$$ 2239 1029 1203 3491 4875 2720 -696 -1019 1450 3081 2163 -209 21 2948 4404 3412 767
1859G67n79Q19P74j292q59J929K331m7k431j776J657K290j295l108r57K609L369
$$ 767 188 1007 1781 489 -370 1559 3890 3843 1412 -364 1293 3583 2288 -820 -1777 832 4201
1876D201r8k539j300J630J154j954k284R31K725P34j918j851K415L151j267m076
$$ 4201 4103 1564 264 1894 3048 1094 -1190 -259 2466 3200 1282 -569 1846 4997 3730 -346
1892c46k337K760L038m62k708j83K716J907j852l081l27K721K80k553j629K819
$$ -346 -2683 77 3115 2653 -55 -238 2478 4385 2533 -548 -875 1846 2126 -427 -2056 763
1908G63L504j94l819k027K249K184j476l043l19K768K288n66k175p8J252L16k589
$$ 763 4267 4073 254 -1773 476 2660 1184 -1859 -2178 590 2878 2312 137 59 1311 1627 -962
1925i62j623R81K718Q29j838r89J206J696o29l228j528J189K302L43j253n00J394
$$ -962 -2585 -1604 1114 1943 105 -884 322 2018 1389 -1839 -3367 -2178 124 467 -786 -1286 108
1942A08J659j763k421j154J873J549j502j528J043L241J133l290k941L63K550
$$ 108 1767 4 -2417 -3571 -1698 -149 -1651 -3179 -2136 1105 2238 -1052 -3993 -3630 -1080
1957a080N93k640j439K291K786K45k805j570J493J073j801k798R65L890K039k498
$$ -1080 -487 -3127 -4566 -2275 511 756 -2049 -3619 -2126 -1053 -2854 -5652 -4687 -797 1242 -1256
1973a256k822M17L345Jl693k501J827L706O30k074j084K357J395k188l536L8L075
$$ -1256 -4078 -3661 -316 -315 -4008 -6509 -4682 -976 -346 -2420 -3504 -1147 248 -1940 -5476 -5438 -2363
1990b363J789j748k090J623L453P00l449l345M41K670R55j662k49J973J984o09
$$ -2363 -574 -2322 -4412 -2789 664 1364 -2085 -5430 -4989 -2319 -1364 -3026 -3275 -1302 682 73
2006G3k559j057J316O44j444j626J329L235J688j670k301q90J609J011j267k132
$$ 73 -2486 -3543 -2227 -1583 -3027 -4653 -3324 -89 1599 -71 -2372 -3262 -1653 -642 -1909 -4041
2022d041J033K606J516r87j376J26J423j150k663j036K629L469M6k386j143K204
$$ -4041 -3008 -402 1114 127 -1249 -1123 300 -850 -3513 -4549 -1920 1549 1595 -791 -1934 270
2038B70K037j867l552j081K832K594p39j569P11K713j73l616k568J930L449m37
$$ 270 2307 440 -3112 -4193 -1361 1233 494 -1075 -364 2349 2176 -1440 -4008 -2078 1371 934
$$ [...]
8191A4
##END NTUPLES=NMR FID
##END=
