##TITLE=1H_LR-695-RM1
 CDCl3, 8 sc, 
 18.10.2019
##JCAMPDX= 6.0         $$ Bruker NMR JCAMP-DX V2.0
##DATA TYPE= NMR FID
##DATA CLASS= NTUPLES
##ORIGIN= UXNMR, Bruker Analytische Messtechnik GmbH
##OWNER= root
$$ XWIN-NMR		Version 3.5
$$ Fri Oct 18 14:58:19 2019 Russian Standard Time (UT+4h)  she@DPX200
##.OBSERVE FREQUENCY= 200.1315
##.OBSERVE NUCLEUS= ^1H
##.DELAY= (6, 6)
##.ACQUISITION MODE= SIMULTANEOUS
##.ACQUISITION SCHEME= undefined
##.AVERAGES= 8
##.DIGITISER RES= 18
##SPECTROMETER/DATA SYSTEM= spect
##.PULSE SEQUENCE= zg30
##.SOLVENT NAME= CDCl3
##.SHIFT REFERENCE= (INTERNAL, CDCl3, 0, 15.7039)
##AUDIT TRAIL= $$ (NUMBER, WHEN, WHO, WHERE, WHAT)
$$ ##TITLE= Audit trail, XWIN-NMR		Version 3.5
$$ ##JCAMPDX= 5.01
$$ ##ORIGIN= Bruker BioSpin GmbH
$$ ##OWNER= she
$$ F:/spectra/data/she/nmr/H-F/1/audita.txt
$$ ##AUDIT TRAIL=  $$ (NUMBER, WHEN, WHO, WHERE, WHAT)
(   1,<2019-10-18 14:57:12.70 +0400>,<she>,<DPX200>,
      <created by zg, POWCHK disabled, PULCHK disabled
       configuration hash MD5:
       00 E9 B6 7A A2 85 ED C7 34 08 36 98 17 FE 4E 26
       data hash MD5: 16K
       6D 1B 05 64 72 21 24 65 B3 95 94 A2 E8 87 8B 22>)
$$ ##END=
$$ 
$$ hash MD5
$$ 25 F4 3B EA 74 E5 CF 3D E2 A1 FF 2C 74 9D 71 59
##$RELAX= 
##$RELAX= 
##$RELAX= 
##$RELAX= 
##$RELAX= 
##$RELAX= 
$$ Bruker specific parameters
$$ --------------------------
##$DU= <F:/spectra>
##$EXPNO= 1
##$NAME= <H-F>
##$PROCNO= 1
##$TYPE= <nmr>
##$USER= <she>
##$AMP= (0..31)
100 100 100 100 100 100 100 100 100 100 100 100 100 100 100 100 100 100 
100 100 100 100 100 100 100 100 100 100 100 100 100 100 
##$AQSEQ= 0
##$AQ_mod= 1
##$AUNM= <au_zg>
##$AUTOPOS= <>
##$BF1= 200.13
##$BF2= 200.13
##$BF3= 200.13
##$BF4= 200.13
##$BF5= 200.13
##$BF6= 200.13
##$BF7= 200.13
##$BF8= 200.13
##$BYTORDA= 1
##$CFDGTYP= 0
##$CFRGTYP= 5
##$CHEMSTR= <none>
##$CNST= (0..31)
1 1 145 1 1 1 1 1 1 1 1 1 1 1 1 1 1 1 1 1 1 1 1 1 1 1 1 1 1 1 1 1 
##$CPDPRG= <>
##$CPDPRG1= <>
##$CPDPRG2= <>
##$CPDPRG3= <>
##$CPDPRG4= <mlev>
##$CPDPRG5= <mlev>
##$CPDPRG6= <mlev>
##$CPDPRG7= <mlev>
##$CPDPRG8= <mlev>
##$CPDPRGB= <>
##$CPDPRGT= <>
##$D= (0..31)
0 1.2 0 0 0 0 0 0 0 0.06 0 0.03 0 0 0 0 0.0002 0 0 0 0 0 0 0 0 0 0 0 0 
0 0 0 
##$DATE= 1571396232
##$DBL= (0..7)
120 120 120 120 120 120 120 120 
##$DBP= (0..7)
150 150 150 150 150 150 150 150 
##$DBP07= 0
##$DBPNAM0= <>
##$DBPNAM1= <>
##$DBPNAM2= <>
##$DBPNAM3= <>
##$DBPNAM4= <>
##$DBPNAM5= <>
##$DBPNAM6= <>
##$DBPNAM7= <>
##$DBPOAL= (0..7)
0.5 0.5 0.5 0.5 0.5 0.5 0.5 0.5 
##$DBPOFFS= (0..7)
0 0 0 0 0 0 0 0 
##$DE= 6
##$DECBNUC= <off>
##$DECIM= 24
##$DECNUC= <off>
##$DECSTAT= 4
##$DIGMOD= 1
##$DIGTYP= 9
##$DL= (0..7)
0 120 120 120 120 120 120 120 
##$DP= (0..7)
150 150 150 150 150 150 150 150 
##$DP07= 0
##$DPNAME0= <>
##$DPNAME1= <>
##$DPNAME2= <>
##$DPNAME3= <>
##$DPNAME4= <>
##$DPNAME5= <>
##$DPNAME6= <>
##$DPNAME7= <>
##$DPOAL= (0..7)
0.5 0.5 0.5 0.5 0.5 0.5 0.5 0.5 
##$DPOFFS= (0..7)
0 0 0 0 0 0 0 0 
##$DQDMODE= 0
##$DR= 18
##$DS= 0
##$DSLIST= <SSSSSSSSSSSSSSS>
$$ [...]
##$SUBNAM2= <"">
##$SUBNAM3= <"">
##$SUBNAM4= <"">
##$SUBNAM5= <"">
##$SUBNAM6= <"">
##$SUBNAM7= <"">
##$SUBNAM8= <"">
##$SUBNAM9= <"">
##$SW= 24.0689530833862
##$SWIBOX= (0..15)
0 0 2 0 0 0 0 0 0 0 0 0 0 0 0 0 
##$SW_h= 4816.95568400771
##$TD= 16384
##$TD0= 1
##$TE= 0
##$TE2= 300
##$TE3= 300
##$TEG= 300
##$TL= (0..7)
0 120 120 120 120 120 120 120 
##$TP= (0..7)
150 150 150 150 150 150 150 150 
##$TP07= 0
##$TPNAME0= <>
##$TPNAME1= <>
##$TPNAME2= <>
##$TPNAME3= <>
##$TPNAME4= <>
##$TPNAME5= <>
##$TPNAME6= <>
##$TPNAME7= <>
##$TPOAL= (0..7)
0.5 0.5 0.5 0.5 0.5 0.5 0.5 0.5 
##$TPOFFS= (0..7)
0 0 0 0 0 0 0 0 
##$TUNHIN= 0
##$TUNHOUT= 0
##$TUNXOUT= 0
##$USERA1= <user>
##$USERA2= <user>
##$USERA3= <user>
##$USERA4= <user>
##$USERA5= <user>
##$V9= 5
##$VALIST= <valist>
##$VCLIST= <CCCCCCCCCCCCCCC>
##$VD= 0
##$VDLIST= <DDDDDDDDDDDDDDD>
##$VPLIST= <PPPPPPPPPPPPPPP>
##$VTLIST= <TTTTTTTTTTTTTTT>
##$WBST= 1024
##$WBSW= 4
##$XGAIN= (0..3)
0 0 0 0 
##$XL= 0
##$YL= 0
##$YMAX_a= 506386
##$YMIN_a= -361414
##$ZGOPTNS= <>
##$ZL1= 120
##$ZL2= 120
##$ZL3= 120
##$ZL4= 120
##$ABSF1= 10
##$ABSF2= 0
##$ABSG= 5
##$ABSL= 3
##$ALPHA= 0
##$AQORDER= 0
##$ASSFAC= 0
##$ASSFACI= 0
##$ASSFACX= 0
##$ASSWID= 0
##$AUNMP= <proc_1d>
##$AZFE= 0.1
##$AZFW= 0.1
##$BCFW= 1
##$BC_mod= 2
##$BYTORDP= 1
##$COROFFS= 0
##$CY= 11.3945322036743
##$DATMOD= 1
##$DC= 2
##$DFILT= <>
##$DTYPP= 0
##$F1P= 20.1720416913024
##$F2P= 0.152960286110954
##$FCOR= 0.5
##$FTSIZE= 0
##$FT_mod= 4
##$GAMMA= 1
##$GB= 0.15
##$INTBC= 1
##$INTSCL= 1
##$ISEN= 128
##$LB= 0.24
##$LEV0= 0
##$LPBIN= 0
##$MAXI= 10000
##$MC2= 0
##$MEAN= 0
##$ME_mod= 0
##$MI= 1.114404
##$NCOEF= 0
##$NC_proc= 0
##$NLEV= 6
##$NOISF1= 3.799351
##$NOISF2= 2.8
##$NSP= 1
##$NTH_PI= 0
##$NZP= 0
##$OFFSET= 15.70392
##$PC= 1
##$PHC0= -9569.271
##$PHC1= 11.60089
##$PH_mod= 1
##$PKNL= yes
##$PPARMOD= 0
##$PSCAL= 0
##$PSIGN= 0
##$REVERSE= no
##$SF= 200.130013532006
##$SI= 16384
##$SIGF1= 3
##$SIGF2= 2
##$SINO= 400
##$SIOLD= 16384
##$SREGLST= <1H.CDCl3>
##$SSB= 0
##$STSI= 0
##$STSR= 0
##$SW_p= 3612.71676300578
##$SYMM= 0
##$S_DEV= 0
##$TDeff= 0
##$TDoff= 0
##$TI= <>
##$TILT= no
##$TM1= 0
##$TM2= 0
##$TOPLEV= 0
##$USERP1= <user>
##$USERP2= <user>
##$USERP3= <user>
##$USERP4= <user>
##$USERP5= <user>
##$WDW= 1
##$XDIM= 8192
##$YMAX_p= 0
##$YMIN_p= 0
$$ End of Bruker specific parameters
$$ ---------------------------------
##NTUPLES= NMR FID
##VAR_NAME=  TIME,          FID/REAL,        FID/IMAG
##SYMBOL=    X,             R,               I
##VAR_TYPE=  INDEPENDENT,   DEPENDENT,       DEPENDENT
##VAR_FORM=  AFFN,          ASDF,            ASDF
##VAR_DIM=   8192,          8192,            8192
##UNITS=     SECONDS,       ARBITRARY UNITS, ARBITRARY UNITS
##FACTOR=    0.0002076,     1,               1
##FIRST=     0,             0,               0
##LAST=      1.7004516,     0,               0
##MIN=       0,             -361414,         0
##MAX=       1.7004516,     506386,          0
$$ Real data points
##PAGE= N=1
##DATA TABLE= (X++(R..R)), XYDATA
0@%%%qJ6j6J6j6K4l2M0n6P2q8J07j31J60j87K20k63L09l61M20m84N57o38P26q28
28d41R41j064J200j352J517j696J896k115K356k620K907l223L571l955M379m847
44b546N369n953O608p353Q205r190J0343j1718J3390j5473J8153k1756K6893l4862
58a9890M9065q2224L01429K58006k60114Q686j919L821q5904L7364J02138J01414
70D11872m7430q7074n7510J1972l7440p4024m0661Q5807J16178L7734p3050o6764
82A79610k1537j9717p5703o5889P654P2708N3609Q886q138N793q461m9505p3965
95E345m4684Q171M3895M0876J8287l330o007o376k4707n2851n1352j3966K5612
108f1087L2491J5359M318J1064Q173k5982o9040o6328r197L8412K3391j5249k168
$$ y = [0, 0, 0, 0, -8, 8, -8, 8, -8, 16, -16, 24, -32, 40, -48, 59, -72, 88, -99, 121, -142, 167, -194, 226, -258, 299, -339, 387, -441, 500, -564, 636, -716, 801, -895, 1001, -1114, 1242, -1378, 1529, -1694, 1877, -2078, 2301, -2546, 2823, -3130, 3478, -3875, 4330, -4860, 5483, -6235, 7155, -8318, 9835, -11921, 14972, -19890, 29175, -53049, 248380, 506386, 246272, 254958, 253039, 256860, 170956, 208320, 310458, 411872, 364442, 277368, 219858, 231830, 194390, 120366, 79705, 165512, 281690, 319424, 246374, 179610, 158073, 138356, 62653, -3236, 4418, 77126, 130735, 139621, 131483, 137276, 128815, 79310, 5345, -39339, -31168, 12727, 53603, 71890, 68560, 62553, 56177, 31470, -21381, -72733, -86699, -61087, -28596, -13237, -8919, 2145, 10318, -15664, -84704, -151032, -160229, -121817, -98426, -113675, -115843]
121a15843M9575M8110k9456q4782m6927J7105J5230k5578j8645M6011P6180J5402
133e3618o4411o4160N494L2654k0264n6284K370Q8640P8811j4438o2282j3867
145a41355L0921j3469p3749m0221N5296Q3001J2681m8159j7848L7450J7166n7056
157a55342p1843L988O9545M7141j2686j7576K6860L4421k4635p1643l6094L3114
169a74750M3885r48j8789J9200M3787Q563m1503m1278j10K5758J3845k258Q927
182a15671L0295K9220l93k8012k7016k784J3119P303j006O972K0732K0021R48
195d6272j8441k0161k324J4621P524r829l159K6994L5670J15l7536k3894K0451
208e6241K8152j1629l0718P569M8281K6692k7747l7006J0381L8756J751m1813
$$ y = [-115843, -66268, -18158, -47614, -132396, -179323, -162218, -146988, -172566, -191211, -145200, -69020, -53618, -118029, -182189, -176695, -144041, -164305, -220589, -218219, -129579, -50768, -65206, -127488, -141355, -110434, -123903, -197652, -237873, -182577, -99576, -86895, -135054, -152902, -115452, -98286, -155342, -227185, -223197, -153652, -106511, -119197, -136773, -109913, -75492, -100127, -171770, -207864, -174750, -130865, -131813, -150602, -131402, -87615, -79052, -120555, -161833, -161943, -136185, -122340, -124598, -115671, -85376, -56156, -56549, -84561, -111577, -114361, -101242, -93939, -94945, -87973, -67241, -47220, -46272, -64713, -84874, -87198, -72577, -65053, -74882, -78041, -51047, -15377, -15262, -52798, -76692, -56241, -28089, -39718, -70436, -62867, -14586, 12106, -15641, -52647, -42266, -3510, -1759, -43572]
220d3572j9322M3258N4187m848m6959j0478M3286K8567l4455m5429J9235O1563
232D5033J6721m4329k9160L3944M0439k0858n5525r829N0582L9837j9630l6781
244A0444R610M1329N196m5210l2742K4837M4783J175l3514n826L6727K1940l0324
257D8425m5162m103L2268K0489r703r382J6248K4249k090k8243k2520K918J4754
270C8148M526m801M634K1850J8414q152k9617k4010m85J2504P515k793J415J7796
284E6944K1573k322l0682k9242l69J5051m40j4920O498L8644K7754k2627m5397
297B0465j3889J9839N700k7193j8147L1884N1831J1230l8027l0194J3161J7232
309D3892k5931m4162L455N7168M0968j9509l5470O897K7838j4613n6722k7898
$$ y = [-43572, -62894, -19636, 34551, 29703, -17256, -27734, 15552, 44119, 9664, -35765, -16530, 45033, 61754, 17425, -11735, 22209, 62648, 41790, -13735, -23564, 27018, 66855, 47225, 10444, 20054, 61383, 66579, 21369, -11373, 13464, 58247, 59422, 25908, 20082, 56809, 78749, 48425, 3263, -840, 31428, 51917, 42214, 32832, 49080, 73329, 71239, 42996, 20476, 23394, 38148, 42674, 37873, 42507, 64357, 82771, 74619, 45002, 20992, 20507, 33011, 40526, 37733, 39148, 56944, 78517, 76195, 45513, 16271, 15902, 30953, 30513, 15593, 22091, 60735, 88489, 65862, 20465, 6576, 26415, 32115, 4922, -13225, 18659, 70490, 81720, 43693, 13499, 26660, 43892, 17961, -26201, -22746, 34422, 75390, 55881, 20411, 27308, 55146, 40533, -16189, -44087]
321d4087L6747N0331K337k7874K163L5266J0006m7423n4151k23L9308J9235j5614
334F021n257L3489L1418j9717n3260k5491J6972J5499j2491j0581K5332M2497
346D4431J2972k6397l2773j0745J555p516j1903P292L0184L0916P186j5948j8782
359A0472r555q103j4670j3038N506K6180L1087J5495p758j8955j4366q372j4183
372b0260j8374o57K9250L6690R599j5568r748P361m538l5880l6417P758M5694
385e090L2594m409j2604J0795J5196k0096m8478k2935K6094L4591L48j4408J8024
398I622M2886O940n0808n2357L115L5898Q681k0826L006M2619L3021k0266m6088
411d557j5204J8185K805k8720j5167L6539N3921J0716l5794k8423P736J0974k1128
$$ y = [-44087, -7340, 42991, 45328, 17454, 19617, 54883, 64889, 17466, -36685, -36908, 2400, 21635, 6021, 764, 34253, 65671, 45954, -7306, -32797, -15825, -326, -12817, -23398, 1934, 44431, 57403, 31006, -1767, -12512, -10957, -18473, -30376, -23084, 7100, 38016, 45202, 29254, 10472, 917, -7186, -21856, -34894, -29388, -3208, 27879, 43374, 35616, 16661, 2295, -6077, -20260, -38634, -39291, -10041, 26649, 36248, 20680, 10932, 18293, 13755, -22125, -58542, -50784, -5090, 27504, 23095, 10491, 21286, 36482, 16386, -32092, -55027, -28933, 5658, 6006, -8402, 9622, 52508, 59448, 8640, -43717, -40602, -4704, 3977, -16849, -13843, 28776, 61797, 41531, -4557, -19761, -1576, 1229, -27491, -42658, -6119, 47802, 58518, 22724, -5699, 2037, 13011, -8117]
424h117l1017N900M0282K7791p692j3694O115R111j7991l6733j7408J9668L1378
437G593J3723l167o25P463M16j7358k4092j1288O998J3567R451P375R863R459
451B9378k634j7839k6027j5547P063J8483R360l430J509J6629J2389j5062l2816
464a8544j5879J1264J2268o927n415K0555K9587j25l4524k8015Q381K0914p652
477a4112k7680m79L8373L0884j4554l4396n386K0598p62l2671j8126L0007M0726
490A2422k146l3547j0678K5545J4678k8374l8309L871L7778J9115j7859j6721
502c4225J6287K3249j1793l6442j3839K3822K2709j0130k0493P776K7594O853
514A368k4089k3037M078J6498J543j2400j933J6691J4958l932j5138o882O604
$$ y = [-8117, -39134, -33234, 7048, 34839, 27147, 13453, 19568, 28679, 10688, -26045, -43453, -23785, 7593, 21316, 18149, 17524, 24987, 25403, 8045, -16047, -27335, -20337, -6770, 2681, 10056, 19919, 29378, 26744, 8905, -17122, -32669, -25606, -7123, 2237, -1193, 316, 16945, 29334, 14272, -18544, -34423, -23159, -10891, -17818, -23233, -2678, 26909, 26784, -7740, -35755, -27374, -6460, -14112, -41792, -42271, -3898, 26986, 12432, -21964, -27350, -6752, -7514, -40185, -58311, -28304, 12422, 10276, -23271, -33949, -8404, 6274, -22100, -60409, -56538, -18760, 355, -17504, -34225, -17938, 5311, -6482, -42924, -56763, -32941, -10232, -20362, -40855, -33079, -5485, 1368, -22721, -45758, -41680, -25182, -23639, -36039, -37972, -21281, -6323, -10255, -25393, -32275, -25671]
527b5671O098m425p517J404J0975J0141j584q406n300J761M281r34p215k516J0059
542a8849J2860k42j3342n139J2026J2071q685j8479Q2K0815J1361j4583j6742
555b6846P987K1767J629k2811j2608J7833K2325p452k5869k829K7622J7448j7492
568G04k4485Q861K9276L743k9330j7475K1602K6645q131k8583k361K8723J6842
581B6031k0535k6702N955K6580N812k1939j1581K0964K4744p481k6964o716K0495
594H663J2420j6827k0059P800K5578Q193j5025j2362O290J0471n004j4804j815
607f481J4513J2670k055p384R00Q537J591j0369j2571j250J0138R795K217k548
621A7703j588K295J813n087j0160n250O923J1692K451m726J769J1954N474j5903
$$ y = [-25671, -19573, -23998, -31515, -30111, -19136, -8995, -10579, -18985, -24285, -22524, -18243, -19177, -26392, -28908, -18849, -5989, -6231, -19573, -24712, -12686, -615, -9300, -27779, -27697, -6882, 4479, -10104, -26846, -18859, 2908, 4537, -18274, -30882, -13049, 9276, 1824, -24045, -26874, 748, 18196, 704, -23781, -14920, 14356, 18099, -11231, -28706, -7104, 19541, 11410, -17173, -19534, 9189, 26031, 5496, -21206, -15251, 11329, 17141, -4798, -16379, 4585, 29329, 21848, -5116, -11832, 8663, 21083, 4256, -15803, -8003, 17575, 25768, 10743, -1619, 4671, 15142, 10138, -4666, -6481, 8032, 20702, 18647, 11263, 12163, 20700, 22291, 11922, -649, -1899, 8239, 18034, 20251, 17703, 16115, 18410, 20223, 15136, 4976, -274, 6649, 18341, 20792, 16066, 17835, 29789, 35263, 19360]
635A9360k0704j180J7812Q923j0903q995J3581K0255l039k4891j4527J2495J5216
648B3403r015j8566P627L1251J4081k1584k5513M905K0881l597k7257q787K6501
661A4330K6568p732k5190j886K0261M209k6585k2948J2917L1668Q017j8970r991
674D668J7101J5103j5083k9660o244K0156J3512j0388j0483J2390K0119k604k4433
687D154j6569O544J2194j781q958L344J7195J1266p072j5199o857J773L3o097
701f030k948P292J3792P213m438r174o357k438r42m138m168L944J4224J2397j783
716A6446j1860o058M573P07j3573j3129P476K3016J0522j1198j1540N585J0477
729A1444r164k2938p337J9313J9689m768j4850N756K2023K811k7686k4721Q779
$$ y = [19360, -1344, -2524, 15288, 24211, 13308, 4313, 17894, 38149, 35110, 10219, -4308, 8187, 23403, 14388, -4178, 3449, 34700, 48781, 27197, 1684, 6589, 27470, 23873, -3384, -12171, 14330, 40898, 33166, 7976, 6090, 26351, 30560, 3975, -18973, -6056, 25612, 33629, 14659, 4668, 21769, 36872, 21789, -7871, -14115, 6041, 19553, 9165, -1318, 11072, 31191, 28587, 4154, -12415, -5871, 6323, 4542, -4416, -1072, 16123, 27389, 20317, 5118, -1739, 34, 67, -6030, -8978, -1686, 12106, 19319, 14881, 5707, -650, -3088, -4030, -8168, -12336, -8392, 5832, 18229, 16446, 4586, -1472, 3101, 3808, -9765, -22894, -15418, 7598, 18120, 6922, -4618, 967, 11444, 2280, -20658, -27995, -8682, 11007, 6239, -8611, -2855, 19168, 21979, -5707, -30428, -21649]
742b1649K5347K786j8347m156K3606J7544j4935k7767l780J8104N983j8265j1135
755b6664J9573K9371R97k6014j4919J1711J2061j2368k0316L130K5331J3180j1535
768C538j2408O617J0950q932k1899p793J5735J8409O71q973M82R819J845j2036
782c975j3406j535P552M691q12J979Q201O632l455j1770j0232k162M329N807K211
797e945r41K631Q072N660o393j3522p374M186M931k839k456J0414J4709k00j6222
812e289j2359O178J0885n824j6198j269K1527J8178o972j8196j700J2258m82j9670
826a8933j0967J6358K3178j683j9425l589J9485J0244j9260k5456J238K3281J0911
839E382j2405r554J3611J7164q179k4985q542J6442J2350j1558j5306R074K4441
$$ y = [-21649, 3698, 6484, -11863, -16019, 7587, 25131, 10196, -17571, -21351, -3247, 2736, -15529, -26664, -7091, 22280, 23277, -2737, -17656, -5945, 6116, -6252, -26568, -23438, 1893, 15073, 3538, -8870, -2253, 8697, -235, -22134, -29927, -14192, 4217, 4888, -4085, -3603, 6216, 8061, -3975, -17381, -18916, -11364, -6673, -7485, -5506, 2695, 9327, 5872, -5898, -16130, -18292, -13963, -8156, -5945, -6886, -4255, 3817, 9477, 3084, -10438, -17812, -13626, -8695, -11534, -13990, -3576, 11133, 10933, -5289, -17648, -11470, -585, -6409, -22607, -23876, -2349, 15829, 8857, -9339, -11039, 1219, 737, -18933, -29900, -13542, 9636, 7953, -11472, -15061, 4424, 14668, -4592, -30048, -28810, -5529, 5382, -7023, -16577, -2966, 14198, 6019, -18966, -27508, -11066, 1284, -10274, -25580, -16506, 7935]
852G935O313j8557j6868M913J1397m183j3880k43J7132J2582n950j2555n44Q810
866c698m41j2837r667N898J3430O217l813l193K059J253n033p532l750L263O496
881a1348L964O07o19J756L566j278r808j0031J264J1350P304m230m504O688J0000
896D681k993j5374q525P495J1163k999r731L676J8901Q864j4856j8386K711J5948
910E75J306j6355o859J8210K0694n000j9634m412J5351O954j6385j5999R050K4045
924A1541O798j6132r538J2431J3939r965k2383l087J9999J3914r147j2771P518
937C117J8050J069j9547j2530Q430J3360j944r500J820J4269P937r207j3042n31
951A751Q681K005p551m425P613J1496L271o541o035o45J502j832k435m15M197
$$ y = [7935, 14248, -4309, -21177, -16264, -4867, -9050, -22930, -23173, -6041, 6541, 591, -11964, -12508, -3698, -4139, -16976, -26643, -20745, -7315, -1098, -4911, -8104, -6045, -4792, -9825, -17357, -21107, -17844, -11348, -7384, -6777, -7396, -5640, -2074, -3352, -13160, -23191, -21927, -10577, -3273, -7503, -12007, -5319, 4681, 1688, -13686, -22211, -14716, -3553, -6552, -16283, -12607, 6294, 15158, 302, -18084, -15373, 575, 1881, -14474, -21333, -3123, 17571, 12571, -7063, -11475, 3876, 10830, -5555, -21554, -12504, 11541, 18339, 2207, -7331, 5100, 19039, 9074, -13309, -16396, 3603, 17517, 8370, -4401, 3117, 21167, 22236, 2689, -9841, -1411, 11949, 10005, 505, 2325, 16594, 24531, 15324, 2282, 1751, 10432, 12437, 4886, 461, 8074, 19570, 22841, 16300, 10265, 9620, 11122, 9290, 6855, 6440, 10637]
966A0637N754L894j831m675r56K519n01o664n517M979J1934N380p323p382L805
981A4053P930l726j2487m435J0354J1557m046j0523K098J4342L756j5833j4928
994a888O631J6523K386j4641n650J4768J3514r042j8779p59J5359N700j4637j1656
1008b171J1105J9715L39j8303r558J1500J2226q209j6696N02J6735Q080j1380
1021A3885j0603P537J3116l645j7264o786J1782J1568m214j1547J37J0948N397
1034B0311q373j0332J133O827L16o369k159N944O901j848p236l483K339K223k519
1049C675m168j504K852N304K064k913n421o01K186m04n901m460M342Q247J634
1064D932p225m522M899N849n860j2427k857J0384Q649n396r585M048J2202O46
$$ y = [10637, 16391, 20285, 18454, 13779, 12823, 15342, 14841, 8177, 2660, 7639, 19573, 24953, 17630, 10248, 14053, 21983, 18257, 5770, 1335, 11689, 23246, 19200, 8677, 10775, 25117, 28873, 13040, -1888, 4743, 21266, 23652, 9011, 3361, 18129, 31643, 22601, 3822, 3063, 18422, 24122, 9485, -2171, 8934, 28649, 28988, 10685, 1127, 12627, 24853, 16644, -52, 450, 17185, 25265, 13885, 3282, 10819, 23935, 20290, 3026, -3760, 8022, 19590, 15376, 3829, 3966, 14914, 20311, 11938, 1606, 2739, 9566, 9882, 3513, 1354, 7298, 14199, 12351, 5115, 1632, 3971, 6194, 3675, -493, -1997, 855, 6159, 8223, 5310, -111, -712, 1474, 1070, -4831, -9291, -4949, 3298, 4932, -2293, -6815, -1916, 3933, -1927, -14354, -17211, -6827, 1822, -3574, -13159, -9111, 3091, 3737]
1078C737j5975j1727P764J3176j747j4059j388J5858J0461j0898j7892K35J3158
1091i297K012j3960p908J3259J7946j925j7961o948J2096P740j1662j5830L716
1104b8722J9020P607j0516r099P241R884p025j6792m724J2355J1475k443p626
1117a9365K617J0005K180j1525j1016J538P896K357l731J193Q456O554l717j0312
1131a6870n591J386L031N67q08K308N797N972R65n555p616k600J790O26j283J790
1147a6091R285Q284j475r791o124L597M576n679r150L136J5883J1127m909j1119
1161h450k88O650k361j3629n067J3573J5757j288j1258r33J3257M269j5964j7332
1175b3064L323J8457P936p859m628J0948J0984q048j9110m991J2151R415p500
$$ y = [3737, -12238, -23965, -16201, -3025, -4772, -18831, -20219, -4361, 6100, -4798, -22690, -22455, -9297, -7285, -21245, -29153, -15894, 2052, 127, -17834, -24782, -12686, -4946, -16608, -32438, -28722, -9702, -2095, -12611, -21710, -14469, -4585, -11610, -28402, -33126, -20771, -9296, -11739, -19365, -16748, -6743, -4563, -16088, -27104, -25566, -17670, -15313, -19044, -17851, -9395, -2841, -6558, -16870, -22461, -21075, -18044, -17477, -18285, -15977, -10180, -4208, -3243, -8798, -16414, -19014, -17224, -16598, -17881, -16091, -6806, 1478, 3, -9788, -15912, -12315, -7739, -13418, -22568, -19432, -3549, 7578, 2669, -8450, -8738, -2088, -4449, -18078, -23145, -9572, 6185, 4897, -6361, -7294, 5963, 10232, -5732, -23064, -19741, -1284, 6652, -1207, -5835, 5113, 16097, 8049, -11061, -16052, -3901, 5514, -1986]
1188a986p931R367J8199K796j5709j3749L832Q519k629q447K961J4645R674o135
1202A3407j0299l83N455j720j0231n054Q931J2962M386m231l693O21q94n968o178
1217b889O56O518N633K477O25J109Q85k080n204p800l164M771R110N174q73l134
1233A1814K036K061m751r809m174N927P697M27l065L891R583L06j3019j2763L060
1248g79J1004K289q349j665J2473J0538o216j5918m160R716K904r873o760J0340
1262E544J6810J043j4215q574P758P334q298j3750J980J6505R186q221r642L968
1276G428R593m378j5441n768J1471J1437k049q378J365R508J685j0701j0078K745
1290a561R484J295n887j161P796O493m305r529l937L510L153k033k012L540N072
$$ y = [-1986, -9917, -550, 17649, 20445, 4736, -9013, -5181, 3338, 709, -7738, -4777, 9868, 19542, 13407, 3108, 2725, 8180, 6460, -3771, -8825, 106, 13068, 17454, 13223, 9530, 10151, 9257, 3289, -2889, -2233, 4285, 9918, 12395, 13020, 14129, 15014, 12934, 7730, -70, -3234, 1537, 10647, 15821, 14948, 11814, 13850, 15911, 11160, 1351, -2823, 3104, 10801, 11228, 8163, 12054, 21637, 21943, 8924, -3839, -779, 10225, 12514, 4165, 2500, 14973, 25511, 19295, 3377, -783, 8933, 11837, 1964, -4796, 5544, 22354, 23397, 9182, 608, 8366, 15700, 7402, -6348, -4368, 12137, 21323, 13102, 3460, 7428, 17021, 12643, -2798, -8566, 2905, 14342, 12293, 3915, 5280, 14788, 16473, 5772, -4306, -1561, 7923, 9218, 3331, 2170, 9966, 16459, 12154, 2625, -1312, 2198, 5351, 3318, 1306, 4846, 9918]
1305I918J377k854l542k167J19L95o00j229O70M227M406j101n857m058J805L739
1321E248j928n728J97P485N360m467q184J210P556R82r773o787P393J1327r12
1336H979j1072l783Q919P171q117j1918J921J3180K856j0921q091Q352J2411l254
1350F633j4412m843J1330R214o987j2279J625J2596L281j0633q457P572J0901
1363E541l442j2895l649J1221Q008o746j0628J785J0482L450p623o997L319O750
1377a424j801p285j259P259N052l748n757k92N056J251m335m276J239M146L144
1392c030k67j108j195k43J24j352k682m61K781L997R24l186j230L258K453m322
1408e539p297j023P565O414k848n045K668O886Q7j0079p050N868R359j531p993
$$ y = [9918, 11295, 8441, 4899, 2732, 2851, 3246, 2646, 1417, 2087, 6314, 10720, 9619, 3762, -296, 1509, 5248, 3320, -2408, -2211, 5274, 10634, 6167, -2017, -807, 6749, 7731, -2042, -8829, -1436, 9891, 8979, -2093, -5876, 3043, 10214, 2097, -9821, -7900, 5280, 8136, -2785, -10876, -2524, 9887, 6633, -7779, -12622, -1292, 7922, 935, -11344, -9719, 2877, 6158, -4475, -12932, -5360, 5541, 2099, -10796, -14445, -3224, 4784, -1962, -12590, -10805, -323, 3127, -4496, -11493, -8174, -1424, -3225, -10510, -11769, -4510, 542, -3206, -8963, -9255, -4199, -2948, -7283, -11559, -10320, -6174, -3030, -3297, -4405, -5600, -5843, -5719, -7071, -9753, -10214, -7433, -3436, -2512, -5698, -6928, -3670, -1217, -5539, -12836, -13859, -6294, 120, -2728, -7773, -5105, 1781, 1868, -8211, -15261, -9393, -34, -1565, -9558]
1423i558M89J1568O532r075j2805L54J0226K278r068l601J0188J1985l265j2961
1437f713l763Q299N008r830r445O090J5648M321r998p140N357O662o285j2185
1451a3974j105J2797Q071m403o237L489Q570k540j2106p128N536Q537P54l998
1465c737J587P420K420o562q704j744L822J931j340J356N438M486l88m327m507
1480b849k866n75N04J260K012L803M316K247l162o252m158J295J939j564j887
1495e937M379R286M515n392q300j565K923j042o416k18J0430R895j957q633j852
1510A16O635O20j0778r120O138J4432M384o943l965O540N210q337j3410r57J2077
1525B642P287n291n443P517J1426k401j4835r334O324Q800k014o068L844J2114
$$ y = [-9558, -9069, 2499, 9031, -44, -12849, -12495, -2269, 9, -9059, -12660, -2472, 9513, 6248, -6713, -10476, -2177, 2831, -6999, -16444, -10354, 5294, 9615, -383, -7523, -2166, 4496, -1789, -13974, -15079, -2282, 5789, 1386, -4851, -1362, 7208, 4668, -7438, -14566, -9030, -493, 261, -3737, -2150, 5270, 7690, 1128, -7576, -9320, -5498, -3567, -4907, -3551, 1887, 6373, 5985, 1658, -2849, -5715, -6290, -5786, -4526, -2514, 1289, 5605, 7852, 4690, -1562, -5720, -4425, -2486, -4050, -5937, -1558, 7728, 12243, 6851, -1449, -3014, -91, -1133, -7549, -7767, 2663, 12558, 10601, 1968, 116, 6751, 7371, -3407, -12527, -6389, 8043, 12427, 5484, 1519, 8059, 13269, 4932, -8478, -9435, 2642, 9929, 4638, -805, 6712, 18138, 15737, 902, -8432, -2108, 6692, 4678, -1390, 2454, 14568]
1539A4568M326j0007j0114J287O219p70p759j576J0434J0369j224q253l779K193
1553E914Pn290l517M315Q076K845k422j943Q52L0l584n935k205K874N787M615
1569A0419R29j747k045q94j071l107l651K60M748M310L02j380J190K550k486q750
1585d23n493M524Q528J787n380j051O390M466n977j0254j660P515L513n544l486
1600b545P529R763k599j2201o000O893O794m682q836K613J1812N078q557q471
1614c409L429O805k655j0501k115J0612Q808m130r261J15P809J405q888o357M424
1629c909Q450N49o267j797O146L805n245p984l36O190K975l112l205K204M656
1644C120k87m373k770J159J446n41j007P3J914J741R5k720j898l6J477R03j319
$$ y = [14568, 18894, 8887, -1227, 60, 6279, 5509, -2250, -3826, 6608, 16977, 15753, 7500, 3721, 5914, 5921, 631, -2886, 1429, 9505, 12350, 9928, 7985, 8837, 8867, 5283, -652, -2857, 17, 5804, 10419, 11348, 9601, 7556, 6662, 5591, 2484, -1167, -907, 3841, 8151, 8453, 7073, 8263, 10813, 8327, -423, -5916, -1392, 7136, 8923, 3543, 2492, 8882, 13348, 7371, -2883, -4543, 2972, 6485, 941, -2545, 4984, 14747, 12148, -53, -6053, 840, 7634, 2952, -5884, -3271, 8541, 13619, 5062, -3409, 20, 6825, 4170, -6331, -8446, 2166, 10974, 6844, -2417, -2302, 5507, 6912, -1976, -8333, -3909, 4541, 5090, -1177, -2974, 3172, 6977, 1732, -6252, -6588, -398, 2577, -535, -3740, -1536, 3120, 2833, -1540, -4310, -3151, -1705, -2246, -3253, -3180, -1266, 475, 570, -2150, -4048, -4084, -2607, -1704, -3023]
1661c023k439J009L201J799k786l870J079L956O13m787k996L749N668j774o162
1676f763j097O332L721m840o840J667P583J289p420m960O424Q099k108r305j769
1691i987P616N380o401q107K526R559K180p672m891O035P293l842r950j468Q840
1706b889N617n053p035K990Q728J231p716n920L691N762j365n392J51P445L893
1721D138n025o309P29M798L71m958k195L907N392J013l228j815L77pj906j963
1737f681M15L221K742J082j475r12J09l62r85k934j941J815N656K913j863l005
1753b205O88J858j657n715j721N128O062q13m785J135O151J180p936p851K452
1768h029Q239K321n222j746P214N885m802j0085j732P098L827n761n311O487J0774
$$ y = [-3023, -5462, -4453, -1252, 547, -2239, -6109, -5030, -1074, -461, -5248, -8244, -4495, 1173, -601, -6763, -7860, -1528, 2193, -2647, -9487, -7820, -237, 1052, -6368, -11328, -4904, 3195, 1087, -8218, -9987, -2371, 3009, -3392, -11499, -8973, 586, 2766, -4906, -9797, -3762, 3531, -311, -10261, -11729, -2889, 2728, -2325, -9360, -6370, 2358, 3589, -4127, -10047, -6356, -594, -1959, -7351, -7200, 245, 4138, -887, -7196, -6467, -1669, -1298, -6256, -8451, -4544, 848, 1861, -1367, -3182, -2805, -2812, -4718, -6681, -6266, -3045, -303, 779, -696, -1608, -1499, -1861, -2846, -5780, -7721, -5906, -250, 2663, 800, -2205, -1517, 341, -1316, -7031, -8752, -3624, 2438, 1625, -3160, -2025, 4126, 5306, -2630, -10481, -8029, 210, 2531, -2691, -4437, 2777, 8662, 3860, -6225, -7957, -859, 2968, -2793, -8104, -1617, 9157]
1783I157R75j0028o626M056N612l434p397J879J0459N252n294o237K235N001k542
1798C068q494l383P449Q770l11n125k76M219P01o524n431J143N745K219j512L1
1814B289L823K455l482n275l248J060K806J302M65J902K172R43j655l430l482
1829a355j082J313K310L60K21L280K963k33n220n314O2L438K86k481N83O494M180
1846I805l361o858j633L779P30n810l643O157R121R21p102l954L751K933n119
1861b83p550J216R862M465m845m761L676N751l457j0005l552P204O968j832n228
1876b371K142O606J344q185o758K866O590n15m818n96P115N600m351p184j334
1891c849L437J016l420j768M871N080k05m133j777J910J097l167l315J196L712
$$ y = [9157, 10132, 104, -6522, -2466, 3146, -288, -7685, -5806, 4653, 9905, 4611, -1626, 609, 5610, 3068, -5426, -8809, -1360, 7410, 7099, 1974, 1698, 5917, 6618, 94, -5337, -4194, 1551, 3770, 2258, 2289, 6112, 8567, 5085, -190, -3438, -2378, 428, 1730, 2195, 4097, 6269, 7212, 5557, 2127, -1355, -2437, -1124, 1186, 1546, 1767, 5047, 8010, 7777, 2557, -2757, -2695, 743, 1029, -1452, -869, 5625, 9805, 6444, -414, -2047, 1732, 2462, -3348, -6991, -834, 8287, 9208, 2106, -1848, 1903, 4836, -283, -7833, -6617, 3245, 7710, 2865, -1896, 1780, 7531, 4074, -5931, -9483, -2279, 4689, 2857, -2371, -229, 6377, 7721, -464, -7222, -4356, 2234, 1719, -3099, -3695, 3420, 9020, 4669, -2515, -3849, -412, 604, -2816, -4584, 287, 5367, 5162, 1029, -748, 1162, 2259, -908, -4223, -3027, 685]
1906F85L229M94j234j167n82p73j179q53k11J707K024J418n27q81O04N76j797
1923A533m023j227L667M778K59l811r59L772J998l725n375Q45N079J524m023j710
1939a398M569N074l152p059k267N867M698m084n842K111P471K140o526n065M038
1954E75N280k512p401m30P605N359n202o624J285P232J025o852m305L988N520
1969D543q84n705m72N527L166m617o019J376N772J269m878l067L274M342m39l630
1985d42j488K132J220k281k101R64K627R49j230j406l7J444M35j222j962j040
2001c438J308K174P10r32j106J41J797r54k832j477K129K922r12k777M73M167
2017A393K149m908n310J328M915J064m669k066M781N353k025o849j854N108K756
$$ y = [685, 3914, 4408, 3174, 2007, 1425, 652, -527, -1380, -1591, 116, 2140, 3558, 3031, 2150, 2754, 3330, 1533, -2490, -3717, -50, 4728, 4987, 1176, 217, 3989, 5987, 2262, -3113, -2268, 2811, 4335, 312, -1398, 3171, 8245, 5093, -1966, -4233, 1634, 6332, 2248, -3594, -1483, 5988, 8128, 1602, -3463, 575, 5855, 3343, -4058, -4488, 3117, 8476, 3274, -3350, -2065, 5167, 6192, -660, -4965, -977, 4543, 3659, -2046, -2518, 3009, 6175, 1558, -4461, -3085, 2687, 3956, -922, -3989, -715, 3627, 3188, -442, -1930, 202, 1422, -859, -2960, -1996, 631, 1580, 350, -1056, -1093, 351, 786, -436, -2398, -3438, -2130, 44, 754, -178, -1284, -1143, 654, -300, -3132, -4609, -2480, 442, -470, -3247, -2774, 1393, 3542, -1366, -6676, -5348, -433, 631, -4038, -6104, -1323, 4030, 2005, -4844, -6698, -1590, 1166]
2032A166m803m804L035P900J482o344m453L834M506l355p087k73P881M620m257
2047i52n169K312N829q98p707l669M442N820j010l965L71N579J479n306n721J367
2063g198M857K86l194p51M600L819j618m871j705J270M55j325o63K626L241Q50
2079F79j397j587p81p30r12n43J72J152K123K430N31j379k886p71L43m22j525
2096e503M83L295M087p52l151j033K498Q3m351l568K460O902J775l256k249L040
2112G60K711l876o380k55O294L301l433k947M336O033j631p871m711M236N698
2127B265k070m091K116O746K180n742n589K203M408j359n581n40P328N679k443
2142E510o244n97L799M15m536k985L499N729O39l566n31K962J026l923m286L95
$$ y = [1166, -3637, -8441, -5406, 2494, 3976, -2368, -6821, -2987, 1519, -1836, -8923, -9196, -1315, 3305, -952, -6121, -3809, 2020, 1122, -6585, -10254, -5812, 8, -1002, -4967, -4596, 983, 2462, -2844, -8565, -7198, -2341, -2055, -5249, -6000, -1400, 2419, 801, -4070, -5775, -4505, -4050, -5375, -6038, -3412, -171, 679, -718, -2305, -3086, -3816, -4728, -5271, -5099, -3947, -1824, 606, 1137, -242, -3128, -3899, -3556, -3978, -5503, -5020, -1725, 2362, 1610, -1541, -2574, -76, 7, -4344, -7912, -5452, 1450, 3225, -31, -2280, 760, 3471, -405, -6785, -7040, -746, 2555, -878, -3825, 511, 6544, 4913, -2958, -7669, -3433, 2265, 195, -3896, -1780, 4966, 7146, 1404, -4185, -1982, 2426, 1067, -4514, -5054, 2274, 7953, 5510, -734, -1331, 2468, 2883, -1653, -4638, -1139, 4590, 5229, 1663, 1132, 4094, 5120, 1197, -3089, -2694]
2158b694M004K316l86q47J427J561j481k373j912N55J175M79O27J234J420J63
2174E268n74j310k157j389J144K216J036j036Q0K570J417k514l888o46K761J320
2190D298k205j220L571M491q90n656k594L573L187l118m650J559O599K753m772
2205D926m281K368M422k241n961j548O069N338k783n774Q42N598Q22o197m360
2220b760L530N737o50n345n95N407L321m574n408L75N016Q39l499k496L255L874
2236F027r21m715j256K728J564k145k967P17L922J106k205j586L00J306n86j694
2252d05m80J064R20m47m55K98K18M0j93j034j752J83J202J475j95k080l91K642
2270F10J187k223l007L34K322Q53k511j361K947L298j650m910q21L896K489l186
$$ y = [-2694, 1310, 3626, 3240, 2393, 3820, 5381, 3900, 1527, -385, 170, 1345, 1824, 2451, 3685, 5105, 5268, 4694, 3384, 1227, -162, 982, 3198, 4234, 3198, 3278, 5848, 7265, 4751, 863, 217, 2978, 4298, 2093, 873, 4444, 8935, 8045, 2389, -205, 3368, 6555, 3437, -1213, 346, 6945, 9698, 4926, 645, 3013, 7435, 5194, -767, -2315, 3754, 9092, 6309, 535, 1377, 6975, 7797, 1600, -2760, 770, 6507, 5857, 512, -83, 5324, 8645, 4071, -1337, -962, 4054, 4893, 1394, -1102, 2153, 6027, 5106, 391, -865, 1863, 3427, 1282, -1685, -968, 2954, 4060, 1855, 269, 569, 1875, 1289, -405, -885, 179, 1099, 652, 197, 495, 713, 753, 560, -474, -2226, -2043, -841, 634, 439, -1641, -2032, 610, 1797, -426, -3433, -3099, -777, 76, -2435, -3796, -849, 2449, 799, -4111, -4932, -1036, 1453, -1733]
2286a733m413J272N664J440l987l223K710L517k336n122l69N310L311l357m404
2301e720J625N330M34n336l761L127M154q60l966L58M973K018m097m761J322M164
2317i96K20m083j512L645M073p23l697j393J811R61k713j449J667L551L13k191
2333b516p99Q96J094j004k496j119J436J816J164K03J21n18r44k72j002j042J10
2350d872J517J517J2k84M94J243l87l499k485J241L499J252k008q04K810K371
2366A617k477m266r09L284J844k359j712K887M764O7n112l383K396L283j711l879
2382e666R68N932K821l559l895J331L470j077n146j785N598M566o76m039n7L560
2398B346L38m145l784K060M690J289k975o56L567K273k810m778m73K733K455j441
$$ y = [-1733, -6146, -4874, 790, 2230, -1757, -4980, -2270, 1247, -1089, -6211, -6580, -1270, 2041, -1316, -5720, -4095, 1235, 1669, -3667, -7428, -4301, -147, -1007, -4973, -4615, 358, 2376, -1721, -6482, -5160, -996, -776, -4859, -6371, -2726, 1347, 624, -3073, -4466, -2655, -1694, -4407, -5856, -4189, -638, -325, -2516, -3315, -2419, -1325, -2329, -4825, -5944, -4508, -2692, -1528, -1325, -1204, -1722, -2666, -2938, -3940, -4982, -4872, -3355, -1838, -1826, -2110, -1616, -373, -760, -4259, -6744, -5503, -2004, -752, -2760, -3564, -754, 1617, -860, -5126, -6035, -2751, -907, -3266, -4978, -2091, 2673, 2740, -2372, -5755, -3359, -76, -1787, -5666, -4698, 1234, 4055, 496, -3399, -2068, 1402, 325, -4821, -6606, -1008, 3558, 2882, -1157, -1214, 2346, 2684, -1461, -5245, -3185, 1505, 2794, -181, -837, 2730, 5003, 2193, -2585, -3058, -325, 2130, 689]
2414F89q07K223K314n4l073j770O06Q82j80p90R90K139J409m1j668j155j083K
2432F33O04K70k88J320K194Q91j362k620n30J085J9j723r22K694L781L11l206
2449C151j777J176J598k274l250J075M904K072k893k579J827L417j818n326k043
2464b740M384M193j397l573R68M058N21m559l697K053M337n51l977n0M932L355
2480H257l812m848k41L565J066k941k139L287L541l00l753j353K379J297l163
2495H42k465J327L997R99k084j526P75J299j257j759q59J715J312n63m89O37O14
2512B515m26p97j371p25N22R05P81L43m77n60N24L70r43j789j58J794O18j295
2530a69o18J893J669j266l195q87K519K047j591l203Q81L814Q20l226k501J865
$$ y = [689, -118, 2105, 4419, 4365, 1292, -478, 128, 1010, 830, 40, 1030, 3169, 4578, 4537, 2869, 1714, 631, 633, 1237, 1507, 1219, 2539, 4733, 5624, 4262, 1642, 1112, 2197, 2216, 493, -429, 2265, 6046, 6357, 3151, 1374, 2550, 4148, 1874, -1376, -301, 4603, 6675, 3782, 1203, 3030, 6447, 4629, -697, -2740, 1644, 5837, 4440, 867, 1835, 5893, 6414, 1855, -1842, 211, 4548, 3997, 20, -30, 4902, 8257, 4445, -403, -644, 2921, 3987, 1046, -1093, 2194, 5735, 5435, 1682, 329, 2708, 4005, 842, -1623, -296, 3701, 4700, 2616, 1090, 1865, 3164, 1907, 148, -711, 1004, 2316, 1753, 1264, 1901, 2515, 2089, 1292, -79, -804, -282, 623, 1404, 1747, 1270, 710, 1234, 1604, 661, -1128, -1286, 508, 1126, -169, -787, 1106, 2775, 1509, -1686, -2573, -54, 1993, 402, -2801, -1920, 1894, 2714, -512, -3013, -1148]
2546a148K894j422l754j22L941K621l044l914J606M269L28m416k839L095L446
2561A541j002l906jL910K123l691l473J661L899j23m086j554L398L298j589l327
2577b922n27K911R61k377k127J230L129K17k271p77J329J490r68k226l46J718
2593a556N62m58o97P98J306l84j056m46k71l42N73O74O4m15O64J022l31j045k010
2612c348K27J693M28j371k47J892K268j443k899r40K492Q86j890k277J971L785
2628A227O83l269k093J843K225j863l711M59M923K134k940l141J537L707n73m870
2644c722k208L682L749r80l109O82L465P80m129l112J567L852J39l185o60L732
2660E43K779j883l841o68K111R64j864q55K256K779m1k815q48Q61J007j273j564
$$ y = [-1148, 1746, 324, -3430, -3552, 389, 3010, -34, -3948, -2342, 1927, 2255, -2161, -5000, -1905, 1541, 539, -3367, -3368, 542, 2665, -1026, -4499, -2838, 1061, 938, -3148, -4702, -1304, 1994, 405, -2922, -3449, -538, 423, -1954, -4081, -2851, 278, 495, -1776, -2553, -1224, 266, -702, -2928, -3274, -1556, -994, -1452, -2149, -1351, -45, -429, -1485, -1931, -2202, -2544, -1971, -1297, -1233, -1648, -984, 38, -293, -1338, -3348, -3121, -1428, -1000, -2371, -2618, -726, 1542, 99, -2800, -3740, -1248, -362, -2252, -4529, -2558, 1227, 1910, -1359, -3452, -1609, 616, -1247, -4958, -4499, 424, 2558, -382, -3523, -1986, 1721, 1148, -3722, -5930, -2248, 1501, 521, -2588, -1906, 1559, 2339, -1790, -4902, -3335, 517, 656, -2529, -3189, 543, 3322, 1439, -2402, -3070, -959, 5, -1859, -2714, -458, 2321, 2280, -535, -1383, -522, 485, -788, -2352]
2677b352K97J854J916j00m88l64k20j314o59K49M84P65O83J060k66k56l20j81
2695G88m94j566j335J849K907R91j700j190J310R00j618k814L4K869J778j476
2711A233j489J902K647j262l926j987K715L008j227k705Q79M006Q38l473l052
2726a893J351K777j207k861n7M191L186k340l945r9K650N70l215j956K715L810
2742C677o30k588r17K661J282l393l159J302L114J325j913q23J359J592q29k905
2758h45m90J605P50n80m66R24J911k40j357j631N7N82l42K38K96O28O82JO0j002
2778G81r35m22M27J015l88m21J367J278j39k312r03J382R38j285j741J117K981
2795B740Q14k428j769J506J768j171l031l58L271K545j677k991P02L126J37l497
$$ y = [-2352, -2055, -201, 1715, 1615, 1127, 763, 543, -771, -1430, -1181, -697, 68, 751, 1811, 1545, 1289, 969, 788, 294, -1272, -2607, -758, 2149, 3140, 1440, 250, 1560, 2460, 842, -1972, -1938, 931, 2709, 1233, -256, 1646, 4293, 3031, -895, -2882, -167, 2841, 1614, -1091, -212, 3794, 4632, 1159, -1893, -542, 2235, 1028, -1833, -1890, 2301, 5487, 3147, -798, -897, 1753, 2323, -892, -2848, -133, 3677, 3047, 459, -458, 2203, 3485, 92, -3067, -1765, 1349, 2674, 761, -62, 1297, 2889, 2060, -845, -1335, 270, 1020, 440, -26, 898, 2809, 2569, 1212, -419, -362, 220, -122, 116, 412, 1040, 1722, 1723, 1783, 781, -154, -576, -149, 866, 478, 57, 1424, 2702, 2563, 251, -652, 730, 1668, 383, -1358, -241, 2740, 3554, 1126, -643, 863, 2631, 1460, -1571, -1929, 1342, 3887, 2210, -781, -79, 3047, 3184, -313]
2811c13k035K468L293j243k900q5L617J439k972l477O80L591Q30l172j508K460
2827F73L089j309l536k90K662J580l152j982J447L120N31k782j600J821J596q45
2843A023k347j9K203O90j333j103R73J461k12j850p08M63Q81L8k21k59L32K43
2861B55J14j62j63o63l71N46K06k31m38J259R69q99k065L96J383Q73j496k015
2879b502P20K697J010k092j620J262J542r67k505N8K639J953k314k571J472L151
2895A933K11l771k219K282K918m96k893J35L101J434k859l079J345L309k23l139
2911b011j179L457K366j158l359n28K304J268k218k024K071K543M76k682r52J986
2927C60J020j647k283J03K350J268j390l54P51P65o69j524m11O79N22J38j3M17
$$ y = [-313, -2348, 120, 3413, 2170, -730, -815, 2802, 4241, 1269, -2208, -1528, 2063, 2893, -279, -1787, 673, 3762, 2453, -1083, -1373, 1289, 2869, -283, -2265, -818, 2302, 2833, 51, -1549, 272, 1868, 1023, -1324, -1343, 860, 1550, 217, -886, 87, 1548, 1336, -514, -1222, -759, 122, 160, -61, -320, 12, 255, 369, 207, 44, -619, -990, -444, -238, -469, -907, 352, 1321, 422, -1643, -1247, 136, 1009, -487, -2502, -1782, 915, 1925, -167, -1787, -525, 1017, 50, -2455, -2397, 242, 2195, -119, -2690, -1218, 1933, 2144, -1627, -3846, -1564, 1354, 858, -2035, -1900, 1201, 2635, -224, -3303, -1958, 1351, 1128, -2011, -3190, 267, 2633, 1475, -1884, -2412, -108, 1160, -1058, -3082, -1011, 1532, 2008, -674, -1626, 360, 1380, -267, -2550, -2447, -97, 1171, -219, -573, 178, 943, 274, -1250, -1661, -982, -460, -322, -335, 82]
2945H2P27l99K63n84j151o01K61J242O74m03j05M69O78p02j537p22J214O28k22
2964a88r80J186K051j48k495j895J737J828r93j946J60L223J469j989k724O24
2980a080K181n36k784m79K494K796r32l014K54K338K51k578k211J736L303K37
2996A976k608q23K471J888k360l071j74K804Q09j348q20J639K277j175k608q10
3012a933J749J216j561j381Q50K347O25j532j113L79K57l38j101L76J552L35n1
3029F76n14M8j09k52m85l39k57P14P95J038k4j392j44K38L68p50j123M59J689
3048F36R70j125r55Q73J348q70k573p42K248K057p49j708M89K204L17k618j704
3065a902J376K261n46k268J50K546K052k052l483M86K585P36k418j454K140K671
$$ y = [82, 809, 410, 673, 89, -1062, -1663, -1402, -160, 514, 111, 6, 475, 1153, 451, -1086, -1808, -594, 34, -188, -1168, 18, 2069, 1921, -574, -2469, -732, 1096, 103, -1843, -1683, 1540, 3009, 1020, -1704, -1080, 1101, 565, -2219, -2698, -204, 2592, 1660, -1354, -1100, 1238, 1489, -1089, -3300, -1564, 1739, 1976, -632, -1455, 1016, 2904, 544, -2527, -2701, 103, 912, -436, -1256, 383, 2660, 1485, -1123, -1933, -184, 1032, -529, -1910, -1060, 1287, 1912, 380, -733, -354, -97, -435, -1536, -1160, 392, 727, 676, 162, 210, 101, -151, -636, -975, -1232, -518, 277, 1315, 1291, -101, -245, -7, 361, -389, -1512, -1053, 636, 1606, 481, -474, 399, 1747, 877, -1696, -2438, -190, 1867, 1118, -590, -101, 2103, 2420, -198, -1902, -526, 1735, 1189, -1079, -929, 1617, 3669, 1617, -1866, -1380, 1205, 1941, -477, -1931, 209, 2880]
3081B880o16k282o72K099J141k426k341J444L045R10k544j299J301J949p76k213
3097d00j61J375J133j053p08O78J634o40j558j108R94R39j34q92J65J068J3rn58
3116G78k09j10l94M17On6L34j75P90n84q38m30J151L93p77q27L36J553M28j356
3136D30j109Q66J094n48j840k48J740J523r58k021O66J996J40k283j394J656J925
3153A635o19k054n22K755J275k417k258J060K441R2k538r94K359K032r98k706
3169a457O5K016P33k072j423J401K459m24j808o20J617P34j212j543r0J897N65
3186H38r00o57N28J266k38j987j78O53O86l47m11K57R59Q9o22m47J59l62q1j76
3206i71L60J89J96M13K61o26j017m35Q94L80q91o00Q49J863J36j559q44L12Q76
$$ y = [2880, 2264, -18, -690, 1409, 2550, 124, -2217, -773, 2272, 3182, 638, -661, 640, 2589, 1813, -400, -561, 814, 1947, 894, 186, 864, 2498, 1858, 300, -808, 186, 1125, 991, 99, 264, 1332, 1345, 1336, 778, 569, 459, 65, 482, 488, 432, 766, 591, 1381, 797, -41, -471, 680, 1073, 296, -531, -195, 1358, 1786, 430, -679, 187, 1281, 733, -1107, -1355, 385, 1908, 950, -1071, -405, 1591, 1731, -552, -1946, -290, 1635, 1016, -1038, -1560, 1195, 2470, 53, -2205, -1145, 1296, 1388, -1150, -2144, 215, 2247, 1249, -1457, -1392, 624, 1357, -715, -2138, -737, 1722, 1298, -510, -1130, 487, 1221, 9, -1534, -1624, 273, 838, -62, -719, -191, 1075, 837, -1150, -1328, -675, 11, -336, -747, -490, 469, 558, -64, -511, -352, -714, -795, -971, -611, -422, -226, 187, 448, -178, -1195, -1630, -736, -356, -1247, -1847, -998, 865, 1001, -558, -1402, -1090, -214]
3225b14q25j330J43K424P58j744j378Q08J928m94k322j537K211K000m44j981J13
3242a884K247M02k727j630J509K178l70k025m30K624J473j570k833j14K186O57
3258c07j588j145K094J893l85k478p67J622R69j293j687M74K621N51j005j179
3274a610O82M48n38j040l3J204Q89p37j76M05O00k08j093l76k03Q71J37M73M22
3293A17l45m6j41J57m18n11m0O60P85o19J87L77Q89n97j838n43J217J612p47j143
3313i87L09J786M51j361j697R21J440l83j824l2K376J413j128k320J67J611P79
3330A521j975j092J261K505q1k567l71J914Q18j388k225P22K357P54j658r40J220
3347G75J343q53k077j02J667Q41q84j073J157J276r7j405j040P27Q99m79p30L77
$$ y = [-214, -1039, -2369, -2226, 198, 956, -788, -2166, -1358, 570, 76, -2246, -3783, -1572, 428, -16, -1997, -1884, 363, 765, -1962, -3592, -2083, 95, -275, -2300, -2730, -106, 1367, -203, -3036, -3150, -964, -307, -1895, -3040, -946, 947, 562, -1916, -2683, -1061, -92, -1385, -3072, -2598, 23, 574, -431, -1610, -928, -480, -1018, -2058, -2091, -887, 2, -735, -911, -506, 94, -114, -1207, -1583, -1786, -915, -778, -305, 117, -228, -274, -415, -258, -676, -1187, -1227, -567, 218, -401, -214, 163, 1052, 455, -1383, -1926, -709, 903, 156, -987, -678, 1108, 1559, 198, -1499, -578, 862, 479, -1345, -1377, 999, 2412, 1284, -1036, -869, 742, 1521, -454, -1546, -285, 2220, 2139, -428, -799, 1115, 1933, 545, -1680, -958, 1399, 2153, 495, -445, 775, 2118, 1265, -812, -914, 753, 1594, 710, -363, 794, 2070, 1973, 568, -472, 255, 1154, 675, -55, 322]
3365C22J049L42n86r67N74K19j59m60j92M98M90L6j4J95m60l73l7L79n7m07K81
3386F73P98k8o34m45J31R10n27j032l07J610P59r63r23J42J647j11j390j154J291
3405D47J684q80j605m8K084O95j416j815O43J707M54j910j195J628J555q84j579
3422d35p3J830O37j739j706J010K472k52j899j000J871J419q99j914j23J907J17
3439A223j160p12R76J510p63j224p46R86J066r09p88J03J231L12o42m19K67P5
3457C86o43j62J85L85K79nj72l21L22o5r0q1k35n66M51R19J67n46n40j06O59k35
3479a4j198M6J377N15j211p24P22J496j70j771j273J217J606l74j668L99J675
3496F50M41k011j218P90J759k85j745m07K019J531r40k262k17J591N22j664j298
$$ y = [322, 1371, 1713, 1127, 160, 734, 953, 794, 334, 142, 640, 1130, 1166, 1152, 1347, 887, 514, 477, 856, 799, 392, 673, 1471, 1443, 809, 364, 495, 1405, 878, -154, -461, 1149, 1908, 945, 22, 164, 1811, 1700, 310, -844, 447, 2131, 1251, -354, -402, 1682, 2377, 961, -854, -211, 1496, 1950, 40, -1155, 473, 2028, 1144, -435, -508, 1322, 1959, 220, -1486, -476, 1996, 1744, -155, -1155, 716, 2135, 1236, -678, -801, 1106, 1223, 63, -649, 327, 1837, 1074, -150, -896, 90, 1156, 247, -541, -438, 793, 1105, 463, 44, 311, 386, -257, -419, -234, 151, 430, 425, 253, -68, 254, 189, 99, 18, -217, -783, -332, 587, 754, 208, -332, -438, 221, -14, -1212, -1166, 211, 726, -485, -1209, -487, 1009, 839, -932, -2205, -988, 618, 244, -1424, -1025, 650, 1091, -920, -2138, -1348, 411, 126, -1619, -2026, -7, 1524, 584, -1678, -1895, -304, 218, -1446, -2744]
3513b744J540J815Pk053m32J550P86j379j478M86J742M94j036j060J222J059j428
3530i09r55m9R88P15m64o75N82P03K99j272m16J03O44m70J82L6N99L3l4l85Oj80
3552i19n29N95M00j25j35M40L61K2o41j257R30M18l09l85M2J307M89p70j552O60
3572i58R49j32j369n98J642J677n48j578OJ361K9j256j111J031J713l14j430P9
3590h07J152J066j482j932L62K051O89j403o88J186J465j037j872n28J870M82
3606E74o81j089P50J812J28j468j029N83R06o83j100K91J712M34p31p00K11O88
3624F08k05j098lO00M95K0p5K49J37n59k34k97M86l79K61K48L24K7k65L8L2l51
3646E9l36m54J258O10n37n13JR59m5n17q66K34R89p7q69J19J234P89j284j634
$$ y = [-2744, -1204, 611, 618, -1435, -1867, -317, 469, -910, -2388, -1902, -160, 334, -702, -1762, -540, 519, -909, -1864, -1913, -925, -210, -674, -1349, -767, -64, 235, -1037, -1453, -1350, -706, -1176, -994, -958, -359, -326, -360, -745, -739, -919, -1448, -853, -453, -578, -713, -273, 88, 110, -531, -1788, -858, -440, -749, -1134, -1092, 215, 704, -66, -1618, -958, -9, -141, -1510, -2108, -466, 1211, 663, -915, -909, 452, 481, -775, -1886, -855, 858, 544, -886, -807, 345, 1411, -71, -2003, -1641, 410, 1099, -304, -992, 194, 1659, 622, -1250, -1778, 92, 574, -107, -1196, -446, 1366, 1494, 26, -1003, -420, 486, -197, -1297, -1006, 706, 1140, 409, -291, -80, 608, 403, -695, -698, -98, 397, 417, 342, 591, 728, 169, -65, -362, 124, -255, 6, 254, 578, 605, 340, 378, 410, 59, -277, -731, 527, 1137, 600, 87, 88, 1047, 1002, 485, -381, -147, 842, 765, -104, 15, 1249, 2038, 754, -880]
3666h80M21J717K25j189r88J189J579o30j597l41J606P09j257j067M55J836M16
3683B204j774r37J130J300m70j788K5J309Q43r11j252J010Q18q6j176m95O88J193
3701A631p80o94j91J124L20p29n77L97N28J8r08l6M11O10m58l07k25L73L34m02
3721D39K9j0m1o6j08L94Jl12j71K89L39r97oM11L70l76n97M24P30L40j137p29
3743g84Q20O53n08q24o1J044N60j113q53O14J206p7j393o73J306J026n76r59m36
3762a028J015P47j146j234R41J296K36j581n71J264J021p31j824J23J609K7m16
3779b52r35P44J219l77j265l17M12J078n73j035L66J129J55m77n44L51J36k85
3797d70n74J53O76L17r8m46K56k03k04J84l97K0P1K25N95J17m54l48Q0K5N2n38
$$ y = [-880, -459, 1258, 1483, 294, -694, 495, 2074, 1444, -153, -494, 1112, 1821, 564, -503, -48, 1788, 2204, 430, -507, 623, 1923, 1453, -335, -310, 999, 1842, 931, -321, 689, 1507, 1421, 245, -250, 438, 1631, 851, 157, -34, 1090, 1410, 681, 104, 501, 1029, 1047, 139, 103, 514, 1124, 666, 359, 134, 507, 841, 439, 468, 458, 417, 351, 243, 637, 638, 326, 155, 444, 783, -214, -220, 191, 561, 185, -412, 12, 742, 1082, -55, -784, 36, 689, 181, -643, -704, 340, 900, -213, -1066, -452, 754, 677, -716, -1389, -83, 943, 367, -592, -1028, -13, 734, -412, -1646, -705, 591, 827, -754, -1325, -61, 960, 229, -1595, -1472, 137, 164, -252, -1187, -443, 776, 399, -866, -1183, -771, 307, -266, -1301, -935, 194, 349, -128, -672, -321, -185, -470, -1044, -891, -215, 102, 4, -442, -186, -389, -593, -409, -806, -786, -715, -490, 105, 222, -232, -580, -500, -475, -423, -961]
3819i61K47O00K29l40l43J37O89l89j237m3P81P26P5p10o6J110J07r71j285P00
3839i44J533m33j130j77J409P22m84j751j81J645N5q83p33J020J601m25j603n09
3857a268J382O20j087j351R73J391L91j247n95N52P39n53j016n3J423P03r46l77
3875c19L10P57k81j322j76K95R66k42l90kQ99J32p77l56j06M49k31K0j5L93M13
3896D17j48j64r9m43j91L23L02J66l91K37M31r5l13o73Q8Q70k27q19K18J139M41
3917A069o42q74N0L88P17j075o02Q53J494l36j347k83J312L81r40j492P19J688
3935A080j20q85q72J172R42n51j343m65J471Q25j236p47R57J198l93j297n10J019
3953B45N23k11j228N74J106O4o02n30N3L94K74p91k23R61M15k64m50q5K74N3o30
$$ y = [-961, -714, -114, 115, -225, -568, -431, 258, -131, -1368, -1411, -630, 96, 171, -539, -605, 505, 612, -359, -1644, -944, 589, 156, -974, -1151, 258, 980, 496, -1255, -1436, 209, 264, -619, -1352, -332, 1269, 844, -759, -1268, 114, 734, -353, -1704, -731, 660, 1051, -196, -791, -239, 500, -53, -1069, -1122, 301, 1004, 58, -319, -9, 748, 467, -855, -1031, -736, 230, -12, -402, -404, 495, 627, -150, -506, -612, -163, -394, -374, -389, 4, 417, 269, 105, 6, -437, -628, -305, -3, 163, -228, 9, 440, 345, 32, -641, -553, 317, 90, -729, -511, 628, 1069, 427, -447, -397, -9, 708, -367, -969, -116, 1378, 1042, -305, -588, 724, 1105, 165, -1327, -608, 1080, 960, 75, -797, 375, 1317, 766, -577, -1042, 429, 1254, 18, -729, 228, 1426, 1033, -264, -774, 245, 768, 557, -671, -97, 1009, 1073, 471, -59, -6, 388, 662, -129, -352, 609, 1024, 760, 310, 225, 499, 552, -78]
3974g8m5M78m3J39m1l6K97l59J44m12K92l35j3M51O46n98o75L13M67Q8n88n28
3996d36N16M39J21q05j5J015k80p30n61O38Q40K94j037o86N45J220m31p51o64
4015g68J184N90j057p37N24J273mj307q20J260J040o76j286K38J045J92p44p86
4033h39O80J051l94j280J35R95K91m84r51M17J007L11j243q0M04M82l0q45j62
4052e35O83M68o35j95L2Q06m99Mk36J66j55K50j48J67J58n17j13M13j81k47QK65
4074d1J75J50m83L12O01l68m61m83N71O39l28n48k46P70L96m74j086O48P71p6
4094D39j019p1J091M04l35p86m21J017M94j373l01R44Q17j74j023l36R28J44o26
4113a87q56J68J304q6p13l33N68J111q94j013j06J076L17n49l04J90R45j05j056
$$ y = [-78, -123, 355, 312, 451, 410, 374, 671, 312, 456, 44, 336, 1, -12, 439, 1085, 487, -188, 125, 592, 680, 92, -436, 80, 519, 640, -165, -180, 835, 555, -175, -736, -98, 742, 1036, -1, -687, -142, 1078, 647, -104, -768, 416, 1006, -51, -788, -264, 1009, 1005, -302, -1122, 138, 1178, 502, -784, -546, 499, 691, -53, -839, -159, 892, 498, -782, -647, 348, 639, 155, -796, -379, 628, 939, -304, -384, 20, 502, 472, -373, -535, 148, 616, -19, -214, -182, 624, 125, 129, -107, 59, -96, 154, 6, 173, 331, -186, -299, 114, -67, -314, -306, -41, 134, 284, -199, 113, 714, 346, -115, -598, -27, 612, 284, -264, -510, 260, 656, 182, -904, -256, 515, 439, -580, -651, 440, 844, 509, -277, -698, 319, 813, -560, -861, 83, 900, 726, -297, -633, 295, 439, -187, -1043, -875, 429, 343, -370, -703, -135, 976, 82, -931, -1037, 39, 356, -193, -497, -307, 638, 533, -523]
4132e23j87L65L32m6q42M43J031k71l65o36M89J58J26p88K20J55L18j74k15M57
4152D7l22R1n73N3O07n35J60O86J79k87o88L23M66m33p06J37N95P98m18n01q4
4173d05N43j72n97m99O31P66J72q17m38J327K35p53j179J65J334O24j063q13Q51
4192h8Q85m14j325rJ117L22q00n20L53J147K54j387m58N78Q77p13n92kJ297L38
4212H60p74q59O70N89o7q65m88P38P86m72j07k83O67k00n28j07L85J41Mj85k1
4233a16J62M07m97k83L36m04M14j59K86j80J82k06J59J42K13j024J11N23Q3k33
4253h4m1N76K04n58r37M34N35L08n74m71N49R15l94p70j29P52K52o71p23M80J116
4274G69J42r54n47R69O01n52j226P6J236j30l54o45P82P14j66r75k97O41Q05o24
$$ y = [-523, -710, -345, -13, -59, -901, -458, 573, 302, -63, -699, -210, -52, 74, -714, -494, -339, -21, -195, -410, 47, -275, -184, -757, -704, -97, -632, -472, 214, 393, 106, -582, -259, 207, -226, -932, -795, -200, 598, 180, -321, -405, 138, -34, -631, -1130, -499, 267, 439, -378, -816, 511, 746, -7, -1186, -1021, 313, 937, -126, -939, -88, 797, 383, -942, -951, 166, 488, -312, -832, -479, 668, 922, -465, -923, -345, 532, -181, -773, -775, 522, 860, 86, -773, -103, 486, 419, -446, -934, -196, 590, 118, 11, -272, 395, 195, -333, -440, -55, 86, 90, -95, -116, 46, 453, -44, -327, 9, -395, 19, -140, 146, -34, 148, -58, 101, 243, 456, -568, -457, 66, 149, -84, -125, 451, 655, 97, -840, -406, 129, 437, -137, -608, -59, 856, 462, -308, -437, 315, 567, -104, -827, -347, 769, 911, -43, -590, 379, 980, 428, -798, -722, 514, 384, 30, -615, 167, 881, 715, -260, -557, 84, 889, 265]
4294B65q76O56O79p1o05l67L86Q88m30q33J35Q22M34p71k65J66K80L5n23J5L37
4315C57M14l85j01p7L58L27k92n28J99N9Q1k52K07J47n2k78M41k8k45l62M30M11
4337H31n2n43k09N95kl45j88r4Q10J53q73n48Q54N09k50o97j60Q91K25o71n97
4358c61L74R42l14o11l85J005L78l26j433J32J240K77p80n28N73Q23l10j232J39
4377c97P34O29p75p87L27R65N1o25n90M71K86j78m58m59R50K62m49m63L60L77
4397B31n7l14o94Q77J10k38L78l03J92k45l61j91J11K47J02J29k24L68l29j70
4417c81J93K17m60j74N2P94o27k32k6L85L11o00j98q7Q70Kp31K70L81O64n77j183
4439a137J21Q97J85n64l26L93P51j69n63k93N42L96p25o41M5R69N25j032m49Q20
$$ y = [265, -611, 45, 724, 653, 48, -319, 67, 955, 525, -308, -173, 649, 1083, 312, 47, 213, 493, 528, 5, 20, 357, 771, 386, 285, 208, 566, 893, 601, 73, 272, 331, 412, 160, 367, 514, 462, 184, 625, 597, 352, -10, 420, 831, 779, 236, 27, 622, 620, 275, 87, -7, 803, 956, 83, -465, 389, 898, 648, -49, -209, 682, 907, 236, -361, 13, 955, 641, 30, -355, 650, 1028, 702, -731, -599, 641, 918, 138, -390, 183, 1006, 696, -536, -397, 337, 966, 191, -596, -269, 696, 747, 122, -468, 3, 289, 111, -347, -806, 144, 406, -43, -506, -146, 231, 174, -140, -834, 43, 153, -85, 293, -10, 182, -63, -424, -615, -504, -257, -155, -26, -250, 118, -211, -381, -188, 29, -431, -605, -553, 241, -386, -618, -644, -259, 52, -548, -746, -833, 37, 39, -692, -422, -41, 623, 46, -1137, -1016, -119, 66, -498, -824, -431, 320, 151, -412, -705, -163, 233, -492, -1133, -1088, -119, 406, -626, -1075, -255]
4459b55M91o67l83j24P40L81o95l50N88M35p9q75l48Q29N18l88p72N17K69L45
4479A77n90j21K08L15p7m61k57N32M67m66j38m2J51j70O5m06N43ok64J51J75r9
4501c13l5K6k28M8M4j80N30R5L3n70k31O33J51k54m09O8O59k49l69OO62M7l53
4524a89q56J70J031P8p61j42M91M91K30j199j57J140N6m29o40L48P86K45r48n00
4544g55Q58L88j88r57K35J053L5o22l84M47O21j81j088L24L53M77n85l96M36L03
4564C74N5m15J36M0O3N8l80l4N43RO3n33J50R8J21J44j17M2k10J08K12j14mj38
4588B71j93M75j06r5j03L62j2j82o58J50P99K14m54o83N45O59n04p87L71L81K30
4609F80k24p54L79O66J14j091j86P28Q27p44m32j42O96O8o04q5L45O61l18p19
$$ y = [-255, 236, -431, -814, -938, -198, 183, -512, -862, -274, 161, 82, -793, -1141, -312, 206, -182, -954, -437, -168, 177, -413, -534, -326, -11, -88, -549, -806, -274, 193, -273, -411, -453, -302, -472, -407, -813, -270, -276, -540, -389, -214, -313, -348, -322, -550, -502, -458, -638, -108, -13, 20, -550, -781, -148, 3, -251, -660, -592, 67, -182, -551, -545, 117, 164, -189, -1045, -875, 156, 234, -527, -669, -178, 313, 543, -656, -813, 327, 383, -46, -686, -338, 448, 693, -255, -755, 103, 491, 303, -654, -419, 634, 669, 47, -337, 110, 731, 550, -538, -214, 139, 616, 31, -365, 71, 374, 429, 14, 150, 190, 253, 311, -69, -103, 440, 449, 512, -21, 129, 227, 348, 492, 375, 417, 207, 315, 527, 413, 409, 271, 78, 553, 447, 352, 249, 611, 599, 417, -241, -91, 708, 922, 468, -215, 330, 989, 485, -302, 69, 450, 680, 456, -298, 81, 747, 861, -230, -416, 312, 1139, 395, -37, -179, 517, 585, -19, -104, 241, 902, 584, -135]
4629a35m6N45L51k23o40P6O36L70j065m92M90Q45k96q15k4O63K78n91l09L47L84
4650C49K47q46j42M19K49j32l41K05J97k31Ok60K98M7k65p1K76K04j49j10j30
4671a80M17k57k34k93K87M45k87mJ74M61m31m88j31N16R5n54O7M50K84j17o83
4692d63k7L03N37p51k63J56Q84Kr77R4M23N93n53p40L74O07P8o77k14K02Q93k85
4714A96j178L08P32L75n11l68K22K28K58p12m38R69Q1l03n66L76L60M71p18k91
4734e09K89K06n8m74j69Q11L3k10n4J42R1m25m9n3L39m8J04k38m5J79Q2l28j64
4757e48L14j53j54J78M06l1j14k47J34J85p0n72K82M73k02n32L60K56K14n20k70
4778f11J71M90J49m49j72L00L62rr72L48L43L95o71l06L12P18J97p95l17O43K9
$$ y = [-135, -181, 364, 715, 492, -148, -72, 564, 934, -131, -623, -133, 712, 416, -399, -423, 240, 518, -73, -382, -35, 349, 596, -250, -392, 27, 276, 144, -197, 8, 205, -26, -20, -280, 18, 65, -200, -271, 5, 209, 60, -50, -180, 237, -20, -254, -547, -260, 185, -102, -106, 68, 529, 98, -390, -521, -5, 90, -464, -397, 53, 337, 220, -463, -490, -187, 350, -401, -664, -508, 376, 378, -599, -505, -82, 511, -42, -782, -408, 199, 277, -400, -614, -412, 481, 196, -982, -674, 58, 433, -78, -446, -224, 4, 262, -450, -888, 81, 162, -141, -707, -331, 29, 500, -218, -509, -220, -14, -72, -546, -715, 96, 129, -81, -135, 7, 98, -327, -376, -429, -90, -138, -34, -272, -317, -138, -56, -384, -548, -234, -387, -541, -363, 43, 12, -102, -349, -215, -30, -100, -672, -390, 83, -119, -651, -291, -35, 179, -341, -611, -440, 50, 199, -250, -422, -122, 240, 231, -741, -393, -50, 345, -326, -632, -320, 398, 595, -200, -517, 126, 155]
4799A55q2p98K76N18N33p06m26P50R5no46l45O49P25o33J3k31O15J30n10m79J16
4821b86Q41k98m51J60K05K61j01l74N2J60J32n76K46M03P8q2n49N38k53j72l7
4842a03K64J41Q3j74L5L03R4o10j30K50K79j45k01k20O62k68l32J35K24L17k57
4863C47o74K55N96K38o57o06O44O07l37m38k31P73rl12p01M68O73l26j83m18N40
4884B49M49n64l56k1M95L75m81l00M17K29l80l33M0O75j30m55j4Q2P10l74j25
4905A88k79J70M46k10n22J1O82J93o66k16K48R2n4j69k34K31M73k83M1j48P7j46
4927g5j66M86l26o7K88n2J24L0m71L85p9J63km21L00K04O9o74L80K89K42q65J30
4950a08J08N19p1o51j17L37N69n72m41K20K40N72n89m38M38N86k60o42j88N75
$$ y = [155, 73, -725, -449, 69, 602, -104, -530, 220, 315, 310, -336, -681, -32, 693, 60, 73, -158, 457, 587, 77, -402, -286, 555, 257, -194, -34, 171, 432, 331, -43, 9, 169, 301, -275, -29, 374, 452, 370, -179, 359, 106, -66, -103, 161, 302, 385, 211, 246, 549, 643, 33, -97, 153, 432, 287, 86, -134, 528, 260, -72, 63, 287, 604, 347, -327, -72, 524, 762, 105, -501, 143, 750, 413, -25, -256, 517, 508, 196, -505, -37, 636, 310, 127, -291, 249, 698, 134, -222, -243, 252, 627, 146, -154, 263, 492, 112, -221, -181, 494, 364, -91, -105, -23, 687, 313, 188, -91, 79, 525, 315, -207, -196, 486, 679, 13, -203, 45, 137, 83, -86, -320, -89, 384, 101, 142, -6, 71, -75, -241, 245, -81, -148, 140, 88, 212, 242, -229, 156, 77, 240, 238, -183, 117, 321, 390, -284, 96, 385, 627, -238, -108, 0, 519, 448, -203, -320, 17, 586, 14, -427, -207, 33, 605, 16, -422, 16, 602, 342, -300, -488, 87]
4970H7L00n46k52K11Q93k73m92l25J67M35j98n55L57M85P8m60m93J22Q75j03m43
4991a30o71N88J64K31m91R0O32j7p03j22n5N02l7k82k43M57J58r8k07k29R0K7
5013c46M5n1K50K34k14J54j78j28J04l18P42k66j77L3J63j0Q5m76J2P8M75n16
5035c05j8QJ65J87l68K50k19J93n3j44k20K86M98n61j07L01K88Lp59Q8O75L00
5057D88k37q17K74P12l47k62n60L73N56p9m63Q0P52j5m86m18J46L20J40o82K19
5078c06M88L69p14J99M7J66l50O0l01P11j96k09Rk22K79j0p9k65J06K07K1J04
5100A14j3j08r4O2k47q3J48K16n68K46L59N2n45O17mk72j94J22L07K09m92QK73
5123A13J47k8m29k02Q20J84n62l53J84P13m18J4r13Q09K30k33l53j96Q96j91k27
$$ y = [87, 387, -159, -411, -200, 693, 420, -72, -397, -230, 205, 7, -548, -191, 294, 372, -88, -581, -459, 416, 313, -130, -801, -213, -49, 182, -309, -219, 413, 396, -307, -429, -484, 18, -19, -301, -544, -87, 71, -27, -234, -463, -373, -346, -301, -352, -102, 132, -82, 72, -106, -234, -130, -448, 294, 28, -149, -116, 47, 37, 122, -354, -342, -264, 211, -305, -323, -315, -150, 37, -331, -81, -300, -107, -160, -304, -524, -238, 260, -301, -408, -107, 181, 184, -575, -487, 188, 488, 251, -566, -292, 420, 73, -189, -749, -376, 180, 101, -362, -282, 470, 455, -31, -449, -303, 17, 157, -525, -306, 182, 551, -163, 36, 83, 249, -101, -41, -342, 369, 173, -36, -27, -249, 30, 20, -59, -324, -218, -11, 10, 114, 101, -7, -101, -39, -286, -369, -221, -5, -573, -327, 32, 84, -461, 156, 152, -120, -314, -192, 115, 324, -168, -160, 113, 260, 232, -197, -399, 421, 605, 43, -310, -126, 587, 169, 183, -730, 79, 309, 76, -277, -473, 423, 232, 5]
5144El86M6P96m77j50j64L87O25l77p00M44K49J05n18l70O05m5J36q00M33L79
5165B23p5m5l98PL64J32k0n20N79L7j26q2j9j15K85l23o9J66J25k8N0J19k38M9
5189G8j0K8q8N4L18l47q2K21k3k42%K54j42m9J48L40k48k54J99m2M40l87n50L04
5213h0K44J32j33j69O0N82m13j67l09L71J51p8l41L50R0K56o28j74K78P00n12
5234B10m18N5R2N58l17k03r7N75q7m21m1o9M34J43j64p10Q82r4j03l75j63N86
5256B73o2j67l47N07j3Q1m25O9j9O1j40j82K15L24J3K2j4k71j04J21ML18k63j60
5280a59R5L14J64o51R0K98r7j00j01mO57l60O4n76M07J60k14o38K50L14M95l95
5302A3l61L63%K32o73lL38J83j7l75p5J077j55n16n52M67L51m70J18k06L20K43
$$ y = [5, -381, -335, 461, -16, -166, -330, 57, 682, 305, -395, 49, 298, 403, -115, -485, 120, 75, 211, -589, -156, 223, 148, 103, -295, -288, 76, 208, 188, -332, 247, 284, 158, 76, 57, -58, 227, -96, -165, 1, 126, 98, 148, 267, 29, 78, 68, 96, 8, 62, 380, 33, -49, 172, 149, -93, -93, 161, 19, -30, 118, 458, 210, -44, 155, 113, 553, 166, -384, -80, 164, 296, 163, -6, 54, 636, 223, 56, -253, 118, 269, 191, -150, 200, 290, 546, -82, -256, 22, 722, 210, -208, -153, -61, 497, 180, -23, -120, 455, 368, -53, -94, -163, 271, 414, 250, -460, 422, 328, 225, -150, -313, 273, 211, 44, -303, 204, 191, 272, -153, -84, -103, -42, -182, -364, -149, 175, 188, 210, 196, -75, -179, -58, -54, 264, 1, -159, -64, 250, 414, -237, -147, 151, 54, -46, -147, -151, 506, 146, 210, -366, 41, 201, -13, -651, -401, -87, 408, 13, -348, 15, 15, 247, -426, -429, -91, 92, 75, -300, -375, 702, 547, 31, -521, -54, 297, -173, -55, -261, 59, 302]
5324C02k95m67L82L28k75n10l3N51K00J27m20K80M0j15m6k42M14p7j28p9JK18
5346A56L4j83l78J00j7M60q2k45J02J35l2K84j06j64k36L5m6J89m3n9J57O7k92
5369a64k77K98M6K08l44j21L29K28j45k44NJ61j08P0l32K76O38m48k75j06O8N43
5391C06l80n3L3r7O87n13l80K53M61k59m87q9M14K85k5m00r1L32K38l03m01L58
5413a11o0J83O4m76K96K54n14J04k11M99K33m55L6K29L13o96k45M09K32j37j90
5434b43J48O6J48j96k15J5O67k83j93L82m86K69j85K37L8l14J45M5m26O09k42
5455a4j79K67q0K85m79J02P6J31m02M25k36K79K57k67m33J01O19k84q1r3k9L22
5477B87k10m14K30O63j84l12n3J56J49N6n01j54N80M8l45k36K71K87K25o05J9
$$ y = [302, 7, -460, -78, 250, -25, -535, -568, -17, 183, 310, -110, 170, 210, 95, 49, -193, 221, 144, 16, -63, -62, 156, 190, 7, -371, -271, -288, 172, 90, -155, -53, 82, 50, 334, 228, 64, -172, -137, -183, 6, -37, -96, 61, 128, -164, -441, -143, -97, 111, -233, -354, -25, 203, 58, -186, -181, -20, -128, -58, -390, -114, 524, 76, -199, -305, -237, 306, -74, -127, -94, -191, 496, -17, -397, -144, 317, 58, -429, -518, -104, 181, 156, -244, -335, -3, 235, -68, -469, -111, -171, 12, 76, -400, -104, 150, -364, -260, -471, 28, 261, -194, -158, 71, 384, -312, -557, -148, 84, -53, -243, -95, -29, 119, -77, -292, -277, 390, 107, -86, 296, -190, 79, -106, 131, 169, -145, 0, 45, -381, 228, -14, -193, 74, -6, 279, -200, -98, -22, 109, -293, 132, -104, 175, 432, 165, -268, -167, 452, 168, 87, -6, -35, 287, 77, -337, -107, 556, 372, 60, 7, 163, 312, 368, -133, -287, 293, 341, -4, -240, 31, 318, 543, -62, -43]
5498d3M0J4J9o1j12N27j53k36M7k4L50n43M8j50K27J24K18o00L16J15pl38J18
5521a04J98j5j02k31K24M07l78kj8n6J40nK62k39j35k4L86j03J3m2Qn69N22q0
5545E7j04R4oJ13l45j9J64J36L76k36l52K12J42K14o46j04N36M4J30p76L00M42
5567C72P6n07j87R3M83m44K04l69N39K90n38q9j13M59J16n52j68N02L27Q9p63
5588a80L3M82l44l41J07K19J70K25m13KK18J91n48J79r6P7L61l66j20L49P7j13
5610A69j5N0k53J39J12n33M06O0j17j69L97j07k93j25J44Ql51L52m2M28k38j27
5632a05l7J4M4L40j003K29N66n8O6l34J08L33j63j05q0J56N74n34l21q2P28k41
5654I5l29q4J78J39J47m04R3R5J90k05l63M13Q5M3n22j10M83K24k58q1l8J32k88
$$ y = [-43, -3, 11, 30, -31, -143, 384, 231, -5, 42, 18, 368, -175, -127, -277, -50, 74, 292, -308, 8, 123, 116, -222, -104, 94, 79, -23, -254, -30, 377, -1, -3, -21, -77, 63, 58, 320, 81, -54, -78, 308, 205, 218, 176, 184, -385, 137, 57, -47, 47, 41, 154, -191, -210, -46, 90, 466, 230, -122, 90, 232, 446, -200, -304, 232, 276, 406, -370, -70, 372, 448, -59, -246, -153, 330, -114, 90, -279, 260, 550, 12, -77, -190, 269, 385, -167, -335, 167, 494, 583, -180, -147, 335, -9, -350, -243, -24, 146, 371, -42, -40, 178, 369, -179, 0, -96, -19, 342, -24, -144, 205, 282, 169, 154, 204, -49, 90, 202, -331, 75, 135, 18, -151, 246, 139, -154, -279, -135, -127, -478, -126, -168, 260, 22, -105, -142, -128, -84, 256, -747, -518, 48, -10, 56, -278, -170, 163, 0, -105, -185, -29, 545, 11, -310, -392, 336, 95, -234, -318, -140, -1, 146, -258, -165, -70, 120, -85, -448, -35, 50, 93, -429, -539, -56, 168, -90, -171, -209, -77, -365]
5677c65J56l18M58K37j55m80J03j2P47q16K80l21M93K37n35L54k29J14q3P7M6
5698a2L36m71k71L89K51m74K36o0o3J71r9J68q9k2J35k83K61r7J76l37k6J26K54
5721A99m65qJ98J52J52k04j24Q8K5J87k15k01J87K26k24j94J65K55j7k03n7K43
5743A65J80j87m66K05J08L80m20j80R4L45j39m19J80M96k28k02j31rO19j98m98
5764c05O1L93K73l00k81J05J45L58m72Q9j3L44n2m63J64j66K25p7K1K1J92J22
5786C84m66Q6K34j78J21m21K04R5j22J13Q0L15l98j14j70L05L6k12N8J76N2J00
5808B78m82K0N16p7k35J87k5R1j41k09n1K31K85j97l6k04M83m65L3j66O52m16
5830G2j65O4l6L94k93q0k19L78K23M4o11oN18J42m75N4PP2K6k7j95K89r9K5k2
$$ y = [-365, -209, -527, -69, 168, 13, -467, -364, -376, 371, -445, -165, -486, 7, 244, -291, 63, -166, -52, -135, -58, -12, 324, -147, -418, -29, 222, -252, -16, -76, -139, 32, -67, 101, 12, -10, 125, -158, 103, 6, 182, -155, -181, -55, 199, -266, -274, -76, 76, 228, 24, -100, -12, 13, 200, -15, -216, -29, 197, -27, -221, -56, 199, 182, -21, -78, 165, 345, 158, -308, -103, 5, 385, -35, -215, -121, 224, 85, -334, -154, 342, 114, -88, -219, -228, 391, 193, -305, -244, 149, 422, 122, -159, -54, 91, 449, -23, 66, 53, 397, 345, -118, 46, -120, 105, 28, 49, 70, 262, 384, -82, 4, 238, 60, 181, -240, -36, 59, -63, 50, 130, 445, 47, -67, -237, 68, 104, -108, -50, 126, 178, 278, -204, -184, 332, 255, 20, 207, 182, 273, 132, -77, -128, 103, 388, 191, 155, -49, 434, -31, 2, -164, 488, 72, -93, -29, -65, 329, 36, -44, -263, 115, 338, 382, -229, -235, 283, 425, -50, 4, 11, 83, 109, 82, -113, 176, 77, 102, 80]
5855H0k38L91J29n75J35K06O7j40n4M4k0J11k64j03K80k8p0k29O04J33k11l35
5877h7K5j13j3M05m26K95J85j15j71q8M26n26q7j8K30L66m45J17J05P2k19rl58
5900d49N34L5j62m70M13K83J30n59p5O77k54j06m24M17k06L04R0n03K41J48N0
5921A14l47j1L33L1Q6n19kJ13J87j44J63q6P4k9r6K9J29n3l51L3K66R5J39l14
5945a60k96M58O6M1J0l11P6J65m55L62O1k62j24M45k20L38k87J04k65K45m4k98
5967c51R4R9J68O2l61R3J86m45M42k42K30L61m37q2J94q8J95l78qL45L81m56Q3
5990H5q1J0r2j0l31N44P1q9k68n9J57M09o53j3M53l15L16j21J2L58k07l41K52
6013H7m00L90L23m70o4M07j16j06l54L61k54N78o25J12J54j39L51l86J86k89M69
$$ y = [80, -158, 233, 362, -213, -78, 128, 195, 55, 1, 45, 25, 136, -128, -231, 49, 21, -49, -278, 326, 459, 248, -87, -62, -175, -188, 217, -209, 86, 271, 156, -15, -103, 323, -203, -290, -308, -78, 288, -157, -40, 65, 137, -82, -91, -449, 85, 120, -42, -512, -99, 184, 314, -245, -320, 357, 103, -3, -427, -10, -216, 88, 178, -325, -84, 64, 114, -233, -244, 89, 120, 206, -313, -315, -202, -15, -159, 4, -82, -8, -37, -133, -104, 25, -28, -379, -346, -80, 15, 154, -160, -456, 2, 68, 109, 119, -192, -116, 49, -406, -44, 17, -245, -369, 76, -144, 194, -93, 11, -254, -9, -53, -351, -257, -158, 10, 72, -289, -196, -10, -455, -13, -255, -25, 336, -101, -183, 11, -77, 118, -260, -268, 77, 458, 2, 85, 4, 14, -78, -88, -419, 125, 196, 107, -161, -220, -63, 346, -307, -320, 133, -182, 134, 13, 25, 383, 176, -165, 87, -313, 77, 400, -70, -134, 273, 157, 51, -303, 58, -196, 382, -243, -131, 23, -116, 235, -151, 35, -254, 215]
6034B15j72j34K92j55J7l19L76r8l8Oq8K92k34J44o6j63K22j79jP1M0r9M37l49
6058A7qj67J69j74J42o5K42k65J26J46J43l19j45k88N21q3J97n10O30m8K0k46
6080C5q9L11q3K38l68J13K68n5k19j05N3K13j23j42o1L07j36J98k72l3J64j31
6102H3k25N9j17O13l81k92L54O4p6j37J76p1N4R5k54M3J20j09J73l49K21N8k46
6125a44L50l3Q5J2l33K96m02L77j77K9L5m5J18l37M19q9q6j62k8L82K1m84r4L29
6149C9q5K21k24j10L5L73k50j81j11N02Mk64p0m9J69K24l48J50j4J25j88j34L10
6172A24L07k03q1l33J77M50m60lj33M05l51K74k53k18M26p7m26L18K15j11J66
6193B13o46K87M7L04n60J08N95j14j1k58j56k1N52q23O10k70J3J74j62K78J14
$$ y = [215, 43, -91, 201, 46, 63, -256, 120, 22, -16, -10, -98, 194, -40, 104, 38, -125, 97, -82, -83, -12, 28, -71, 366, 17, 9, -158, 11, -163, -21, -86, 156, -109, 17, 163, 306, -13, -158, -446, 75, -8, 189, -321, 309, 261, 281, 35, -54, 257, 174, 412, 44, 157, 425, 370, 151, 46, 99, 312, 189, 47, -14, 293, 157, 355, 83, 50, 214, 83, -142, -83, -200, 413, 32, -260, 94, 158, 82, -55, 121, 50, 104, 199, -55, -12, 108, -1, 172, -177, 44, 102, -144, 206, 173, 258, 270, -63, 233, -169, 208, 31, 60, 95, 50, 168, -169, 250, 161, 75, -87, -115, 267, 288, -196, -290, 39, -46, 175, -49, -159, -124, 249, -1, -182, -293, 209, 213, -51, -121, -170, -1, 223, -125, 25, 11, 136, -52, -186, 124, 431, 228, 147, -186, -9, 441, -19, -22, -155, 250, -101, 173, -80, -298, 128, 51, -375, -57, 158, 47, 213, -433, -146, -99, 205, -355, -247, 348, 234, 223, -35, -191, -212, 340, -483, 127, -143, -130, 44, -118, 160, 274]
6214B74k32R2O7o39M75j48j41K65J92l45J00J71j60M0o4j02L74k44j81L2J68L7
6236C1J13k22l12N18j99J25J1k77L95Q7m09j10K12LL59n84q0M12O4k51l9P1K11
6259A29k4l30K21k27J34n7j08J05L14M0k59n8J24J12j94l86J42K19M31m02r4j05
6281b73K28m3m8J0K07Q6j50m40L51o0K25M6l69L87j13J60j4m97K33K56j67j72
6303a57L57j25o6m2J41K18l21J26j21j4L0k95QM23j13j07L6j67K46Rl37K04L75
6326C08j98K04m94K21K35j98l34J45J73K37k1k92J66nR5m05j41M41qK01l03l00
6348b73L70J23j79j06m4N0J22j12l67L87L80k30m10K94K10o7p6k40K27M5J63k97
6370c0m5K17j78j26M49j84n6p9j43J39J15j97j5J04k32L00L4n1j71K99j87j32
$$ y = [274, 42, 134, 201, -438, 37, -111, -252, 13, 205, -140, -40, 131, -29, 11, -53, -155, 219, -25, -206, -174, -6, 31, 144, -78, -390, 128, -71, 54, 65, -212, 183, 270, -139, -249, -37, -34, 325, -259, -339, 73, 137, -114, -153, -82, 129, 105, -225, -4, -231, -97, -154, -262, -157, 157, 197, -62, -120, 4, 116, -78, -464, -322, -103, 328, -74, -168, -273, -45, -88, -136, -126, 81, 167, 17, -423, -72, -132, 93, 139, -230, 157, 44, 204, 190, -307, -74, 182, 15, -157, 200, 75, 9, -33, 108, 326, 5, 131, 10, -4, 26, -269, -261, 162, 49, -58, -22, -189, 57, 66, -271, -67, 308, 110, 314, -180, 41, 276, 78, -256, -111, 62, 299, 278, -14, 152, 147, 242, -163, -304, 137, 129, 330, 27, -273, 97, 220, 41, -65, -109, -59, 63, -49, -416, -29, 351, 121, -289, 5, 215, 148, 72, -168, 59, 104, 267, -30, -75, 142, -36, -162, 287, 103, 47, -32, -175, -36, 79, -118, -133, -29, -261, 39, 73, 22, -149, 150, -37, -169]
6392a69N6L31M7k90J19k97K00pK73n22j45L01l4q8J41j33L8P4k5K80J70j29k25
6415c4J5J68N6m13P9m6O41n08o5K95k01K94j04l23K7L32l5m34R4K64r9J50j73
6438b0P2O07k86n53M5J51R0J08l16J09J50l9O5l70J62K69j18l10k66M82p4K04
6460A62q1o6j75K51l3J6Q9k27j07J12K0L22j06j41o3j98L23J77K8l47K40j26r5
6483b5J07k46L66j71L2o3J0j51J52o7N7m4K84m07N88l09%k61L34l39J73k20K98
6506I8K32O2l82j70j1M28l2l5n81L83r9Q3Q7j67P6Q2o0k13k0L20m0k28L3J42J75
6531A63Ol32m1L32l70m5M9J14L82j84k39J19L81m19J56%j27m8O2j04J0j9K02R2
6555A40l74J00K48j92l69M81O0Lj09j66j71J32K21l96J50M55j59M1p2O0l6k17
$$ y = [-169, -113, 218, 265, -25, 94, -203, -3, -10, 263, -259, -404, -103, -137, -225, -84, -217, -179, -105, -130, 150, 320, 191, -34, -19, 149, 205, -208, -129, -175, 466, -42, -107, 188, -13, 281, 177, -146, -119, 213, 178, -256, -162, 102, 3, 153, -20, 52, 659, 373, -180, -135, 16, 106, 214, -102, 7, 157, 118, 183, -187, -25, 244, 126, -184, -450, 32, -42, 162, 81, 15, -160, 91, 58, 74, 163, -64, -171, -59, -39, 283, 177, 36, -27, -225, 98, 275, 303, -44, 196, 70, -25, 82, -164, 202, 31, 63, 0, 10, -141, 11, -56, 1, -43, 241, -166, 422, 113, 113, -148, 186, -153, 20, -200, 98, 330, 392, 10, -160, -171, 257, 225, 190, -391, -8, -107, -24, 63, -104, -28, 54, -6, -219, -239, 81, 41, -187, -154, -12, 163, 169, -163, -204, 128, -242, -287, -238, -124, 258, 74, -165, -46, 335, -84, 72, 72, -55, -103, -41, -145, -135, -154, 48, 140, -234, -134, 114, -78, -447, 34, 94, 97, -12, -178, -349, -217, 4, -392, -242, 213, 54, 95, 23, 83, 47, -170]
6577a70L7K89k59J63j38m9J30j11J39k00K67p4nk16J2K32k95J17j09J1L67o2k6
6600E0k4q7j03J10k0r1J35R2j09k6P3q4K51r6j85O7N4q2l9J71m11L93j19k7J97
6625I0K67j01m21L3L4L44k75k05m7J56j29J78j28R6K11r4r9P6J04j22r9q2M09
6648A96j45j26K00l08K51K4J7j73k0O1j43P7Q6j32r9J7K36P3k27J93k9o2M5l28
6672c16N24k07L35k71k5j72L32k00O0k4j10O3L53n11k2M14j0l66J40N7k30L28
6694A42k46n9J56K0O2j11k7K72jJ20n17J99l8K07k06j54J64P5K30j85m5M3J69
6717B70l54J26M0L92l59j09r0J02K69m6k60N3J8o3J39J16l7j36l3k50K10J62k17
6740e7L4K38L4j78N9j05l2M05l85O7k34L79J9k21n4Q0j18J86j13k5R9o7O3J16
$$ y = [-170, -133, 156, -103, 60, -78, -127, 3, -108, 31, -169, 98, 24, 19, -197, -185, 47, -248, -131, -240, -229, 138, 76, 50, 26, -61, -164, -54, -74, -165, -30, 62, -47, -73, 0, -84, 167, 71, -114, -47, 7, -75, -114, 57, -354, 39, -80, -107, 90, 357, 256, -165, -132, -98, 246, -29, -234, -281, -125, -254, -76, -204, -108, 103, 9, -90, -14, 90, -32, -131, -213, 196, 51, -75, 125, -183, 68, 92, 109, -64, -84, -23, -166, -89, -3, -135, -234, -217, 19, 92, -135, 58, 29, -33, 12, -316, 208, 1, 336, 65, 40, -132, 200, 0, 60, 36, -74, -11, 342, -169, -191, 223, 213, -153, -13, 44, -186, 142, -104, -163, -7, 13, 75, -36, -63, 209, 208, 328, -189, 10, -28, 179, -27, -181, -17, 58, 288, 103, 58, 101, 270, -84, 42, 82, 474, 115, 6, -84, 18, 287, 241, -19, 34, 52, -11, 128, 244, 207, 71, 38, -212, -2, 160, -57, -23, 215, 249, 71, 130, 25, -7, 398, 13, 80, -154, 225, 244, 23, -31, 49, -69, 117, 4, -21, 78, 11, 74, 190]
6764A90o5k80K17m2n1K11P9m24p0K37j51J21J36R1l76J83j71K31M6L7k53j1P9
6787c6L6J10nk52M9Q3K66j61l8K66j54j75q5k1K04k27J2J91j16K22R2m78J30J17
6811C0l4k71M08r0n0J60j42R3o6j16N6N7mN4j67J84P4j89J46l4m19J88L34j79
6835B3P0L5j63q2j34L27J0j43J3L8O5J4l2k90K70M0J7k41j07K35l4j16p7M58k51
6860e5J32N7j02RR2J4m88L62J61j06k26J14N9K53k48j94J0J19k13j75L47l4K39
6883A27j36j55J80pk29J11j28K04j29pJ44j68n1j29J53J12j87K68L24q8n76L96
6905B9j26K69j86k73J48J14o5j00K12j31K08j51L20j72l19N3J27l5r0K46n7j73
6927a52M11l35N2j55M8K12O1k93N0O0J64j6l10M30L2k66j86J62l0J48j98j71J41
$$ y = [190, 125, -155, 62, 20, -31, 180, 259, -165, -235, 2, -149, -28, 108, 199, -177, 6, -165, 66, 112, 149, -104, -115, -36, 0, 110, 105, -147, -98, -15, 251, 90, 52, 318, 164, -11, -96, -117, 87, -140, -128, 63, -53, 169, 261, -217, -87, 30, -4, -275, 133, 43, -7, 153, 11, 104, 38, -78, -22, 35, 31, 85, -82, 102, 176, -13, 133, 99, -320, -132, 202, 23, 93, 128, -35, -117, -251, 76, 86, -57, -44, -6, 59, 73, 41, -249, 21, 61, 78, -163, -270, -35, -69, -185, -262, 196, -55, 77, 134, 32, 41, 133, 147, -341, 21, 182, 76, -150, -36, 23, 276, 28, -166, -156, -37, -250, -425, -78, -112, 127, -9, -164, 16, 9, -220, -109, -237, -33, -162, -169, -25, -193, -244, -373, -220, -108, -295, -27, 297, 209, -367, 29, -97, 172, -14, -287, -139, -25, -90, -190, 22, -109, 99, -52, 268, 96, -223, -170, -43, -78, -168, 78, 21, -152, 259, -76, -24, -179, -131, 81, 142, -151, -101, -41, 123, 107, -203, 227, 259, -7, -193, -31, -61, 87, -111, -282, -141]
6950a41K52nl88K88k6J79l03l00M87p9K32m67K55J22k1r3j47j25K69R5k96N4L14
6973A56O2j46j72k55K97J86k94M4K72k55J62J7l18L38r4l07K63J28r4N8K00k19
6995B9o7k2L5L6Q0o6j27J21J31K3O5l79J92Pr2j05k9J77q1K28j20l4O4Ok27O8
7021h7J61l3lK08j62o1L18j89r1j35R5j80L1n0K82O4q7m66K76R0L24m70OL86k02
7046B5K32o3k42L02j02j69j72J53nJ64n3k71L39l49L07l17J56M5j72J55K3k7J76
7069A35k07K2J32n3j83K95n58L98Q9K7l16K44o6R6K9k10N23l50K87j23j02Jp1
7092C9r3j62L29o4k18J01M6J81Mj02Q2r5R6jj54J19K7o7K08k42nJ79l84L79j23
7117H0m3q9p7qK07K08l08j02R8K4K01k21j99j49N63J1k04k31R6L23j56M6O4m4
$$ y = [-141, 111, 106, -282, 6, -20, 159, -144, -444, 43, -36, 196, -271, -16, 106, 85, -8, -155, -280, -11, 84, -212, -158, 156, 218, 72, -100, -355, -58, 128, -166, -122, 150, -105, 57, 74, -244, 94, 0, -307, -44, 84, -10, 48, 248, 29, -38, -60, -25, 11, 91, 25, -102, 19, 150, 173, 238, -141, 51, 58, -34, -139, -168, 9, -72, 156, 36, 2, 66, 72, -155, -87, 74, 41, 38, 246, 84, 23, 341, 152, 61, -74, 21, -159, -128, -178, 104, 168, 81, -385, -109, -19, 305, -165, -159, 227, 25, 257, 194, -48, 254, 152, -17, -189, -36, -41, 123, 70, -201, 138, -211, 96, -221, -65, -20, -192, -37, -14, -41, 135, -72, -50, 82, 29, -154, 141, -417, -19, 70, 97, -219, 25, -41, 55, 84, -126, 397, 47, 334, 211, 109, 110, 39, -54, -216, 113, 49, -169, -68, -22, 159, 163, 61, 143, 48, 144, 143, -11, 108, 135, 68, 276, 34, 29, 208, -176, 203, 80, 37, -52, -129, -137, 70, 278, -30, -132, -34, -10, 191, -30, -229, -378, 185, 196, -8, -239, -143, 180, 24, 70, 134, 90]
7141I0K03k26k84L74m1j9R3o27Q7P28l79Jo8L7m5r2J09q2J43Q9O5j57l40L5k9
7166c35L42K20l19O3jL3j41K26j05k35L5K13J6k53J13K57k75J86k28J34p5m3R7
7189g5J04j05l2J07j22L36k0l53P9K39j99Mj2j01K08k91Q5O1m1mQ3K01l10K84
7213A26K7l61Q1J07l8Q0q4L3j0L42m64q6K19K21k16R1L5P6%l82m9M05P8j97k54
7238b20R2L85k44M8k00J89J07j18j44N4J13j62j78M01j45J78j80k70M12K61m36
7259e7Q3j10J80j2j00j64J65J71q3l2L1k43L2K35k12J3q6J44L05l90L34j84k12
7282a92M5J71J16o8j37Q6j22J26j80Q5Q1J86j79Kk58J94M1j30J24J56J04k00J47
7305A98k75J41j36J00J22j37J76J6k03o3l3m3o6K17j5J97n85O11n9k09K35j34
$$ y = [90, 293, 67, -217, 157, 116, 97, 190, -437, -350, 378, -1, 0, -68, -31, -76, -168, -59, -141, 2, 91, 156, -1, -341, -306, -335, 7, 227, -92, -29, -30, 3, -138, 88, -17, -252, -217, -4, 12, -241, -128, 129, -146, 40, -188, -54, -129, -172, -75, 29, -76, -108, -1, -123, 213, 193, -160, -81, 158, -41, -37, -49, -150, 58, -233, -148, -87, -128, -132, -49, 152, -158, 126, 153, -208, -127, -20, -58, 22, -62, -29, -39, 303, -161, -247, -28, 193, -23, 68, 103, 179, 179, -203, -252, 153, 231, 34, -220, -128, 257, 13, 61, -139, 50, 157, 39, -105, -51, 62, -100, -278, 123, -22, 156, -24, -294, 118, 379, -57, 26, -84, 96, 84, -16, -180, -15, 156, 73, 41, 72, -171, -139, 96, -116, -103, -189, -45, 260, -130, 204, 20, -192, -147, 24, 140, 72, -65, 21, -101, 25, -155, -70, 11, 197, 18, 20, -238, -44, -3, -133, -9, 147, 251, 51, 198, -77, 64, -72, 28, 150, 13, 189, 205, 2, -61, -94, -137, -203, 14, -1, 196, -389, 222, 163, -46, 189, 55]
7327E5J1N4K04j87jj13P3J03R4k54L6J56j18l10J95lJ90j21j78J1L83k70J09o0
7351E9k3j05L55l07p2L47j12j02J8j33K27k11M9P9K15k08J52k08J01J84l61R3
7373C7K31j85K59k65M37n07K37k1n1l14J64K84k81r6m7K1K03k04j15J54k33M66
7395A74k13l8J7K39n35Q02m51k47J68o5M6J64N3j63j34M61k07K76l65k09J53K24
7417A50j05Q2rk06L53l30J52j03J50j72j46M86l05n9M0k72K15J09O9q0K08n70
7439c43J97K37j92J86l61J80r0L67q2l88M42l76J61J14k29J95J6j26L59k90l6
7460e9J00J18k76j70Q8L50M6k13l74J52l4K46O5j85M85k20L7j47j3pJ61Q9l46
7483a07RJ35j65J19k18K76j3l77K27L2J61n9j56n6M52l08j87M73l24q9L16k30
$$ y = [55, 66, 120, 324, 137, 136, 23, 96, 199, 293, 39, 75, 231, 113, -197, -2, -5, 185, 64, -114, -103, 280, 10, 119, 59, 36, -69, 286, -21, -93, 254, 142, 40, 58, -75, 152, -59, -10, 69, 284, 76, 228, 20, 121, 305, -56, 37, 268, 83, 342, 77, 514, 7, 244, 223, 172, -142, 22, 306, 25, -71, -118, -97, 106, -98, -213, -59, -292, 174, -39, -77, -60, 179, -356, 446, -5, -252, -84, -149, -103, 61, 114, -49, -183, 278, 71, 347, -18, -227, -74, 150, 45, 127, 118, -88, 265, -65, 87, -16, 134, -38, -184, 302, -3, -62, -22, -294, -79, 30, 99, 19, 227, -343, -146, 91, -101, 85, -276, -96, -186, 181, 99, -289, 153, -223, -62, 52, -177, 18, 34, -92, 267, -23, -59, 41, 159, -117, -287, -199, 151, 197, -16, -390, -238, -272, -26, 39, -146, 339, 119, 156, 9, -4, -11, 150, 239, -107, -98, 37, -128, -9, -227, 49, 36, -341, -114, -82, 79, 20, -136, -192, 260, -48, -235, 238, -86, -175, 141, -89]
7505h9j3J47R1k0k0k90R5J98%J36l54l3K62l20J34K17j98j32R7M9J44k60K07k76
7529b28M28l92k05M37O2J77k60J53O2j49P5k29j0J11O1k84O8K57J53k23nl3j7
7552Ij34L21l47K63k37K5Nj20K80O4o7j34p0J02N9J03J2k29L44l37k11K10J37
7575D8r2P7N4k29L93J28m98M2J46j30r5J60r5K08L18m22j30J1K5O4J88k78oon1
7600a70L49k75n7r5L90l30K50r4Q3j0R5j11n9k0K41j73j03R6L42j03k03lj62J80
7624E8k89K96M6J10r0j39n5q4M87l47R8n9N6o5k31Q7J69m1J82j99j40J51J96p9
7648A18o8r0j45M79j83k0j01j11Q6M71m99Np1M22j82j82J63j85q2J32R3J68K15
7671D33m54K31n6K4j41J84k63L35k96Q8j0M9m5l23L7J93J72k13j03n7K76j86j50
$$ y = [-89, -102, 45, 136, 116, 96, -194, -99, 99, 99, 235, -119, -152, 110, -210, -76, 141, -57, -189, -92, -43, 101, -159, 48, -228, 200, -192, -397, 40, 102, 279, 19, 172, 234, 85, 160, -69, -79, 32, 93, -191, -123, 134, 287, 64, 59, 26, 9, -125, 196, -151, 112, -125, -100, -95, -215, 65, 129, 62, -72, -142, -40, 19, 122, 134, -95, 249, -88, -299, -89, 48, -44, 33, 87, -142, 251, 379, -119, -77, 69, -61, -156, 4, -91, 117, 435, 13, -117, -106, -81, -17, 171, -107, -113, -119, -170, 179, -96, -153, -248, 142, -188, 62, -32, 51, 41, 136, 25, -34, -54, 187, 14, -89, 7, 349, 246, 43, 40, -122, 58, -231, 65, 111, 221, 131, -8, -63, -147, 340, -7, 91, 32, 88, 23, -208, -121, 48, 7, 189, -10, -150, 1, 197, 118, 50, -40, -185, 294, 111, 91, -10, -121, -35, 436, -63, -58, -129, 293, 111, -71, 92, -93, -175, -43, 50, 218, 433, -21, 210, 154, 178, 37, 221, -42, 293, -3, 85, 75, 124, 79, -244, -207, -14, 158, -55, -158, -215, 61, -125, -275]
7694b75J78L4J56j59J26n3J6j87J32o5J6M3J54mk82K75l24L64O4p5k9J1k03j39
7718b26O7N6M7O0M5K2J09j97j2%j61K94J26j78N2J93k57j16L4M35n26O3J88m2
7742G6j35lo4N7J65J17j19k73L15J69Jk76j46K79k24L3J1j05l2K83r8k10J14P3
7766Hk21J79j11J82m1k33M14Q1k79L0N4j39j20K54k45J39p4O7m8k3L07L8j51j42
7790g4qo5K25l95L97k20K6K11m70M19q9K05J71l46j3j51J88j98L40l11K25r4r1
7813a18J64k2R1m94J99J14K3J77m61J82K76j7j46Q0m4P7k38J43q3j11O7r6Q4K95
7837A42K6l70K36j78J18N5Or8K60j43j64J53j57N3jJ60k77K04n4K66l68N5k6J74
7861G2j56m41O45M5j09j75L26k30q3K40m1l10J58K34j44J79l3J41k45j26R8j31
$$ y = [-275, -97, -63, 93, -66, 60, 7, 23, -164, -32, -97, -81, -38, 116, 112, -170, 105, -219, 145, 209, 134, 105, 116, -87, -226, -159, -103, -56, 4, 49, 71, 180, -17, -29, -29, -190, 104, 230, 52, 104, 297, 40, -76, -42, 393, -133, -70, 118, 76, -59, -62, -126, -69, 96, 213, 94, -179, 136, 305, 306, 30, -116, 163, -61, -28, -17, -122, -154, 129, 31, -179, -65, 8, -213, -34, -145, 37, -4, -237, 177, 258, -21, 9, 63, -76, -196, 58, -187, -48, -122, -55, -103, -126, 181, 219, 68, -74, -82, -147, 78, -317, 80, -140, -114, 97, -373, 46, -43, 162, 333, -13, -26, -177, 11, -187, 153, -158, 67, -27, -118, 46, 24, 115, -379, -180, -66, -43, 134, -327, -145, 131, 114, -32, 48, 4, 81, -157, -14, -97, -208, -141, -237, -153, 142, 168, -202, 34, -144, -26, 29, 35, -63, 197, 54, -110, 43, -114, -61, -62, 98, -179, 25, -29, 237, -131, -76, -102, 72, -84, -525, 120, 165, 56, -119, 207, -23, -106, 134, 93, -217, -59, 175, 31, 210, 177, 318, 73, -53, 45, -86]
7883h6j60PM14k94R6%K33k03l8k8K09OJ26l6l05L7j45j5K63P2k06R5j30j5K02
7908I9j37J14k7j09j02M66J39o07L86k95J69j19q3J49O4K00l62j30R2K63l03L19
7930A86m11J73K56k35J47l33J82N7O8k47K33r4j60Q3K66j65l36J77R3J09k6l2
7952ij93K87J3J4k80L59l08J45R7l13j15N38j48m5J94j90j80L95j10J55j39Q9
7974B56r5j37j03K44L3o0k78L20J3k97M13j65j44j00K77q3M1J00j52l52J41K60
7996A32k09J86j18rK06k77J39K26l62p5K38Q4M9k84J59k50J26J22l0Q7l17J08
8018f9J24j48n6J91O5J09k29M4K02j98J0J05l19K40J91j52k85j7K56j9J27k29
8040e7%J91l67M98l93K54J48m44R5J89J28k9j76J65j25j54J91m1L01k83j24J92
$$ y = [-86, -246, -239, 175, -119, -23, -23, 210, 7, -31, -59, 150, 156, 282, 246, -59, -22, -167, -182, 81, 153, -53, 42, -88, -103, 99, -38, 76, 49, -60, -162, 304, 443, -164, 222, -73, 96, -23, -106, 43, 107, 307, -55, -185, -93, 170, -133, 186, -225, -52, 204, -31, 116, -217, -35, 22, 90, -157, 76, -18, -178, -95, 171, 6, -330, -153, -60, 49, 23, -9, -202, 85, 98, 112, -168, 191, -117, 28, 125, -188, -303, 235, 87, 42, 236, 46, -134, 261, 151, 306, 167, 256, 161, 24, -79, 165, 198, 138, -140, 180, 193, -104, 309, 144, 0, -100, 177, 94, 135, 235, 83, -269, -128, 132, -77, 109, -9, -18, 188, -89, 50, 276, -86, -161, 77, 161, 210, -74, 85, -165, -39, 83, 53, 140, -177, -69, 55, -93, -149, 42, 107, 216, -13, 31, 233, 35, 45, 150, -169, 71, 262, 110, -175, -192, 64, 45, 172, -57, -57, 134, -233, 265, -128, 126, 274, -170, -75, 114, 242, 213, 37, 202, 77, -77, 114, 73, 374, 91, -33, 159]
8062A59P2m86J1J33J17p6Jk32K37j09K42m6o4L4j67M07k82O6j4J71o9J96l31K57
8086B27j55K2j23N7j50r2j3J97K9l7J03Mn7Jj92j2Q7L07l14M6o8m9R9L32m29J71
8112il8k14M84k12J28j53n7j98O0L67n0J4j11k57M60j70k8mL6j15j27K30o6J17
8136H7k1Q1j22J9r4N6l26L21M0m1m6K50J25l12k6r3J96L7k21K02m07L79j35j71
8160b22L89q5j06K74j37k85J98Q9J2l40L16l9j21j25n2K59N4q9j53j23M30k41
8182i7K78j74J34n6p6J74l63J46L06
$$ y = [159, 231, -255, -244, -111, 6, -70, -69, -301, -64, -173, 69, 23, -41, -7, -174, 233, -49, 17, 3, 174, 105, 301, -30, 227, 72, 94, -29, 28, -122, -214, -227, -30, -1, -38, 65, 69, 12, 13, -179, -191, -104, 203, -111, -65, -133, -182, -83, 249, -180, -9, -47, -261, 223, 11, 139, -14, -71, -269, -209, 158, 108, 122, 11, -246, 214, 44, 16, 12, 48, -67, -194, 36, -30, 87, 66, 147, 25, 44, -50, 6, -320, 1, 41, 0, -46, 204, 329, 17, -9, -102, 94, 131, -90, 112, -295, 84, -51, -222, 167, 82, -24, 250, 113, -172, 26, 115, 127, -213, 103, 64, -57, -182, -234, 25, 79, -10, -163, -286, 144, -97, 181, 7, 141, 85, 9, 183, -180, -34, 272]
8191B72
$$ Imaginary data points
##PAGE= N=2
##DATA TABLE= (X++(I..I)), XYDATA
0@%%%%%%pPqJ6j6J6k4L2m0M8n6O6p7R1j06J27j47J68j92K20k53K87l28L71m17
31b22M69n26N90o59P35q16R05j007J117j237J370j516J680j861K064k293K550
48A343k850L196l602M089m684N433o402P722r636J2670j8256L1978j27671k54744
62c61414N7623R1128L7625l2683N0866R7738L5948j00555j16986l4817L8595M734
74b32198l0149J3052J00644Q3413l2713j22799q2629k259J0150k9103j0868O0108
86b75351R1698L6130l0013m2587j9221k1267m3127l9906Q949N7521O5552L1714
98a79908p328k5996k2610j3934j9852k7601q439L3462N7944M1274P111j0679p385
111a83941q918l0696m6080j7749M2104P1155L5735j2186m400L4041J8157n2447
$$ y = [0, 0, 0, 0, 0, 0, 0, -7, 0, -8, 8, -8, 8, -16, 16, -24, 24, -32, 34, -43, 48, -58, 69, -78, 90, -102, 118, -135, 152, -176, 195, -222, 247, -279, 311, -348, 387, -429, 476, -531, 586, -651, 719, -797, 883, -978, 1086, -1207, 1343, -1507, 1689, -1913, 2176, -2508, 2925, -3477, 4245, -5391, 7279, -10977, 21001, -106670, -361414, -303791, -212663, -175038, -207721, -156855, -59117, -23169, -123724, -240710, -275527, -236932, -232198, -262347, -249295, -148651, -65238, -97951, -220750, -303379, -305638, -295488, -324591, -335459, -275351, -183653, -147523, -177536, -220123, -239344, -260611, -303738, -343644, -334695, -277174, -211622, -179908, -187236, -213232, -235842, -249776, -269628, -297229, -305668, -272206, -214262, -172988, -165877, -176556, -183941, -192859, -223555, -269635, -287384, -245280, -174125, -138390, -150576, -154976, -120935, -102778, -155225]
123a55225p8709j4087N5732M3220o053j491M7729N1421k0414q0787m7833L4255
135a72242N4159j322k8165K9980Q8937M6110n4005q0102r329M0940P31m4255J967
148a26596Q3778P8299j2993o4432j8374L9243J5361m6330l7189M5063Q8207L6481
160H0518l4360l2887J4991J7776l4585n7229l139O1772N2398o481k5223J1765
172D5316K9930j0522m8406k7903K4710M2513J7156n025M051J8878Q086k1020l5344
185D2420j6773J4316K5721J3059O14N904J4591O352j2702k2865j2534R211K1616
198H8930J0050p209m33K0979J8529j8141m2137j6066K8286K7131j4416k7538J1639
211G9604M0620P241m3108l6648J6076L6173m667m0593q432M6637L8215k6227n5029
$$ y = [-155225, -233934, -248021, -192289, -149069, -155122, -156613, -108884, -57463, -77877, -158664, -206497, -172242, -118083, -119405, -147570, -117590, -28653, 17457, -36548, -116650, -125979, -85039, -84308, -128563, -126596, -42818, 35481, 22488, -41944, -60318, -21075, -5714, -52044, -89233, -44170, 44037, 80518, 46158, 13271, 28262, 46038, 11453, -45776, -48915, 12857, 65255, 58774, 33551, 45316, 75246, 64724, 16318, -11585, 13125, 55638, 72794, 67769, 71820, 90698, 98784, 77764, 42420, 25647, 39963, 65684, 78743, 79357, 85261, 99852, 106204, 93502, 70637, 58103, 67314, 88930, 98980, 91771, 91338, 112317, 130846, 112705, 70568, 54502, 82788, 109919, 95503, 67965, 79604, 120224, 127465, 84357, 47709, 63785, 99958, 95291, 54698, 46266, 92903, 131118, 104891, 49862]
224D9862o978M3375J7703m0780l7086K9042N5901j302n6411k5992L6761L2724
236I6819k9193m9454P543N7369K7907l5491m1353J1405L5530o171m6674k0329
248G908L6274M1850j1364m1043o977L0948R053l9431l8270J3005M2770J6017j8854
261D1886j5926R874J2352j4818l2018j3678J5295K2056M116o243J418J2052K556
274C8922k2030l0862j0974J5731K2833R074l772j049R624O101j6809l3521j8291
287c5023J5010K5147M447j0632P138K6752N635l9124m5036j070L1772J2040j9739
300b2683o451L4015L6679j4061n3679k8824J9599K0993j9357k6928K2344N7401
312A9048K1884m1008m5029N608K5660j4849m2966j812N5640M7277j3382l9281
$$ y = [49862, 42884, 86259, 103962, 63182, 26096, 55138, 111039, 109737, 53326, 27334, 64095, 96819, 67626, 18172, 25715, 83084, 110991, 75500, 34147, 45552, 81082, 74911, 28237, 7908, 44182, 86032, 74668, 33625, 26648, 57596, 66649, 27218, -11052, 1953, 44723, 60740, 41886, 25960, 35834, 48186, 33368, 1350, -12328, 2967, 25023, 29139, 22896, 24314, 36366, 38922, 16892, -13970, -24944, -9213, 13620, 22694, 18922, 17873, 27497, 33598, 16789, -16732, -35023, -20013, 5134, 9581, -1051, 6087, 32839, 38474, -650, -45686, -46756, -14984, -2944, -22683, -29134, 4881, 41560, 27499, -26180, -55004, -35405, -14412, -33769, -60697, -38353, 19048, 40932, -76, -45105, -39497, -13837, -28686, -71652, -73464, -17824, 29453, 16071, -23210]
324b3210m621K5991l630m7652l4173K7014N5051J8327k1999j0429K2481J1603
336A4753l4451n0318o361L7671K7066o899n962K3065K6794j1025m3016l1965L421
349e7227J8016O558J083J6233K8269J3756j5289l0967k1376j958M037R53M770
362c3142J9706K8382J7209p129k5783k5781j0552K428J488J863J6426L2664K3683
375D1462j0412l1250j7574L680k517k3301j1763L0434N0963J9520k4492k7124
387b374k95N690k2576l4810J267M4715L7336o607k1376Q111K3265j4142n6452
400c8248l4338K8604N0569J0845k0994N98L1945J1382l9659m7977k862L1377J2248
413f510j7762j355L9789L7045j6054n3162k8268J5714J7403j3074j7076K0140
$$ y = [-23210, -27831, -1840, -5470, -53122, -87295, -60281, -5230, 13097, -8902, -19331, 3150, 14753, -19698, -70016, -76377, -38706, -11640, -18539, -24501, -1436, 25358, 14333, -28683, -60648, -57227, -39211, -32653, -31570, -15337, 12932, 26688, 11399, -19568, -40944, -42902, -38865, -37912, -33142, -13436, 14946, 32155, 25026, -757, -26538, -37090, -34662, -33174, -31311, -14885, 17779, 41462, 31050, -200, -17774, -14094, -16611, -39912, -51675, -21241, 29722, 49242, 24750, -2374, -2669, 3021, -19555, -54365, -53098, -8383, 28953, 22346, 970, 9081, 32346, 18204, -38248, -72586, -43982, 6587, 17432, -3562, -2964, 28981, 40363, 704, -47273, -50135, -18758, -6510, -24272, -25627, 14162, 51207, 35153, -18009, -46277, -30563, -13160, -26234, -43310, -23170]
425b3170M2173J4070k5650k6109k68M950j7223k4372M313L5000L2043J264j7838
438h17j1299l44n694j7233j4790N125K0700J9770O697q93r73l928j2432k0161
452c6272j5057L113K1650K3944O308q348m256P537P90k1725k7323j303K5273J9357
466f312m010m496J5297J5676j5299l8590j7672K1283K6718m812j9939P807L6025
479A1676J6517k9747l8131L87K5636K910k4286m329L6520L2453j6222l9299p814
492c3729K7373J1293k7970k5440K0038M3197J1702k6390j9089J5096J7106j6594
504c407l1246r14L3279K2063j4702k0375R297K3816k479k8711j7167J4561K2218
517F233J703j1399O94J6060Q625j1804j7444k385J0916P777l615n268M350J1224
$$ y = [-23170, 19003, 33073, 7423, -18686, -18954, -14004, -31227, -55599, -51286, -16286, 15757, 17021, -817, -12116, -12460, -18154, -35387, -50177, -45052, -24352, -4582, 2115, 1222, 249, -3679, -16111, -36272, -51329, -48216, -26566, -2622, 3686, -4662, -8918, -1381, -591, -22316, -49639, -50942, -25669, -6312, -10322, -14818, 479, 16155, 856, -37734, -55406, -34123, -7405, -12217, -32156, -24349, 11676, 28193, -1554, -39685, -39298, -13662, -10752, -35038, -39367, -2847, 29606, 13384, -25915, -33729, -6356, 4937, -23033, -48473, -28435, 14762, 26464, 74, -19015, -3919, 13187, -3407, -34653, -35567, -2288, 19775, 5073, -15302, -6005, 17811, 15332, -13379, -30546, -15985, 6233, 7936, -3463, -2769, 13291, 21916, 10112, -7332, -9717, 1199, 8976, 5361, 93, 4443, 15667]
531A5667N065o842j0386k524M827N920k89m294J373J0830Q825n943j2916l101
545F212J3252Q581j0833j5053N272K1315O270j7752j4669J1643J9742l676k2399
558G905o500K1155J8693j2679k3890L111K7877J0641k3660k1990J3393K7213k894
571C8375l0438j0797K6682K3313j4735k7994L112K9209Q909k5909k2438J2844
583A0133K8525Q89k4100q612K2164J7719j5812k8317j187K2689J0115j9074j6097
596i65J4051K3896K95k2348j2746R506J0385n799j2344L225J6275Q154q629j1689
610A1267n95N963j940j0825p999N431J3525P573l234p677l630M05j84m874o424
625c218O54J0716J0409r41q516j565O664j611j6962j4847Q111K1668O380j3232
$$ y = [15667, 20732, 13890, 3504, 980, 5807, 11727, 11438, 7144, 8517, 19347, 28172, 22229, 9313, 6212, 19464, 28045, 17212, 2159, 7431, 28746, 35016, 17264, 2595, 14238, 33980, 30304, 7905, 1405, 22560, 41253, 28574, 4684, 7795, 35672, 46313, 22653, 663, 14056, 41269, 38375, 7937, -2860, 23822, 47135, 32400, 4406, 7518, 36727, 45636, 19727, -2711, 10133, 38658, 39547, 15447, 6835, 28999, 46718, 30906, 2589, 1402, 24091, 34206, 15132, -965, 13086, 36982, 37277, 14929, 2183, 11689, 22074, 16275, 3931, 7156, 23431, 31585, 22956, 11267, 10672, 16635, 14695, 3870, -4129, 1302, 14827, 22400, 19166, 11489, 7859, 8264, 8080, 3206, -3218, -2564, 8152, 18561, 17620, 9104, 7539, 14203, 12592, -4370, -19217, -11106, 10562, 16942, 3710]
639C710p851J1840J2989j0800k5541p353J9128J6432q787j4494J0475K5027J728
652B6503l0034k3525J1349K2809m117k2519m86K9629J8859j8126k8283L12K0509
665B880J623k3793j2627K3070L1010j438k6107j1297J5591R513j8744k4542N280
678b9581K7324J2504j3141j1728J0938J3357j0720k5560q611J6137J6716j123
690c488q069L587J3633K341j5232j7094k595P684M863j953J148R227R860j537
704B375j1561j0690m302K680L422J432R95O874J1210M818j0174j5419n254O402
718a7192K474q522m310J4225K0552K136j8114j3468N623R236q401j6679L270K4858
732d312J6324j0988j7062M526J5961m342k7703j4693K0465K8344K48k0293k655
$$ y = [3710, -4141, 7699, 20688, 9888, -15653, -23006, -3878, 12554, 3767, -10727, -252, 24775, 26503, -3531, -27056, -15707, 7102, 2985, -19534, -20020, 9609, 28468, 10342, -17941, -17629, 2880, 4503, -19290, -31917, -8847, 22163, 20725, -5382, -16679, -1088, 8425, -10319, -34861, -29581, -2257, 10247, -2894, -14622, -3684, 9673, -1047, -26607, -35218, -19081, -2365, -3488, -11557, -7970, 5663, 8004, -7228, -24322, -26917, -19233, -14370, -16323, -15175, -5948, 3912, 2375, -9186, -19876, -24178, -21498, -18076, -16644, -15649, -8775, 2435, 7253, -2921, -18340, -23594, -17192, -14718, -23240, -27550, -13325, 7227, 9363, -8751, -22219, -16596, -7360, -15761, -32440, -29170, -4312, 12012, 1024, -16038, -11512, 4449, 107, -27596, -42289, -21824, 6520, 6768, -13525, -16180]
745a6180K0780R439k1837k5133M854K3846P049j5611n689K1528K1209j1265l0929
758a7939j0961J7426J3625j1001j4239J0805K5476N834j9038j5219P228R457q800
771g346j6420K736K2394J5829n725j3784k647P130j754j2261q973O809J2578N822
785D388k313l88M077M00q724j1628m780N698R387O710P60k584N50L716m65j0417
801e613j1749j434R982Q436r66j907P634P836p546j8630q033J0770J2460m652
815c412j2433M653K1113J0177j5560k1071J3J3910P0j4886l533K0773J9313r079
829A0048k1958k415J8119N230k0534j8658J1911K7657P524j6583j0013J2420J1429
842A4177j3029k2804n15K2302J2046j1981j2225J1482K0845k090k4097j4092J1282
$$ y = [-16180, 4600, 14039, -7798, -32931, -28077, -4231, 2818, -12793, -18482, 3046, 24255, 12990, -17939, -28900, -11474, 2151, -8850, -23089, -12284, 13192, 19026, -12, -15231, -8003, 1454, -7346, -23766, -21030, 1364, 17193, 11468, -2316, -4963, 2167, 413, -11848, -20821, -14012, -1434, 4388, 2075, 1687, 5764, 6164, -2560, -14188, -18968, -13270, -3883, 2827, 3587, 1003, 1553, 5269, 4804, -5613, -17362, -18796, -8814, -378, -1344, -3251, 4383, 12219, 4673, -13957, -21990, -11220, 1240, -3412, -15845, -11192, 9921, 20098, 4538, -16533, -16520, -2610, -2540, -17426, -20959, -186, 19127, 10048, -11910, -14325, 3794, 9024, -11510, -30168, -18257, 9400, 16924, 341, -9672, 2748, 14177, 1148, -21656, -22171, 131, 12177, 196, -12029, -547, 20298, 18208, -5889, -19981, -8699]
855h699J4542k975j0339L938J7457P214j2690j4291J182J0035r60j0091l169J1749
869B903J3710J804q559o193J186J027m134m459J623P892O916K086k041l054p10
884I997O97l090p727l826P422J3294M923p142o114M821N893o319j4227k982J2462
899H082J2002l825r534M928J4364J056j9504j4909Q387J7788N58j4637k677J9032
913B1111J4314j2697k2186j647J6999N494j5742j0066J4966K1886q39k0823r538
926A232J2906J0708j2458j8360M359K3303J0391j4007j3537P673J4795n217k0178
939A610p532J4840J4434l939j0545K573J2155J578j3737j2107L235J1502K440
952A6507p491k164Q581Q246k575j0830o906J977L373k63j053J379M530L773p19
$$ y = [-8699, 5843, 2868, -7471, -3533, 13924, 21138, 8448, -5843, -4661, 5374, 4414, -5677, -8846, 2903, 16613, 18417, 9858, 3665, 4851, 5878, 1744, -2715, -1092, 6800, 13716, 15802, 13761, 10707, 9997, 10694, 7604, -123, -3949, 3473, 16767, 21690, 14548, 8434, 13255, 19148, 12829, -1398, -4380, 8082, 20084, 16259, 6725, 11653, 26017, 27073, 7569, -7340, 1047, 18835, 19393, 4756, 2079, 21111, 35425, 22728, 542, -1105, 15894, 21388, 5646, -4420, 10546, 32432, 31593, 10770, 1232, 14138, 24846, 12388, -5972, -1613, 21690, 32081, 18074, 4537, 12210, 27005, 21788, 1610, -5922, 8918, 23352, 19413, 8868, 11441, 23596, 25174, 11437, -670, 2565, 14067, 16507, 9016, 6852, 15433, 23679, 21104, 10274, 3368, 5345, 8718, 8455, 7402, 8781, 13311, 17084, 16365]
967A6365n278n980r11K747j11m752j524P342R651m71j1046p696M411O371m537
982D581j0421q2J2660Q179p418j1096J916J1302n14j6701j0243J1671J6857j767
996H924j5389m204J4509Q327j3253j7679L026J7268K875j4740q026J3623J5925
1009A1186o051k1194o466J4663J0371r776j4952M689J7547M172j4235j0698Q742
1022a2002J0769o348j6052j349J5377R893p394j2213J877J0864J873j0671q541
1035b3917M450Q559M50o076o96O191M743m620q569j672M376L024k090k929J226
1050a7550M610L630p62m575m827L45L246M20l933j107N878P571j402q184l820
1065b0460N519M137n967q700K009J3143O856p487r041M422J0017k514j5273o231
$$ y = [16365, 11087, 5107, 4196, 6943, 6832, 2080, 556, 7898, 17549, 17078, 6032, -1664, 2747, 9118, 4581, -5840, -5922, 6738, 14917, 7499, -3597, -1681, 9621, 9107, -7594, -17837, -6166, 10691, 8924, -6465, -10669, 3840, 12167, -1086, -18765, -15739, 1529, 4404, -10336, -18362, -4739, 11186, 5135, -16059, -22525, -7862, 2509, -7267, -22219, -17530, 17, 4189, -10046, -20744, -12002, -1233, -7581, -23633, -24982, -9605, 288, -7106, -19319, -17442, -6578, -4705, -15376, -23917, -19467, -10908, -10458, -16534, -17230, -11039, -6296, -10916, -19485, -21157, -16781, -13757, -15847, -18776, -17550, -12940, -9310, -10072, -14647, -19474, -19129, -15883, -15463, -19396, -20503, -14625, -7054, -8456, -16640, -20460, -14941, -10804, -16771, -25471, -23462, -10319, -3463, -10950, -19991, -15569, -5552, -8066, -23339, -29570]
1079b9570J2615J4203l577j2926N69J5207N719j4825j5327N117J6000K139j2249
1092a6905l800J5490J3479q361j9054l416J4148P679j1459j0604R841J9080L059
1105I177j4978r369P388Q805p262j3191K502J6897J0332o432r578K283Q851j650
1119C775j2043o825P412J1702K377m104P83N964K146p538r490j609O470O118J790
1134F928k44K195M315J522m051p417n070J405N497L863M40K845O216L115o654
1149A4905j1550l494P045N405l200n009O607J4351M853j1566j3641N38P858j318
1163A1784r600J133J5837J2072o858j4742j305J1001P64j5974j0829J1485K0431
1176B5199M675j2305o997Q101N918j2070j6324J406J7168R078q855p409Q861J3099
$$ y = [-29570, -16955, -2752, -6329, -19255, -18686, -3479, 2240, -12585, -27912, -22795, -6795, -4656, -16905, -20705, -5215, 8264, -97, -19151, -22567, -8419, -740, -12199, -22803, -12962, 6118, 9177, -5801, -15170, -7782, 1023, -6239, -19430, -16928, -31, 10301, 3869, -5709, -3426, 5425, 3775, -8268, -15093, -7681, 4021, 6398, 2294, 3077, 9041, 11187, 3649, -5841, -7450, -980, 5138, 6928, 6684, 8879, 13194, 14716, 10665, 3248, -1822, -417, 5080, 8943, 9383, 12228, 18444, 21559, 14905, 3355, -139, 6906, 12311, 9111, 4102, 10709, 25060, 29913, 18347, 4706, 5244, 13102, 11784, 2184, 3317, 19154, 31226, 24368, 9626, 8321, 19322, 20086, 4112, -6717, 4768, 25199, 29874, 17569, 10572, 18673, 24591, 12521, -3803, -2397, 14771, 23849, 14994, 7585, 16446, 29545]
1190B9545n649j9715j0318Q963J1617j267o644M560J2562K720j2433j2398R13
1203B456O818p93p404R6J1377J0961k321j0624o409J55Ll398k608N443Q030M080
1219A5862j573l342k320j907l302m666l076K730P974P768J221n671n598k69M13
1234D244m436o442J080R513P947j782n029J336M632l884j3110p959Q991J3665
1248H766P63q585j523J0592N191j1570j5377K29J2454M596q343l627J1668J2275
1262A7509n758j7958o322R662P755p624r996O659J6460M239j3438j1074M937Q470
1276C521n438j2903p5J4945J0426o351j0541R53Q066j364j1480o744P294J1024
1290A333O28o847j581O514K845p317r563n50O947M403j386k124K600L815j611
$$ y = [29545, 23896, 4181, -6137, 2826, 14443, 13176, 6532, 11092, 23654, 26374, 13941, 1543, 2456, 9274, 8481, 1077, 1173, 12550, 23511, 21190, 10566, 4157, 4312, 4315, 917, -1691, 3752, 11782, 15862, 14289, 10947, 8627, 6720, 3418, -1248, -4324, -1594, 6380, 14148, 15369, 9698, 4100, 3831, 4244, -192, -6634, -5554, 3959, 11906, 10124, 5095, 6431, 11063, 7179, -5931, -13890, -4899, 8766, 9529, 944, -579, 10013, 15204, 3634, -11743, -11514, 940, 5536, -2807, -6434, 5234, 17509, 11751, -6207, -12529, -2867, 4888, -2736, -12732, -6073, 10387, 14626, 1188, -9886, -4949, 3521, -1917, -14820, -14895, 50, 10476, 4125, -6416, -5463, 2603, 1239, -10241, -16985, -9691, 1333, 1961, -4886, -6467, 47, 2892, -4425, -13988, -14538, -7591, -3188, -4574, -6698, -4098, -283, -1894]
1305a894n061l488p60J944J967j03k21J288L133J162l219o399k095L929L871j684
1321g630m080K119O821K835o716p580K564P537k60q446l623R268R946m254j1979
1336a3478j312R703N496r087r604N455J2955J230j1620o062J0237J0559o410j4141
1350a6079j005J3982P644r436j0927M403J3024J142j2242n579R242R461n373j2333
1364a4076L24J2874N952q783r560M293J1224J051r673n758N825P096k303o456
1378g970R22P536L160n446o211J576N803Q44m821k695L620M905J597k324k392
1393a896j122J88N36o10o56P41L574K861p70l900j261K760J374m350m715K837
1409d409Q774M378m698n811J935N788k192r440l563R443Q841k506q012J434R599
$$ y = [-1894, -6955, -10443, -11203, -9259, -7292, -7395, -7616, -6328, -3195, -2033, -5252, -11651, -13746, -9817, -5946, -7630, -11710, -9591, -2770, 65, -6651, -14231, -11667, -4130, -4390, -12836, -16459, -7191, 2755, -1499, -13478, -14790, -5087, 409, -8678, -18282, -12827, 128, 1358, -10262, -16324, -6087, 4472, -1938, -16079, -17084, -3102, 4542, -4894, -15821, -11418, 1606, 2748, -9494, -15073, -5831, 3630, -1743, -14076, -13752, -878, 5074, -3709, -13269, -8976, 2248, 3299, -6374, -12132, -6307, 789, -1514, -7970, -7048, 488, 3648, -1798, -8009, -6433, -630, 214, -4607, -7302, -3682, 1223, 2820, 496, -1896, -3018, -2830, -2294, -2904, -3560, -2819, 755, 3616, 2846, -1054, -2315, 445, 1819, -2531, -7246, -4409, 4365, 8743, 4045, -1766, 169, 5957, 3765, -5675, -9238, 205, 9046, 6540, -1472, -38, 9561]
1424I561K149j1485j0967M979J2754J659q506k236J0609P834p847j3805j057J0414
1438D056M698q650o001R240J3827m42j4008p614O607O555n620r003L832J4002
1452A1479N368p583p750K810N683m025j0832k071J0124R307q91n797N54M645r26
1467A0095q685o539K619P189L616j301N02L140J602m182o268l578K74K492L109
1482D085K447K157K072P33k163n422n918j237L998M067M08m70M033N513r50r104
1498D249q477J060N802O33l083K277R591N629p043j1058r70O132K71q762l725
1513g474J0502J3782j96j0946n681M980L071q484r141M459J4342O107q240o319
1527G62N487P406o610j4556m193J1293J0649k693o181L295Q719j018j2767q969
$$ y = [9561, 11710, 225, -10742, -5763, 6991, 8650, 144, -2092, 8517, 16351, 8504, -5301, -6358, 4056, 8754, 104, -5897, 3343, 17170, 16728, 2720, -4894, 1713, 8268, 2648, -6355, -2523, 11479, 16847, 9264, 1514, 4324, 10007, 5982, -4850, -6921, 3203, 12510, 11619, 5822, 6376, 11021, 10095, 1410, -5129, -2510, 4679, 8295, 6994, 7496, 10636, 12238, 8056, 1788, -1790, -1516, 976, 4085, 6532, 8689, 10761, 11494, 9331, 3909, -2009, -3246, 752, 4819, 5227, 4757, 8790, 14303, 13353, 4249, -4228, -3168, 2634, 3267, 184, 2461, 12052, 17681, 10638, -420, -1390, 4742, 5013, -3749, -7474, 3028, 16810, 16614, 5668, -13, 4967, 8038, -446, -9587, -5128, 9214, 15321, 7081, 762, 6249, 13655, 7045, -7511, -11704, -411, 10238, 7545, 1364, 4659, 13378, 12360, -407, -9376]
1541i376M850Q595k82o006J213J0788N320o832j0985l097M203J366k882n44O409
1556B740O737j71o514l932J10K06l267k829J233N735N645J625k979m684l098r44
1572d387Mj554p64K793N386K920k186m169k46P90l648o284j111P784Q579l57p553
1589d003j746M873J886p226q333K404R530L183n574k493O348N744o144j2223k349
1604a6123R658O714m841p304M622J0496Q47j1255p443N132P522k982q493J439
1618a2011J1515N761p379j0017J550Q254m6p946l922P148Q533j191p265j548N582
1633b982K572o454o001K691P720K533m015l281K717L833j835m345j974L211K523
1648c087l92j484P59J877J054j928k303q46J007K455L30j343j269J233L188M50
$$ y = [-9376, -4526, 4069, 3787, -2219, -1006, 9782, 15102, 8270, -2715, -5812, -1609, -243, -3125, -3669, 2740, 9477, 9306, 2792, -1140, -1030, -824, -4091, -6920, -5687, 48, 5693, 7318, 4339, -345, -3443, -4387, -4383, -5937, -6701, -3908, 1478, 4398, 2212, -1957, -2203, -1413, -5061, -11345, -12456, -4672, 3907, 3550, -4003, -5749, -876, 1010, -6216, -14549, -12145, -2615, 568, -5006, -7499, -1151, 4593, -1551, -13774, -16123, -6465, 249, -4592, -11896, -7274, 3222, 4069, -7186, -14629, -9497, -1975, -4957, -13450, -12011, -496, 5265, -2114, -12131, -10581, -2327, -2373, -10319, -14241, -7093, 1440, 249, -7016, -8564, -2982, -410, -6864, -12865, -10174, -2454, 79, -3936, -7217, -4500, -667, -2502, -6847, -8821, -5610, -3087, -3479, -4963, -4204, -2327, -1273, -3201, -5504, -6350, -5343, -2888, -2558, -3901, -5170, -3937, -749, -299]
1664b99l171l075K232L443L40m757j271M513L917k435o000N55O347K635o057n480
1680h563L333P588K5p588k904P385O414m758q446R6Q538L868p499o435M382R730
1696E166N3q759l971P133N666n475q724J324J0388M427p412n979M097P687j199
1711D422q715l830N957O297j810n437J673O451J464o524n918K894N433K53m201
1726a591p82N039M459j349m964k417J592J053j169p12K203L386J669j364k231
1741B822j471m32M10j68j489J36L612M300Q80l862l845P06J771j678l484O87O412
$$ y = [-299, -3470, -6545, -4313, -870, -530, -5287, -6558, -2045, 1872, -563, -6563, -6008, 339, 2974, -3083, -8563, -5230, 2358, 2383, -5205, -8109, -724, 5690, 932, -7514, -7418, 1120, 4988, -2511, -8946, -4564, 5166, 5219, -3540, -7511, -378, 5288, -187, -8911, -7587, 2801, 7228, -184, -6163, -2066, 5621, 4422, -4293, -8123, -2166, 4131, 2321, -3116, -1443, 5008, 6472, -52, -5970, -3076, 2357, 2610, -1591, -2373, 2666, 7125, 5776, 812, -1605, -13, 1040, -129, -841, 1362, 4748, 6417, 5053, 2822, 1351, 919, 1329, 1161, -328, -192, 3420, 7720, 8600, 4738, 893, 1599, 3370, 1692, -1792, -1105, 5307]
$$ [...]
8191e2
##END NTUPLES=NMR FID
##END=
