##TITLE=1H_LR-695-MK1
 CDCl3, 8 sc, 
 22.10.2019
##JCAMPDX= 6.0         $$ Bruker NMR JCAMP-DX V2.0
##DATA TYPE= NMR FID
##DATA CLASS= NTUPLES
##ORIGIN= UXNMR, Bruker Analytische Messtechnik GmbH
##OWNER= root
$$ XWIN-NMR		Version 3.5
$$ Tue Oct 22 15:06:50 2019 Russian Standard Time (UT+4h)  she@DPX200
##.OBSERVE FREQUENCY= 200.1315
##.OBSERVE NUCLEUS= ^1H
##.DELAY= (6, 6)
##.ACQUISITION MODE= SIMULTANEOUS
##.ACQUISITION SCHEME= undefined
##.AVERAGES= 8
##.DIGITISER RES= 18
##SPECTROMETER/DATA SYSTEM= spect
##.PULSE SEQUENCE= zg30
##.SOLVENT NAME= CDCl3
##.SHIFT REFERENCE= (INTERNAL, CDCl3, 0, 15.7039)
##AUDIT TRAIL= $$ (NUMBER, WHEN, WHO, WHERE, WHAT)
$$ ##TITLE= Audit trail, XWIN-NMR		Version 3.5
$$ ##JCAMPDX= 5.01
$$ ##ORIGIN= Bruker BioSpin GmbH
$$ ##OWNER= she
$$ F:/spectra/data/she/nmr/H-F/1/audita.txt
$$ ##AUDIT TRAIL=  $$ (NUMBER, WHEN, WHO, WHERE, WHAT)
(   1,<2019-10-22 15:05:44.23 +0400>,<she>,<DPX200>,
      <created by zg, POWCHK disabled, PULCHK disabled
       configuration hash MD5:
       00 E9 B6 7A A2 85 ED C7 34 08 36 98 17 FE 4E 26
       data hash MD5: 16K
       04 95 DE C7 F9 90 6A E0 9E BA 23 BF 00 D4 EC FA>)
$$ ##END=
$$ 
$$ hash MD5
$$ 08 77 B8 73 DD BB B1 AF 96 86 38 D2 86 B7 2E ED
##$RELAX= 
##$RELAX= 
##$RELAX= 
##$RELAX= 
##$RELAX= 
##$RELAX= 
$$ Bruker specific parameters
$$ --------------------------
##$DU= <F:/spectra>
##$EXPNO= 1
##$NAME= <H-F>
##$PROCNO= 1
##$TYPE= <nmr>
##$USER= <she>
##$AMP= (0..31)
100 100 100 100 100 100 100 100 100 100 100 100 100 100 100 100 100 100 
100 100 100 100 100 100 100 100 100 100 100 100 100 100 
##$AQSEQ= 0
##$AQ_mod= 1
##$AUNM= <au_zg>
##$AUTOPOS= <>
##$BF1= 200.13
##$BF2= 200.13
##$BF3= 200.13
##$BF4= 200.13
##$BF5= 200.13
##$BF6= 200.13
##$BF7= 200.13
##$BF8= 200.13
##$BYTORDA= 1
##$CFDGTYP= 0
##$CFRGTYP= 5
##$CHEMSTR= <none>
##$CNST= (0..31)
1 1 145 1 1 1 1 1 1 1 1 1 1 1 1 1 1 1 1 1 1 1 1 1 1 1 1 1 1 1 1 1 
##$CPDPRG= <>
##$CPDPRG1= <>
##$CPDPRG2= <>
##$CPDPRG3= <>
##$CPDPRG4= <mlev>
##$CPDPRG5= <mlev>
##$CPDPRG6= <mlev>
##$CPDPRG7= <mlev>
##$CPDPRG8= <mlev>
##$CPDPRGB= <>
##$CPDPRGT= <>
##$D= (0..31)
0 1.2 0 0 0 0 0 0 0 0.06 0 0.03 0 0 0 0 0.0002 0 0 0 0 0 0 0 0 0 0 0 0 
0 0 0 
##$DATE= 1571742343
##$DBL= (0..7)
120 120 120 120 120 120 120 120 
##$DBP= (0..7)
150 150 150 150 150 150 150 150 
##$DBP07= 0
##$DBPNAM0= <>
##$DBPNAM1= <>
##$DBPNAM2= <>
##$DBPNAM3= <>
##$DBPNAM4= <>
##$DBPNAM5= <>
##$DBPNAM6= <>
##$DBPNAM7= <>
##$DBPOAL= (0..7)
0.5 0.5 0.5 0.5 0.5 0.5 0.5 0.5 
##$DBPOFFS= (0..7)
0 0 0 0 0 0 0 0 
##$DE= 6
##$DECBNUC= <off>
##$DECIM= 24
##$DECNUC= <off>
##$DECSTAT= 4
##$DIGMOD= 1
##$DIGTYP= 9
##$DL= (0..7)
0 120 120 120 120 120 120 120 
##$DP= (0..7)
150 150 150 150 150 150 150 150 
##$DP07= 0
##$DPNAME0= <>
##$DPNAME1= <>
##$DPNAME2= <>
##$DPNAME3= <>
##$DPNAME4= <>
##$DPNAME5= <>
##$DPNAME6= <>
##$DPNAME7= <>
##$DPOAL= (0..7)
0.5 0.5 0.5 0.5 0.5 0.5 0.5 0.5 
##$DPOFFS= (0..7)
0 0 0 0 0 0 0 0 
##$DQDMODE= 0
##$DR= 18
##$DS= 0
##$DSLIST= <SSSSSSSSSSSSSSS>
$$ [...]
##$SUBNAM2= <"">
##$SUBNAM3= <"">
##$SUBNAM4= <"">
##$SUBNAM5= <"">
##$SUBNAM6= <"">
##$SUBNAM7= <"">
##$SUBNAM8= <"">
##$SUBNAM9= <"">
##$SW= 24.0689530833862
##$SWIBOX= (0..15)
0 0 2 0 0 0 0 0 0 0 0 0 0 0 0 0 
##$SW_h= 4816.95568400771
##$TD= 16384
##$TD0= 1
##$TE= 0
##$TE2= 300
##$TE3= 300
##$TEG= 300
##$TL= (0..7)
0 120 120 120 120 120 120 120 
##$TP= (0..7)
150 150 150 150 150 150 150 150 
##$TP07= 0
##$TPNAME0= <>
##$TPNAME1= <>
##$TPNAME2= <>
##$TPNAME3= <>
##$TPNAME4= <>
##$TPNAME5= <>
##$TPNAME6= <>
##$TPNAME7= <>
##$TPOAL= (0..7)
0.5 0.5 0.5 0.5 0.5 0.5 0.5 0.5 
##$TPOFFS= (0..7)
0 0 0 0 0 0 0 0 
##$TUNHIN= 0
##$TUNHOUT= 0
##$TUNXOUT= 0
##$USERA1= <user>
##$USERA2= <user>
##$USERA3= <user>
##$USERA4= <user>
##$USERA5= <user>
##$V9= 5
##$VALIST= <valist>
##$VCLIST= <CCCCCCCCCCCCCCC>
##$VD= 0
##$VDLIST= <DDDDDDDDDDDDDDD>
##$VPLIST= <PPPPPPPPPPPPPPP>
##$VTLIST= <TTTTTTTTTTTTTTT>
##$WBST= 1024
##$WBSW= 4
##$XGAIN= (0..3)
0 0 0 0 
##$XL= 0
##$YL= 0
##$YMAX_a= 385292
##$YMIN_a= -327518
##$ZGOPTNS= <>
##$ZL1= 120
##$ZL2= 120
##$ZL3= 120
##$ZL4= 120
##$ABSF1= 10
##$ABSF2= 0
##$ABSG= 5
##$ABSL= 3
##$ALPHA= 0
##$AQORDER= 0
##$ASSFAC= 0
##$ASSFACI= 0
##$ASSFACX= 0
##$ASSWID= 0
##$AUNMP= <proc_1d>
##$AZFE= 0.1
##$AZFW= 0.1
##$BCFW= 1
##$BC_mod= 2
##$BYTORDP= 1
##$COROFFS= 0
##$CY= 11.3945322036743
##$DATMOD= 1
##$DC= 2
##$DFILT= <>
##$DTYPP= 0
##$F1P= 20.1720416913024
##$F2P= 0.152960286110954
##$FCOR= 0.5
##$FTSIZE= 0
##$FT_mod= 4
##$GAMMA= 1
##$GB= 0.15
##$INTBC= 1
##$INTSCL= 1
##$ISEN= 128
##$LB= 0.24
##$LEV0= 0
##$LPBIN= 0
##$MAXI= 10000
##$MC2= 0
##$MEAN= 0
##$ME_mod= 0
##$MI= 1.114404
##$NCOEF= 0
##$NC_proc= 0
##$NLEV= 6
##$NOISF1= 3.799351
##$NOISF2= 2.8
##$NSP= 1
##$NTH_PI= 0
##$NZP= 0
##$OFFSET= 15.70392
##$PC= 1
##$PHC0= -9563.218
##$PHC1= -1.599142
##$PH_mod= 1
##$PKNL= yes
##$PPARMOD= 0
##$PSCAL= 0
##$PSIGN= 0
##$REVERSE= no
##$SF= 200.130013532006
##$SI= 16384
##$SIGF1= 3
##$SIGF2= 2
##$SINO= 400
##$SIOLD= 16384
##$SREGLST= <1H.CDCl3>
##$SSB= 0
##$STSI= 0
##$STSR= 0
##$SW_p= 3612.71676300578
##$SYMM= 0
##$S_DEV= 0
##$TDeff= 0
##$TDoff= 0
##$TI= <>
##$TILT= no
##$TM1= 0
##$TM2= 0
##$TOPLEV= 0
##$USERP1= <user>
##$USERP2= <user>
##$USERP3= <user>
##$USERP4= <user>
##$USERP5= <user>
##$WDW= 1
##$XDIM= 8192
##$YMAX_p= 0
##$YMIN_p= 0
$$ End of Bruker specific parameters
$$ ---------------------------------
##NTUPLES= NMR FID
##VAR_NAME=  TIME,          FID/REAL,        FID/IMAG
##SYMBOL=    X,             R,               I
##VAR_TYPE=  INDEPENDENT,   DEPENDENT,       DEPENDENT
##VAR_FORM=  AFFN,          ASDF,            ASDF
##VAR_DIM=   8192,          8192,            8192
##UNITS=     SECONDS,       ARBITRARY UNITS, ARBITRARY UNITS
##FACTOR=    0.0002076,     1,               1
##FIRST=     0,             0,               0
##LAST=      1.7004516,     0,               0
##MIN=       0,             -327518,         0
##MAX=       1.7004516,     385292,          0
$$ Real data points
##PAGE= N=1
##DATA TABLE= (X++(R..R)), XYDATA
$$ plain form
0 0 0 0 0 -1 8 -8 8 -8 16 -16 24 -24 32 -40 49 -57 73 -85 104 -121 140 -164 189 -218 253 -287 327 -374
28 -374 423 -479 538 -605 677 -758 846 -943 1051 -1164 1293 -1434 1587 -1756 1946 -2154
44 -2154 2387 -2649 2944 -3278 3662 -4108 4637 -5270 6051 -7030 8312 -10070 12640 -16778
58 -16778 24569 -44505 208058 385292 130697 149109 197031 238590 162125 161883 219112 294112
70 294112 260291 203468 177822 205912 165941 64573 -7021 67869 202449 258160 177224 86827
82 86827 71839 103207 83261 26597 -1351 29512 65762 73398 65623 78183 91122 62027 -16881
95 -16881 -83383 -78327 -9461 48028 40648 -3061 -11283 26927 48240 4278 -65615 -91614 -63134
108 -63134 -29768 -21505 -16279 10881 34407 5314 -70822 -121942 -98118 -47159 -53551 -111816 -124681
$$ packed form
0@%%%jRj6J6j6K4l2M0m8N6p2Q9j06J30j58J89k25K61l04L53m07M71n40O14p01
28c74P97r02J017j143J282j435J604j789J994k215K457k727L021l343L702m100
44b154M541n036N593o222O940p770Q745r907J1321j3081J5342j8382K2710k9418
58a6778M1347o9074K52563J77234k54595J8412M7922M1559p6465k42N7229P5000
70B94112l3821n6823k5646K8090l9971j01368p1594P4890J34580N5711q0936r0397
82H6827j4988L1368j9946n6664k7948L0863L6250P636p775J2560J2939k9095p8908
95a6881o6502N056O8866N7489p380m3709q222L8210K1313m3962o9893k5999K8480
108f3134L3366Q263N226K7160K3526k9093p6136n1120K3824N0959o392n8265j2865
$$ plain form
121 -124681 -47669 30691 9212 -82346 -133918 -114813 -97084 -124692 -145000 -102884 -35967 -30171
133 -30171 -91672 -130816 -92380 -44520 -81832 -177522 -206905 -125720 -35552 -40358 -106099 -127709
145 -127709 -91543 -82933 -134394 -171760 -134351 -72597 -72254 -122050 -131443 -69875 -19032 -56596 -142455
158 -142455 -170785 -115771 -57279 -62363 -97915 -91970 -47832 -35728 -78601 -116537 -100014 -65844
170 -65844 -73670 -110137 -111546 -62044 -17802 -28906 -76023 -99379 -78847 -54611 -66034 -96952
182 -96952 -98297 -59588 -24907 -33170 -63574 -69869 -48497 -42869 -71358 -98226 -86838 -50295 -33010
195 -33010 -51474 -70868 -55065 -20290 -20608 -65775 -99033 -74007 -24272 -16594 -54808 -70881 -32290
208 -32290 6596 -12965 -62556 -68715 -26881 -4621 -37416 -72836 -47983 12010 25276 -27934
$$ packed form
121a24681P7012P8360k1479r1558n1572J9105J7729k7608k0308M2116O6917N796
133c0171o1501l9144L8436M7860l7312r5690k9383Q1185R0168m806o5741k1610
145a27709L6166Q610n1461l7366L7409O1754L43m9796r393O1568N0843l7564q5859
158a42455k8330N5014N8492n084l5552N945M4138J2104m2873l7936J6523L4170
170f5844p826l6467j409M9502M4242j1104m7117k3356K0532K4236j1423l0918
182i6952j345L8709L4681q263l0404o295K1372N628k8489k6868J1388L6543J7285
195c3010j8464j9394J5803L4775l18m5167l3258K5026M9735P678l8214j6073L8591
208c2290L8886j9561m9591o159M1834K2260l2795l5420K4853N9993J3266n3210
$$ plain form
220 -27934 -71221 -44494 7328 3276 -50757 -69017 -19086 28778 7193 -43096 -40465 9612
232 9612 22517 -29876 -74719 -47423 11206 21028 -23456 -48636 -13160 29788 13715 -43166
244 -43166 -64003 -26461 7608 -9560 -42800 -29214 19799 35378 -3574 -40534 -28163 4103
256 4103 1502 -32404 -44253 -7843 38380 41710 4478 -21530 -7182 16947 8875 -22589 -29809
269 -29809 2967 37681 36322 14305 12498 31974 33072 -1217 -33557 -19891 27864 55824 35130
282 35130 3885 14031 52116 57943 11342 -31091 -17813 28082 43413 19906 13313 48488
294 48488 74558 43096 -12857 -22339 19955 46830 20693 -10771 13997 76331 95403 43529
306 43529 -10726 -2575 37896 39333 1310 -7036 43173 90172 74710 27704 19272 49495 55037
$$ packed form
220b7934m3287K6727N1822m052n4033j8260M9931M7864k1585n0289K631N0077
232I612J2905n2393m4843K7296N8629R822m4484k5180L5476M2948j6073n6881
244d3166k0837L7542L4069j7168l3240J3586M9013J5579l8952l6960J2371L2266
256D103k601l3906j1849L6410M6223L330l7232k6008J4348K4129q072l1464p220
269b9809L2776L4714j359k2017j807J9476J098l4289l2340J3666M7755K7960k0694
282C5130l1245J0146L8085N827m6601m2433J3278M5895J5331k3507o593L5175
294D8488K6070l1462n5953r482M2294K6875k6137l1464K4768O2334J9072n1874
306D3529n4255Q151M0471J437l8023q346N0209M6999j5462m7006q432L0223N542
$$ plain form
319 55037 10350 -24481 5922 71696 96260 61183 25617 38979 69414 56979 8368 -13449
331 -13449 18488 59542 62625 45058 51876 78546 76613 29046 -13891 -5331 37346 60350 45124
344 45124 27424 43179 76653 81908 45244 4052 -2024 17264 27678 24332 34708 66880 86538
357 86538 63113 16996 -498 21454 41192 24828 -4967 737 50405 92104 78606 31825
369 31825 5983 14701 19552 863 -7544 24528 65780 64745 27044 10368 38103 57905 22533
382 22533 -36669 -45995 8842 64532 64020 27301 13888 30889 31077 -3895 -30510 -11479 23340
395 23340 21552 -4847 578 48438 74648 31819 -38202 -59027 -18981 20566 16175 -6441 -1974
408 -1974 26055 34405 8778 -15839 -13270 -5465 -22434 -46822 -32564 20288 55941 33998 -17761
$$ packed form
319E5037m4687l4831L0403O5774K4564l5077l5566J3362L0435j2435m8611k1817
331a3449L1937M1054L083j7567O818K6670j933m7567m2937Q560M2677K3004j5226
344D5124j7700J5755L3474N255l6664m1192o076J9288J0414l346J0376L2172J9658
357H6538k3425m6117j7494K1952J9738j6364k9795N704M9668M1699j3498m6781
369C1825k5842Q718M851j8689q407L2072M1252j035l7701j6676K7735J9802l5372
382B2533n9202r326N4837N5690n12l6719j3413J7001J88l4972k6615J9031L4819
395B3340j788k6399N425M7860K6210m2829p0021k0825M0046L9547m391k2616M467
408a974K8029Q350k5627k4617K569P805j6969k4388J4258N2852L5653k1943n1759
$$ plain form
421 -17761 -40210 -20667 386 -9417 -33591 -36088 -12249 10604 12657 2987 -1401 -3978 -23301
434 -23301 -53894 -60012 -26741 14993 20420 -11722 -34804 -20197 7212 3096 -34024 -61104 -49533
447 -49533 -18974 -4475 -9015 -7369 5505 884 -34857 -66439 -53260 -11120 688 -32428 -58224
460 -58224 -32029 16046 22584 -21965 -60377 -54318 -30750 -29713 -43781 -33795 -1249 10372 -21473
473 -21473 -53915 -40988 -3785 -4449 -51811 -81429 -49723 5828 17784 -17663 -43829 -32319
485 -32319 -16810 -30824 -55233 -49468 -19673 -8862 -29962 -46016 -24484 8170 3046 -42468
497 -42468 -74595 -56073 -15912 -4335 -25315 -39519 -25049 -7080 -13764 -35941 -43824 -32867
509 -32867 -26318 -37058 -47123 -32623 -3902 7591 -15358 -46780 -48726 -24462 -10161 -26758
$$ packed form
421a7761k2449J9543K1053r803k4174k497K3839K2853K053r670m388k577j9323
434b3301l0593o118L3271M1734N427l2142k3082J4607K7409m116l7120k7080J1571
447d9533L0559J4499m540J646J2874m621l5741l1582J3179M2140J1808l3116k5796
460e8224K6195M8075O538m4549l8412O059K3568J037j4068R986L2546J1621l1845
473b1473l2442J2927L7203o64m7362k9618L1706N5551J1956l5447k6166J1510
485c2319J5509j4014k4409N765K9795J0811k1100j6054K1532L2654n124m5514
497d2468l2127J8522M0161J1577k0980j4204J4470J7969o684k2177p883J0957
509c2867O549j0740j0065J4500K8721J1493k2949l1422j946K4264J4301j6597
$$ plain form
521 -26758 -46808 -38635 -8452 5979 -9546 -28351 -24036 -9351 -15729 -40549 -47781 -20114 9935
534 9935 4624 -25291 -32613 -4643 15391 -7749 -45381 -45842 -8946 11565 -6520 -26613 -10033
547 -10033 20570 16265 -22825 -43332 -19233 10480 1525 -29038 -27932 11194 36712 12181 -27982
560 -27982 -29335 2036 11435 -15378 -33770 -9088 28744 30098 -417 -15011 3739 18863 555
573 555 -28454 -25123 10085 33193 19488 -3942 -566 22015 24733 -2408 -26081 -15907 11644
586 11644 23049 13054 7138 18828 29702 19102 -4954 -14241 -1213 14655 13484 2355 5635
599 5635 27914 43601 28717 -3217 -16142 756 18775 15645 2205 7396 31274 43402 27366
612 27366 4334 3692 17264 15322 -4415 -10031 18556 53362 50334 15917 -2662 16508 36252
$$ packed form
521b6758k0050Q173L0183J4431j5525j8805M315J4685o378k4820p232K7667L0049
534I935n311k9915p322K7970K0034k3140l7632m61L6896K0511j8085k0093J6580
547a0033L0603m305l9090k0507K4099K9713q955l0563J106L9126K5518k4531m0163
560b7982j353L1371R399k6813j8392K4682L7832J354l0515j4594J8750J5124j8308
573E55k9009L331L5208K3108j3705k3430L376K2581K718k7141k3673J0174K7551
586A1644J1405r995n916J1690J0874j0600k4056r287J3028J5868j171j1129L280
599E635K2279J5687j4884l1934j2925J6898J8019l130j3440N191K3878J2128j6036
612B7366k3032o42J3572j942j9737n616K8587L4806l028l4417j8579J9170J9744
$$ plain form
625 36252 20069 -11900 -10850 25024 49603 37089 17035 23866 42179 32570 -3262 -18160 10060
638 10060 44911 42770 15198 11398 41720 60446 34543 -5509 -8448 21092 36501 23077 14450
651 14450 34880 59845 50694 16794 603 17461 34297 23493 3574 10313 41995 61700
663 61700 47323 19287 11802 23111 25771 11813 4582 20031 42553 46859 33184 23594 28169
676 28169 32501 20432 -337 -5682 13831 38464 43828 30111 18135 23279 30671 21037 -130
689 -130 -6867 8700 26078 26218 18481 23336 37427 34678 6934 -17862 -11068 16807 27042 9045
703 9045 -4864 12676 40150 36364 1316 -20930 -9093 8658 1934 -13089 -2436 27753 35147
716 35147 6504 -21446 -12298 13123 9022 -24647 -40274 -10557 28351 28332 -4555 -21949 -7371
$$ packed form
625C6252j6183l1969J050L5874K4579j2514k0054O831J8313r609l5832j4898K8220
638A0060L4851k141k7572l800L0322J8726k5903m0052k939K9540J5409j3424q627
651A4450K0430K4965r151l3900j6191J6858J6836j0804j9919O739L1682J9705
663F1700j4377k8036p485J1309K660j3958p231J5449K2522M306j3675r590M575
676B8169M332j2069k0769n345J9513K4633N364j3717j1976N144P392r634k1167
689a30o737J5567J7378J40p737M855J4091k749k7744k4796O794K7875J0235j7997
703I045j3909J7540K7474l786l5048k2246J1837J7751o724j5023J0653L0189P394
716C5147k8643k7950R148K5421m101l3669j5627K9717L8908j9l2887j7394J4578
$$ plain form
729 -7371 3519 -14839 -37407 -27721 2108 9624 -11046 -23225 -4541 16833 2592 -36819 -54411
742 -54411 -30364 626 2969 -16321 -22401 -8029 2260 -10399 -30544 -32903 -21353 -19519 -30239
755 -30239 -31770 -11190 10201 5053 -22727 -44255 -38453 -18925 -12993 -25926 -36877 -27802 -8161
768 -8161 -907 -12472 -25703 -26433 -24736 -33642 -43921 -34971 -8605 6362 -8689 -34171 -36724 -14306
782 -14306 -1525 -20607 -49073 -48900 -20098 403 -7470 -21569 -16697 -5724 -17476 -43759 -47264
795 -47264 -18078 4106 -10938 -39522 -35518 425 19703 -6434 -44598 -48183 -21701 -6624
807 -6624 -17965 -26787 -10648 7331 -3363 -30877 -34240 -8962 3964 -19929 -48332 -37860 2154
820 2154 23505 3881 -25936 -28807 -12195 -6840 -20022 -27243 -14478 -297 -3806 -15706 -12037
$$ packed form
729g371J0890j8358k2568R686K9829P516k0670j2179J8684K1374j4241l9411j7592
742e4411K4047L0990K343j9290o080J4372J0289j2659k0145k359J1550J834j0720
755c0239j531K0580K1391n148k7780k1528N802J9528N932j2933j0951R075J9641
768h161P254j1565j3231p30J697q906j0279Q950K6366J4967j5051k5482k553K2418
782a4306J2781j9082k8466J73K8802K0501p873j4099M872J0973j1752k6283l505
795d7264K9186K2184j5044k8584M004L5943J9278k6137l8164l585K6482J5077
807f624j1341q822J6139J7979j0694k7514l363K5278J2926k3893k8403J0472M0014
820B154K1351j9624k9817k871J6612N355j3182p221J2765J4181l509j1900L669
$$ plain form
833 -12037 6229 11168 -11782 -38216 -35793 -8106 11629 5467 -10520 -12877 -1059 6211 -1553
846 -1553 -14397 -17846 -11426 -7398 -10058 -7102 7024 19805 12056 -11676 -25188 -13453 6176
859 6176 6957 -9421 -17107 -1125 19886 19922 2165 -9785 -3334 2645 -7621 -18330 -5906 20477
873 20477 28172 6577 -12714 -2068 19762 16470 -11893 -25413 -5121 22298 23097 5830 2192
886 2192 17219 21838 92 -21130 -11561 16000 23103 3746 -7028 12363 36101 28115 -4285
899 -4285 -19718 -3114 15598 11295 -1611 4975 27016 33008 14670 -3640 37 13780 11561
912 11561 -4878 -8323 12799 35524 33130 12619 1769 9854 17348 8412 -5625 -2884 15350
925 15350 28589 25281 15974 14813 19556 17018 3412 -6660 807 18897 26999 19365 12020 18459
$$ packed form
833a2037J8266M939k2950k6434K423K7687J9735o162j5987k357J1818P270p764
846a553j2844l449O420M028k660K956J4126J2781p749k3732j3512J1735J9629
859F176P81j6378p686J5982K1011L6j7757j1950O451N979j0266j0709J2424K6383
873B0477P695k1595j9291J0646K1830l292k8363j3520K0292K7419P99j7267l638
886B192J5027M619k1746k1222R569K7561P103j9357j0774J9391K3738p986l2400
899d285j5433J6604J8712m303j2906O586K2041N992j8338j8310L677J3743k219
912A1561j6439l445K1122K2725k394k0511j0850Q085P494q936j4037K741J8234
925A5350J3239l308r307j161M743k538j3606j0072P467J8090Q102p634p345O439
$$ plain form
939 18459 29161 24588 3764 -9999 245 19974 25189 15628 11279 23306 33458 23916 2136
952 2136 -4242 9516 20804 13061 3241 14998 38774 41554 16104 -5902 1610 22351 21868 2066
966 2066 -3557 18405 41236 35108 12446 4789 17194 21470 3597 -11490 2983 32262 38654
979 38654 17319 1210 13343 31035 22156 -4959 -14606 4860 25229 22905 10104 12386 26174
992 26174 26041 5210 -12197 -4765 15571 20306 5937 -2104 11915 29908 27004 4953 -10153
1005 -10153 -4746 6935 6736 576 4061 17036 23449 12960 -2683 -4900 4984 8753 -2606 -14752
1019 -14752 -7021 15536 27164 14489 -5335 -9178 1200 3802 -7794 -16555 -6181 10844 13182
1032 13182 107 -6077 3882 11323 -2980 -26453 -27507 -2576 16503 6941 -13162 -12256 6798
$$ packed form
939A8459J0702m573k0824j3763J0244J9729N215r561m349J2027J0152r542k1780
952B136o378J3758J1288p743r820J1757K3776K780k5450k2006P512K0741m83j9802
966B066n623K1962K2831o128k2662p657J2405M276j7873j5087J4473K9279O392
979C8654k1335j6109J2133J7692q879k7115r647J9466K0369k324j2801K282J3788
992B6174j33k0831j7407P432K0336M735j4369q041J4019J7993k904k2051j5106
1005a0153N407J1681j99o160L485J2975O413j0489j5643k217R884L769j1359j2146
1019a4752P731K2557J1628j2675j9824l843J0378K602j1596q761J0374J7025K338
1032A3182j3075o184R959P441j4303k3473j054K4931J9079r562k0103R06J9054
$$ plain form
1045 6798 12213 -7759 -28127 -22436 -3306 -19 -12569 -15172 2122 14454 -283 -26053 -29856
1058 -29856 -9251 2734 -11612 -29533 -21578 3959 12435 -6224 -25269 -22086 -9724 -12415 -26126
1071 -26126 -27352 -9822 3400 -4692 -20988 -22167 -8754 -4725 -20121 -36863 -32005 -10880 344
1084 344 -8079 -19926 -18402 -9761 -11257 -23920 -31477 -24750 -13774 -13023 -19376 -19286 -8788 -1610 -11491
1099 -11491 -29686 -36441 -24057 -9878 -11960 -23573 -24252 -10461 -857 -9206 -24477 -27789 -18950
1112 -18950 -15312 -23658 -28018 -14230 2622 562 -19405 -30420 -18076 -2410 -8634 -28750 -33738
1125 -33738 -13778 4906 413 -14317 -15946 -6121 -6391 -21794 -29133 -13998 5397 2281 -16120
1138 -16120 -20531 -1463 14764 3503 -22051 -30173 -12735 3705 1058 -7552 -3701 7744 5954
$$ packed form
1045F798N415j9972k0368N691J9130L287j2550k603J7294J2332j4737k5770l803
1058b9856K0605J1985j4346j7921P955K5537Q476j8659j9045L183J2362k691j3711
1071b6126j226J7530J3222q092j6296j179J3413M029j5396j6742M858K1125J1224
1084C44q423j1847J524Q641j496j2663p557O727J0976P51o353R0J0498P178r881
1099a1491j8195o755J2384J4179k082j1613o79J3791R604q349j5271l312Q839
1112a8950L638q346m360J3788J6852k060j9967j1015J2344J5666o224k0116m988
1125c3738J9960J8684m493j4730j629R825k70j5403p339J5135J9395l116j8401
1138a6120m411J9068J6227j1261k5554q122J7438J6440k647q610L851J1445j790
$$ plain form
1151 5954 -8613 -15346 -4334 6578 -984 -16576 -14928 7165 24605 17549 -3535 -13269 -4652
1164 -4652 4789 2630 -4182 -1808 7922 12442 8039 4543 9769 13925 6443 -9124 -13196 1558
1178 1558 20514 23905 11104 487 4976 16102 15898 2893 -5763 523 11660 13433 9776 13289
1192 13289 22898 22570 5821 -10078 -4795 14984 22758 10066 -1556 6909 26357 29830 11754
1205 11754 -3245 574 10894 8499 -423 5418 25651 32745 15733 -3811 185 18825 21944
1218 21944 2609 -11969 1071 25535 31328 16897 5827 11397 16658 6415 -7391 -2193 18041
1231 18041 26597 13413 885 9213 26654 25807 3871 -12531 -4801 13953 19873 12787 9460
1244 9460 16856 21935 13666 451 -1589 8214 13423 6670 214 8165 24467 28921 15556 -812
$$ packed form
1151E954j4567o733J1012J0912p562j5592J648K2093J7440p056k1084r734Q617
1164d652R441k159o812K374R730M520m403l496N226M156p482j5567m072J4754
1178A558J8956L391j2801j0617M489J1126k04j3005q656O286J1137J773l657L513
1192A3289R609l28j6749j5899N283J9779P774j2692j1622Q465J9448L473j8076
1205A1754j4999L819J0320k395q922N841K0233P094j7012j9544L996J8640L119
1218B1944j9335j4578J3040K4464N793j4431j1070N570N261j0243j3806N198K0234
1231A8041Q556j3184j2528Q328J7441q47k1936j6402P730J8754N920p086l327
1244I460P396N079q269j3215k040R803N209o753o456P951J6302M454j3365j6368
$$ plain form
1258 -812 -3393 6174 12491 7259 1869 7920 20012 23781 14485 4587 5121 10720 7744 -2732 -4268
1273 -4268 10649 25650 22942 7174 1427 10405 16781 6289 -9209 -7005 11735 23703 15351
1286 15351 3371 6675 18743 16007 -3622 -14392 -1950 16039 15078 988 133 16274 24872
1299 24872 9019 -12583 -12356 5421 13438 1816 -7322 3844 21584 20019 10 -11426 -3286
1312 -3286 7070 599 -11917 -8258 10866 20259 8294 -7773 -7412 3385 3835 -9220 -17448 -8184
1326 -8184 7317 10357 1526 -4452 -1025 2002 -5456 -16781 -17295 -5648 4002 979 -6984 -7051 475
1341 475 3371 -5969 -18760 -21781 -12839 -2965 -2620 -6788 -6351 -1450 -1830 -11338 -20322 -17308 -7850 -7116
1357 -7116 -15988 -18856 -6520 7196 3181 -15673 -27442 -19875 -7978 -9025 -19128 -18782 -5914
$$ packed form
1258h12k581R567O317n232n390O051J2092L769r296r898N34N599k976j0476j536
1273d268J4917J5001k708j5768n747Q978O376j0492j5498K204J8740J1968q352
1286A5351j1980L304J2068k736j9629j0770J2442J7989r61j4090q55J6141Q598
1299B4872j5853k1602K27J7777Q017j1622r138J1166J7740j565k0009j1436Q140
1312c286J0356o471j2516L659J9124R393j1965j6067L61J0797M50j3055q228R264
1326h184J5501L040q831n978L427L027p458j1325n14J1647R650l023p963o7P526
1341D75K896r340j2791l021Q942R874L45m168M37M901l80r508q984L014R458P34
1357g116q872k868J2336J3716m015j8854j1769P567J1897j047j0103L46J2868
$$ plain form
1370 -5914 1381 -7508 -19118 -16237 -6265 -9394 -26242 -32366 -14638 5474 2704 -16454 -24156 -11957
1384 -11957 -2173 -11028 -26836 -25847 -10742 -3338 -11632 -17712 -8522 2651 -4913 -24755 -30788 -16017
1398 -16017 -813 -5598 -19578 -19377 -4090 3685 -5989 -19246 -19891 -11660 -9406 -15808 -17157 -6551
1412 -6551 3070 -193 -12946 -17633 -10408 -3616 -7748 -17421 -18097 -7382 3263 1834 -5578 -9335
1426 -9335 -6952 -5412 -9055 -13806 -11097 -2209 2782 -1341 -6798 -4441 3517 4153 -7298 -17418 -12740
1441 -12740 2053 8082 408 -6342 -916 8252 6057 -6389 -12090 -3349 5647 1320 -7640 -2887
1455 -2887 13310 18515 3507 -12898 -8709 7817 11360 -2619 -10985 1029 18146 16576 1304
1468 1304 -4545 4778 10917 540 -10577 -3285 15558 20686 6133 -5392 3409 18163 15130
$$ packed form
1370e914P295q889j1610K881R972l129j6848o124J7728K0112k770j9158p702J2199
1384a1957R784q855j5808R89J5105P404q294o080R190J1173p564j9842o033J4771
1398a6017J5204m785j3980K01J5287P775r674j3257o45Q231K254o402j349J0606
1412f551R621l263j2753m687P225O792m132r673o76J0715J0645j429p412l757
1426i335K383J540l643m751K709Q888M991m123n457K357P958O36j1451j0120M678
1441a2740J4793O029p674o750N426R168k195j2446n701Q741Q996m327q960M753
1455b887J6197N205j5008j6405M189J6526L543j3979q366J2014J7117j570j5272
1468A304n849R323O139j0377j1117P292J8843N128j4553j1525Q801J4754l033
$$ plain form
1481 15130 -3290 -12650 -564 15386 15323 5486 4125 12680 15508 5247 -4629 -433 10330 11870
1495 11870 2583 -1189 9001 21582 20279 5051 -5494 -1916 8272 10887 5636 3313 8683
1508 8683 15688 14386 7925 4843 7271 7967 2565 -2850 1850 15485 23324 16042 2880 229 8759
1523 8759 14730 7258 -3593 -1380 11478 18718 13032 7233 10534 15462 8838 -5309 -7700 7654
1537 7654 21441 16019 982 82 14963 23372 11288 -5983 -6737 6327 13074 6371 2887 13554
1551 13554 22830 13955 -3688 -7411 6464 16783 7369 -7339 -4001 15126 25265 15078 -164
1564 -164 -2148 4989 5423 -2334 -3228 8421 17537 11638 295 6 10157 14095 2170 -11474 -10578
1579 -10578 3945 15054 12287 4489 2406 5270 4378 -2062 -5876 -2399 2834 2995 -679 393 8504
$$ packed form
1481A5130j8420r360J2086J5950o3r837j361Q555K828j0261r876M196J0763J540
1495A1870r287l772J0190J2581j303j5228j0545L578J0188K615n251k323N370
1508H683P005j302o461l082K428O96n402n415M700J3635P839p282j3162k651Q530
1523H759N971p472j0851K213J2858P240n686n799L301M928o624j4147k391J5354
1537G654J3787n422j5037r00J4881Q409j2084j7271p54J3064O747o703l484J0667
1551A3554R276q875j7643l723J3875J0319r414j4708L338J9127J0139j0187j5242
1564a64j984P137M34p757q94J1649R116n899j1343k89J0151L938j1925j3644Q96
1579a0578J4523J1109k767p798k083K864q92o440l814L477N233J61l674J072Q111
$$ plain form
1594 8504 13148 6429 -7579 -14191 -7738 2758 5169 -688 -3647 2451 8872 5330 -5168 -9221
1608 -9221 -5333 -2394 -6908 -10267 -2086 10353 11367 -1931 -13475 -9689 100 -479 -11644 -16134
1622 -16134 -4843 8464 6292 -5105 -8404 -1675 -410 -11381 -20580 -13121 3067 7372 -3490
1635 -3490 -11698 -4250 4863 -411 -15781 -21299 -10181 1092 -1419 -8877 -6212 4135 4801 -8497
1649 -8497 -19509 -14793 -3276 -1801 -10583 -12631 -2275 7392 2974 -9882 -15434 -9854 -4676 -8136
1663 -8136 -13252 -9568 772 5270 -1464 -9639 -9397 -5103 -5831 -12835 -15403 -8066 2024 3925 -3373
1678 -3373 -9225 -6522 -1828 -4596 -13219 -17036 -9671 1125 2451 -3817 -6822 -2937 -226 -6693 -15867
1693 -15867 -14596 -4380 1183 -4764 -10542 -4962 5712 5141 -8800 -19917 -14503 -1736 1135 -7567
$$ packed form
1594H504M644o719j4008o612O453J0496K411n857k959O098O421l542j0498m053
1608i221L888K939m514l359Q181J2439J014j3298j1544L786R789n79j1165m490
1622a6134J1291J3307k172j1397l299O729J265j0971r199P459J6188M305j0862
1635c490q208P448R113n274j5370n518J1118J1273k511p458K665J0347O66j3298
1649h497j1012M716J1517J475q782k048J0356R667m418j2856n552N580N178l460
1663h136n116L684J0340M498o734q175K42M294p28p004k568P337J0090J901p298
1678c373n852K703M694k768q623l817P365J0796J326o268l005L885K711o467r174
1693a5867J271J0216N563n947n778N580J0674n71j3941j1117N414J2767K871q702
$$ plain form
1707 -7567 -11185 -2087 6301 600 -11215 -12803 -4232 -660 -10177 -17032 -7651 8386 9648 -4712
1721 -4712 -15487 -9428 1295 -190 -11706 -15328 -4667 5425 2237 -6117 -5332 2236 2076 -9468
1735 -9468 -17456 -9419 4355 7086 -2798 -9089 -2527 6113 4269 -6322 -12240 -6947 421 556 -3115
1750 -3115 -1178 6198 8039 -614 -9029 -7276 1673 4984 -974 -7183 -3213 7557 11936 5410 -3792
1765 -3792 -4743 487 2354 -1513 -2884 3539 11355 9137 102 -2371 5501 11225 4098 -7526 -7452
1780 -7452 6191 16471 12127 1555 462 8366 10599 2379 -4525 853 10590 10547 1802 925 12215
1795 12215 19666 10487 -4999 -6883 5568 14919 9357 187 2691 13926 16888 7577 -248 3280
1809 3280 9736 7250 -977 141 12202 19874 12913 1093 217 9205 13332 5223 -2886 218 10902
$$ packed form
1707g567l618R098Q388n701j1815j588Q571L572r517o855R381J6037J262j4360
1721d712j0775O059J0723j485j1516l622J0661J0092l188q354P85P568j60j1544
1735i468p988Q037J3774K731r884o291O562Q640j844j0591n918N293P368J35l671
1750c115J937P376J841q653q415J753Q949L311n958o209L970J0770M379o526r202
1765c792r51N230J867l867j371O423P816k218r035k473P872N724p127j1624P4
1780g452J3643J0280m344j0572j093P904K233q220o904N378R737m3q745q77J1290
1795A2215P451r179j5486j884J2451R351n562r170K504J1235K962r311p825L528
1809C280O456k486q227J118J2061P672o961j1820q76Q988M127q109q109L104J0684
$$ plain form
1824 10902 15893 10890 5524 6945 10178 7184 -5 -1322 4971 11692 10438 4579 4500 10662 13867
1839 13867 7964 -1489 -4174 2615 9338 8630 4435 4463 9632 11505 5876 -1221 -1027 3986 5739 1030
1855 1030 -1232 5889 15209 13214 1240 -5522 -863 7019 4984 -3314 -4207 6066 13225 8672 7
1870 7 -375 4993 4209 -5433 -9830 -505 11755 11677 -139 -5504 2962 10015 3851 -8538 -10917 -571
1886 -571 6923 3851 -825 2735 9068 5294 -6774 -11885 -3770 5802 3572 -6023 -6725 4334 11932
1901 11932 6506 -5696 -9836 -4922 -977 -2875 -4453 709 6442 5453 -2062 -5827 -1711 2071 -1886
1916 -1886 -10278 -11467 -2354 8096 8765 818 -5886 -5689 -1955 -2833 -6631 -7120 -2647 1823 622 -2127
1932 -2127 -783 3706 2076 -7652 -16062 -11538 1346 7169 1206 -6565 -4473 3784 3746 -5674 -12454
$$ packed form
1824A0902M991n003n366J421L233k994p189j317O293O721j254n859p9O162L205
1839A3867n903r453k685O789O723p08m195K8N169J873n629p097J94N013J753m709
1855A030k262P121R320j995j1974o762M659P882k035q298q93J0273P159m553q665
1870Gl82N368p84r642m397R325J2260p8j1816n365Q466P053o164j2389k379J0346
1886e71P494l072m676L560O333l774j2068n111Q115R572k230r595p02J1059P598
1901A1932n426j2202m140M914L945j898j578N162N733r89p515l765M116L782l957
1916a886q392j189R113J0450O69p947o704J97L734q78l798m89M473M470j201k749
1932b127J344M489j630r728q410M524J2884N823n963p771K092Q257l8r420o780
$$ plain form
1947 -12454 -8184 -1190 -1780 -7005 -3763 6438 9175 -2469 -15049 -13295 -766 3403 -5085 -12225
1961 -12225 -5266 6815 7622 -3789 -9626 -5317 -964 -6560 -14342 -9178 4113 9347 -519 -10620
1975 -10620 -8024 1669 1559 -9276 -15413 -9104 1522 3600 -2702 -4305 -249 1115 -6373 -13855
1989 -13855 -11600 -2246 1711 -3008 -8178 -4746 3016 3689 -4578 -12633 -12184 -5561 -1756 -3203 -4840
2004 -4840 -2075 1893 206 -5595 -9642 -7103 -3143 -4323 -8897 -8200 -576 6098 2963 -6870 -10899
2019 -10899 -5916 -658 -3514 -10218 -8926 788 6287 641 -6903 -5425 694 -364 -9265 -12870 -4466
2034 -4466 5977 4850 -4500 -6842 1895 6604 -1401 -12711 -11004 773 6480 373 -6212 -1308
2048 -1308 8149 5911 -5667 -10192 -2733 4565 1141 -6058 -3425 7234 11752 2554 -7311 -5758
$$ packed form
1947a2454M270O994n90n225L242J0201K737j1644j2580J754J2529M169q488p140
1961a2225O959J2081Q07j1411n837M309M353n596p782N164J3291N234r866j0101
1975a0620K596R693j10j0835o137O309J0626K078o302j603M056J364p488p482
1989a3855K255R354L957m719n170L432P762O73q267q055M49O623L805j447j637
2004d840K765L968j687n801m047K539L960j180m574O97P624O674l135r833m029
2019a0899M983N258k856o704J292R714N499n646p544J478O119j058q901l605Q404
2034d466J0443j127r350k342Q737M709q005j1310J707J1777N707o107o585M904
2048a308R457k238j1578m525P459P298l424p199K633J0659M518r198r865J553
$$ plain form
2062 -5758 2600 4878 -1833 -6102 319 8339 8203 1865 -1717 2256 4233 -425 -5342 -2984 5325
2077 5325 9907 5937 -53 576 5393 6465 1790 -3464 -2583 3011 6739 5457 4282 5354 7008
2092 7008 4790 -735 -2652 1198 6639 6584 1821 -14 5297 11835 9965 1092 -4358 -614 5691
2107 5691 5542 1662 2782 8650 10852 4112 -1679 1489 8487 6976 -2315 -5727 3339 14756 14085
2122 14085 2886 -2603 3104 8385 4325 -2872 -889 7929 10373 3505 -428 6029 13452 8175
2136 8175 -4506 -8718 1438 11764 9908 1034 -307 7146 11184 5145 -2232 -922 4411 4797
2150 4797 -268 -810 7454 14031 10066 -585 -4146 1823 6811 4335 -1211 -1278 5051 10005 8374
2165 8374 3626 2639 3773 2401 -1407 -2720 1638 8005 9259 4084 637 2478 6237 5336 -1041
$$ packed form
2062e758Q358K278o711m269O421Q020j36o338l582L973J977m658m917K358Q309
2077E325M582l970n990O29M817J072m675n254Q81N594L728j282j175J072J654
2092G008k218n525j917L850N441n5m763j835N311O538j870q873n450L744O305
2107E691j49l880J120N868K202o740n791L168O998j511r291l412R066J1417o71
2122A4085j1199n489N707N281m060p197J983Q818K444o868l933O457P423n277
2136H175j2681m212J0156J0326j856q874j341P453M038o039p377J310N333L86
2150D797n065n42Q264O577l965j0651l561N969M988k476n546o7O329M954j631
2165H374m748r87J134j372l808j313M358O367J254n175l447J841L759r01o377
$$ plain form
2180 -1041 -5558 -2608 4778 8225 5083 1681 3283 5784 2493 -4513 -5574 832 5882 3319 -2169
2195 -2169 -292 7961 10003 945 -8767 -7282 1372 4705 -783 -4411 1446 9258 6125 -3726 -6950
2210 -6950 -459 3196 -2728 -9671 -5235 6970 10709 1186 -8256 -5408 2469 1474 -7434 -11039 -3513
2225 -3513 5218 3944 -2878 -4172 1080 2072 -5830 -12738 -8778 1261 3506 -2477 -7137 -2805 4340
2240 4340 2224 -6851 -12278 -8734 -2708 -1143 -3491 -3364 268 1822 -2945 -7902 -8501 -4554 -2761
2255 -2761 -5865 -8468 -4982 2380 4736 -944 -8690 -10379 -6157 -2709 -4528 -7218 -5362 378 2359
2270 2359 -2187 -5755 -4295 -1746 -4735 -11106 -10752 -1646 6259 3004 -5976 -8479 -2198 2212 -3422
2285 -3422 -11098 -9703 -1415 2348 -1921 -5127 -232 4634 -712 -11313 -13142 -3822 3986 542 -7733
$$ packed form
2180a041m517K950P386L447l142l402J602K501l291p006j061O406N050k563n488
2195b169J877Q253K042r058r712J485Q654L333n488l628N857P812l133r851l224
2210f950O491L655n924o943M436J2205L739r523r442K848P877r95q908l605P526
2225c513Q731j274o822j294N252R92p902o908L960J0039K245n983m660M332P145
2240D340k116r075n427L544O026J565k348J27L632J554m767m957n99L947J793
2255b761l104k603L486P362K356n680p746j689M222L448j819k690J856N740J981
2270B359m546l568J460K549k989o371L54R106P905l255q980k503O281M410n634
2285c422p676J395Q288L763m269l206M895M866n346j0601j829R320P808l444q275
$$ plain form
2300 -7733 -7002 1953 6307 -421 -8643 -8119 -2492 -1864 -6071 -5852 1784 6929 1713 -7362 -9001 -2003
2316 -2003 2370 -2442 -9268 -7933 718 5410 1987 -2760 -3469 -1879 -3396 -6960 -6557 -1508 2914
2331 2914 1146 -3237 -3856 439 3649 -237 -7406 -9234 -4505 1719 3002 84 -1982 -18 1228
2346 1228 -1805 -4752 -4444 -902 -31 -2402 -3921 330 6324 5748 -2445 -8445 -5585 1317 2680 -2411
2362 -2411 -4556 448 6251 3785 -2384 -3420 1091 2344 -2801 -7071 -2201 7224 8663 728 -4875
2377 -4875 -432 6172 3653 -4125 -5926 1019 7620 4952 -355 450 6508 6805 -110 -5924 -1822
2392 -1822 6032 6819 931 -1403 4423 9754 6415 -960 -3299 2031 5815 2992 -400 2393 8231
2407 8231 9632 4547 -301 1103 5432 4765 653 -756 4072 9577 9217 4342 1157 3461 6463
$$ packed form
2300g733P31Q955M354o728q222N24N627O28m207K19P636N145n216r075j639O998
2316b003M373m812o826J335Q651M692l423m747p09J590j517l564M03N049M422
2331B914j768m383o19M295L210l886p169j828M729O224J283k918k066J964J246
2346A228l033k947L08L542Q71k371j519M251N994n76q193o000K860O902J363n091
2362b411k145N004N803k466o169j036M511J253n145m270M870R425J439p935n603
2377d875M443O604k519p778j801O945O601k668n307Q05O058K97o915n814M102
2392a822P854P87n888k334N826N331l339p375k339N330L784k823l392K793N838
2407H231J401n085m848J404M329o67m112j409M828N505l60m875l185K304L002
$$ plain form
2422 6463 4543 123 -522 3959 8661 8169 4397 3661 6270 7305 3073 -1357 111 6013 9271 5617
2438 5617 1137 3988 9827 10041 2354 -3753 -455 6486 7636 3284 1768 6765 10220 5991 -1272
2453 -1272 -1271 4856 6861 1477 -3734 1382 11032 12205 3263 -3660 -948 5407 4655 -1404 -2732 3923
2469 3923 8536 4918 -114 670 6052 5372 -3008 -8196 -2829 6600 8487 1990 -2811 333 4726
2484 4726 3283 -2848 -5272 -1653 1482 501 -1322 1279 5423 4811 -1929 -7428 -5769 200 2625
2499 2625 -726 -4064 -2344 3123 4392 338 -4864 -5689 -3032 -2502 -4389 -3516 977 4186 1927 -4447
2515 -4447 -7003 -2783 1032 -2108 -8302 -8327 -975 4870 2290 -3912 -5126 -2120 -1975 -6573 -9041 -4268
2531 -4268 2327 1622 -4362 -6492 -453 3995 -1030 -10876 -11831 -4321 2627 214 -4589 -3599 1389 1100
$$ packed form
2422F463j920m420o45M481M702m92l772p36K609J035m232m430J468N902L258l654
2438E617m480K851N839K14p687o107L298O941J150m352j516M997L455m229p263
2453a272JO127K005n384n211N116R650J173q942o923K712O355p52o059j328O655
2469C923M613l618n032P84N382o80q380n188N367R429J887o497m801L144M393
2484D726j443o131k424L619L135r81j823K601M144o12o740n499J659N969K425
2499B625l351l338J720N467J269m054n202q25K657N30j887Q73M493L209k259o374
2515d447k556M220L815l140o194k5P352N845k580o202j214L006J45m598k468M773
2531d268O595p05n984k130O039M448n025r846r55P510O948k413m803R90M988k89
$$ plain form
2547 1100 -5674 -9566 -5224 -64 -2127 -7514 -6579 1304 5972 917 -8005 -9251 -3898 -401 -3359
2562 -3359 -6397 -3857 1372 2144 -2061 -5051 -2589 -1125 -4241 -8627 -7418 -716 3457 1256 -3472
2577 -3472 -4636 -1888 -504 -3286 -7205 -7101 -2798 548 124 -1779 -2073 -274 -1066 -4938 -7482 -5218
2593 -5218 -1122 499 -2615 -3864 -1282 2722 1094 -5312 -8790 -5208 -14 -223 -3824 -3953 828
2608 828 3388 -535 -6315 -5693 -854 -159 -4730 -7381 -2062 5422 4525 -3510 -7573 -2960 1861 -902
2624 -902 -6911 -6462 636 4249 408 -4257 -1488 2939 1298 -6196 -8931 -1766 5047 3853 -3108
2639 -3108 -4242 1046 5071 1072 -5260 -5130 -333 2017 -819 -1818 1539 5932 3433 -2912 -5094
2654 -5094 -558 3743 2276 -2484 -3072 1843 6347 5503 1010 -1509 -666 1439 600 28 1471 4320
$$ packed form
2547A100o774l892M342N160k063n387R35P883M668n055q922j246N353L497k958
2562c359l038K540N229P72m205k990K462J464l116m386J209O702M173k201m728
2577c472j164K748J384k782l919J04M303L346m24j903k94J799p92l872k544K264
2593e218M096J621l114j249K582M004j628o406l478L582N194k09l601j29M781
2608H28K560l923n780O22M839O95m571k651N319P484q97q035m063M613M821k763
2624i02o009M49P098L613l841m665K769M427j641p494k735P165O813j194o961
2639c108j134N288M025l999o332J30M797K350k836r99L357M393k499o345k182
2654e094M536M301j467m760n88M915M504q44m493k519Q43K105q39n72J443K849
$$ plain form
2670 4320 5268 2556 214 1606 5059 4542 69 -3570 -992 5952 8848 5482 677 666 4629 5006
2686 5006 1430 -1049 2359 6040 4425 487 1825 7826 9895 3324 -4212 -2564 5392 8933 3662
2701 3662 -1485 1695 8030 8151 1928 -1280 2759 6091 2923 -2430 238 8596 10906 4823 -2861
2716 -2861 -789 6132 7084 782 -3308 1309 7185 6723 2097 643 4498 5824 1175 -3712 -1641
2731 -1641 4888 7395 3174 -1023 1233 5724 6055 1154 -2816 -1361 1916 3295 1506 1728 3940
2746 3940 4939 2709 -817 -2037 311 2762 1319 -1377 -1019 2970 6563 4287 -729 -3236 -719
2761 -719 1893 871 -2206 -900 3263 5418 1934 -1671 -1243 2135 1589 -3531 -5616 -302 5745 4917
2777 4917 -790 -3308 1330 4608 281 -6105 -5439 899 4931 969 -2880 24 4558 3102 -4187
$$ packed form
2670D320R48k712k342J392L453n17m473l639K578O944K896l366m805j1L963L77
2686E006l576k479L408L681j615l938J338O001K069o571p536J648P956L541n271
2701C662n147L180O335J21o223l208M039L332l168n353K668Q358K310o083p684
2716b861K072O921R52o302m090M617N876m62m626j454L855J326m649m887K071
2731a641O529K507m221m197K256M491L31m901l970J455L277J379j789K22K212
2746C940R99k230l526j220K348K451j443k696L58L989L593k276n016k507K517
2761g19K612j022l077J306M163K155l484l605M28L378n46n120k085N314O047q28
2777D917n707k518M638L278m327o386O66O338M032l962l849K904M534j456p289
$$ plain form
2792 -4187 -7219 -1771 3536 1151 -4005 -3015 3953 6493 855 -6168 -5778 6 1487 -2428 -4402
2807 -4402 -366 4626 2723 -2389 -3792 -667 846 -2803 -6438 -4418 2440 4513 882 -3409 -3376
2822 -3376 -457 -479 -3752 -5578 -3605 -591 155 -854 -1282 -258 -124 -2753 -5996 -6323 -3085 235
2838 235 129 -2687 -3649 -1514 1084 -647 -4952 -7343 -5056 -1979 -1585 -2854 -2085 556 476 -4112 -7977
2855 -7977 -5740 -745 -517 -5077 -7636 -2789 3425 2575 -4187 -7444 -4636 -1821 -3687 -6702 -4222
2870 -4222 1477 2428 -3020 -6923 -3594 2056 4 -7502 -10333 -3635 2957 2167 -3189 -4762 -1071
2885 -1071 529 -3609 -7121 -4503 941 469 -4463 -5139 -25 4761 1728 -5970 -8655 -3865 1209
2900 1209 339 -2842 -2603 916 2051 -953 -3381 -2289 15 -889 -3770 -3794 59 4212 3663 -924
$$ packed form
2792d187l032N448N307k385n156R90O968K540n638p023L90N784J481l915j974
2807d402M036M992j903n112j403L125J513l649l635K020O858K073l631m291L3
2822c376K919k2l273j826J973L014P46j009m28J024J34k629l243l27L238L320
2838B35j06k816r62K135K598j731m305k391K287L077L94j269P69K641q0m588l865
2855g977K237M995K28m560k559M847O214q50o762l257K808K815j866l015K480
2870d222N699R51n448l903L329N650k052p506k831O698O592p90n356j573L691
2885a071J600m138l512K618N444m72m932o76N114M786l033p698k685M790N074
2900A209q70l181K39L519J135l004k428J092K304r04k881k4L853M153n49m587
$$ plain form
2916 -924 -3738 -2212 1209 1181 -1402 -3004 -707 2745 3420 1227 -442 391 1195 -970 -3289 -2270
2932 -2270 2204 5082 2741 -1308 -1285 3172 4595 470 -4033 -2669 2936 4761 1361 -675 2386
2947 2386 5284 3290 -2401 -3317 1807 5609 2373 -2593 -667 6195 8252 2274 -3311 -1426 4205
2962 4205 4396 -463 -2115 2591 7270 4856 -729 -1146 3745 5261 962 -3329 -720 5688 7297
2977 7297 2916 -1078 1287 5223 4358 2 -1999 1138 4678 3860 1463 2025 4633 5070 1771 -1614
2993 -1614 -717 3182 4636 2261 -201 1092 4470 5663 2846 -507 -752 1908 3049 1679 850 2485
3009 2485 4653 4068 1120 40 1813 4098 1973 -1866 -1638 3044 7145 5270 36 -1576 2231
3024 2231 4570 2121 -1650 -392 3568 4846 1669 11 2767 6156 3128 -2861 -3775 1818 6892
$$ packed form
2916i24k814J526L421k8k583j602K297L452O75k193j669Q33Q04k165k319J019
2932b270M474K878k341m049K3M457J423m125m503J364N605J825l400k036L061
2947B386K898j994n691r16N124L802l236m966J926O862K057n978n585J885N631
2962D205J91m859j652M706M679k414n585m17M891J516m299m291K609O408J609
2977G297m381l994K365L936q65m356k001L137L540q18k397N62K608M37l299l385
2993a614Q97L899J454k375k462J293L378J193k817l353k45K660J141j370q29J635
3009B485K168n85k948j080J773K285k125l839K28M682M101j875n234j612L807
3024B231K339k449l771J258L960J278l177j658K756L389l028n989r14N593N074
$$ plain form
3039 6892 4133 -974 -911 4064 6033 2286 -2534 -1155 2672 2579 -789 -738 3731 7077 3719 -2360
3055 -2360 -2849 1767 4569 1554 -2625 -1589 3558 5380 2680 12 768 2112 590 -2806 -2161 2080
3071 2080 4527 2592 -753 -1035 2003 3564 1402 -2684 -3308 -60 2284 2290 1138 700 1617 903 -1602
3088 -1602 -2899 -1248 1422 789 -1138 -2244 530 3617 3089 -1828 -5295 -3628 344 989 -1323 -2270
3104 -2270 262 2606 227 -3460 -3428 -309 260 -3487 -6013 -2173 3473 3973 -1726 -5117 -3299 726
3120 726 -529 -4900 -5667 -1149 2191 265 -3376 -2756 817 539 -4702 -7791 -4129 1049 1246 -2846
3136 -2846 -4390 -1030 1952 -675 -5546 -6615 -2919 -106 -1758 -4111 -2330 1295 1239 -2805 -5806
3151 -5806 -4372 -1000 -1191 -4085 -4333 -1192 1661 834 -3081 -4437 -2891 -1550 -2020 -4089 -3654 -686
$$ packed form
3039F892k759n107O3M975J969l747m820J379L827r3l368N1M469L346l358o079
3055b360m89M616K802l015m179J036N147J822k700k668P56J344j522l396O45M241
3071B080K447j935l345k82L038J561k162m086o24L248K344Oj152m38R17p14k505
3088a602j297J651K670o33j927j106K774L087n28m917l467J667L972O45k312r47
3104b270K532K344k379l687L2L119N69l747k526L840N646N00n699l391J818M025
3120G26j255m371p67M518L340j926l641O20L573k78n241l089L662N178J97m092
3136b846j544L360K982k627m871j069L696K813j652k353J781L625n6m044l001
3151e806J434L372j91k894k48L141K853q27l915j356J546J341m70k069M35K968
$$ plain form
3167 -686 1347 90 -2527 -3044 -1639 -707 -2964 -4881 -3339 500 2216 -253 -3193 -2380 421 363
3183 363 -3045 -5434 -3156 673 1194 -1090 -2495 501 2278 -1090 -5279 -4659 282 2485 -701 -4207
3199 -4207 -1958 3267 3693 -1463 -5618 -3229 768 778 -2358 -2561 1409 4080 509 -4087 -3259 1527
3215 1527 2186 -2292 -5393 -2062 3390 4452 325 -3094 -1418 939 -38 -2453 -2334 712 1934 217
3231 217 -2170 -407 2647 2469 -1573 -4657 -2904 1550 3244 1001 -1118 -682 1574 1468 -313 -1366
3247 -1366 -821 492 102 -750 -189 2477 3597 1507 -2216 -3435 -141 2739 2212 -1377 -1855 1300
3263 1300 3925 2719 -338 -1110 1078 1605 -915 -1930 1110 4966 3969 -451 -2180 1514 4906 2925
3279 2925 -1830 -2684 1670 4678 2934 124 1043 4096 3530 -772 -2298 1426 4876 3524 -968 -1152
$$ packed form
3167f86K033j257k617n17J405R32k257j917J542L839J716k469k940Q13K801n8
3183C63l408k389K278L829N21k284j405K996J777l368m189O20M941K203l186l506
3199d207K249N225M26n156m155K389L997J0l136k03L970K671l571m596Q28M786
3215A527O59m478l101L331N452J062m127l419J676K357r77k415J19L046J222j717
3231B17k387J763L054j78m042l084J753M454J694k243k119M36K256j06j781j053
3247a366N45J313l90q52N61K666J120k090l723j219L294K880n27l589m78L155
3263A300K625j206l057p72K188N27k520j015L040L856r97m420j729L694L392j981
3279B925m755q54M354L008j744k810R19L053n66m302j526L724L450j352m492j84
$$ plain form
3295 -1152 3586 6680 3836 -1328 -1628 2030 3959 1752 342 2358 4865 3779 646 -526 2535
3310 2535 4271 2344 -1211 -605 3295 5423 3787 515 267 2280 2660 1635 155 624 2465 2638
3326 2638 2047 1400 2318 3237 2282 182 -1283 626 3078 3315 1173 121 1438 3386 3063 -230 -1674
3343 -1674 -73 2445 1980 161 374 2579 3682 1392 -2052 -1207 2209 2660 -387 -2648 343 4803
3359 4803 4099 -650 -2960 -124 2568 678 -2699 -2306 1579 3602 783 -2471 -474 2813 1743
3374 1743 -2788 -4625 -631 4036 2765 -1401 -2053 822 3005 44 -3432 -3203 409 1636 -995
3389 -995 -2167 566 3166 1487 -2725 -4526 -1349 1253 250 -2427 -2568 348 2445 822 -1349
3404 -1349 -2096 -1173 -787 -1845 -2561 -317 1312 1298 -772 -2666 -1624 185 421 -2187 -3992 -2741 797
$$ packed form
3295a152M738L094k844n164l00L658J929k207j410K016K507j086l133j172L061
3310B535J736j927l555O06L900K128j636l272k48K013L80j025j480M69J841J73
3326B638n91o47R18R19r55k100j465J909K452K37k142j052J317J948l23l293j444
3343a674J601K518m65j819K13K205J103k290l444Q45L416M51l047k261K991M460
3359D803p04m749k310K836K692j890l377L93L885K023k819l254J997L287j070
3374A743m531j837L994M667j271m166o52K875K183k961l476K29L612J227k631
3389i95j172K733K600j679m212j801L177K602j003k677j41K916K097j623k171
3404a349p47R23L86j058p16K244J629j4k070j894J042J809K36k608j805J251L538
$$ plain form
3421 797 2375 777 -1765 -2053 -766 -591 -2625 -3058 -824 1285 131 -2256 -2273 1135 2249 -1264
3437 -1264 -5604 -5075 -278 2386 -53 -2882 -1714 1309 915 -2929 -4431 -1767 797 -923 -4212
3452 -4212 -2813 2003 4074 -710 -5804 -4423 -15 1150 -2472 -4671 -1971 1784 1293 -2357 -3085
3467 -3085 -571 479 -2781 -5623 -3613 1309 2648 -794 -3771 -2792 123 -113 -3006 -4268 -2812
3482 -2812 -93 -473 -1670 -1549 52 111 -2137 -3985 -3905 -1251 164 -935 -2367 -2185 -108 714 -545
3499 -545 -2624 -3578 -2197 -640 -1038 -1949 -769 562 824 -1572 -3486 -2420 -238 11 -2414 -3283 -859
3516 -859 2023 1860 -1608 -3430 -1652 631 -557 -3017 -2581 1157 2536 -235 -2585 -1142 1812 875
3532 875 -2989 -4159 -212 3185 1991 -1877 -2317 1653 3250 165 -3156 -2492 1391 2432 -323 -1169
$$ packed form
3421G97J578j598k542k88J287J75k034m33K234K109j154k387j7L408J114l513
3437a264m340N29M797K664k439k829J168L023l94l844j502K664K564j720l289
3452d212J399M816K071m784n094J381M408J165l622k199K700L755m91l650p28
3467c085K514J050l260k842K010M922J339l442k977R79K915k36k893j262J456
3482b812K719l80j197J21J601N9k248j848Q0K654J415j099j432J82K077Q22j259
3499e45k079r54J381J557l98r11J180J331K62k396j914J066K182K49k425q69K424
3516h59K882j63l468j822J778K283j188k460M36L738J379k771k350J443K954r37
3532H75l864j170L947L397j194l868m40L970J597l085l321O64L883J041k755q46
$$ plain form
3548 -1169 1086 3837 1785 -1770 -2175 1031 2651 701 -2173 -672 3307 4180 1705 -1270 -577 1489
3564 1489 1907 144 -467 1847 3069 2180 541 556 2517 2632 1009 -1233 -178 2191 3582 2820 974
3581 974 585 1652 2658 1585 667 -166 1319 2390 1660 1302 2089 3430 2830 388 -1245 521 3384
3598 3384 3433 1043 -799 1244 3973 3575 993 -699 1102 2784 1572 -310 1136 4080 4332 728
3614 728 -2163 659 4275 3781 -413 -2564 762 4368 3602 378 -100 2068 2891 128 -1924 181
3630 181 3708 3340 -291 -1907 1242 5091 3195 -1203 -2714 -196 3206 2020 87 638 2352 2449
3646 2449 128 -807 441 2419 1296 -1138 -2058 970 3584 3264 263 -1526 -407 1240 1324 -49
3662 -49 -445 438 1537 827 473 131 1201 899 -525 -2036 -1351 1756 2842 1140 -1388 -1194 1217
$$ packed form
3548a169K255K751k052l555m05L206J620j950k874J501L979Q73k475k975O93K066
3564A489M18j763o11K314J222q89j639J5J961J15j623k242J055K369J391p62j846
3581I74l89J067J006j073r18q33J485J071p30l58P87J341o00k442j633J766K863
3598C384M9k390j842K043K729l98k582j692J801J682j212j882J446K944K52l604
3614G28k891K822L616m94m194k151L326L606p66l224m78K168Q23k763k052K105
3630A81L527l68l631j616L149L849j896m398j511K518L402j186j933N51J714R7
3646B449k321r35J248J978j123k434r20L028K614l20l001j789J119J647Q4j373
3662d9l96Q83J099p10l54l42J070l02j424j511O85L107J086j702k528J94K411
$$ plain form
3679 1217 2179 -34 -2330 -1697 907 1958 128 -776 697 2358 590 -2417 -2924 -75 2422 268
3695 268 -2653 -1863 2140 3135 45 -3018 -2347 649 913 -1977 -2745 482 2986 1000 -2697 -3089 -44
3712 -44 1435 -1262 -3908 -2633 1247 2353 -371 -2890 -1447 254 -580 -3029 -3402 -1053 799 -769
3728 -769 -2161 -1753 367 531 -2219 -4134 -3498 -804 129 -1207 -2677 -1811 -16 -196 -2052 -3169 -3056
3745 -3056 -1863 -1509 -1979 -2014 -850 162 -1137 -2595 -3443 -2042 -667 -1355 -3029 -3435 -764 1331 19
3762 19 -2852 -3458 -2124 -651 -1790 -3216 -2201 299 417 -1688 -2917 -1159 536 -423 -3938 -4514
3778 -4514 -587 2155 679 -2493 -2458 -163 849 -1633 -3364 -2106 343 468 -2255 -2002 696 2461
3794 2461 416 -3547 -3638 -317 1956 407 -1859 -1542 1228 1591 -450 -1679 -595 422 -616 -2186
$$ packed form
3679A217R62k213k296O33K604J051j830r04J473J661j768l007n07K849K497k154
3695B68k921P90M003R95l090l063O71K996K64k890p68L227K504j986l697l92L045
3712d4J479k697k646J275L880J106k724k519J443J701q34k449l73K349J852j568
3728g69j392M08K120J64k750j915O36K694R33j336j470Q66J795j80j856j117J13
3745c056J193L54m70l5J164J012j299j458q48J401J375o88j674m06K671K095j312
3762A9k871o06J334J473j139j426J015K500J18k105j229J758J695r59l515n76
3778d514L927K742j476l172L5K295J012k482j731J258K449J25k723K53K698J765
3794B461k045l963r1L321K273j549k266L17K770L63k041j229J084J017j038j570
$$ plain form
3810 -2186 -1534 1407 2574 1004 -1618 -1447 581 1362 196 -1287 -1036 792 1410 1098 209 716 768
3827 768 -141 -1100 -1494 185 1904 1852 -71 -691 631 2170 1709 -308 -1828 -672 1701 2078 395
3844 395 76 1724 1995 444 -1570 -235 1810 2030 -116 -1597 243 3643 3365 -3 -2507 -476
3860 -476 1806 1699 -311 -753 1717 2891 1284 -1143 51 2669 2473 -559 -2561 -35 3614 3329
3876 3329 135 -1135 1014 2767 1451 -1196 -855 1240 2880 1224 -368 789 3052 2617 -103
3891 -103 -1452 585 2486 2217 423 -617 1727 3112 2328 162 -221 1112 1903 1244 210 493 2318
3908 2318 2554 1758 -70 539 1773 2014 707 -629 561 2526 3120 1141 -61 477 2405 2239 313
3925 313 -610 655 2658 2472 605 113 1760 2838 1132 -1343 -921 2130 3379 1042 -1248 410
$$ packed form
3810b186O52K941J167j570k622J71K028P81j166j483K51J828O18l12q89N07N2
3827G68r09r59l94J679J719n2j923o20J322J539m61k017j520J156K373L77j683
3844C95l19J648K71j551k014J335K045K20k146j481J840L400k78l368k504K031
3860d76K282j07k010m42K470J174j607k427J194K618j96l032k002K526L649k85
3876C329l194j270K149J753j316k647L41K095J640j656j592J157K263m35k720
3891a03j349K037J901k69j794j040K344J385p84k166l83J333P91o59j034K83J825
3908B318K36p96j828O09J234K41j307j336J190J965N94j979j202N38J928j66j926
3925C13r23J265K003j86j867m92J647J078j706k475M22L051J249k337k290J658
$$ plain form
3941 410 3054 3098 400 -1865 -171 2272 1853 -678 -659 1950 3273 656 -1872 -761 2035 2639 -392
3958 -392 -2318 -634 2571 2649 -26 -1073 -6 1331 57 -1959 -1017 1338 1860 -241 -1742 -293
3974 -293 1670 1459 -1264 -2708 -1628 676 1428 -238 -395 -368 -113 -410 -1466 -1672 -470 -482 -1129 -1834
3992 -1834 -923 675 1105 -339 -2549 -2998 -1344 116 -240 -1824 -2086 -862 365 -160 -1868 -1708 -815
4009 -815 -1113 -2568 -2772 -762 1487 797 -2282 -3160 -1284 717 -501 -2857 -3946 -982 824 -149
4025 -149 -1958 -1172 58 -324 -2868 -3547 -929 1573 393 -2743 -2666 0 1686 -618 -2979 -3205 -732
4042 -732 154 -1574 -2191 -487 1437 -257 -2574 -2947 -522 1055 -713 -2660 -1935 601 1569 227
4058 227 -1758 -1503 -654 -438 -1628 -1542 -283 932 323 -1169 -893 69 725 -344 -1764 -1872 -596 929
$$ packed form
3941D10K644M4k698k265J694K443m19k531J9K609J323k617k528J111K796O04l031
3958c92j926J684L205P8k675j047J067J337j274k016R42K355N22k101j501J449
3974b93J963k11k723j444J080K304P52j666j57K7K55k97j056k06J202j2o47p05
3992a834R11J598M30j444k210m49J654J460l56j584k62J224J227n25j708J60Q93
4009h15k98j455k04K010K249o90l079q78J876K001j218k356j089K964J806r73
4025a49j809P86J230l82k544o79K618K502j180l136P7K666J686k304k361k26K473
4042g32Q86j728o17J704J924j694k317l73K425J577j768j947P25K536R68j342
4058B27j985K55Q49K16j190Q6J259J215o09j492K76R62O56j069j420j08J276J525
$$ plain form
4076 929 837 -210 -917 -255 116 -112 -892 -1767 -473 512 21 -480 -446 762 1011 -769 -2502 -1280 533
4095 533 1024 -408 -1563 -139 2008 1421 -1104 -2257 -658 1114 185 -1635 -1222 1455 2102 -386
4111 -386 -2208 -812 1291 1279 -1704 -2618 -75 2852 1721 -1303 -2069 621 1542 -263 -1973 -1209 1074
4128 1074 1676 -497 -1446 614 2244 795 -2355 -2263 264 1902 1084 -975 -781 932 1755 471 -1122
4145 -1122 -580 631 794 -450 -837 667 2056 1424 -507 -1186 -107 1211 1265 -133 -531 11 1290
4162 1290 1860 843 59 208 531 576 42 -160 1293 1903 1277 -484 -640 1779 2527 958 -1334 -1204
4180 -1204 1522 3229 1594 -198 550 2002 1600 -100 -421 1527 2666 1424 -982 -469 2818 3886
4196 3886 1124 -1454 -843 1960 2760 733 -425 1012 2848 1568 -509 -173 1916 2617 642 -1717
$$ packed form
4076I29r2j047p07O62L71k28p80q75J294R85m91n01L4J208K49j780j733J222J813
4095E33M91j432j155J424K147n87k525j153J599J772r29j820M13K677O47k488
4111c86j822J396K103j2k983r14K543K927j131l024p66K690R21j805j710P64K283
4128A074O02k173r49K060J630j449l150R2K527J638q18k059J94J713Q23j284j593
4145a122N42J211J63j244l87J504J389o32j931o79J079J318N4j398l98N42J279
4162A290N70j017p84J49L23M5n34k02J453O10o26j761j56K419P48j569k292J30
4180a204K726J707j635j792P48J452m02j700l21J948J139j242k406N13L287J068
4196C886k762k578O11K803Q00k027j158J437J836j280k077L36K089P01j975k359
$$ plain form
4212 -1717 -423 2879 3464 849 -1136 -162 1875 1837 -124 -679 859 1757 912 -18 358 1549 1771
4229 1771 94 -1129 -435 1564 1873 843 -597 4 938 1175 288 -174 -292 117 445 237 155 566
4247 566 1161 793 -211 -790 -158 682 576 -259 -1239 -215 1588 1197 -643 -1299 -417 836 -18 -1536
4265 -1536 -758 1278 1582 -116 -1560 -576 1216 797 -1531 -2565 -162 1952 774 -1100 -1362 743
4281 743 1208 -191 -2141 -1327 953 625 -1134 -1583 393 1868 498 -2000 -2070 171 1058 -271 -2119
4298 -2119 -1058 1051 1727 -124 -1789 -786 271 -115 -1626 -1324 352 1130 -4 -1508 -1223 458
4314 458 661 -987 -1890 -1326 198 1056 193 -821 -707 167 -188 -764 -1037 -661 -437 -157 -764 -768 -156 508
4334 508 335 -1657 -2145 -1127 266 872 -614 -1616 -1046 857 171 -1259 -1712 -481 20 -845 -1425
$$ packed form
4212a717J294L302N85k615j985R74K037l8j961n55J538Q98q45r30L76J191K22
4229A771j677j223O94J999L09j030j440O01R34K37q87m62j18M09L28k08q2M11
4247E66N95l68j004n79O32Q40j06q35r80J024J803l91j840o56Q82J253q54j518
4265a536P78K036L04j698j444R84J792m19k328j034K403K114j178j874k62K105
4281G43M65j399j950Q14K280l28j759m49J976J475j370k498p0K241Q87j329j848
4298b119J061K109O76j851j665J003J057l86j511L02J676P78j134j504K85J681
4314D58K03j648r03N64J524Q58q63j014J14Q74l55n76k73L76K24K80o07mO12O64
4334E08j73j992m88J018J393O06j486j002N70J903o86j430m53J231N01q65n80
$$ plain form
4351 -1425 -614 1174 1090 -1377 -2924 -1511 645 547 -1914 -2614 -712 1214 505 -1363 -1692 -1 300
4368 300 -1947 -2798 -1401 1243 972 -1535 -2511 -412 1261 429 -1959 -2555 -912 538 -33 -1552 -924
4385 -924 578 386 -1470 -2527 -782 725 233 -1381 -2058 -243 1331 919 -998 -1810 -1145 -2 -323
4402 -323 -780 -482 161 260 -478 -1125 -609 37 490 -1119 -1477 -1067 910 1642 374 -1163 -1182 120 386
4421 386 77 -859 -399 692 862 -139 -398 243 1248 37 -1695 -1410 1212 2025 722 -822 -831 1028
4439 1028 1902 159 -1392 -490 1162 943 -473 -805 1145 2144 925 -1292 -1096 852 1834 -35 -1407
4456 -1407 -316 2092 2251 249 -1025 -28 1115 628 -958 -752 807 2119 624 -645 -139 1267
4472 1267 1512 238 -1166 -443 1091 1232 322 1 510 1218 645 -172 -296 98 835 319 -12 -71 892
$$ packed form
4351a425Q11J788q4k467j547J413K156r8k461p00J902J926p09j868l29J691L01
4368C00k247q51J397K644k71k507r76K099J673q32k388n96J643J450n71j519O28
4385i24J502j92j856j057J745J507m92j614o77J815J574m12j917q12O65J143l21
4402c23m57K98O43R9p38o47N16O46M53j609l58M10J977P32j268j537j9J302K66
4421C86l09r36M60J091J70j001k59O41J005j211j732K85K622Q13j303j544rJ859
4439A028Q74j743j551R02J652k19j416l32J950R99j219k217J96J948R82j869j372
4456a407J091K408J59k002j274R97J143m87j586K06J559J312j495j269N06J406
4472A267K45j274j404P23J534J41r10l21N09P08n73q17j24L94P37n16l31n9R63
$$ plain form
4491 892 1382 214 -237 -390 320 985 538 -30 -147 829 1329 753 -447 -276 251 715 303 -610 175
4510 175 1554 1378 -196 -963 391 1609 554 -1064 -1146 801 1937 1232 -387 -490 958 1184 103
4527 103 -849 -24 1444 986 -620 -623 1391 2510 859 -1547 -1404 718 1967 978 -883 10 1451
4544 1451 1679 -176 -584 822 1224 445 -1138 -259 1546 2035 988 -781 -551 680 1278 605 -327
4561 -327 106 684 1251 512 536 982 1088 205 -523 -652 559 1304 850 -41 -798 327 863 1172 -314
4580 -314 -1053 -372 641 579 -53 53 551 645 -272 -1238 -590 639 1268 -458 -1561 -402 1478 1421 -308
4599 -308 -1693 -697 501 83 -1141 -1008 158 1068 -343 -1795 -944 930 1021 -1290 -2638 -992 1041
4616 1041 600 -1162 -1737 -465 803 -456 -2004 -1531 361 437 -969 -1936 -780 770 672 -1654 -2483
$$ packed form
4491H92M90j168m51j53P10O65m47n68j17R76N00n76j200J71N27M64m12r13P85
4510A75J379j76j574p67J354J218j055j618q2J947J136p05j619j03J448K26j081
4527A03r52Q25J468m58j606lK014J119j651k406J43K122J249r89j861Q93J441
4544A451K28j855m08J406M02p79j583Q79J805M89j047j769K30J231N98o73r32
4561c27M33N78N67p39K4M46J06q83p28j29J211P45m54q91p57J125N36L09j486
4580c14p39O81J013o2o32J06M98R4r17r66O48J229O29j726j103J159J880n7j729
4599c08j385R96J198m18j224J33J166R10j411j452Q51J874R1k311j348J646K033
4616A041m41j762n75J272J268j259j548M73J892P6j406r67J156J550r8k326q29
$$ plain form
4633 -2483 -1066 450 -224 -1335 -1469 -314 321 -432 -1587 -1578 -317 -92 -912 -1198 -596 -29 144 -596
4651 -596 -1389 -1114 -210 -157 -1024 -1639 -1023 146 549 -127 -1352 -1024 -223 -197 -706 -1316 -44 516 618 -816
4671 -816 -870 3 465 -669 -1736 -1417 643 1275 38 -1109 -767 761 993 -607 -1992 -711 752
4688 752 265 -719 -738 618 1808 204 -1861 -1525 647 1398 -411 -1332 -177 1516 1386 -464 -1094
4705 -1094 -65 587 -88 -1293 -542 1184 1830 -1 -1120 -444 1137 1103 -761 -1269 -385 1093 976
4722 976 194 192 449 581 -317 -731 -334 808 513 -257 -582 139 731 1046 253 -1166 -1000 -332 744 629
4742 629 249 233 257 281 325 -152 3 349 334 -434 -799 718 1712 1251 -567 -1108 -152 1180 779 -835
4762 -835 -545 359 1076 492 -390 336 1128 727 -631 -1132 706 2306 1321 -641 -1143 668 1779 737
$$ packed form
4633b483J417J516o74j111j34J155O35p53j155RJ261K25q20k86O02N67J73p40
4651e96p93K75R04N3q67o15O16J169M03o76j225L28Q01K6n09o10J272N60J02j434
4671h16n4Q73M62j134j067L19K060O32j237j147L42J528K32j600j385J281J463
4688G52m87r84j9J356J190j604k065L36K172P51j809r21J155J693j30j850o30
4705a094J029O52o75j205P51J726O46j831j119O76J581l4j864n08Q84J478j17
4722I76p82kK57J32q98m14L97J142k95p70l25P21N92L15p93j419J66O68J076j15
4742F29l80j6K4K4M4m77J55L46j5p68l65J517R94m61j818n41R56J332m01j614
4762h35K90R04P17n84q82P26P92m01j358n01J838J600r85j962n02J811J111j042
$$ plain form
4780 737 -823 -404 931 1624 106 -223 976 2002 1093 -1187 -1020 938 2226 775 -920 -297 1062
4797 1062 1760 777 -503 294 1173 703 -155 -145 1085 1992 713 26 -288 892 1437 707 -117 -284 941
4816 941 1203 1283 659 701 748 617 566 456 380 1202 901 315 204 421 1087 817 291 -837 -77 994 1380
4837 1380 405 -614 437 1251 1028 -238 -664 197 986 775 -495 -63 1062 1659 128 -1286 -302
4854 -302 1398 1308 -850 -1351 11 1755 773 -454 -916 398 1063 -150 -1239 -738 888 911 -503
4871 -503 -1269 168 1072 596 -1456 -1810 -277 1234 201 -1104 -1004 344 756 -441 -1291 -553 -20
4888 -20 -52 -1094 -951 33 936 532 -568 -1419 -701 387 68 -670 -770 -242 222 19 -68 -551 -604 -395
4908 -395 -659 -1155 -690 275 410 -80 -879 -1081 54 448 -302 -1537 -1580 75 442 93 -742 -654 373
$$ packed form
4780G37j560M19J335O93j518l29J199J026r09k280J67J958J288j451j695O23J359
4797A062O98r83j280P97Q79m70q58J0J230R07j279o87l14J180N45p30q24j67J225
4816I41K62Q0o24M2M7j31n1j10p6Q22l01n86j11K17O66k70n26j128P60J071L86
4837A380r75j019J051Q14k23j266m26Q61P89k11j270M32J125N97j531j414R84
4854c02J700r0k158n01J362J744r82j227m62J314O65j213j089N01J626K3j414
4871e03p66J437R04m76k052l54J533J511j033j305J00J348M12j197q50P38N33
4888b0l2j042J43R84R03m04j100q51P18J088l19p38j00N28M64k03q7m83n3K09
4908c95k64m96M65R65J35m90p99k02J135L94p50j235m3J655L67l49q35Q8J027
$$ plain form
4927 373 98 -1315 -1435 -7 621 -71 -1524 -1151 351 1265 -174 -2183 -1539 77 278 -399 -1213 -270
4945 -270 670 67 -1392 -1087 165 619 -668 -1769 -1348 740 1169 -409 -1470 -953 144 -107 -855
4962 -855 -1488 -138 474 -154 -918 -495 711 552 -799 -1638 -1053 356 355 -500 -628 -638 26 -139 -623 -768
4982 -768 -286 -379 -97 -688 -221 600 290 -342 -1064 -690 -400 378 -248 -509 -827 -119 507 49 -691 -1084
5002 -1084 -299 -26 -285 -793 -291 457 558 -665 -903 -381 383 168 -982 -1007 95 976 437 -1001 -727
5021 -727 309 581 -384 -1525 -379 685 889 -479 -856 586 1344 537 -1120 -1123 361 1143 13 -686
5039 -686 -221 751 1121 76 -813 40 1132 147 -601 -667 894 1771 415 -341 -375 347 1064 196 -481
5058 -481 111 1059 1259 566 -15 441 804 622 248 211 822 793 873 87 496 786 1222 730 -116 -602 254
$$ packed form
4927C73k75j413j20J428O28o92j453L73J502R14j439k009O44J616K01o77q14R43
4945b70R40o03j459L05J252M54j287j101M21K088M29j578j061N17J097k51p48
4962h55o33J350O12o28p64M23J206j59j351q39N85J409jq55j28j0O64j65m84j45
4982g68M82r3K82n91M67Q21l10o32p22L74K90P78o26k61l18P08O26m58p40l93
5002a084P85K73k59n08N02P48J01j223k38N22P64k15j150k5J102Q81n39j438K74
5021g27J036K72r65j141J146J064K04j368l77J442P58q07j657lJ484P82j130o99
5039f86M65R72L70j045q89Q53J092r85p48o6J561Q77j356p56l4P22P17q68o77
5058d81N92R48K00o93n81M56L63j82l74l7O11k9Q0p86M09K90M36m92q46m86Q56
$$ plain form
5079 254 1001 921 742 284 536 1041 433 213 315 996 1095 391 -281 769 1343 1225 22 -685 -105 1550
5099 1550 1331 -39 -643 467 1244 795 -141 -196 721 1012 -199 -758 137 1558 1372 -326 -1013 234
5117 234 1475 614 -480 -1001 279 803 521 -476 46 1006 821 -635 -941 216 1334 774 -694 -868
5135 -868 100 1401 719 -396 -627 -219 114 265 -30 162 617 481 -312 -526 -95 653 709 -322 -734
5154 -734 -608 679 583 180 -241 -470 36 102 -51 -407 174 420 332 -607 -239 519 777 385 -1036 -1194
5174 -1194 288 969 600 -664 -733 465 817 -37 -807 -135 633 410 -901 -568 547 1070 275 -965
5192 -965 -886 247 606 -155 -922 -439 622 767 -377 -791 -99 445 170 -734 -577 421 928 51 -1096
5211 -1096 -601 300 395 -551 -1558 -640 176 205 -104 -611 -297 130 -413 -938 -763 -312 -52 -381 -625 -556
$$ packed form
5079B54P47q0j79m58K52N05o08k20J02O81R9p04o72J050N74j18j203p07N80J655
5099A550k19j370o04J110P77m49r36n5R17K91j211n59Q95J421j86j698o87J247
5117B34J241q61j094n21J280N24k82r97N22R60j85j456l06J157J118n60j468j74
5135h68R68J301o82j115k31M08L33J51k95J92M55j36p93k14M31P48N6j031m12
5154g34J26J287r6m03m21k29N06O6j53l56N81K46q8r39L68P58K58l92j421j58
5174a194J482O81l69j264o9J198L52q54p70O72P68k23j311L33J115N23p95j240
5192i65P9J133L59p61p67M83J061J45j144m14O92N44k75r04J57R98N07q77j147
5211a096M95R01R5r46j007R18Q16K9l09n07L14M27n43n25J75M51K60l29k44O9
$$ plain form
5231 -556 -1 49 -516 -973 -826 -403 -19 -321 -655 -523 -272 164 -442 -993 -1100 -391 -258 -682 -717 -466 173
5252 173 207 -548 -1373 -230 97 -328 -1027 -973 19 525 57 -930 -917 -170 -314 -1001 -1485 -467 565 24
5272 24 -922 -1270 -63 943 -82 -1429 -1163 -87 553 -40 -819 -209 891 305 -829 -842 88 731
5290 731 -84 -1336 -445 841 1117 244 -457 -642 -146 307 -244 -102 -5 416 583 -62 231 704 135 -195
5310 -195 -658 -507 400 980 452 -106 -341 302 595 529 -106 -78 46 486 452 450 233 628 673 120 -700 -243
5332 -243 718 1160 203 -412 206 1169 1328 314 -501 72 603 693 -268 227 1253 1171 32 -616 -76 1130
5352 1130 1055 53 -855 -13 1513 1248 99 -526 88 839 6 -962 -512 983 1136 -245 -708 282
5370 282 1113 1044 -279 -1019 57 1168 1062 -43 -531 644 418 121 -618 -127 613 516 -126 -488 299
$$ packed form
5231e56N55N0n65m57J47M23L84l02l34J32K51M36o06n51j07P09J33m24l5K51O39
5252A73L4p55q25J143L27m25o99N4R92N06m68r87J3P47j44o87m84J018J032n41
5272B4r46l48J207J006j025j347K66J076O40n93p79O10J100n86j134j3R30O43
5290G31q15j252Q91J286K76q73p01j85M96M53n51J42R7M21J67o45K93M73n69l30
5310a95m63J51R07N80n28n58k35O43K93o6o35K8J24M40l4kk17L95M5n53q20M57
5332b43R61M42r57o15O18R63J59j014q15N73N31R0r61M95J026q2j139o48N40J206
5352A130p5j002r08Q42J526k65j149o25O14P51q33r68M50J495J53j381m63R90
5370B82Q31o9j323p40J076J111j06j105m88J175k26k97p39M91P40r7o42l62P87
$$ plain form
5389 299 606 601 -247 -420 -96 413 288 -42 72 149 445 159 -119 -179 169 392 -26 -133 -119 319 741 431
5411 431 88 -418 168 505 277 -256 -469 885 1156 212 -235 -380 566 586 180 -547 261 1068 561 -89
5431 -89 -449 890 1226 181 -799 -804 973 1203 130 -743 118 845 838 -178 -406 178 792 259 -687 -311
5451 -311 962 918 -198 -774 209 791 629 -339 -468 50 594 378 -115 167 726 541 -561 -667 -320
5470 -320 502 388 -311 -342 -213 309 623 -81 -529 -585 -372 109 -142 137 -492 -54 -180 -321 -66 -312 -27
5491 -27 96 -605 -746 -19 605 638 -253 -1095 -567 31 -30 -221 -345 -151 -82 -176 -848 -201 390 208 -1198
5512 -1198 -1453 -305 916 615 -1064 -1076 -91 609 -28 -956 -733 35 69 -706 -1062 43 885 62 -1212
5531 -1212 -1233 -61 510 125 -1050 -877 132 559 -274 -733 -325 71 -217 -864 -553 240 855 11 -710
$$ packed form
5389B99L07nq48j73L24N09j25l30J14P7K96k86k78o0L48K23m18j07J4M38M22l10
5411D31l43n06N86L37k28n33k13J354K71r44m47j45R46K0m06p27Q08Q07n07o50
5431h9l60J339L36j045r80nJ777K30j073q73Q61P27pj016k28N84O14n33r46L76
5451c11J273m4j116n76R83N82j62r68j29N18N44k16m93K82N59j85j102j06L47
5470c20Q22j14o99l1J29N22L14p04m48n6K13M81k51K79o29M38j26j41K55k46K85
5491b7J23p01j41P27O24L3q91q42N28N98o1j91j24J94O9r4o72O47N91j82j406
5512a198k55J148J221l01j679j2R85P00o37r28K23P68L4p75l56J105Q42q23j274
5531a212k1J172N71l85j175J73J009M27q33m59M08L96k88o47L11P93O15q44p21
$$ plain form
5550 -710 -774 -116 486 -410 -847 -533 263 426 -94 -308 -55 305 -84 -370 -756 -69 388 147 -193 -33
5570 -33 -74 637 326 -87 -777 -780 91 731 345 -42 -125 599 378 -251 -794 -139 222 111 -523 -348 746
5591 746 883 -260 -784 -588 443 390 -584 -888 -92 1202 675 -491 -746 135 658 -362 -988 -355 719
5610 719 755 -321 -808 -37 1144 360 -1050 -965 -99 671 352 -198 -366 176 550 -116 -1056 -416 245 120
5630 120 -595 -664 326 627 449 -239 -714 -15 404 83 -403 -303 483 455 -128 -87 -147 185 -10 -325 -154
5651 -154 -57 156 416 142 -589 -144 167 311 382 -183 -278 509 726 511 -23 46 801 344 -128 -282 287
5672 287 700 577 -195 -343 354 1196 432 -569 -552 357 670 543 -5 445 773 217 -316 -650 691 1147
5692 1147 189 -635 -355 1212 1307 207 -946 -228 793 483 28 -372 363 757 298 -464 -287 748
$$ packed form
5550g10o4O58O02q96m37L14P96J63n20k14K53L60l89k86l86O87M57k41l40J60
5570c3m1P11l11m13o90lQ71O40l86l87q3P24k21o29n43O55L61j11o34J75J094
5591G46J37j143n24J96J031n3r74l04P96J294n27j166k55Q81N23j020o26O33J074
5610G19L6j076m87P71J181p84j410Q5Q66P70l19n50j68N42L74o66r40O40O61j25
5630A20p15o9R90L01j78o88m75O99M19l21m86J00P86k8n83M1o0L32j95l15J71
5651a54R7K13K60k74p31M45L11J44P1n65r5P87K17k15n34O9P55m57m72j54N69
5672B87M13j23p72j48O97Q42p64j001J7R09L13j27n48M50L28n56n33l34J341M56
5692A147r58q24K80J567R5j100j153P18J021l10m55m00P35L94m59p62J77J035
$$ plain form
5710 748 822 -236 -546 -204 724 773 336 -113 156 569 213 -74 173 358 78 50 -101 -56 738 414 44
5731 44 -347 -428 205 497 41 10 -141 -181 8 21 -142 -393 255 46 -130 -428 -28 557 545 -319 -560 -53
5753 -53 378 295 -598 -877 -185 656 381 -494 -126 179 265 -304 -627 -337 625 245 -581 -984 38 560 291
5774 291 -504 -856 194 641 -217 -656 -479 607 401 -382 -888 -209 390 290 -640 -708 54 639 -154 -692
5794 -692 -465 363 264 -352 -722 -623 275 753 -358 -356 70 104 355 -430 -288 224 245 -2 -251 -139 -26 175
5816 175 128 -295 -625 -122 66 223 -4 -5 69 139 -20 -199 -370 303 95 -90 -474 63 821 372 -94 -853
5838 -853 -373 246 336 -478 -505 139 452 302 -528 -366 285 286 -670 -747 -240 693 812 -602 -900 -341 75
5859 75 179 -914 -698 88 433 -71 -629 -125 478 419 -809 -1127 -373 448 253 -751 -407 -151 419 167
$$ packed form
5710G48P4j058l10L42R28M9m37m49K69M13l56k87K47J85k80k8j51M5P94l24l70
5731D4l91q1O33K92m56l1j51m0J89J3j63k51O48k09j76k98M00N85j2q64k41N07
5753e3M31q3q93k79O92Q41k75q75L68L05Q6n69l23K90R62l80q26m03J022N22k69
5774B91p95l52J050M47q58m39J77J086k06p83n06O79N99j00r30o8P62N85p93n38
5794f92K27Q28r9o16l70R9Q98M78j111KM26L4K51p85J42N12K1k47k49J12J13K01
5816A75m7m23l30N03J88J57k27jP4P0j59j79j71O73k08j85l84N37P58m49m66p59
5838h53M80O19R0q14k7O44L13j50q30J62O51Jr56p7N07R33J19j414k98N59M16
5859G5J04j093K16P86L45n04n58N04O03n9j228l18P54Q21j95j004L44K56N70k52
$$ plain form
5879 167 -822 -546 -173 -175 -261 -637 -31 184 280 -423 -754 -150 115 151 -362 -662 -141 245 109 -124 -291 -472
5901 -472 -453 -333 -120 -344 224 251 77 -317 -214 224 355 -133 -486 -628 433 678 412 -8 -147 61
5921 61 476 71 -460 87 421 543 -523 -101 442 1086 261 -558 -496 466 802 166 -286 23 868 814 -184
5942 -184 -277 238 472 411 -139 -54 926 1114 630 -411 -17 418 553 145 -473 -110 549 578 357 -25 523
5963 523 490 10 -160 167 597 878 -25 -16 207 358 360 273 -143 191 218 426 261 -163 327 369 214 98 -278
5986 -278 61 91 37 113 13 494 523 538 -148 -178 -185 606 221 56 -319 244 805 471 -87 -196 235 494 -477
6009 -477 -597 231 888 518 -402 -398 202 923 446 -472 -301 272 783 147 -533 -231 874 162 -526 -316
6029 -316 289 558 308 -626 -431 531 695 178 -571 -258 351 292 -45 -165 177 501 -7 -185 -155 585 708
$$ packed form
5879A67r89K76L73kq6l76O06K15R6p03l31O04K65L6n13l00N21L86j36k33j67j81
5901d72J9J20K13k24N68K7j74l94J03M38J31m88l53j42J061K45k66m20j39K08
5921F1M15m05n31N47L34J22j066M22N43O44q25q19O2R62L36o36m52L09Q45n4r98
5942a84r3N15K34o1n50Q5R80J88m84j041L94M35J35m08o18L63O59K9k21l82N48
5963E23l3m80j70L27M30K81r03RK23J51Kq7m16L34K7K08j65m24M90M2j55j16l76
5986b78L39L0n4P6j00M81K9J5o86l0pP91l85j65l75N63N61l34n58j09M31K59r71
6009d77j20Q28O57l70r20MO00P21m77r18J71N73N11o36o80L02J105p12o88K10
6029c16O05K69k50r34J95R62J64n17p49L13O09n9l37j20L42L24n08j78L0P40J23
$$ plain form
6050 708 -150 -423 -417 250 522 578 111 -150 128 226 28 64 13 10 141 62 80 400 279 22 -373 -595 -292
6073 -292 456 715 -304 -394 -7 430 650 -159 -422 0 148 169 -428 -190 314 759 -46 -970 -505 417
6093 417 701 -309 -1087 -290 473 205 -503 -673 -25 187 -255 -742 -404 400 349 -562 -995 -106 529 270
6113 270 -550 -861 -174 360 37 -284 -268 89 187 -447 -777 -740 77 97 -320 -884 -297 6 11 -436 -676 -804
6135 -804 -147 -287 -666 -211 -374 -187 -122 -431 -605 -276 -255 -449 -521 -471 -115 251 -233 -515 -519 -381 -38 -243
6157 -243 -701 -355 237 -7 20 -755 -619 62 4 -469 -612 -284 200 -64 -694 -433 -87 439 -229 -734 -539
6178 -539 130 417 -114 -618 -25 622 314 -417 -805 -19 596 22 -509 -238 451 416 -83 -556 -114 314
6198 314 267 -405 -441 -41 578 529 -216 132 545 424 73 -615 -80 414 668 109 -456 175 463 351 151
$$ packed form
6050G08q58k73OO67K72N6m67k61K78R8j98L6n1lJ31p9J8L20j21k57l95k22L03
6073b92P48K59j019r0L87M37K20q09k63M22J48K1n97K38N04M45q05r24M65R22
6093D17K84j010p78P97P63k68p08j70O48K12m42m87L38Q04n1r11m33Q89O35k59
6113B70q20l11O87N34l23l21J6L57R8o34l30L7Q17K0m17n64N87L03Nm47k40j28
6135h04O57j40l79M55j63J87O5l09j74L29K1j94p2N0L56L66m84k82mJ38L43k05
6157b43m58L46N92k44K7p75J36O81n8m73j43L28M84k64o30K61L46N26o68n05J95
6178e39O69K87n31n04N93O47l08p31l88P86O15n74n31K71O89l5m99m73M42M28
6198C14m7o72l6M00O19m9p45L48M13j21l51o88N35M94K54n59n65O31K88j12k00
$$ plain form
6219 151 -179 40 -88 94 143 86 142 440 313 -101 -166 361 148 15 -43 -133 362 270 473 -48 -339 -157
6241 -157 350 152 392 -80 296 470 -29 -209 0 403 262 -135 -371 169 786 413 -186 -170 75 474
6261 474 176 -335 -72 547 560 -12 -285 155 802 686 -435 -730 283 926 232 -182 -218 385 332 114
6281 114 -318 116 278 307 -576 11 815 1094 318 -530 -239 335 619 -127 -171 -103 1080 533 69 -28 327
6302 327 615 95 -218 -160 618 547 404 -117 -30 278 412 401 67 130 142 301 199 508 183 297 582 410
6324 410 46 110 -13 513 435 -133 -342 463 797 238 -167 -82 539 687 29 -49 324 705 196 -196 -151 164
6346 164 630 53 -565 -43 635 788 -115 -559 -252 548 466 -377 -513 214 240 35 -212 -132 378 286 48
6367 48 -457 -115 255 394 -163 -299 127 566 81 -466 -757 -40 -96 -289 -479 -195 177 -67 -107 -369 -272
$$ packed form
6219A51l30K19j28J82M9n7N6K98j27m14o5N27k13j33n8r0M95r2K03n21k91J82
6241a57N07j98K40m72L76J74m99j80K09M03j41l97k36N40O17l73n99J6K45L99
6261D74k98n11K63O19J3n72k73M40O47j16j121k95J013O43o94m14l6O03n3k18
6281A14m32M34J62K9q83N87Q04K79p76q48K91N74K84p46m4O8J183n47m64r7L55
6302C27K88n20l13N8P78p1j43n21Q7L08J34j1l34O3J2J59j02L09l25J14K85j72
6324D10l64O4j23N26p8n68k09Q05L34n59m05Q5O21J48o58p8L73L81n09l92M5L15
6346A64M66n77o18N22O78J53r03m44L07Q00q2q43j36P27K6k05k47Q0N10r2k38
6367D8n05L42L70J39n57j36M26M39m85n47k91P17n6j93j90K84L72k44m0k62R7
$$ plain form
6388 -272 216 -220 -779 -282 -11 157 70 -171 -508 -323 -158 -152 -201 -397 -194 -5 -143 -156 -279 -378 -112 -293
6410 -293 -648 -408 -65 147 256 -643 -686 156 567 148 -635 -683 -53 108 -44 -272 -12 269 -7 -381 -518
6431 -518 -193 232 -216 -726 -467 59 593 -108 -514 -257 144 107 -406 -311 95 432 -151 -696 -369 147 414
6452 414 -407 -575 -267 413 192 -20 -124 63 201 -65 -482 -117 55 175 -161 -674 -153 295 -130 -168
6472 -168 -422 -250 -92 226 311 144 -25 35 -344 -218 -241 -244 -119 -306 -385 26 -27 58 308 -243 -409 -88 223
6495 223 62 -238 -364 22 308 296 12 -281 -121 51 -464 -368 -182 331 231 -29 -301 79 411 231 -435
6516 -435 -347 105 431 -42 -107 -156 303 472 -387 -334 -127 520 -107 -298 -326 340 864 457 -519 88 -107 407
6538 407 -475 -268 324 481 461 -109 -88 259 398 396 -252 -272 525 406 162 -177 182 616 515 159 -82 56
$$ packed form
6388b72M88m36n59M97K71J68q7k41l37J85J65Om9j96K03J89j38j3j23r9K66j81
6410b93l55K40L43K12J09q99m3Q42M11m19p83m8O30J61j52k28K60K81k76l74j37
6431e18L25M25m48n10K59N26N34p01m06K57M01l7n13R5M06L37n83n45L27N16K67
6452D14q21j68L08O80k21k12j04J87J38k66m17L65J72J20l36n13N21M48m25l8
6472a68k54J72J58L18Q5j67j69O0l79J26k3lJ25j87p9M11n3Q5K50n51j66L21L11
6495B23j61l00j26L86K86j2k84k93J60J72n15R6J86N13j00k60k72L80L32j80o66
6516d35Q8M52L26m73o5m9M59J69q59N3K07O47o27j91k8O66N24m07r76O07j95N14
6538D07q82K07N92J57k0n70K1L47J39ko48k0P97j19k44l39L59M34j01l56k41J38
$$ plain form
6560 56 232 125 501 541 262 583 259 176 445 133 379 584 453 -128 80 520 165 365 125 -61 725
6581 725 706 540 46 367 595 261 98 -208 662 575 -21 -469 78 832 698 -51 -474 -208 676 504 -242
6602 -242 -206 595 584 106 -247 26 800 398 -249 -519 -28 673 316 -204 -87 84 260 365 -368 79 191
6623 191 241 -262 -201 224 328 -147 -258 -375 -294 359 162 -34 -446 -50 105 66 20 -236 -385 4 -345 -402
6645 -402 -230 88 -82 -120 -213 -260 -149 197 53 -396 -476 -171 414 198 -224 -345 -144 -215 -423 -664 -89 136
6667 136 -14 -491 -325 7 391 -29 -790 -690 -296 249 200 -226 -118 131 61 -362 -240 -173 181 -186 -695
6688 -695 -263 32 466 -161 -436 -399 97 -167 141 -147 -3 196 65 -299 -307 152 218 -321 -365 -268 108 113 -342
6711 -342 -260 -452 -130 -172 -170 -144 67 -85 -59 -409 271 -14 -77 -343 -275 -428 -226 -164 -75 -131 -287 -107 -18 308
$$ packed form
6560E6J76j07L76M0k79L21l24q3K69l12K46K05j31n81K08M40l55K00k40j86P86
6581G25j9j66m94L21K28l34j63l06Q70q7n96m48N47P54j34p49m23K66Q84j72p46
6602b42L6Q01j1m78l53K73P74m02o47k70M91P01l57n20J17J71J76J05p33M47J12
6623A91N0n03O1M25J04m75j11j17Q1O53j97j96m12L96J55l9m6k56j49L89l49n7
6645d02J72L18j70l8r3m7J11L46j44m49q0L05N85k16m22j21K01p1k08k41N75K25
6667A36j50m77J66L32L84m20p61J00L94N45m9m26J08K49p0m23J22O7L54l67n09
6688f95M32K95M34o27k75L7M96k64L08k88J44J99j31l64qM59O6n39m4R7L76Nm55
6711c42Q2j92L22m2KK6K11j52K6l50O80k85o3k66O8j53K02O2Q9n6j56J80Q9L26
$$ plain form
6735 308 123 -230 -216 38 -343 -47 -522 -65 164 -139 -173 -243 -45 124 -120 -478 -168 285 191 -340 -662
6756 -662 -56 382 53 -671 -535 -49 103 -102 -335 -325 216 60 -960 -659 13 223 108 -436 -646 335
6776 335 73 -18 -453 -184 -144 68 -337 -167 1 317 -26 -165 -318 321 452 -329 -308 -391 292 323 353 -78
6798 -78 -163 128 -223 261 -6 75 277 -150 9 -1 433 290 272 38 -85 180 579 240 336 -41 11 81 376
6821 376 258 -205 235 128 3 248 278 466 498 -108 -208 28 383 872 115 -398 8 464 688 60 -280
6842 -280 132 282 -141 -60 -153 506 917 67 -388 59 309 390 -193 -394 13 621 331 -69 250 325 479
6863 479 -143 -274 79 675 385 -98 195 383 391 -40 -72 -205 206 -113 64 105 125 607 76 186 -8 55
6885 55 166 211 -57 -128 -31 229 373 217 94 -135 197 239 39 168 70 -174 292 177 -134 76 164 46
$$ packed form
6735C08j85l53J4K54l81K96m75M57K29l03l4p0J98J69k44l58L10M53r4n31l22
6756f62O06M38l29p24J36M86J52k05k33J0N41j56j020L01O72K10j15n44k10R81
6776C35k62r1m35K69M0K12m05J70J68L16l43j39j53O39J31p81K1q3O83L1L0m31
6798g8q5K91l51M84k67Q1K02m27J59j0M34j43j8k34j23K65L99l39R6l77N2P0K95
6821C76j18m63M40j07j25K45L0J88L2o06j00K36L55M89p57n13M06M56K24o28l40
6842b80M12J50m23Q1r3O59M11q50m55M47K50Q1n83k01M07O08k90m00L19P5J54
6863D79o22j31L53N96k90m83K93J88Qm31l2j33M11l19J77M1K0M82n31J10j94O3
6885E5J11M5k68p1R7K60J44j56j23k29L32M2k00J29r8k44M66j15l11K10Q8j18
$$ plain form
6907 46 -77 -405 219 217 296 -201 -489 160 515 45 -282 -421 251 740 125 136 123 498 294 -10 -313 245
6929 245 298 -107 -503 116 309 530 -181 -282 -75 349 379 -334 -75 222 302 146 -80 -188 90 271 -266
6950 -266 -571 -58 513 374 -152 -192 148 17 107 -151 53 219 -143 -5 -14 425 89 -98 -278 -121 -227
6971 -227 160 53 -381 -234 23 -261 105 -121 96 -241 -310 -132 204 65 189 -52 152 -85 -448 61
6991 61 105 81 -303 -550 -136 140 86 185 -636 -559 -104 -84 -616 -60 -75 -21 -343 -503 23 15 15 -328 -544 -208
7015 -208 -89 22 -366 -403 163 134 -286 -569 140 83 -214 -393 -566 44 427 -63 -710 -714 176 186 -351 -208
7037 -208 -333 207 -624 -175 73 -74 59 -293 -317 -261 88 284 33 -393 -319 12 -73 157 -187 -123 -472 -123
7059 -123 -38 177 39 64 112 -51 -226 -152 -1 168 149 -261 -111 206 222 587 -319 22 -222 219 -41 -24
$$ packed form
6907D6j23l28O24kP9m97k88O49L55m70l27j39O72M89o15J1j3L75k04l04l03N58
6929B45N3m05l96O19J93K21p11j01K07M24L0p13K59K97Q0j56k26j08K78J81n37
6950b66l05N13N71j39n26m0L40j31R0k58K04J66l62J38rM39l36j87j80J57j06
6971b27L87j07m34J47K57k84L66k26K17l37o9J78L36j39J24k41K04k37l63N09
6991F1M4k4l84k47M14K76n4R9q21P7M55K0n32N56j5N4l22j60N26q%l43k16L36
7015b08J19J11l88l7N66k9m20k83P09n7k97j79j73O10L83m90o47mQ90J0n37J43
7037b08j25N40q31M49K48j47J33l52k4N6L49J96k51m26P4L31q5K30l44O4l49L49
7059a23Q5K15j38K5M8j63j75P4J51J69j9m10J50L17J6L65r06L41k44M41k60J7
$$ plain form
7081 -24 274 131 168 -44 -436 -265 238 -12 -516 -271 319 369 -132 -401 318 38 420 -291 -136 338 257
7102 257 160 -140 150 321 246 38 -631 -96 297 510 -183 24 20 51 226 -275 -236 -117 181 -9 -319 16
7124 16 109 320 -291 -171 -59 287 283 -115 -296 169 469 211 -164 9 156 76 -5 245 45 393 163 -51
7146 -51 48 100 -141 285 -184 -327 -172 108 315 458 59 -350 185 154 205 -258 243 558 262 198 -81 169
7168 169 517 119 -21 -305 344 135 359 -23 -343 121 520 45 -143 237 498 521 -193 55 586 469
7188 469 226 -13 153 349 617 208 -83 151 315 358 263 -79 36 161 434 -296 330 521 390 102 205
7209 205 15 364 585 127 -90 93 148 293 316 144 482 103 225 123 148 287 226 76 -72 -72 357 212
7231 212 15 9 -50 -96 310 347 -54 -60 -56 391 -12 61 18 114 81 -464 -371 34 566 216 -366 -392 -5 63 317
$$ packed form
7081b4K98j43L7k12l92J71N03k50n04K45N90N0n01k69P19k80L82p11J55M74q1
7102B57r7l00K90J71p5k08o69N35L93K13o93K07mL1J75n01L9J19K98j90l10L35
7124A6R3K11o11J20J12L46ml98j81M65L00k58l75J73J47q0q1K50k00L48k30k14
7146e1R9N2k41M26m69j43J55K80K07J43l99m09N35l1N1m63N01L15k96o4k79K50
7168A69L48l98j40k84O49k09K24l82l20M64L99m75j88L80K61K3p14K48N31j17
7188D69k43k39J66J96K68m09k91K34J64M3r5l42J15J25K73p30O26J91j31k88J03
7209B05j90L49K21m58k17J83N5J45K3j72L38l79J22j02K5J39o1j50j48%M29j45
7231B12j97on9m6M06L7m01oMM47m03P3m3R6l3n45R3M05N32l50n82k6L87O8K54
$$ plain form
7256 317 -259 -120 39 98 51 -600 -59 25 311 -520 -321 13 235 130 -241 -199 4 159 -312 -319 -538 71
7278 71 -108 -71 -471 213 87 15 -33 -235 21 22 -174 -534 -75 -42 -290 94 -254 -120 124 29 -436 -67 -241
7301 -241 -6 173 -156 -188 -331 178 -341 -158 -69 -310 83 -118 59 -220 -220 7 163 -378 -317 -276 165 95
7323 95 -336 -242 -148 487 51 -228 -199 -165 229 -265 -506 204 303 148 224 -553 -296 227 -16 -335 -145 -152 168
7346 168 -103 -228 -63 345 364 -376 -421 -235 256 82 -504 -279 -101 -4 -260 -482 23 47 64 -453 -220 59
7368 59 306 85 -234 -571 -130 176 -15 105 -170 -32 -181 -152 -130 202 7 -108 -267 -345 232 -211 144
7389 144 35 -264 -144 7 -205 -153 -125 -397 -200 416 193 -55 -423 -41 -17 251 -138 -161 350 287 -209 -263
7411 -263 15 206 384 -544 -370 135 235 247 -45 -372 295 221 -98 -319 120 129 55 -251 -449 418 753 53
$$ packed form
7256C17n76J39J59N9m7o51N41Q4K86q31J99L34K22j05l71M2K03J55m71pk19O09
7278G1j79L7m00O84j26p2m8k02K56Jj96l60M59L3k48L84l48J34K44r5m65L69j74
7301b41K35J79l29l2j43N09n19J83Q9k41L93k01J77k79%K27J56n41O1M1M41p0
7323I5m31R4R4O35m36k79K9L4L94m94k41P10R9j55P6p77K57N23k43l19J90pL20
7346A68k71j25J65M08J9p40m5J86M91j74n86K25J78R7k56k22N05K4J7n17K33K79
7368E9K47k21l19l37M41L06j91J20k75J38j49K9K2L32j95j15j59p8N77m43L55
7389A44j09k99J20J51k12N2K8k72J97O16k23k48l68L82K4K68l89k3N11o3m96n4
7411b63K78J91J78r28J74N05J00J2k92l27O67p4l19k21M39Rp4l06j98Q67L35p00
$$ plain form
7433 53 19 57 237 374 53 189 222 380 55 -119 -6 438 117 90 -270 252 467 378 259 168 19 87 303
7456 303 39 -9 371 44 -69 36 123 485 429 137 241 173 318 128 154 148 301 460 140 357 -57 100
7478 100 -30 157 336 104 136 -55 192 125 -156 -69 319 185 -136 -3 230 332 318 -110 -112 -172 508 209
7500 209 -6 -272 301 309 -138 -339 81 552 45 50 -193 242 343 185 -360 -273 118 586 -24 122 101 -83
7522 -83 -67 -130 -91 410 148 41 -327 -301 285 232 69 -517 209 239 260 -60 155 161 28 -50 -25 116 370 97
7546 97 -156 -248 -171 93 -62 34 -84 -15 15 -78 290 33 -154 -241 -147 172 123 -435 -120 -88 40 163 -65 251
7570 251 218 56 -443 -166 243 368 47 -283 57 227 59 -121 -264 59 143 -249 18 -357 228 248 -232
7591 -232 -543 -318 -85 188 -121 -288 -86 -41 -84 -211 -273 -60 -74 -464 -342 -140 22 -123 -317 -438 -238
$$ packed form
7433E3l4L8J80J37l21J36L3J58l25j74J13M44l21k7l60N22K15q9j19r1j49O8K16
7456C03k64m8L80l27j13J05Q7L62n6k92J04o8J45j90K6oJ53J59l20K17m14J57
7478A00j30J87J79k32L2j91K47o7k81Q7L88j34l21J33K33J02j4m28ko0O80k99
7500B09k15k66N73Qm47k01M20M71n07Nk43M35J01j58n45Q7L91M68o10J46k1j84
7522h3J6o3L9N01k62j07l68K6N86n3j63n86P26L0K1l20K15Oj33p8K5J41K54k73
7546I7k53r2P7K64j55R6j18O9L0r3L68k57j87q7R4L19m9n58L15L2J28J23k28L16
7570B51l3j62m99K77M09J25l21l30L40J70j68j80j43L23Q4l92K67l75N85K0m80
7591b32l11K25K33K73l09j67K02M5m3j27o2K13j4l90J22K02J62j45j94j21K00
$$ plain form
7612 -238 139 4 98 -184 34 -195 -490 -374 -576 65 -14 -284 -315 -11 14 -44 -414 -319 -1 -197 -231 -244 11
7635 11 77 -149 -338 -47 -161 -315 -491 -175 105 -156 -214 -295 -365 -201 -216 77 1 -14 -151 -119 -384 -19 -304
7658 -304 -416 -206 -151 -8 40 -304 -71 106 3 -336 -413 48 170 -156 -387 -24 149 20 -241 -410 -239
7679 -239 290 121 96 -207 216 366 -213 -104 112 303 455 -151 -112 26 480 331 12 97 90 539 -8 -1
7701 -1 -174 438 14 -129 157 239 73 83 -215 -312 -88 196 -135 194 350 3 -70 441 433 -54 -233 -159 78
7724 78 -21 486 305 200 113 255 -55 -135 384 335 -173 -36 -44 189 339 200 23 -125 337 225 -323 -226 423
7747 423 34 -169 -84 -101 407 87 0 -140 -8 242 228 -385 -156 104 354 193 308 -117 569 128 55 -146
7769 -146 330 453 52 -209 -425 260 -214 29 48 139 172 -11 97 79 -46 384 38 -104 11 337 286 -142
$$ packed form
7612b38L77j35R4k82K18k29k95J16k02O41p9k70l1L04K5n8l70R5L18j96l4j3K55
7635A1O6k26j89K91j14j54j76L16K80k61n8q1p0J64j5K93p6j5j37L2k65L65k85
7658c04j12K10N5J43M8l44K33J77j03l39p7M61J22l26k31L63J73j29k61j69J71
7679b39N29j69k5l03M23J50n79J09K16J91J52o06L9J38M54j49l19Q5pM49n47P
7701aj73O12m24j43K86Q2j66J0k98r7K24K84l31L29J56l47p3N11qm87j79P4K37
7724G8r9N07j81j05q7J42l10q0N19m9n08J37qK33J50j39j77j48M62j12n48R7O49
7747D23l89k03Q5j7N08l20q7j40J32K50j4o13K29K60K50j61J15m25O86m41p3k01
7769a46M76J23m01k61k16O85m74K43J9R1L3j83J08j8j25M30l46j42J15L26n1m28
$$ plain form
7791 -142 -214 -21 68 88 -185 -19 93 102 200 54 163 -6 545 115 -227 -28 -156 39 127 115 154 120 89 181
7815 181 219 -233 -176 7 353 292 101 -30 197 267 -132 -78 574 292 56 -320 -108 194 267 31 -93 -252
7837 -252 161 623 18 -145 -58 280 93 17 -125 134 182 177 -466 184 277 137 -49 -16 -270 138 -169 -196 -332
7860 -332 218 -174 -202 -151 -154 170 57 -288 -287 -109 341 -348 -441 -119 -189 -306 -323 -197 -156 109 1 50 -333 -175
7884 -175 72 -377 -409 -129 97 -258 -104 -472 -434 -127 -198 -162 -97 -41 -232 61 -225 -322 -284 -286 -56 -225 -163 22
7908 22 128 -115 -13 -215 -398 23 -123 36 -161 -258 -112 -88 -99 -436 -247 -267 -385 -331 -104 86 119 -177
7930 -177 -381 -385 -185 272 -69 -328 -169 19 -205 -345 -108 53 267 -86 -395 -206 38 45 -274 -269 -380 128
7952 128 101 -196 -259 219 86 -105 0 -197 14 3 24 -187 -100 -219 331 7 -335 104 132 5 53 115 -394
$$ packed form
7791a42p2J93Q9K0k73J66J12RR8j46J09j69N51m30l42J99j28J95Q8j2L9l4l1R2
7815A81L8m52N7J83L46o1j91j31K27P0l99N4O52k82k36l76K12L02P3k36j24j59
7837b52M13M62o05j63Q7L38j87p6j42K59M8no43O50R3j40j86L3k54M08l07k7j36
7860c32N50l92k8N1lL24j13l45JJ78M50o89r3L22p0j17j7J26M1K65j08M9l83J58
7884a75K47m49l2K80K26l55J54l68L8L07p1L6O5N6j91K93k86r7L8kK30j69O2J85
7908B2J06k43J02k02j83M21j46J59j97r7J46K4j1l37J89k0j18N4K27J90L3k96
7930a77k04mK00M57l41k59J59J88k24j40K37J61K14l53l09J89K44Pl19Nj11N08
7952A28k7k97o3M78j33j91J05j97K11j1K1k11Q7j19N50l24l42M39K8j27M8O2n09
$$ plain form
7975 -394 -56 98 -253 148 -248 172 -107 67 51 -27 107 -333 5 -27 34 158 233 -32 -298 245 477 66
7997 66 -71 -82 178 84 235 -80 39 173 194 165 -344 157 368 70 -15 -31 374 5 -183 -410 -54 159
8019 159 50 -124 -153 70 248 215 -23 -245 43 186 -109 -270 -165 187 125 -142 -27 11 73 69 17 -132 -26
8042 -26 74 274 -58 228 129 327 230 305 -28 193 395 164 284 159 89 230 334 -50 299 -33 142 48
8064 48 172 -66 244 342 254 -40 199 104 304 -18 -42 -446 329 261 32 -147 138 342 0 192 -72 381
8086 381 360 97 164 13 516 -42 -68 251 175 406 397 133 122 -45 268 89 -83 163 404 146 -129 -336
8108 -336 149 252 -165 -284 -321 9 114 124 -50 0 -126 17 -48 -356 114 -19 -290 -102 -188 154 166 381
8130 381 69 28 -46 -101 444 171 93 -144 -386 94 282 81 -38 -117 82 -190 -234 21 292 73 -261 -258 14
$$ packed form
7975c94L38J54l51M01l96M20k79J74j6p8J34m40L38l2O1J24P5k65k66N43K32m11
7997F6j37j1K60r4J51l15J19J34K1k9n09N01K11k98q5j6M05l69j88k27L56K13
8019A59j09j74k9K23J78l3k38k22K88J43k95j61J05L52o2k67J15L8O2mn2j49J06
8042b6J00K00l32K86r9J98r7P5l33K21K02k31J20j25p0J41J04l84L49l32J75r4
8064D8J24k38L10R8q8k94K39r5K00l22k4m04P75o8k29j79K85K04l42J92k64M53
8086C81k1k63O7j51N03n58k6L19p6K31rk64j1j67L13j79j72K46K41k58k75k07
8108c36M85J03m17j19l7L30J05J0j74N0j26J43o5l08M70j33k71J88q6L42J2K15
8130C81l12m1p4n5N45k73p8k37k42M80J88k01j19p9J99k72m4K55K71k19l34LK72
$$ plain form
8153 14 216 246 -274 -137 152 105 -56 -88 -94 -302 -291 -107 -134 109 303 205 -309 -463 -41 29 72 -508 127 -163
8177 -163 111 -96 -128 96 -20 46 -311 -160 -203 -2 -45 -249 -156 3
$$ packed form
8153A4K02L0n20J37K89m7j61l2ok08J1J84k7K43J94r8n14j54M22P0M3n80O35k90
8177a63K74k07l2K24j16O6l57J51m3K01m3k04R3J59
8191C
$$ Imaginary data points
##PAGE= N=2
##DATA TABLE= (X++(I..I)), XYDATA
$$ plain form
0 0 0 0 0 0 0 0 0 0 -8 8 -8 8 -13 16 -16 24 -25 32 -40 41 -51 59 -69 79 -91 102 -118 134 -152 170 -192 217
32 217 -241 272 -304 336 -374 415 -463 512 -567 628 -695 769 -854 945 -1051 1170 -1312 1472
50 1472 -1666 1899 -2187 2552 -3037 3714 -4721 6390 -9673 18613 -94909 -327518 -250957
63 -250957 -125533 -77502 -136781 -138078 -75455 -33883 -95481 -173362 -189827 -157788 -175602 -234714
75 -234714 -238686 -127109 -11082 -20594 -148204 -242754 -228271 -173210 -176943 -217044 -216646 -163666
87 -163666 -124651 -132584 -158569 -166323 -171106 -207743 -263352 -279298 -223363 -137384 -98957 -133802 -188951
100 -188951 -195394 -160267 -152046 -200200 -248774 -234534 -172051 -125858 -122666 -131103 -124129 -123898 -163209
113 -163209 -219724 -228575 -167629 -102697 -104668 -147214 -138441 -61609 -14259 -71399 -168459 -190230
$$ packed form
0@%%%%%%%%qJ6j6J6k1K9l2M0m9N7p2Q1r2J10j28J48j70J93k20K52k86L22l62M09
32B17m58N13n76O40p10P89q78R75j079J195j323J464j623J799j996K221k482K784
50A472l138L565m086M739n589O751q435J1111j6063K8286j13522k32609P6561
63b50957J25424M8031n9279j297O2623M1572o1598p7881j6465L2039j7814n9112
75b34714l972J11577J16027r512j27610r4550J4483N5061l733m0101L98N2980
87a63666L9015p933k5985p754m783l6637n5609j5946N5935Q5979L8427l4845n5149
100a88951o443L5127Q221m8154m8574J4240O2483M6193L192q437O974K31l9311
113a63209n6515q851O0946O4932j971m2546Q773P6832M7350n7140r7060k1771
$$ plain form
125 -190230 -131922 -85808 -93212 -97144 -51045 -2389 -23021 -93317 -121296 -73684 -32034 -71615
137 -71615 -140692 -126624 -23775 47216 5022 -80397 -97432 -51494 -36352 -76211 -92531 -38551
149 -38551 18376 4296 -49096 -52774 3482 31320 -24117 -96656 -88553 -7410 48167 25416
161 25416 -19487 -14413 23729 24904 -20430 -45592 -12650 28747 22452 -5866 4736 54390 79901
174 79901 46808 -4252 -13016 22005 49541 37670 14080 24311 64541 85901 59993 22861
186 22861 19768 42520 46157 21096 7197 31731 68194 73643 46197 26099 40858 64722 52191
199 52191 8830 -7796 31372 77631 70876 26406 13292 50224 76095 43056 -4229 1394
211 1394 48698 64916 29261 2319 33897 82910 75086 13976 -17283 24382 74799 61336
$$ packed form
125a90230N8308M6114p404l932M6099M8656k0632p0296k7979M7612M1650l9581
137g1615o9077J4068J02849P0991m2194q5419j7035M5938J5142l9859j6320N3980
149c8551N6927j4080n3392l678N6256K7838n5437p2539Q103Q1143N5577k2751
161B5416m4903N074L8142J175m5334k5162L2942M1397o295k8318J0602M9654K5511
174G9901l3093n1060q764L5021K7536j1871k3590J0231M0230K1360k5908l7132
186B2861l093K2752L637k5061j3899K4534L6463N449k7446k0098J4759K3864j2531
199E2191m3361j6626L9168M6259o755m4470j3114L6932K5871l3039m7285N623
211A394M7304J6218l5655k6942L1578M9013p824o1110l1259M1665N0417j3463
$$ plain form
223 61336 9306 4512 59974 94801 58143 6557 16759 65518 69207 16958 -10666 32834
235 32834 89742 82866 29832 10907 49832 82258 53022 -849 -3833 46457 77408 52908
247 52908 20642 36949 77392 75254 26081 -5214 18684 54066 48595 17976 17116 56604 86985
260 86985 67764 19233 -533 23021 48547 38910 13624 18662 55391 79876 62711 30691
272 30691 25951 42276 40940 13150 66 30891 78342 88362 52440 19374 31574 63033
284 63033 57266 11653 -12761 21557 72680 78119 44854 32376 56997 67295 26839 -18743
296 -18743 -7258 45473 67903 36683 9149 35695 81513 72000 5297 -38497 -10644 38731
308 38731 39420 3940 2679 49484 75995 37996 -16968 -20004 14887 20487 -15997 -31231 13618
$$ packed form
223F1336n2030m794N5462L4827l6658n1586J0202M8759L689n2249k7624M3500
235C2834N6908o876n3034j8925L8925L2426k9236n3871k984N0290L0951k4500
247E2908l2266J6307M0443k138m9173l1295K3898L5382n471l0619q60L9488L0381
260H6985j9221m8531j9766K3554K5526r637k5286N038L6729K4485j7165l2020
272C0691m740J6325j336k7790j3084L0825M7451J0020l5922l3066J2200L1459
284F3033n767m5613k4414L4318N1123N439l3265j2478K4621J0298m0456m5582
296a8743J1485N2731K2430l1220k7534K6546M5818r513o6703m3794K7853M9375
308C8731O89l5480j261M6805K6511l7999n4964l036L4891N600l6484j5234M4849
$$ plain form
321 13618 69614 66783 10781 -26506 -7896 20543 4879 -35002 -37185 9393 47756 36477
333 36477 5964 2654 17467 4347 -38886 -60744 -27857 22791 36166 8716 -12849 -404
345 -404 20878 8314 -35359 -64000 -48111 -12439 3966 -1105 1296 16862 14324 -23171 -63886
358 -63886 -63723 -28447 -6159 -21390 -41823 -25710 17580 33475 -6246 -60620 -74440 -48083
370 -48083 -29429 -36381 -35657 -5230 20347 929 -44418 -57813 -29239 -14449 -48377 -86641 -66140
383 -66140 1034 40350 11556 -41341 -56346 -35616 -31967 -57904 -68307 -36099 -308 -7258
395 -7258 -35606 -31626 2568 5752 -48397 -103233 -91113 -28290 10829 -6493 -37110 -34194 -11868
408 -11868 -13744 -45154 -66101 -54164 -36896 -43202 -52697 -29631 13609 22703 -22367 -75145 -80539
$$ packed form
321A3618N5996k831n6002l7287J8610K8439j5664l9881k183M6578L8363j1279
333C6477l0513l310J4813j3120m3233k1858L2887N0648J3375k7450k1565J2445
345d04K1282j2564m3673k8641J5889L5672J6405n071K401J5566k538l7495m0715
358f3886J63L5276K2288j5231k0433J6113M3290J5895l9721n4374j3820K6357
370d8083J8654o952P24L0427K5577j9418m5347j3395K8574J4790l3928l8264K0501
383f6140O7174L9316k8794n2897j5005K0730L649k5937j0403L2208L5791o950
395g258k8348L980L4194L184n4149n4836J2120O2823L9119j7322l0617K916K2326
408a1868j876l1410k0947J1937J7268o306r495K3066M3240R094m5070n2778n394
$$ plain form
421 -80539 -44228 -19054 -30508 -50451 -43297 -15436 -254 -12040 -32903 -42838 -44435 -54202 -64940
434 -64940 -50999 -10710 19032 4469 -36975 -55074 -33674 -9384 -20558 -54015 -63959 -33944
446 -33944 2013 8766 -7601 -17319 -14694 -23669 -51293 -63544 -33488 9117 11846 -24643 -42341
459 -42341 -11243 26018 12403 -39754 -65991 -40539 -3802 51 -13731 -6502 16416 14145 -22274
472 -22274 -46524 -24633 11318 4608 -36780 -48561 -3047 45257 35685 -13627 -38071 -17639
484 -17639 3814 -7182 -24064 -10332 19756 24769 35 -12497 8232 31595 14952 -27719
496 -27719 -40901 -4627 37924 38521 8384 -5907 10378 24998 13399 -8536 -9806 8086 17443
509 17443 9439 4738 20166 40488 36498 5936 -18386 -8392 22155 32961 13819 -1854 13295
$$ packed form
421h0539L6311K5174j1454j9943P154K7861J5182j1786k0863r935j597r767j0738
434f4940J3941M0289K9742j4563m1444j8099K1400K4290j1174l3457r944L0015
446c3944L5957O753j6367r718K625q975k7624j2251L0056M2605K729l6489j7698
459d2341L1098L7261j3615n2157k6237K5452L6737L853j3782P229K2918k271l6419
472b2274k4250K1891L5951o710m1388j1781M5514M8304r572m9312k4444K0432
484a7639K1453j0996j6882J3732L0088N013k4734j2532K0729K3363j6643m2671
496b7719j3182L6274M2551N97l0137j4291J6285J4620j1599k1935j270J7892R357
509A7443q004m701J5428K0322l990l0562k4322R994L0547J0806j9142j5673J5149
$$ plain form
522 13295 40588 43495 18180 -1723 5896 21929 16360 -1456 1764 32074 53317 35659 3547
535 3547 683 28937 42006 14876 -14448 -255 41334 55096 28437 6986 23111 46902
547 46902 33147 -4119 -12010 21452 49643 34983 6361 12053 48060 58834 23040 -13286
559 -13286 -2494 34245 42135 14890 2919 31530 60811 47649 10071 -1232 21640 36052
571 36052 17083 -3799 11068 47059 58607 33082 6810 12845 33508 31755 5099 -7231
583 -7231 14854 44946 48499 30004 19673 27769 32977 18785 -623 238 21485 37992 33094
596 33094 20644 23406 39156 42316 18271 -9499 -8963 18001 37374 30552 15877 20606 38300
609 38300 38846 14671 -6685 -932 17297 18795 5066 7134 33663 53898 34488 -5331 -17081
$$ packed form
522A3295K7293K907k5315j9903P619J6033n569j7816L220L0310K1243j7658l2112
535C547k864K8254J3069k7130k9324J4193M1589J3762k6659k1451J6125K3791
547D6902j3755l7266p891L3462K8191j4660k8622N692L6007J0774l5794l6326
559a3286J0792L6739P890k7245j1971K8611K9281j3162l7578j1303K2872J4412
571C6052j8969k0882J4867L5991J1548k5525k6272O035K0663j753k6656j2330
583g231K2085L0092L553j8495j0331Q096N208j4192j9408Q61K1247J6507m898
596C3094j2450K762J5750L160k4045k7770N36K6964J9373o822j4675M729J7694
609C8300N46k4175k1356N753J8229J498j3729K068K6529K0235j9410l9819j1750
$$ plain form
622 -17081 8188 27746 10416 -13594 -2431 35127 48597 22778 -3474 1875 17526 6739
634 6739 -20893 -20971 15451 44084 29433 -3436 -5934 20143 27883 -4031 -35883 -23653 14146
647 14146 27649 8705 -2927 12801 26160 6912 -27056 -33125 -6886 11067 -15 -16661
659 -16661 -5557 21878 26939 -808 -29651 -29795 -11220 -4445 -14801 -16623 133 16765 9376
672 9376 -12075 -22896 -17689 -13027 -22749 -34747 -27577 -3399 14521 7221 -15843 -28624 -22537
685 -22537 -15677 -24579 -38851 -34825 -13043 2120 -4279 -17962 -18450 -12025 -20032 -44230 -55469 -35363
699 -35363 -4307 -158 -22342 -34814 -17505 666 -13551 -48886 -60183 -35476 -11877 -17442
711 -17442 -31225 -20748 1177 -3458 -37591 -58298 -40019 -12411 -18059 -46261 -49418 -13753 15107
$$ packed form
622a7081K5269J9558j7330k4010J1163L7558J3470k5819k6252N349J5651j0787
634F739k7632p8L6422K8633j4651l2869k498K6077P740l1914l1852J2230L7799
647A4146J3503j8944j1632J5728J3359j9248l3968o069K6239J7953j1082j6646
659a6661J1104K7435N061k7747k8843j44J8575O775j0356j822J6756J6632p389
672I376k1451j0821N207M662r722j1998P170K4178J7920p300k3064j2781O087
685b2537O860q902j4272M026K1782J5163o399j3683m88O425q007k4198j1239K0106
699c5363L1056M149k2184j2472J7309J8171j4217l5335j1297K4707K3599n565
711a7442j3783J0477K1925m635l4133k0707J8279K7608n648k8202l157L5665K8860
$$ plain form
724 15107 -952 -41336 -54080 -32763 -18645 -33580 -48039 -30729 -1957 -1406 -27576 -38445
736 -38445 -20257 -5824 -25463 -57417 -56856 -20979 8606 300 -25020 -31262 -15852 -8857 -24210
749 -24210 -40115 -34176 -16594 -11442 -19406 -17733 -91 10492 -5867 -34597 -44980 -26329 -2157
762 -2157 1036 -13009 -19982 -7142 9382 8303 -10058 -22840 -20052 -11831 -13142 -14863 -1350 19445
776 19445 22012 -1358 -24394 -19450 5209 13365 -7594 -27478 -14310 18120 31523 13299 -6085
789 -6085 -2755 7077 -2099 -19748 -11994 19243 34490 12407 -13592 -3061 29190 35560 1663
802 1663 -29753 -18481 17561 31213 15090 3854 17089 28622 12790 -11238 -7584 19272
814 19272 27954 3538 -15735 4516 42551 48038 14356 -14578 -8951 14673 20346 7026 2625
$$ packed form
724A5107j6059m0384j2744K1317J4118j4935j4459J7310K8772N51k6170j0869
736c8445J8188J4433j9639l1954N61L5877K9585q306k5320o242J5410O995j5353
749b4210j5905N939J7582N152p964J673J7642J0583j6359k8730j0383J8651K4172
762b157L193j4045o973J2840J6524j079j8361j2782K788Q221j311j721J3513K0795
776A9445K567k3370k3036M944K4659Q156k0959j9884J3168L2430J3403j8224j9384
789f085L330R832r176j7649P754L1237J5247k2083k5999J0531L2251O370l3897
802A663l1416J1272L6042J3652j6123j1236J3235J1533j5832k4028L654K6856
814A9272Q682k4416j9273K0251L8035N487l3682k8934N627K3624N673j3320m401
$$ plain form
827 2625 16920 29022 21442 7549 10681 24169 21868 -1081 -16692 -727 30599 42482 25212
840 25212 5476 5264 18245 22457 11576 124 2970 14575 20297 18561 19785 27928 30345 15490
854 15490 -5962 -8861 10446 29756 26090 8675 5333 22225 36442 26792 3942 -4095 7480
867 7480 16807 10839 5529 19510 39474 35625 8792 -7058 7822 28540 21514 -3899 -7579
880 -7579 19566 43068 33998 9898 5123 18518 20469 1482 -10817 7041 34468 34702 11500
893 11500 1874 20378 35755 19283 -11664 -16235 9909 30003 21735 7546 13554 29693 27310
906 27310 3844 -11020 -1235 15731 13894 1060 2557 23347 37096 22832 -2736 -9961 2644
919 2644 12194 4202 -5115 2984 21609 28229 16230 2249 -23 4438 2545 -6994 -9073 4574
$$ packed form
827B625J4295J2102p580j3893L132J3488k301k2949j5611J5965L1326J1883j7270
840B5212j9736k12J2981M212j0881j1452K846J1605N722j736J224Q143K417j4855
854A5490k1452k899J9307J9310l666j7415l342J6892J4217r650k2850q037J1575
867G480R327n968n310J3981J9964l849k6833j5850J4880K0718p026k5413l680
880g579K7145K3502r070k4100m775J3395J951j8987j2299J7858K7427K34k3202
893A1500r626J8504J5377j6472l0947m571K6144K0094q268j4189O008J6139k383
906B7310k3466j4864R785J6966j837j2834J497K0790J3749j4264k5568p225J2605
919B644R550p992r317Q099J8625O620j1999j3981k272M461j893r539k079J3647
$$ plain form
933 4574 20879 22119 8516 -954 3376 10090 1776 -15352 -18795 -442 18925 18230 3378 -2862
947 -2862 5339 10229 -3015 -20484 -19089 810 12119 3300 -6263 3597 18984 11232 -17158 -31769
961 -31769 -14917 8035 5696 -12737 -14071 7871 21821 5474 -20117 -23917 -7690 -1552 -15744
974 -15744 -23025 -3849 19959 15480 -12444 -26207 -11256 4180 -7582 -30285 -29321 -3659 14119
987 14119 4166 -13394 -13296 -2777 -6206 -25662 -34424 -18581 3258 3125 -13697 -20193 -6143 5680
1001 5680 -5340 -28354 -36297 -22197 -5878 -5842 -13368 -10609 -1572 -2340 -16858 -29624 -27118 -13726
1015 -13726 -9592 -19525 -25646 -13385 5212 6251 -14811 -33831 -31345 -16580 -11876 -21252 -25183
1028 -25183 -12404 1299 -3139 -19652 -25355 -15831 -11157 -24404 -39104 -29734 -1862 9636 -8051
$$ packed form
933D574J6305J240j3603r470M330O714q314j7128l443J8353J9367o95j4852o240
947b862Q201M890j3244j7469J395J9899J1309q819r563R860J5387p752k8390j4611
961c1769J6852K2952k339j8433j334K1942J3950j6347k5591l800J6227O138j4192
974a5744p281J9176K3808m479k7924j3763J4951J5436j1762k2703R64K5662J7778
987A4119r953j7560R8J0519l429j9456q762J5843K1839j33j6822o496J4050J1823
1001E680j1020k3014p943J4100J6319L6p526K759R037p68j4518j2766K506J3392
1015a3726M134r933o121J2261J8597J039k1062j9020K486J4765M704r376l931
1028b5183J2779J3703m438j6513n703R524M674j3247j4700R370K7872J1498j7687
$$ plain form
1041 -8051 -29142 -25348 -6816 -6029 -26748 -39984 -25570 -3134 -2599 -16927 -19265 -4697 581
1054 581 -17920 -38120 -32272 -7285 2768 -13687 -27776 -15414 7391 6949 -17126 -33079 -23094
1067 -23094 -6748 -7413 -18574 -16042 1354 8931 -4846 -20973 -18174 -3856 -1409 -15814 -25357
1080 -25357 -11977 9571 14784 -329 -13532 -10196 -670 -2635 -12793 -14769 -2979 8873 7383
1093 7383 -213 -784 7461 9321 -2871 -16519 -13700 4408 17838 11885 -408 675 13195 17734
1107 17734 5510 -8402 -6030 7525 12349 6098 4613 16681 26908 17104 -3130 -8285 8005
1120 8005 22262 13868 -3032 -1142 20811 34083 21834 3112 2545 13613 14478 2508 767
1133 767 18227 33214 24248 4729 3629 22153 31612 15124 -7656 -5394 18454 33879 25414
$$ packed form
1041h051k1091L794J8532P87k0719j3236J4414K2436N35j4328k338J4568N278
1054E81j8501k0200N848K4987J0053j6455j4089J2362K2805m42k4075j5953R985
1067b3094J6346o65j1161K532J7396P577j3777j6127K799J4318K447j4405r543
1080b5357J3380K1548N213j5113j3203L336R526j965j0158j976J1790J1852j490
1093G383p596n71Q245J860j2192j3648K819J8108J3430n953j2293J083J2520M539
1107A7734j2224j3912K372J3555M824o251j485J2068J0227r804k0234n155J6290
1120H005J4257q394j6900J890K1953J3272j2249j8722n67J1068Q65j1970j741
1133G67J7460J4987q966j9519j100J8524R459j6488k2780K262K3848J5425q465
$$ plain form
1146 25414 12529 14401 23041 18636 4898 2243 15809 25215 16464 3908 10329 30644 38510
1159 38510 21190 -1321 -4519 10452 21983 18520 10768 13937 22576 23886 15294 10314 13433 15781
1173 15781 8372 -1347 2607 20642 34281 27997 9875 549 8025 18223 15342 2871 -860
1186 -860 9892 21387 20746 13485 13156 17438 12492 -2791 -10702 2084 22356 24830 8739 -2014
1200 -2014 8454 23258 19096 -2313 -13504 -3094 11571 10578 2532 7754 21745 20627 -859
1213 -859 -16527 -6436 13086 13270 -6100 -13638 4260 25442 21827 -20 -11335 -3621 3388
1226 3388 -4173 -12430 -2405 16638 18641 594 -11162 -1266 12371 5893 -15623 -23909 -7345
1239 -7345 13644 14839 2313 -4126 1294 3164 -6068 -16337 -13190 -829 4145 -2640 -7439 500
$$ packed form
1146B5414j2885J872Q640m405j3738k655J3566R406q751j2556O421K0315P866
1159C8510j7320k2511l198J4971J1531l463p752L169Q639J310q592m980L119K348
1173A5781p409r719L954J8035J3639o284j8122r326P476J0198k881j2471l731
1186h60J0752J1495o41p261l29M282m946j5283p911J2786K0272K474j6091j0753
1200b014J0468J4804m162k1409j1191J0410J4665r93q046N222J3991j118k1486
1213h59j5668J0091J9522J84j9370p538J7898K1182l615k1847j1315P714P009
1226C388p561q257J0025J9043K003j8047j1756R896J3637o478k1516q286J6564
1239g345K0989J195j2526o439N420J870r232j0269L147J2361M974o785m799P939
$$ [...]
8191a32
##END NTUPLES=NMR FID
##END=
