##TITLE=1H_LR-695-M1-Et2O
 CDCl3, 8 sc, 
 23.10.2019
##JCAMPDX= 6.0         $$ Bruker NMR JCAMP-DX V2.0
##DATA TYPE= NMR FID
##DATA CLASS= NTUPLES
##ORIGIN= UXNMR, Bruker Analytische Messtechnik GmbH
##OWNER= root
$$ XWIN-NMR		Version 3.5
$$ Wed Oct 23 15:33:04 2019 Russian Standard Time (UT+4h)  she@DPX200
##.OBSERVE FREQUENCY= 200.1315
##.OBSERVE NUCLEUS= ^1H
##.DELAY= (6, 6)
##.ACQUISITION MODE= SIMULTANEOUS
##.ACQUISITION SCHEME= undefined
##.AVERAGES= 8
##.DIGITISER RES= 18
##SPECTROMETER/DATA SYSTEM= spect
##.PULSE SEQUENCE= zg30
##.SOLVENT NAME= CDCl3
##.SHIFT REFERENCE= (INTERNAL, CDCl3, 0, 15.7039)
##AUDIT TRAIL= $$ (NUMBER, WHEN, WHO, WHERE, WHAT)
$$ ##TITLE= Audit trail, XWIN-NMR		Version 3.5
$$ ##JCAMPDX= 5.01
$$ ##ORIGIN= Bruker BioSpin GmbH
$$ ##OWNER= she
$$ F:/spectra/data/she/nmr/H-F/1/audita.txt
$$ ##AUDIT TRAIL=  $$ (NUMBER, WHEN, WHO, WHERE, WHAT)
(   1,<2019-10-23 15:31:58.40 +0400>,<she>,<DPX200>,
      <created by zg, POWCHK disabled, PULCHK disabled
       configuration hash MD5:
       00 E9 B6 7A A2 85 ED C7 34 08 36 98 17 FE 4E 26
       data hash MD5: 16K
       22 DA 2B 96 C3 94 F5 4C EB EA AD 1D 0C 47 0E DE>)
$$ ##END=
$$ 
$$ hash MD5
$$ 1D ED 69 78 BE B3 99 AE 08 C0 5A CE 65 4E B5 A9
##$RELAX= 
##$RELAX= 
##$RELAX= 
##$RELAX= 
##$RELAX= 
##$RELAX= 
$$ Bruker specific parameters
$$ --------------------------
##$DU= <F:/spectra>
##$EXPNO= 1
##$NAME= <H-F>
##$PROCNO= 1
##$TYPE= <nmr>
##$USER= <she>
##$AMP= (0..31)
100 100 100 100 100 100 100 100 100 100 100 100 100 100 100 100 100 100 
100 100 100 100 100 100 100 100 100 100 100 100 100 100 
##$AQSEQ= 0
##$AQ_mod= 1
##$AUNM= <au_zg>
##$AUTOPOS= <>
##$BF1= 200.13
##$BF2= 200.13
##$BF3= 200.13
##$BF4= 200.13
##$BF5= 200.13
##$BF6= 200.13
##$BF7= 200.13
##$BF8= 200.13
##$BYTORDA= 1
##$CFDGTYP= 0
##$CFRGTYP= 5
##$CHEMSTR= <none>
##$CNST= (0..31)
1 1 145 1 1 1 1 1 1 1 1 1 1 1 1 1 1 1 1 1 1 1 1 1 1 1 1 1 1 1 1 1 
##$CPDPRG= <>
##$CPDPRG1= <>
##$CPDPRG2= <>
##$CPDPRG3= <>
##$CPDPRG4= <mlev>
##$CPDPRG5= <mlev>
##$CPDPRG6= <mlev>
##$CPDPRG7= <mlev>
##$CPDPRG8= <mlev>
##$CPDPRGB= <>
##$CPDPRGT= <>
##$D= (0..31)
0 1.2 0 0 0 0 0 0 0 0.06 0 0.03 0 0 0 0 0.0002 0 0 0 0 0 0 0 0 0 0 0 0 
0 0 0 
##$DATE= 1571830317
##$DBL= (0..7)
120 120 120 120 120 120 120 120 
##$DBP= (0..7)
150 150 150 150 150 150 150 150 
##$DBP07= 0
##$DBPNAM0= <>
##$DBPNAM1= <>
##$DBPNAM2= <>
##$DBPNAM3= <>
##$DBPNAM4= <>
##$DBPNAM5= <>
##$DBPNAM6= <>
##$DBPNAM7= <>
##$DBPOAL= (0..7)
0.5 0.5 0.5 0.5 0.5 0.5 0.5 0.5 
##$DBPOFFS= (0..7)
0 0 0 0 0 0 0 0 
##$DE= 6
##$DECBNUC= <off>
##$DECIM= 24
##$DECNUC= <off>
##$DECSTAT= 4
##$DIGMOD= 1
##$DIGTYP= 9
##$DL= (0..7)
0 120 120 120 120 120 120 120 
##$DP= (0..7)
150 150 150 150 150 150 150 150 
##$DP07= 0
##$DPNAME0= <>
##$DPNAME1= <>
##$DPNAME2= <>
##$DPNAME3= <>
##$DPNAME4= <>
##$DPNAME5= <>
##$DPNAME6= <>
##$DPNAME7= <>
##$DPOAL= (0..7)
0.5 0.5 0.5 0.5 0.5 0.5 0.5 0.5 
##$DPOFFS= (0..7)
0 0 0 0 0 0 0 0 
##$DQDMODE= 0
##$DR= 18
##$DS= 0
##$DSLIST= <SSSSSSSSSSSSSSS>
$$ [...]
##$SUBNAM2= <"">
##$SUBNAM3= <"">
##$SUBNAM4= <"">
##$SUBNAM5= <"">
##$SUBNAM6= <"">
##$SUBNAM7= <"">
##$SUBNAM8= <"">
##$SUBNAM9= <"">
##$SW= 24.0689530833862
##$SWIBOX= (0..15)
0 0 2 0 0 0 0 0 0 0 0 0 0 0 0 0 
##$SW_h= 4816.95568400771
##$TD= 16384
##$TD0= 1
##$TE= 0
##$TE2= 300
##$TE3= 300
##$TEG= 300
##$TL= (0..7)
0 120 120 120 120 120 120 120 
##$TP= (0..7)
150 150 150 150 150 150 150 150 
##$TP07= 0
##$TPNAME0= <>
##$TPNAME1= <>
##$TPNAME2= <>
##$TPNAME3= <>
##$TPNAME4= <>
##$TPNAME5= <>
##$TPNAME6= <>
##$TPNAME7= <>
##$TPOAL= (0..7)
0.5 0.5 0.5 0.5 0.5 0.5 0.5 0.5 
##$TPOFFS= (0..7)
0 0 0 0 0 0 0 0 
##$TUNHIN= 0
##$TUNHOUT= 0
##$TUNXOUT= 0
##$USERA1= <user>
##$USERA2= <user>
##$USERA3= <user>
##$USERA4= <user>
##$USERA5= <user>
##$V9= 5
##$VALIST= <valist>
##$VCLIST= <CCCCCCCCCCCCCCC>
##$VD= 0
##$VDLIST= <DDDDDDDDDDDDDDD>
##$VPLIST= <PPPPPPPPPPPPPPP>
##$VTLIST= <TTTTTTTTTTTTTTT>
##$WBST= 1024
##$WBSW= 4
##$XGAIN= (0..3)
0 0 0 0 
##$XL= 0
##$YL= 0
##$YMAX_a= 374358
##$YMIN_a= -308359
##$ZGOPTNS= <>
##$ZL1= 120
##$ZL2= 120
##$ZL3= 120
##$ZL4= 120
##$ABSF1= 10
##$ABSF2= 0
##$ABSG= 5
##$ABSL= 3
##$ALPHA= 0
##$AQORDER= 0
##$ASSFAC= 0
##$ASSFACI= 0
##$ASSFACX= 0
##$ASSWID= 0
##$AUNMP= <proc_1d>
##$AZFE= 0.1
##$AZFW= 0.1
##$BCFW= 1
##$BC_mod= 2
##$BYTORDP= 1
##$COROFFS= 0
##$CY= 11.3945322036743
##$DATMOD= 1
##$DC= 2
##$DFILT= <>
##$DTYPP= 0
##$F1P= 20.1720416913024
##$F2P= 0.152960286110954
##$FCOR= 0.5
##$FTSIZE= 0
##$FT_mod= 4
##$GAMMA= 1
##$GB= 0.15
##$INTBC= 1
##$INTSCL= 1
##$ISEN= 128
##$LB= 0.24
##$LEV0= 0
##$LPBIN= 0
##$MAXI= 10000
##$MC2= 0
##$MEAN= 0
##$ME_mod= 0
##$MI= 1.114404
##$NCOEF= 0
##$NC_proc= 0
##$NLEV= 6
##$NOISF1= 3.799351
##$NOISF2= 2.8
##$NSP= 1
##$NTH_PI= 0
##$NZP= 0
##$OFFSET= 15.70392
##$PC= 1
##$PHC0= -9561.775
##$PHC1= -3.199186
##$PH_mod= 1
##$PKNL= yes
##$PPARMOD= 0
##$PSCAL= 0
##$PSIGN= 0
##$REVERSE= no
##$SF= 200.130013532006
##$SI= 16384
##$SIGF1= 3
##$SIGF2= 2
##$SINO= 400
##$SIOLD= 16384
##$SREGLST= <1H.CDCl3>
##$SSB= 0
##$STSI= 0
##$STSR= 0
##$SW_p= 3612.71676300578
##$SYMM= 0
##$S_DEV= 0
##$TDeff= 0
##$TDoff= 0
##$TI= <>
##$TILT= no
##$TM1= 0
##$TM2= 0
##$TOPLEV= 0
##$USERP1= <user>
##$USERP2= <user>
##$USERP3= <user>
##$USERP4= <user>
##$USERP5= <user>
##$WDW= 1
##$XDIM= 8192
##$YMAX_p= 0
##$YMIN_p= 0
$$ End of Bruker specific parameters
$$ ---------------------------------
##NTUPLES= NMR FID
##VAR_NAME=  TIME,          FID/REAL,        FID/IMAG
##SYMBOL=    X,             R,               I
##VAR_TYPE=  INDEPENDENT,   DEPENDENT,       DEPENDENT
##VAR_FORM=  AFFN,          ASDF,            ASDF
##VAR_DIM=   8192,          8192,            8192
##UNITS=     SECONDS,       ARBITRARY UNITS, ARBITRARY UNITS
##FACTOR=    0.0002076,     1,               1
##FIRST=     0,             0,               0
##LAST=      1.7004516,     0,               0
##MIN=       0,             -308359,         0
##MAX=       1.7004516,     374358,          0
$$ Real data points
##PAGE= N=1
##DATA TABLE= (X++(R..R)), XYDATA
$$ [...]
2527A586j091j524r94J231K902K137j870l345m5L380K427j971m924r48K714K794
2543B459n4j88O06N55k588k727O33M108J347l893l112J708N452J909l739m041
2559a565N1K337mj287J181K659J32l393j697K511L561j255n503k366L775M915
2575D052n3k384j490N61l8q63q75R81J493q40j776R41L029J152k493l463j442
2592c508J843K309N24j72p85k83K37N87K49j089j776r99Q06J523J572M62l61j366
2610b27k001q87J840J893l27k814j111K582L407J36l706k036P24J546p67j385
2626c133J974K505p52l507q05L435K818k784n365l03M738L902j769l687NK200
2642e28J88k752o88K747K195j933l974J276N313J773m391m811M48M224K093k223
$$ y = [1586, 495, -1029, -2023, -792, 2110, 4247, 2377, -968, -1013, 2367, 4794, 2823, -2101, -3049, -335, 2459, 2405, 2217, 2823, 3378, 790, -1937, -1304, 2804, 4151, 258, -2854, -1146, 4306, 6215, 2476, -1565, -1514, 823, 819, -468, 713, 3372, 3504, 111, -1586, 925, 4486, 3231, -2272, -4638, -863, 4052, 3999, 1615, 125, 686, 648, -215, -1090, -109, 1384, 544, -1232, -291, 2738, 3890, 1397, -2066, -3508, -1665, 644, 1168, 996, 211, -72, 165, 752, 1001, -88, -1864, -2863, -2057, -534, 1038, 1500, 1139, -227, -2228, -3115, -1275, 618, 291, -2523, -3634, -1052, 2355, 2491, -1215, -3251, -2527, -981, -1748, -3133, -1159, 1346, 594, -2913, -3718, -283, 2535, -249, -5614, -5917, -1179, 2723, 954, -2733, -2728, -528, -340, -3092, -3780, -1033, 1162, -771, -4745, -3469, 1844, 3617, -774, -5585, -5137, -913, 1180, -1043]
2658a043j795J556J271o90j743P25J926o33k912j333K900L625L24k849k372L32
2674b711J872J068m55j322l14j66O57J665R32j079j954q65N68Q55M44J284j3j698
2692a232j578M42L120J288k415l648j09L460K461j292k223R8J721j99k397L08
2708b195K695Q18k552l183K000M969P69m277l816J973L955N24l332j281K632J735
2724A434j663k820J656L565n11m230j984L583L953p55l886j575K873K261j154
2739G47k610O64J694m12j839K09L056J405k314k878K27K454J574j545j710L99
2755h79J357L94J53k96M22j130j031K52J446P51m58r99M1R50K62K31k74m07j043
2774b58o71J373K444K6j648j731Q75K313l13k281p33J435J267n39q61J398J633
$$ y = [-1043, -2838, -1282, -11, -701, -2444, -1719, 207, -426, -3338, -4671, -1771, 1854, 2178, -671, -3043, -2711, -839, 229, -226, -1548, -1862, -2028, -1371, 294, 1226, 147, -1807, -2672, -2104, -1249, -805, 479, 466, -1232, -2810, -2368, 752, 2040, -375, -4023, -4132, -672, 1789, 497, -1726, -1628, 93, -106, -2503, -2195, 500, 1318, -1234, -4417, -2417, 2552, 3321, -956, -4772, -2799, 1156, 1680, -1652, -2933, -301, 1434, -229, -3049, -1393, 2172, 1661, -2569, -4553, -970, 2983, 2228, -1658, -3233, -360, 1901, 747, -1863, -1199, 495, 83, -1756, -1547, 1509, 2914, 600, -2278, -2051, 403, 1977, 432, -1278, -879, 478, 872, 1025, 729, 1151, 21, -1010, -758, 688, 1439, 981, -18, 23, 973, 1235, 1466, 1192, 785, -258, -929, 444, 2888, 2914, 1266, -465, 410, 2723, 2410, 129, -604, 831, 2098, 1559, 698, 2096, 3729]
2791C729j459l388l73L147K507k206l158Q18L712J719k749k590L78K128p64k102
2807f51Q49L579Q97l311k806J866L910l71m082k509K172M206J09k357o24J462
2823B339L59k946j336K613K808j339k855p85L857K388j586l888j278J596J515
2838A462J48l22Q63K11r81j800Q85J678L5k189j706R78K454J340j15j591j733
2855c83j461P89J756R40p30j541l78J948J336q74j329q53k37q19k72K574K681
2872C147n13l816k020J837L752m20l788k033K102L143J22j639R0J362j405l330
2888c409p75L716L563j672m763q56M801L177k283m652r91K257J572r13m46K270
2904E96J259k366l221N08L692J509l673l430J343M344J842j911k388k50L85l86
$$ y = [3729, 2270, -1118, -1491, 1656, 4163, 1957, -1201, -383, 3329, 5048, 2299, -291, 87, 2215, 1451, -651, 198, 3777, 4674, 1363, -1443, 423, 4333, 3962, -120, -2629, -457, 3749, 3858, 1501, 877, 2339, 2698, -248, -1584, 1029, 3837, 2498, -357, -1142, 2715, 5103, 3517, -371, -1649, -53, 1462, 1610, 1288, 2151, 2362, 1381, -419, 466, 2144, 2179, -10, -1716, -738, 1716, 3056, 2941, 1350, -383, -1844, -1055, 701, 1641, 911, -630, -1008, 940, 2276, 1402, 73, -780, -1017, -1836, -2108, 466, 3147, 2634, -1182, -3202, -1365, 2387, 1967, -1821, -3854, -1752, 1391, 1513, -126, -36, 1326, -79, -3409, -4184, -468, 3095, 1423, -3340, -4196, 605, 3782, 1499, -3153, -4144, -1887, -315, -1228, -1674, 596, 1855, -511, -3732, -3224, 468, 1977, -1696, -5126, -3783, 561, 2403, 492, -1896, -2146, -1761, -2147]
2920b147k60J012J360J42j536j063J597J733l14k436j648Q8J940J892M34j071
2936b77j067j124N82J190L12j003j272P50J150J32j07O91n4j490j963J0K851J994
2954A305j422k951k29K740J989j532k915J49J857N45j391N0K168R78k226l093
2970c978R74L374J130l303k942K041L831O65k645j822J194J369j034j805J236
2985a715K461o0k737j162K650K431j070l544j292K171K658p52j446k22J308l04
3001f25p36j61J369L17j432j368R10K355Q18j377j551o12R48J210j51J97m40o63
3019i92j06Q89J220j18j274q57J54P50N65M12K17n59r46q06K052J546n89k488
3037i30j242J757J973N22j596q22M24Q02q26k77J379J108j327k182j86L476K086
$$ y = [-2147, -2407, -1395, -35, 107, -1429, -2492, -895, 838, 524, -1912, -3560, -3472, -1532, 360, 794, -277, -1344, -2468, -1886, -696, -384, -1387, -2659, -1909, -759, -627, -734, -43, -97, -1587, -3550, -3540, -689, 1305, -117, -3068, -3297, -557, 1432, -100, -3015, -2866, -1009, -464, -1855, -1805, 363, 1341, -885, -3978, -3004, 370, 1500, -1803, -4745, -2704, 1127, 1792, -853, -2675, -1481, -112, -1146, -2951, -1715, 746, 686, -2051, -3213, -563, 1868, 798, -2746, -4038, -1867, 791, 39, -1407, -1629, -321, -625, -1361, -1522, -153, 164, -1268, -2636, -1726, 629, 1447, 70, -1481, -2093, -1145, 65, -86, 111, -329, -992, -1098, -209, 1011, 893, -381, -1238, -1084, -334, 231, 643, 860, 301, -645, -1451, 601, 2147, 1558, -930, -2172, -415, 1558, 2080, 484, -338, 86, 888, 62, -215, 1164, 2272, 945, -1237, -1423, 2053, 4139]
3054D139j998l250J83K264J651j590j748J333J185p00j625P19K525O20l211k898
3070b401J849L815Q11k886j968Q80K294nj702m84R20K65j196n32J785J998m63
3087B980k886j432J664J795k6j534p72M07J139O92k81p60k40j141l4N35J093N78
3105A777m06m21j051K39P48Q29o52j592j030J391K084P00j367j755q7J289J75
3122H71j457R2J067O45r00j029J424J665m57l256j763K592L028j90k884m48J979
3139I79J227q54k384L61J397J11j834m70K955J647j188l086j138K857J729j321
3155I88k486M30K453R70q34j332l6O45q09j209M73K365R82j568j902Q86J526K60
3173A802j341j479j62R96J553M29l63n38l70m66j17K75Q3J05n1r0p1P52R59J51
$$ y = [4139, 2141, -1109, -926, 1338, 2989, 1399, -349, 984, 2169, 1469, -156, 563, 3088, 3708, 497, -2401, -552, 3263, 4074, 1188, -780, 100, 2394, 2389, 687, 203, 1123, 1388, 192, -340, 1445, 3443, 2980, 94, -1338, 326, 2121, 2095, 561, -211, 196, 1335, 2027, 1746, 986, 746, -395, -429, 106, 1199, 1777, 1371, 950, -101, 138, 886, 1715, 1063, -529, -1559, -168, 1916, 2616, 1249, -506, -593, 696, 871, -586, -494, 573, 1218, 318, -711, 713, 2378, 1921, -1335, -3098, -506, 2522, 2332, -552, -1000, 979, 2206, 1352, -1032, -671, 726, 837, -997, -1467, 1488, 3135, 1947, -1139, -2277, 580, 2309, 988, -1498, -1068, 1385, 2355, 1521, 189, 153, 798, -11, -1220, -747, 1618, 2600, 1032, -870, 16, 1542, 1802, 461, -1018, -1180, -184, 1369, 1798, 1435, 897, 527, 61, -56, 219, 302, 407, 356, 266, 195, 947, 1906, 2057]
3193B057j876j953j88K244J905p34j900l90J573O30j076r01K37K69o54n77P70
3210e64K642R86k789l066M30L183J095k201k326R59K592O58j627m44P23j47k326
3227b222o84J884K932lk944j976K174K244k48k356j424R06J397j71PJ074M72j733
3245f71k123M64K192J289j253k118J42J776J208l58q91j194o82K19N29J319O34
3262D82k17j448l32P67R12m1o40j128l05K58J614J341M2k141j389N27J461P11
3280D74q39p61J27Q18k45j15P59Q28j425k034l12K366K585o16k975r43J698J645
3298A035o09j447J19J000M5j353K40K300Q96k133k871P34L075J716k398k654R55
3315a350K300O04j554r00J296L27j244r72J115J939M07k593j548J722K040J14
$$ y = [2057, 181, -1772, -1960, 284, 2189, 1455, -445, -835, 738, 1368, 292, -609, -372, -103, -757, -1334, -564, 2078, 3064, 275, -2791, -2361, 822, 1917, -284, -2610, -1651, 941, 1599, -28, -472, 251, 104, -2222, -2906, -1022, 1910, 1907, -1037, -3013, -839, 1405, 1157, -1199, -2623, -1717, -320, -491, -484, 590, 1062, -671, -2794, -2330, -138, 1151, -102, -2220, -2078, -302, 906, 548, -343, -1537, -2219, -2000, -1471, -152, 482, 265, -1183, -1515, -748, 164, 123, -517, -1645, -1950, -1692, -78, 1263, 1305, -836, -2225, -1698, -237, 474, -365, -1126, -999, -181, -426, -541, 218, 1046, -379, -2413, -2725, -359, 2226, 1610, -1365, -2308, -610, 1035, 426, -1021, -902, 98, 143, -1210, -970, 1330, 2226, 93, -2778, -2044, 1031, 2747, 349, -2305, -1350, 950, 1554, 0, -900, 396, 723, -521, -1493, -378, 1561, 1968, -625, -2173, -451, 1589, 1703]
3331A703k240j309J209J274m5l99J12J5k62n40j07R24Q34j255p94r9P92J403j92
3350A024r75o04m17O43N48Q25q13j255K40P56J201p44m02k75O23l88j143O38J582
3369A064K90k033j309J301K239J40k151k138J545K412j34k069j93J448J066k016
3385e38j393J601J834l70k801o53K759K237q45l203r85K352J159r05j479P63J965
3402A498o55j626k57K154P41j790k538O38K589J331r71j487n0Q80K76n98j99M63
3420C99j25n20L7J118J076o77j438j187Q37O22P85L82m28q45j13P58J057K03j688
3439B53j543N45J775M95n42n09M98k59q32l99R89J534r60j929l30K354K071j069
3457B142k580p58J510P77o56q42R98J235n21j993O16J891M18k107k637J281L030
$$ y = [1703, -537, -1846, -637, 637, 592, 193, 305, 320, 58, -482, -589, 335, 1169, -86, -880, -979, -187, 1216, 1024, 49, -555, -972, -329, 219, 1044, 231, -1024, -784, -28, 1173, 429, 27, -248, 375, -13, -1156, -518, 1064, 1354, -679, -1988, -687, 1552, 1692, -459, -2597, -1052, 1360, 1226, -843, -1036, 412, 1478, -538, -1931, -330, 1504, 1134, -1667, -2320, 439, 2676, 1831, -1372, -2357, -5, 1154, 249, -1230, -467, 1498, 843, -783, -1040, 1114, 1855, 65, -2473, -1835, 754, 2085, 1114, -373, -423, 457, 733, 135, -64, 399, 274, -246, -209, 909, 1985, 1308, -130, -1317, -480, 142, 927, 1309, 881, 36, -77, 681, 1738, 1941, 253, -1290, -745, 1030, 1525, 983, 474, 972, 713, -119, -518, 471, 2005, 1045, -884, -1214, 1140, 3211, 2142, -438, -1196, 314, 1091, 435, -407, 591, 1826, 1305, -688, -72, 1819, 2237, 130, -2507, -1226, 1804]
3474A804J096j714j937J162J514j350j290K39J689j57j237q19K053J940j118k575
3490g00j419J848J483k06j440K11J074L92j087n37Q86N5r47j154O59J699P82j005
3508E94j238j45O34K36k30l4j50K12l09R40N41o4j223j138J22Q17N28m2K38L4
3528C23j98m11L5Q48J8j597j158J271K107M38j565r79P19N85m71q18K06J162J00
3547F15j417k43J798J639j532k900l94K510J567j036j935J34K268N37j889j081
3563a359J529O23j629j349R83K881L11k120k192Q96K264K79j578j357J142J160
3579D84n82m93M27J289q48k013p65J654K112n78j460r77R98J152j37q03n20n9
3597a119l62L50Q62P45j87q76q31K96O28L64o3o98m08l50O60J342M51j212j963
$$ y = [1804, 2900, 1186, -751, 411, 1925, 575, -715, -476, 1213, 1056, -181, -1000, 1053, 2993, 1875, -700, -2119, -271, 1212, 1006, -434, -223, 851, 1243, 156, -381, 505, 560, -387, -1541, -882, 817, 1599, 594, -644, -789, -155, 81, -149, -183, -333, -121, -430, 510, 1051, 987, -236, -1374, -1252, -435, 93, 51, 289, 323, 125, -286, -251, 597, 615, -982, -2140, -869, 1238, 1676, 111, -868, -149, 436, -35, -853, -647, 515, 615, -802, -1045, 753, 2392, 860, -2040, -2434, 76, 1643, 607, -1328, -1194, 1074, 1611, -278, -1359, 170, 793, -836, -2185, -1202, 1679, 1990, -130, -2322, -1426, 838, 1117, -461, -1818, -676, 484, -98, -591, -164, 1125, 277, -1736, -2501, -847, 1265, 687, -773, -1750, -752, 400, 263, -540, -1060, -1119, -1481, -1131, -269, 476, 289, -587, -1418, -1122, -494, -130, -193, -891, -1299, -1649, -989, 353, 804, -408, -2371]
3616b371J04J475J566r29j042m33J095n0p61K62J303j04j543j479J494K762K02
3633A551k601k031J557K035P1j266j094J128Q71j139m17J170J656p45k740o12
3649b606K185K242m53k720p41J585J341m16q30n8P75k49j496N10J649J080j588
3666B10j730R0K406M35l71j559m34R75P40n0L9K37p57o32J25Q68O13n08n97r9
3686Ak58Q89N37J14l14j055o54O17J431L35r20r13L76J295j27r06l10N09Lm84
3706A66n24J133J545p12j885n90J907J220r19j746l19J339J018q45p29O01O36
3723A296q63j304M29J477J125j872j405O25K428J69j850j127L87J456n95m21N41
3740D96N20l1j076o39J418R59q55j768K94J074J284l21j164k91R4K64k13m5M83
$$ y = [-2371, -2267, -792, 774, -155, -1197, -1630, -535, -585, -1346, -1084, 219, 115, -1428, -2907, -1413, 1349, 1551, -1050, -3081, -1524, 511, 582, -684, -1778, -650, 221, -918, -1335, -165, 1491, 746, -1994, -2606, -421, 1821, 1368, -1352, -2093, -508, 833, 417, -413, -471, 304, 55, -1441, -931, 718, 1798, 210, -1520, -1430, 976, 1411, 1040, -519, -953, 22, 762, 712, 751, 988, 231, -401, -276, 592, 1205, 697, 100, 1, -257, 632, 1169, 1283, 969, -86, -740, -123, 1308, 1643, 723, -190, 186, 1481, 1354, 448, 138, 647, 650, 166, -358, 775, 2320, 1608, -277, -867, 1040, 2260, 1341, -405, -724, 615, 1633, 788, 59, 660, 1296, 433, -871, -442, 1035, 2160, 288, -1117, -492, 1936, 2105, 255, -872, -485, 971, 376, -45, 496, 1016, 985, -91, -730, 688, 1647, 792, -976, -682, 392, 1676, 1355, 191, -100, -6, 258, 45, 0, 483]
3759D83K38m19n00P84O04j61j034q74L30O65N86p0j45k18j4l89Q36r2o65r65L15
3780g05J105O02j90n6l44k29o63l47R75J080r9j527m38J248J625m58k097p42R95
3799b65R56k74n59R13P92o60j603N2J394Q41j247j714R8K098J733j284j690j54
3817e73J165O2j336J44J049O88j145r96Q41J613J93j999j432L49J883O26n09q15
3835a92K34Q3k84k17K26L61l31p68k73J363N90Rq02j044j37M40P20K29p80m66
3855a039K24M94O53l42p97l87K02K33kK77P57r0j034j030O60J307L34j550r12
3874b042P36J519Q69j376j000m0J004n08p83L33J022N97j293j219Q30J988j42
3891D95k117j109J322J839k08j203n13R48O46j302k84O68R66n13j366P6J523R33
$$ y = [483, 721, 302, -198, 586, 1190, 1029, -5, -879, -549, 116, 702, 632, 487, 269, 255, -134, 702, 610, -55, -1020, -705, 400, 1002, 812, 756, 412, 183, -480, -827, 148, 1228, 1129, -398, -836, 412, 2037, 1579, -518, -1260, -265, 691, 417, -142, 771, 1563, 903, -700, -648, 746, 1587, 340, -1374, -1276, 822, 2555, 1271, -419, -573, 592, 654, -682, -538, 511, 1199, 54, -942, -101, 1512, 1705, -294, -1726, -1377, 506, 1132, 623, -192, 42, 125, -159, -376, -150, 211, -120, -888, -1161, 202, 792, 801, -1, -1045, -1182, -742, -22, 207, -573, -1039, -815, -321, 332, -10, -807, -1194, -992, -759, -761, -484, 273, 183, -851, -1881, -1221, 86, 420, -1130, -2042, -1306, 213, 1082, -294, -1294, -1334, -330, -838, -1621, -1288, -266, 331, -962, -2181, -1351, 637, 495, -1622, -2731, -1409, 430, 222, -981, -1494, -546, 100, -1202, -1486, -818, 148, -365, -1731, -1655, -132, 801]
3909H01j041j166k65R07R20m42p62K36K09K89p07M61N08j28q46l40N67R27J75
3928C03m09o03n5K13K94L57p6o15k96Q1P80P57l33o80k53K13o3K70M36J16m52
3949a5o91k51J176J443q74j663m20J257P40K73j179p6Q31l5r93K80P71N13r90
3968I7j613O46K143O09j341j978P34J504M71j055m02O02O1m80l89J006J120m98
3986A237j764p41J448J692m82j464l99L92P18M47m42P3K83q85o29L36J323M34
4004A577r71r68N8P73P89n39m83k05l49N02L28R06l71p78o53K70P69J87j47j83
4024E12m08Q0j11O69P85m06j141r22O08J751K62r52p44K71N31K42p95rM75K30
4044I28j126m07J336J578n36j973r47J530J222m54j307j45J473k1p29q45J327
$$ y = [801, -240, -1406, -1671, -764, 156, -286, -1048, -812, -603, -314, -1021, -560, -52, -180, -1026, -1366, -799, 128, 303, -106, -709, -764, -551, -257, 100, 24, -591, -887, -806, -26, 731, 398, -282, -535, -322, -385, -115, 321, 437, -15, -706, -957, 219, 1662, 788, -875, -1295, -38, 702, 975, -204, -280, 551, 516, -477, -197, 574, 1087, 97, -1516, -870, 1273, 1882, 541, -1437, -703, 801, 1272, 217, -185, 417, 478, -2, -391, 615, 1735, 1237, -527, -1268, 180, 1872, 1390, -74, -473, -81, 637, 1084, 642, 715, 998, 113, -516, -180, 1143, 1577, 606, -362, -304, 469, 1258, 719, 236, 31, -318, 184, 512, 1418, 1047, 269, -384, -114, 655, 842, 695, 512, 104, 184, 73, 742, 1527, 1121, -20, -942, -334, 1417, 1679, 727, -17, 254, 785, 1027, 232, 223, 698, 928, -198, -605, 731, 2309, 1773, -200, -1147, 383, 1605, 1151, -156, -301, 1172, 1151, 422, -423, 904]
4061I04O00p94k018N81J720J389j418j508m2J590K65r93r20RJ322k12m09L06R44
4080A316J31j185j278Q66R09J82j063l58N17Q87l1n22m95l05j22R5M14M11k6m16
4100g3j43K33K67n27J53l36q4j8K84L82Q34m83j600j10J233N76o59q33p1J103
4120A28M96r43m47M00L15l96j108K49J702N50j185j494O76K193l81j537j248R31
4138a099J397l81r03M27J099P0j401r52R83J601l07j711m82J221J360k80j509
4155h67m28P72J67l84l42J416L70r71r38K51J351L59j016q97L22R82K56k42n17
4174c56N42o11l88J95O35L01m91r15J22J042M19m25k83k47k49j14L55J108Q5o36
4194H9j214K45J282K39o30j132K93O77Q2m53L86P43n87j078m21J201J470r04j351
$$ y = [904, 1504, 710, -1308, -727, 993, 2382, 964, -544, -586, 1004, 1269, 276, -644, -635, 687, 475, 66, 372, 1316, 1447, 262, -1016, -150, 759, 941, -122, -480, 37, 924, 893, 371, -124, -429, -551, -456, -42, 369, 343, -73, -216, 17, 284, -243, -90, -426, -510, -528, -244, 138, 972, 489, -1111, -1221, 12, 588, -71, -904, -975, 128, 624, -319, -766, -366, -51, -447, -1555, -1306, 396, 946, -239, -1733, -1057, 1136, 755, -782, -2030, -1099, 298, -83, -986, -559, 540, 610, -791, -1743, -760, 841, 534, -1177, -1659, -438, 922, 642, -867, -1295, -523, -356, -740, -1082, 334, 704, -267, -1205, -954, 397, 756, -260, -1157, -835, 147, 403, 161, -356, 186, -425, -813, -618, 17, 318, -173, -1088, -966, 76, 495, 70, -213, -460, -709, -823, -468, 640, 725, 89, -1125, -880, 402, 641, 11, -1121, -828, -151, -69, -522, -136, 607, 20, -1058, -1479, -278, 1192, 288, -1063]
4213a063m27J362J271o45j209j17Q26k99o46R2J446J39j036j229L45J749L97j531
4231e75j104M84J608l6q76k60N46N35j084m59R45R58l23j195o06J130J072o10
4249A50q81m34M98Q54m94k10J66Q03l87q27M18Q57o7r67m85O48K76P40k98k55
4269A05k79q1L76K92K60n10o96R2M71O10n1p72K97K61k94l51L96N64J63o75p88
4290f10O90J258Oj172r92P53J202k51r18QO57L18r09k66R79P96m61j707l22J730
4310G89J254o01j649m78R99J024p45o73J50O63lq98L93Q32P94j352j561O33J579
4329A150L85j162q38M00R23J72q66K29R6m9o16j70R15P17n63o61n31N40M53N4
4349E78q8n76k00j09L18J199P8r87p53N4N54K73k72j24K17n1m57P8R19L24j077
$$ y = [-1063, -1490, -128, 1143, 498, -711, -828, -2, -301, -947, -855, 591, 730, -306, -1535, -1190, 559, 956, -575, -1679, -1195, 413, 377, -499, -759, -213, 322, -762, -1221, -276, 682, 359, -836, -1442, -312, 760, 150, -731, -1165, -667, 187, -307, -517, -351, 452, 65, -762, -344, 513, 446, -521, -1006, -358, -82, 658, 360, 105, -174, -255, 121, 413, 673, 163, -533, -441, 30, 640, 589, -183, 114, 375, 81, -270, 126, 690, 853, 178, -610, 80, 1338, 1344, 172, -820, -67, 1135, 884, -34, -26, 631, 949, 40, -226, 753, 1549, 1088, -619, -941, 789, 2043, 1442, -207, -685, 314, 1338, 593, -80, 70, 733, 730, -168, 225, 1057, 1851, 499, -1062, -429, 1150, 1535, 373, -465, -65, 858, 1030, 164, 393, 489, 440, -176, -346, 569, 1286, 723, 62, -469, 71, 524, 578, 490, -86, -286, -395, -77, 1122, 1200, 213, -540, -486, 68, 341, 69, -55, 162, 111, -346, -268, 651, 975, -102]
4370a02j010j97J219J584o42j228m29J104K55o74n44Q24K42n07p56K55J361L53
4388A108j275j321N79J464M41r27q73N98P57r8n88K37J14k52q00o07J240J630
4406A427m74j095j079R57R20j82p71k38N26J77k65J80N47J5o04j025N28P18M17
4425F79j55m60m37N94K83k93k44pl91k19R01K53Pm30k28J46K22O9l26K08l10j23
4447b61Q4p4J113K20j104j050N57R54K48n18o49Q92K13l29m09K44K99m02p24j38
4467h34J046Q73o15j111J99M94L94p59n04J79J321l77o37J45Q47j77q96n64J80
4486g96J341m9q14m88L32R74n1o81p34N51M80n64j32N23P89k98j031k46O43N85
4506C34l08o56l24O10M66K59k66n07k30J86j85K68L40P3o61N5N73k86K81j96m22
$$ y = [-102, -1112, -1309, -90, 1494, 852, -376, -805, 299, 554, -120, -664, 160, 402, -105, -861, -606, 755, 1108, -167, -1488, -909, 555, 996, 69, -804, -206, 551, 453, -135, 102, 216, -36, -836, -1443, -203, 1427, 953, -142, -1221, -264, 656, 474, -297, -535, -9, 168, -97, 83, 630, 645, 41, -984, -456, 262, 679, 524, 64, -373, 221, 504, 211, -33, -40, -431, -650, 251, 504, 511, 81, -147, -1, 221, 290, -36, 172, -138, -261, -177, -251, 862, 1082, -22, -1072, -515, 439, 687, 169, -480, 412, 625, 296, -113, 131, 430, 28, -696, -834, 212, 1085, 470, -641, -442, 52, 446, -313, -817, -638, 683, 306, -331, -186, 661, 484, -412, -976, -796, 545, 496, -318, -806, -474, 500, 449, -232, -966, -415, 65, -499, -631, -108, 681, 383, -648, -894, -251, 334, 26, -630, -954, -344, 122, 381, 115, -392, -622, -436, -621, -353, -13, 60, -601, -546, 27, -259, 22, -174, -596]
4527e96k86k85Q30Q57J02p42p49J20O99M87p14m75J17N19q6m40P46L95k80q33
4547f14n74J162R30k29j240o87P37J340n14o64l09Q41k48l56J98M90Q01o28j591
4566a155L37R08J008q05j259l4R64O91n65j23nM34l32o22M09R22lp46r29K59Q69
4587B23M22k26m74n36L78K97J68j9J48q61K69K86L28j32j95m3j52k89J91L89N58
4608G30k95r41Q2M62Q65n06q28k63O59O00l18n11J95K48Q4q89q6J177L31j075
4628b79p09M2J404M25m38j083J91N60M6m35k76Q83L43o28n91N22P63j16j003m02
4648g81K28R52M47q21n14O41L6p1k29L12L48k35p27J47Q28L26n45p18j75O79J22
4669B50L7k61J52J74J66m82K61j55n2m51P6O02O07n7p89K17l21K0M58Ol35K80
$$ y = [-596, -882, -1167, -337, 520, 622, -120, -869, -749, -50, 437, -277, -752, -635, -116, -202, -642, 104, 499, 219, -614, -1188, -26, 904, 675, -565, -1252, -515, 825, 311, -353, -662, 179, -69, -425, -227, 263, 1064, 436, -1155, -818, 90, 1098, 293, -966, -1000, -36, 655, 90, -33, -38, 396, 64, -558, -149, 773, 770, 24, -905, -646, 223, 645, 419, -55, -591, -213, 84, 252, 233, 381, -480, -211, 75, 403, 271, 76, 33, -119, -408, -217, 172, 730, 435, -506, -424, 38, 903, 397, -431, -694, -35, 565, 247, -264, -69, 179, 263, -626, -712, 465, 796, -279, -988, -946, 458, 883, 445, -638, -447, 113, 159, -276, -552, 331, 674, 46, -545, -23, 740, 624, -379, -781, -553, 399, 846, 25, -489, 152, 188, 117, -112, 200, 548, 313, -414, -267, 561, 887, 342, -376, -551, 128, 250, 287, 26, 178, 352, 518, 36, 297, 142, 90, -361, -285, 317, 924, 867, 78, 295, -26, -6, 452, 458, 123, 403]
4691D03p64K31R64J09n78n97n0K61N83m65k53L79O3n89Q0K38P80l80q77n33J236
4712B41O94k59q05j24L45L71m60n50R10P0n62o79L37J314K57r64j253K82R66O06
4732G37n64q05Q34n2k74l10P6O94Oj038l23J043P49J56j230p75O36L31M37n00
4752a72p9J42r2l22L13M69j06n72l82J16L33P94l07m9l49l10J85M20L80n03m29
4773e20l72P85M79M4n91j47j64L33r4j36O36K33n21o46M04J051J35j137p21J38
4793h11J123L42m76n39M54L88p16n63M82P90K25j341m56J160J171m28j050o74
4811i19P35M91j35p42N15M98k2n93l08Q50L21p97q07J33J268L18o47l51l8N98
4831C68K47p41QJ38L09o33m8O07K85k39o95k6L03J08K56l41o0l98L45j96N39O3
$$ y = [403, -361, -130, 834, 943, 365, -232, -282, -21, 562, 97, -156, 223, 286, -303, -223, 15, 795, 415, -462, -995, 241, 935, 676, -129, -253, 92, 463, 3, -547, 363, 433, -129, -808, -471, 843, 1100, 136, -1117, -835, 131, 737, 173, -632, 202, 150, -124, -434, -358, 336, 342, -696, -1019, 24, 773, 929, -301, -1076, -440, -109, 328, -172, -251, -109, -201, -523, -210, 259, 153, -419, -801, -685, -352, 442, 135, 86, -263, -573, -388, 32, 412, -91, -520, -892, -107, 372, 416, -175, -322, -486, -153, -247, -383, 253, 486, -35, -681, -277, 774, 909, -228, -949, -811, 312, 654, 178, -361, 93, 481, -235, -798, -316, 474, 699, -642, -1098, 62, 1233, 805, -245, -919, -184, 307, 172, -570, -55, 443, 421, -172, -480, 370, 691, -106, -913, -780, 488, 806, 159, -192, -230, 368, 615, -126, -118, 20, 329, -304, -352, 255, 540, 301, -394, -420, -117, -9, 247, -94, -154, -552, -207, -403, 136, 199]
4853A99m32l1l44N47K24k28n46L34M36j67l93k9N36j09p78J58P45N50n47m87n29
4874h91Q13N09j80o72j4N01j31k74j76O29M10m77j212N14R34O62r37j090O25Q43
4894C86j67o35k43O16J28k50n8J08Q28l54q64m62J015Q58m70q10l15N63L83l10
4914e3K23K01p4m96Mm5Q89J17q10q44O51P29P9l12k48m7J12k17J91P70k58m51
4936A11j21J09K81L71m68j36m30J99K49p0M32K15r06k45L37N43O21q76p90P76
4956B02L32l6j16m43M92j57l94k32M55Q03m09j118LR51Q33m02j236J7N02O01n70
4977G8O0N42J36m16q56K22R46K09p72q12l8J182N04p86o80M39K37p5l02K94L89
4998E01J07p06l64N30M77Q1p82k35L6O60N4l78O7K21j59j82L13j39J90l29k16
$$ y = [199, -233, -264, -608, -61, 163, -65, -611, -277, 159, -8, -401, -430, 106, -3, -781, -623, 122, 672, 125, -362, -891, -78, 431, 251, -421, -435, 66, -65, -339, -515, 114, 524, 47, -1165, -651, 283, 945, 8, -1082, -457, 386, 219, -416, -659, -43, 85, -165, -223, -115, 713, 359, -505, -967, 48, 906, 436, -374, -689, -126, 257, -53, 170, 371, 297, -199, -195, -240, 649, 766, -44, -888, -237, 492, 571, 259, 11, -36, 76, -141, 50, 820, 562, 111, -10, 99, 380, 751, 283, 147, -283, -84, 165, 95, 527, 742, -164, -409, -72, 471, 1092, 216, -574, 202, 534, 498, 382, -61, 431, 274, -120, -352, 103, 906, 497, -621, -618, 333, 1166, 764, -472, -455, 47, 648, 78, 138, 680, 816, 400, -456, -234, 712, 921, 149, -663, -701, 481, 985, 199, -481, -42, 195, 120, -182, 112, 501, 608, -98, -462, 68, 545, 626, -156, -391, -355, 305, 359, -19, 48, 269, 110, -72, 241, 102, 292, -37, -253]
5019b53L83J42R6j62n5l64j29J34K75K38k4p85K21O58K55m05o49K59L49j49k7
5040Hj92L74M34n10p65K36Q11L31j077l25N41J042q2p56m68K20O98o41l78L71
5060a28R52l16j057J7O22P04j58q60p25P10J207k99r15j59O79K0j03k33K07J51
5080C16k07n58M6O02N50l03r08l5N39o9J01J0k64L94l21J36K55j31l33l10M5J69
5102b76J93L21k18k09k93J42O8J37O43q34l24Q8P59J01m26k55K5R4J05r7J76J27
5124D7j32p03J9O69O74l77j083l7M29P23l54p4j74N4R4k65L3K82M81p19m29N09
5146c33O72m7m06p14J13O04K34o31K79M6j12M0l68M47M30O6p50l92R46N15l87
5167B52m41j86J91J03k51K43K92L3l67j14K42L85N8m64m93J68M49j06K2M98m99
$$ y = [-253, 130, 272, 368, 206, 151, -213, -342, -208, 67, 305, 281, -504, -283, 375, 630, 225, -424, -165, 184, 35, 8, -184, 190, 624, 114, -651, -415, 396, 727, -350, -675, -134, 908, 826, 70, -398, -178, 520, -121, -499, -128, 824, 508, -549, -532, 90, 794, 636, -224, -949, -239, 968, 669, -246, -405, 274, 294, 191, -42, 165, 316, 109, -449, -403, 199, 749, 446, -462, -497, 42, -27, 74, 84, -180, 214, -107, 29, 284, 153, -180, -490, -445, -276, -83, 238, 20, -189, -482, -340, -272, -135, 508, -326, -650, -562, 197, 298, -128, -383, -358, -264, -159, -256, -80, 47, -85, -788, -769, -100, 574, 197, -886, -923, -494, 229, -125, -199, -373, -319, -225, -490, -457, -175, 306, -413, -842, -333, 339, 292, -114, -828, -715, -111, 123, -508, -229, -183, -295, -255, -623, -176, 254, 320, -430, -822, 124, 639, 252, -189, -375, -184, -81, -332, -89, 203, 236, -131, -245, -3, 382, 440, -24, -517, -349, 100, -6, 16, 514, 15]
5188A5j89k9J44K94j63j99k72L45n8L72k17K38J33n27J41n4L78J08n63l76J97
5209b82Q65P6o75m87N11K54j81k73N11j1M26r51l46Q83M70m97o63o1N88N69n84
5230A42n64K60N60J47k16n04K30l2j43M2m2M32K94m83p89N50N33L94q61p0k9K39
5252I0J02k57J80K08j74o16M52K67L50n06k43j15M08KL29r3n31k17L16J17J2K70
5274C51l23M9j10L43k05j16J41n1K25m62l5N25L26m40n93J25P82L1p7q75M19L22
5296C52J96m65L4J10K96m15o49P16M49K41p29r22P38P92k65j84o25N78J1j04k34
5317g9K83P66m69r17l9O61M19k68m93l36J003J91j24p03L11k79K12m25K96K95
5337C05K02o49l29K69J41L64j99k89k41M13J97L15j04j98m35l38M98M38l16j80
$$ y = [15, -174, -203, -59, 235, 72, -127, -399, -54, -112, 260, 43, 281, 414, -113, 28, -26, 352, 460, -103, -479, -282, 583, 659, -16, -503, 8, 262, 81, -192, 319, 308, 734, -217, -563, 320, 790, 293, -370, -431, 157, 726, 142, -422, -162, 398, 545, 329, -175, 55, 23, -120, -78, -120, 312, 606, 123, -666, -116, 417, 811, -50, -120, -149, 90, 192, -65, 115, 323, 149, -467, -15, 252, 602, 96, -147, -262, 146, 148, 477, 384, -147, -364, -48, 69, 81, 351, 28, 77, -33, 310, 105, -11, 130, 79, 304, -158, -193, 332, 658, 218, -375, -250, 532, 563, 486, -389, 30, 352, 548, 83, 117, 227, 523, 108, -541, 175, 624, 865, 136, -786, -48, 744, 479, 295, -330, 248, 259, 155, -79, 204, 970, 501, -416, -455, 206, 625, 357, -136, -472, 531, 722, 598, -105, 206, -73, 139, -286, 10, 305, 507, -142, -471, -202, -61, 303, 104, -185, -426, -13, 184, 499, 395, 197, -238, -576, -78, 360, 44, -136]
5357a36m7Q9M09l90L2L33k53l38r8K21O76j39p03k86M07O11l37l56l8P6M58j16
5379G5m52N93L83o27o71Q7L97O77n09m26nM34M53m60o48N10l8j43j97L44L18P8
5401A73n40k94N90L58J54j197K90L00N23k30l82j49P12n81r3K96J39J73n74q8
5421d20L9Q67o4o49m6lN09k30j59L02J59l37j58J7L10N5l57q9L75j2Q4J77k17
5444A53K33o09pN6J88L18n97l49O87P44n07k50l16K90j43K55k87R3L16M0m78m98
5466f68L98P41j30o37m62P04O73n98k03Q8M30o5o50p7P47K82o68m40L2Q32K38
5487E67o59m03k4M65M96n08N3K51L5l60m12M38N18k01m58l07J71O37k01k26j0
5508a38R0l05L61J69J94k09m10k88J63M45J93m38j18J00Q3p6J27M26k94m81k61
$$ y = [-136, -183, -94, 315, -75, -43, 290, 37, -301, -399, -178, 498, 359, -344, -630, -223, 388, 51, -305, -343, -267, 191, 75, -377, 216, 599, -28, -699, -612, -215, 462, -47, -473, -478, -44, 409, -51, -699, -189, -227, -370, -567, -223, 95, 173, -367, -661, -71, 287, 441, -756, -466, -166, 357, 127, -255, -404, 308, -273, -366, -70, 69, 242, -332, -420, -381, 486, 422, -227, -273, -276, 233, 3, -156, 146, 305, -32, -190, -173, 137, 192, -165, -254, 121, 109, 193, 370, 153, 386, -223, -230, -174, 14, 332, -265, -614, 73, 817, 310, 60, -256, 34, -109, 146, -141, -48, 268, 308, -170, -668, -270, 471, 341, -296, -758, -54, 619, 21, -182, -94, 336, 271, -379, -456, 291, 573, -95, -535, -503, 329, 567, -92, -495, -519, -54, 442, -66, -13, 238, 273, -87, -499, -61, 457, 256, -202, -509, -338, 299, 98, -128, -138, -48, -353, 8, 177, 371, 162, -248, -536, -373, 72, 265, -173, -291, -191, -108, -184, -57, 369, 75, -406, -667]
5529f67M90M45k29k18k39N95l1m4l55M56K31o28m23K96P51L50m23q90NQ07N43
5550H22n11p24L44L0L26n41K86K83J87m71k94K19P20P8p77l69N06L32k3p34K89
5571b2M53J9l21k20M42J93m70m66K13M77K68l32j02l1J04J14P5m12J82r2j84P
5593a05M12L50m50k37J35J46r6K46k50m32O62l04k09L97p5k09n70N08K1P09o59
5614a0l00N5M71mm70L84Q1m0m18j00M26K17P5o93l01O36J68K28m65k46M99J18
5636C11k53k47J22N28o54l29K96N09j4l14p37N27M00p9k77m78N23M77l75j34J58
5657d0N21l22n79j84M32P25k89m52j37L35N19k69n99K77Q7j82q2K92J34L86o96
5678a23j64K4O46k16j17j66r0J32r1N17j01l19j23l15L29N79r6m72o9L17q5M4
$$ y = [-667, -177, 268, 39, -179, -418, 177, 146, 102, -253, 203, 434, -194, -617, -321, 430, 780, 357, -533, -528, 279, 822, 311, -413, -69, -39, 287, -254, 32, 315, 502, 31, -263, -44, 676, 754, -23, -392, 114, 446, 423, -311, -22, 431, 450, 129, -91, 351, 544, 74, -392, -179, 298, 566, 234, 132, 101, 205, 319, 394, -18, 164, 72, -112, -105, 307, 657, 207, -30, 105, 251, 155, 401, 151, -281, 381, 77, -132, 265, 190, -19, -589, -81, -60, 649, -10, -310, -255, 216, 212, -258, 126, 207, 167, -251, -351, 75, 292, 367, -326, -627, 9, 177, 405, -60, -306, 193, 311, 58, -189, -67, 461, -193, -522, -226, 283, 269, -45, -782, -255, 145, 66, -211, -689, -166, 311, -64, -198, -40, 481, 159, -420, -604, -172, 553, 264, -188, -325, 10, 529, 260, -339, -62, 25, -157, -239, 53, 187, 573, -123, -287, -263, 383, 167, 50, -116, -206, -74, -165, 352, 251, -68, -191, -506, -177, 402, 306, -166, -235, 82, -3, 41]
5700D1KR1M9k52O6P5L01O7l28j37l15L59J45k55J51l05M78k87j9j11P24l21m01
5723a82m77P60M50k48o70o6L67J72J28m55K03k4N0j78j84N65O9l27p19K77L46
5744a43M31k35m08K19M3K71j05j96M8K54n37k9L32L90l78m48K45J61r6K93k27
5765a15j88Q0JK59L85l68k07k53K26L24j30J48k24n5J62j10k40L77K68j00o56
5786d16J13L59L74k28j76j57J96K49l81m43O25qK88o96L59R0J18l12m32O3J033
5807F18m44m02q4r4R96n04j48N5L11j22o2o73O93J95J70m63k27K97O92m35l34
5828C5l28M69J05k43j20K97N7k77k08L04J03M2l97q1K75o7K69k36r5L19o5l02
5850a44K53M8Q9l94j68K05L86J2k83k5j72J09j10M00J0j61j52n00N14K98o1k87
$$ y = [41, 43, 134, 183, -69, -3, 72, 373, 440, 112, -25, -340, 19, 164, -91, 60, -245, 233, -54, -73, -184, 540, 219, -182, -659, 101, 551, 303, -367, -433, -66, 106, 234, -221, -18, -42, 8, -170, -354, 211, 280, -47, -766, -489, -143, 288, 53, -355, -136, -93, 178, 73, -123, -75, 179, -358, -387, -55, 335, -43, -491, -246, -85, -181, 112, -115, -303, -223, -222, 37, 422, 54, -153, -406, -180, 144, 14, 162, -62, -117, 45, -65, -305, 72, 340, 240, -416, -303, 56, 430, 202, 26, -131, 65, 314, -67, -510, 115, 107, 395, -301, 58, 148, 266, -46, -478, -415, 618, 174, -228, -312, -406, 590, 86, -62, -7, 304, 182, 120, -553, 140, 335, 505, 42, -185, 112, 804, 369, 35, -293, 176, 281, 38, -82, 215, 272, -5, -213, 91, 194, 236, -161, -242, 33, -34, 235, -1, -96, 223, 158, -144, 109, 157, 246, -148, -316, -111, 275, 287, 4, -21, -193, -84, -194, 206, 216, 55, -97, -597, -83, 215, 154, -133]
5872a33r6j11K88J10P6l74K38R9n61K18J33Q29o42n32k00R05K66l06n00K98m05
5893d00M10p2j71M55j52l19j71K52M22K00o16k75k45P38N09m89j81N1L8j60l35
5914e11M99K70l06n7m17N01J25M8k78p9K8J81J1k21M11n66RM39K0K38qn13j07
5937b83L77l4Mk65M46l81K7K4J36J25rl04j78L73L15J14o59J14n1J93l00J30K37
5960A51J89o41R6J93M11m0p84K7L08K83J0j45k27M23k39k82K79K6P3L9m72L0L70
5983G8M54k64k14p13O30L16k20k89l2L59l24n2J47R0J88l6m62P5K19L10k16j80
6005a36L3K1J26j58J73k00j0j58K30K94q6j88j50r1K13L9n2J69J44m00k59K69
6027a77K92J78n77m0rK81K4J77l21J04j9m8qP2N11m85m29J40O14J80m52m23N8
$$ y = [-133, -229, -340, -52, 58, 134, -240, -2, 97, -464, -246, -113, 716, 74, -458, -658, 247, 513, 207, -293, 5, -400, 10, -62, -233, 222, 70, -249, -420, -168, 254, 454, -162, -437, -682, 56, 565, 76, -105, -54, -16, -176, -511, -12, 258, -48, -105, -522, -21, 104, 152, -126, -205, -177, 4, 15, -206, 205, -361, -352, 87, 107, 345, 337, -176, -283, 94, 60, 64, -201, 245, -136, -109, -85, 51, 176, 167, -137, -315, 58, 373, 487, -172, -58, -109, 84, -216, -86, 151, 340, -301, -205, -12, 399, 359, -425, -398, -90, 193, 203, 58, -169, 254, 15, -267, 12, 38, 111, 150, -322, -292, 78, 532, 268, 54, -659, -29, 287, 67, -222, -254, 105, -219, -271, -124, -34, 154, 118, -344, -269, -50, 260, 44, -136, -103, -82, 44, -114, 59, -141, -151, -309, -79, 215, 129, -59, -209, -300, -87, -48, -100, 69, 213, -187, -446, -177, 115, 293, -284, -324, -333, -52, -28, 149, -172, -68, -87, -135, -143, -71, 440, -45, -474, -334, 280, 460, 8, -415, -357]
6050c57J28L98k08k7j0%K57m30N43J06j78l93k39L29J61M1j64k19J40K63k68p1
6072a98M5M71k07j75k74M76M52m28m16K8J6L55O5l42o5J21J28j58J99J15n7n78
6094d27M97j49M81m67k71O2N4J96j69L71j59j25k08J56M31j28R4l26j02L71K07
6115C89m41j86N9M79q8l41l4L77K10n27m97P50k3n6j88j02J87K02k69l37K97J99
6137F0n4k40R0L1M62r7p16L5N95J84l48m83L24K34j11l05L6J55K22j53m01M53
6159b7L52P6l15k92R6L10J50o75M78n3K48n40O2K94R8J6n38J55K47L98l52l76
6181a88J82J61j5k99M04j83k48M5O5J72J82l7l60N5M84k93J04k9r0l7k54M4L46
6204B11J97m86q0N8M82j97J06j31m30L06M6M0j93N68o7k86n63K09N41n2l25k10
$$ y = [-357, -229, 169, -39, -66, -76, -76, 181, -249, 294, 400, 222, -171, -410, -81, 80, 121, -43, -262, -122, 141, -127, -198, -153, 318, 111, -64, -338, 138, 590, 162, -254, -226, -210, 145, 210, -132, -197, -76, 52, -106, 93, 208, 151, -427, 70, -79, 402, -65, -336, -274, -220, -24, -193, 178, 19, -106, -314, -158, 273, 145, 239, -87, -189, 182, 389, -52, -238, -179, 300, 212, -129, -163, 214, 424, -103, -600, 150, 127, 71, -117, -219, -32, 170, -99, -436, -139, 60, 6, -234, -144, -113, 349, 252, -464, -429, 166, 350, 2, -481, -157, 77, -34, -339, -303, -148, 74, -79, -480, -27, 325, 401, 86, -206, -110, 200, 350, -325, 153, 100, 348, -192, -130, 164, 262, 278, -260, -105, 142, 540, 188, -188, -6, 155, 140, -159, 245, 62, -186, -141, -76, 96, 278, 241, -119, -64, 420, 127, 231, 202, 112, 75, -179, -135, 211, 408, -78, -158, -100, 382, 185, 291, 160, -270, 36, 82, 122, -71, 497, 430, 144, -419, -210, 331, 279, -46, -256]
6226b56N22Q3q9r7l25J03M66m10n13N70K14P4o54o1O72j64j60l50K25L44O1j53
6248A02k02P2L53n37j19K20R2J29k56k37O19M2M0l46j6q0j62K30J78J56j52n4
6270G2l37K16L00k57k04k2K12o4R8K11k54L98o29j16K37K43K22k90m20J28M51
6291A95J30q0n67M98m61L64l91L53L31l6m84j44J58M91j99p30M85j85L36k37K37
6312F4l35M52m12o1K37J77K81l55k31k7M02r4m07J51J45k3J15m12J89J40K19n11
6334b96M42J30k2l71j81J69K16p7l9J8J73N0m11M7L77j52J47l07n9K50r4j97O5
6357a22j15J40k1J38j36L5K5k43k4N17k52Mj37j58M3N33o0k82J2p0L17m86Q3J5
6381b44N7q6n4L73j61J56l38LL03L2p0j40J00j1rJj82L00PL8m67J36L13n1p8k56
$$ y = [-256, 266, 349, 260, 163, -162, -59, 407, -3, -516, 54, 268, 342, -312, -373, 299, 135, -25, -375, -150, 194, 255, 102, -100, -28, 325, -212, -331, -111, -19, 110, -146, -383, 236, 278, 318, -28, -44, -124, -286, -56, 122, 278, 126, 72, -265, -49, 251, -6, -210, -232, -20, -84, 14, 225, -29, 369, -260, -376, -139, 104, 326, 36, -384, -256, 195, 325, 245, -322, 176, -285, 79, -312, 41, 372, 336, -148, -292, -134, 357, 158, -572, -87, -272, 64, -173, 64, -271, 181, -231, -292, -55, 122, 403, 48, -183, -210, 192, 98, -309, -158, -13, -36, 79, -333, -144, -4, 215, -296, 146, 276, 254, -117, -298, -129, 87, 10, -29, -11, 162, 212, -199, -152, 225, 73, 220, -87, -146, 104, 10, -187, -122, -237, -97, -118, 20, -116, -81, -56, -299, -323, 194, -58, -54, -191, -349, -306, 227, 167, -115, -103, -173, 144, -342, -259, -244, -187, -273, -327, 46, -115, 41, -297, -294, 9, 41, -29, -169, -69, -80, -89, -88, -270, 30, 37, 75, -392, -256, 57, 6, -72, -328]
6407c28M1L01K14p87K81M09j41m20R0K21K79L5o80M05KJ39k2j83q6M06k92J16
6429@J46L4k12K0l20L85J86l9j92J89n4P5q4K5J56l86q4j35L94J68J82n79l0J08
6453d7R5R8p8N0J91j03m05JO8N52k91m15K03J41K54l98k23L19K67k32qr8L50j09
6477A82k36k04j51Q33l2m33p8j13M14K12n60k74L32k59J15K49J84J16k19l55K20
6498e7J66j36J44k51j6R6L5P0K1j86j59L40K4L1J94m55K21J16j87O8J5j07Q1o
6522F2M5k17J97M44k35n95j42M66K02j50j68Q1J27Q9j41k70L52J41n03O5K7M96
6544C73L4m41k32L89K87n43K43j36J73j27j93J20L38J16k28k97O8O27m36J64l48
6565d9PJ4M07l84q6J33J52Q2k85P9P5J70k58l84M17M6K80n78q9L60K47k66m9K3
$$ y = [-328, -287, 14, 228, -559, -278, 131, -10, -430, -340, -119, 160, 195, -485, -80, -78, 61, 39, -144, -230, 176, -116, 0, 146, 180, -32, -12, -332, 53, 239, 200, 8, 197, 143, 218, 134, 159, 315, -71, -155, -290, 104, 272, 454, -125, -155, -47, 48, 146, 68, 118, 309, 206, -199, -198, -130, 422, 131, -284, -81, 60, 314, -84, -307, 12, 279, 47, 39, -59, 291, 182, -54, -258, -409, 424, 392, -41, -119, -232, 182, 394, -166, -440, -108, -367, -252, -3, 181, 297, 78, -277, -57, 109, -27, 117, -134, -150, -54, -19, 51, 72, -114, -273, 67, 91, 122, 316, -139, 82, 198, 11, 79, 94, -13, 68, 62, 107, -110, 87, 531, 296, -299, -441, 25, 227, 77, -91, -10, 117, 206, 65, -205, 147, 288, -215, -150, -123, 373, 407, -34, -266, 123, 410, -133, 110, -26, 147, 20, -173, -53, 285, 401, 173, -124, -56, 571, 135, 299, -49, -42, -28, 379, -5, -91, 42, 194, 276, -9, 70, 145, 315, 57, -327, 90, 136, 416, -162, -251, 109, 356, 90, 41, 64]
6589F4m01J39r5J81K80j16k94K28J70J7J06l51J08O4Q4k27Q7J12k14m5j77Q7K82
6612H9n5L9l27Q0K84k43M74j89L1k12m35L14L46m0l99k15J06N21J1k64NJ93j28
6635a4r5m85N64M13n15l79M28K16k8k36l11K50K86m9k67MO0M07k27m07O5K96K34
6658B10P4n85M04j25K44n45J49M4k12L65Kl8kR0j83j00K51K36j49k59k27M17l77
6681c16K77J98p4j58j15K00q6J96j36p9O2k16M26j42j1k10J87K16n02K52K03L3
6703B05k41r2MK18K8j01l18M03J16j21k39j09L36j67l39K60K36K32J3n00j7M69
6725B76l23J90m98J51L85L3m95K29O1k49j04M23k71L76j99m19M39Q6J39Q1k98
6746A3l94J97K26J12j66j2k52M83k56J4R0K1r1J37m51M20j69J72q2L57o52J19
$$ y = [64, -337, -198, -293, -112, 168, 52, -242, -14, 156, 173, 279, -72, 36, 100, 184, -43, 44, 156, -58, -103, -280, -193, 89, 34, 73, -254, -174, 110, -133, 341, 152, 183, -29, -464, -150, 196, 156, -243, -458, -352, 169, 180, -84, -79, 114, -14, -109, -594, -30, 383, -132, -511, -83, 133, 105, -131, -442, -192, 94, 45, -222, -218, -158, 249, 22, -385, -320, -24, 210, 284, -301, 103, -22, 222, -323, -174, -130, -342, 23, 25, -13, -15, 75, -108, -208, 43, 279, 130, -129, -356, 61, -316, -39, 159, 85, -73, -188, 12, -74, 122, -14, -93, -31, -247, 179, 37, 26, -184, 3, 219, -283, -31, 172, 205, -36, -128, -124, 94, 122, 21, -297, 106, 222, 101, -138, -247, 89, -78, -417, -157, 79, 311, 324, -176, -193, 276, -47, 143, -355, -204, 181, 214, -281, -52, 9, -240, -344, 79, -192, 184, -15, -434, 5, 91, 230, 311, 13, -381, -184, 42, 154, -12, -24, -276, 207, -49, -35, 55, 76, -15, 122, -329, 91, -78, 94, 12, 369, -283, -164]
6768a64k88N80K70n02K20k29L16p8j37O1j58r2L91k14K23j28k64j28K63j81M93
6789B54l48j00J12J79K61l42p3J82Mp1j68K09k7J28l80J8J24L15j00k34L32m39
6811a64K90j33J1M31r8m13J74J11J82m45K78m91M57j07j01k91J77J42K0j07j9
6832i6L48O9k67j72J13n6L31l20P1P8k38j4K64j99J93k2k37QJ50k6p4r7K97k87
6856a83M10P2r0r4k44K5R4M03l59J77k08pj22K92Q7j74p9N9k73Q0L02j46P8j80
6880h0k2J24J62M32n33l18L61j3J8m21J11K10j84J36r8j51O13m28l78K26J51J47
6902F5q1j38M0J19J62l78R7P6Q0J64p42L34J07N24n03m2Q0J9R7j34k60M94j44
6925C6j79L21r2j40j78J32M3rJ43q5k00J73K56Nj52k40r0J95q1J25L2q3J8j45
$$ y = [-164, -452, 128, 398, -104, 116, -113, 203, 125, -12, 49, -109, -201, 190, -24, 199, 71, -193, -321, -58, -239, 254, -94, -194, -82, 97, 358, 16, -57, 125, 129, 58, -110, 99, 72, 200, -180, -162, -38, 277, 177, -57, 275, -164, 126, -7, 4, 435, 337, -76, 98, 209, 391, -54, 224, -267, 190, 83, -18, -309, -132, 10, 30, -77, -96, 252, 321, 54, -118, -5, -61, 270, -50, 21, 99, -139, -153, 111, -88, 105, 83, -154, -146, 4, -22, -96, -193, 104, -183, 227, 299, 209, 115, -129, -104, -10, 393, 34, 211, 3, -4, -126, 166, 253, 79, 0, 59, -214, -134, 168, 22, 100, -80, -102, 22, 184, 616, 83, -235, 126, 113, 131, -290, -179, 31, -153, -17, -115, -266, 347, -81, -459, -233, -82, 65, -16, -154, -114, 5, 167, -211, -114, -38, 42, 206, -536, -202, -95, 429, -74, -116, -36, -17, 80, -54, -314, 180, 36, -143, 178, 86, -54, -232, -100, -57, -66, 77, -8, -208, -35, 221, 226, 74, -166, -256, -61, -142, -17, 15, -68, -50, -195]
6949a95M6M20J8n12J41L68J8l76k5r5L31K26o07q3K96K42k09k11L51J18P6n40
6971b02q7L01J70k47j9M61q5j47q0m16J35K34K94l47j96L37j66J18j06O8J55m05
6993b30j50N6M77J61k20m06r1L81J24j99P1m58M91J2L7o5K06o8o3k47K69K81j97
7016A72l3l97J45j39J09K69J48m60L7J1J02J08j32mj36K06K2J36k31m7oL40o3
7039A57l22L01k7Q7n48J15L74O7k02j00J44K8L5k50P5K06m9m65L88K46J11Q4m65
7062a0j94M67J93p22P0Q9L19ml11K43J25k2k54l15J73L26r6l4j65J45L45k21o7
7085H0j23K92j29p9l01L52nj14j97J84K22K81j68l32j36K66l1j56L09M5j47K69
7107C82j67l0k23n5J23l38M72l48L69P2j64N4j94j59N33q8k03o1l61M03K04j04
$$ y = [-195, -149, 271, 289, -223, -82, 286, 304, -72, -97, -192, 139, 365, -242, -325, -29, 213, 4, -207, 144, 262, 338, -202, -289, 12, 182, -65, -84, 377, 292, 145, 65, -351, -216, 18, 312, -35, -231, 106, -60, 58, -48, 20, 175, -230, -380, -324, 153, 314, 94, -312, -403, -22, 102, -97, -26, -484, 7, 19, 56, -9, 197, 129, 66, -181, 88, 369, 172, 139, -258, -113, -252, -143, 126, 274, -186, -149, -138, -36, 72, -60, -64, -200, 6, 28, 164, -67, -114, -120, 220, 157, -165, 136, 109, 196, -352, -237, 137, 204, 2, -98, 46, 74, 109, -141, -66, 140, 91, -374, 14, 260, 371, 455, -10, -204, 263, 456, -266, -196, -107, 212, 208, -103, 140, 265, 243, -11, -326, -153, 173, 77, 43, -122, 23, 368, 147, 80, -43, 249, 120, 41, -260, 92, 87, -27, -224, -40, 182, 463, 295, -37, -173, 93, 62, -94, 215, 260, 113, 382, 215, 185, -38, -93, 30, -308, 164, -184, 185, 257, 93, 147, -47, -206, 327, 239, 36, -25, -386, 17, 221, 117]
7129A17k69L9J43l6j20K08j48J92rk82P8R7K03l16l8K28R5p8R7l42K00k2j89l46
7153d98M87K0K19p85L70Q3K15j49L6k68L29O0l7j40J11J81k68J74o2r9J12j61
7175g0k9J34J37J66j93Q1l22K1K08M5J1M8l91J93j5K1P0j70k4K41K3l66%J1J65
7200ek30O8K19M70m37j11N4k7j42L45R5n05M41l8j30k25M1J32R6j30p3K00K38
7223C46k11r6j94J44J35j46P5j75Q1O3j05Rn7K02J65m00j06M53k43J04l3k9Rj73
7247a82K01N7m1M1j3k06L40l22O4l8j61K41L8L2l4Q1j37k63L40L34l70J29kj08
7271B1K05P0m51Q9r4K28J06k31j52J72l0j35j04K3M10k44J80l85K61J18KJ38j13
7294H4M2l44N4k4K94k0j66N6j22L71k1m99J61J53J83j08l39K43K2q5P4n52M19
$$ y = [117, -152, -113, 30, -6, -126, 82, -66, 126, 117, -165, -87, 10, 213, -103, -141, 87, 182, 104, 201, -141, 59, 37, -152, -498, -11, 9, 228, -557, -187, -104, 111, -38, -2, -270, 59, 119, 82, -58, 53, 234, -34, 140, 78, -21, 91, -70, -99, 35, 172, 338, 145, 226, -96, -75, 133, 178, 189, 237, -154, 39, 24, 45, 115, -55, -79, 162, 185, -181, -181, -170, -5, -235, -167, 52, 522, 85, -26, 28, 1, -141, 204, 299, -206, 235, 197, 67, -158, -117, 15, 111, -19, -92, 108, 346, 135, 39, -155, -11, 124, -22, 53, -122, -41, 22, -83, -74, -131, 71, 236, -164, -270, 183, -60, 44, 11, -18, -9, -182, 19, 76, 35, 76, 63, -143, 197, -125, -61, -99, -260, -19, 19, 51, 17, 98, -39, -302, 38, 372, 2, 131, 129, 21, 226, 296, -155, -66, -160, 68, 174, -57, -209, -37, -67, -202, -306, -283, 127, -117, 63, -322, -61, 57, 59, 197, 84, 126, -218, -164, -188, 106, 86, -80, -24, -146, 225, 204, -295, -134, 19, 202, 94, -245, -2, 20, -65, 9, -543, -124]
7317a24M68n52J04j24K89J14k24j8k3R7m0j38K32P1l26o2k60O64l78M15l66J71
7339a0K7J0O5j22J31Q1k97j64J16J97j23K37K1Q2J00j61k29l5J86k16J22q7K60
7362A91k57n4MO4K39k25M6J9R0Q8n36J90j1K35j33K25j79L87j01j15l44J05L95
7385C23k10l36k57M14M38j63n41K31K40%j14l58L19j0J89m11J00Q0J28k62L07
7406A07p5j32J80j37l8J27p5l5J23k22j30L85j56n6j4M84n9l43l4K70L2k04O1
7429E9L9J02l40K47Oj15Q3J9q7K47j04k36P8j63L06M2k49L34l37r4P0K84l16J56
7453C1pP4k89J22J7J07Ln2o1K64j02m5l3r8K37m72M72P5j4l29K16J6L36n46j22
7478b00M10l28K09o7n3J25k26K46k38j2J97j56l2K43k89M08k72J09l70M11J13
$$ y = [-124, 344, -208, -104, -228, 61, 175, -49, -67, -90, 7, -33, -171, 61, 132, -194, -256, -516, 148, -230, 185, -181, -10, 17, 27, 92, -30, 101, 182, -115, -279, -163, 34, -89, 148, 169, 251, 351, 190, -39, -74, 112, -104, 18, -69, 191, -66, -120, -116, -52, 187, -38, 8, 27, 117, 205, -331, -141, -152, 83, -50, 175, -4, 383, 282, 167, -177, -72, 323, 113, -223, -480, -66, 372, 209, -332, -101, 139, 139, 25, -333, -14, -24, 165, -246, -146, -66, 62, -200, 107, 32, -100, 80, -57, -95, 32, -43, -78, 45, -177, -307, 78, -78, -134, -148, 336, 277, -66, -100, 170, 202, -2, 59, 98, 200, -140, 107, 113, -2, 81, 100, 13, 260, 156, -80, -2, -165, 141, 183, -66, 268, -69, -163, -93, 191, -125, 31, 24, 98, -191, -69, -52, 55, 58, 6, -55, 209, 107, 62, 29, -69, 168, -304, 168, 243, 229, -100, 116, 132, 468, -78, -200, 210, -118, 91, 24, -29, 96, -130, 116, -122, -134, 63, -93, -125, 118, -171, 237, -35, 74, -296, 115, 228]
7499B28l00K89q0k16lR7q6L3N20p20J73P3K73j36j75j04O6J95pl90L62l4j96P9
7523e9Q0O5J24l67J24p0K21K4m21M5J93N2j40KN5L37k85o0p4K20J84k60j75Q8
7547i7J37o9j18Q2mk4J43o1j07L71j14k99L07m8L4r7L9m70M44J99k19k84J51m9
7571a53L49j53L6k67K86P1l54N4K14j53j12R3j61J09J37n6K06l9p0K29l43j14
7593a91L14M0l57J34o7J93k32K80j20J66j06l6J1P2l37L38Q2j24N0p6m04M73k0
7616H3P4l70K39M1j16q3r0L38l36J09P2l14J71L76j77k44M9L93k86J86j27j25
7638a37K98j98J3j52K23J91m41O7J94j4j59Ql69O25l26n9K48J36Q2j0k83j14L40
7661A63l37M64l54J04J83j59J0k17J41q8K05l79j56N23j8k12M30o44K00K94k26
$$ y = [228, -72, 217, 137, -79, -82, 15, -71, -38, 482, -238, -65, 8, 281, 145, -30, -134, -68, 127, 120, -270, 92, 58, -138, -59, 21, 86, 210, -157, -33, -103, 118, 142, -279, -234, -41, 11, -129, -127, -72, 265, -20, -80, -154, 66, 250, -10, -185, -97, 40, -29, -147, -65, -69, -93, 50, -11, -118, 253, 139, -160, 147, 99, 133, 36, 75, -395, 49, 248, 29, -255, -104, -153, 196, 43, 79, -188, 98, 169, -185, -131, 83, -70, -182, -89, -250, -141, -4, -60, 146, 107, 37, 266, -77, -191, 123, 163, -194, -60, -127, 66, -166, 114, -6, 160, 54, 18, 29, 101, -236, 102, 184, 60, 110, 34, -370, 103, 83, 157, -213, 26, 67, -49, -132, -222, 116, -220, -111, -39, -353, -182, 194, 17, -227, -178, 215, -71, 115, -12, -137, 161, -37, -24, -176, 47, 238, -203, -136, 58, 44, -115, -107, -476, 149, -177, -236, 12, 148, 230, 220, -63, -177, 163, -174, 290, -64, 40, 223, 64, 74, -143, -2, -90, 115, -264, -420, 103, 85, -127, 303, -341, -141, 153, -73]
7682g3lQ2j07Nj94K30J91j23k33K27J27l99J13K56oK3j92m5M0O5J47l62K19K34
7706B22L7n21J08J9O19m08K9k37J23M6Q6l68M17R6l00j21J81k54L59k09L04k6
7728B02k03j45K83k54P4j7J72M8k50J31n4k1J31K01k06k21l0J20J06n1j65KM2
7751a05K73j18j03j86K26q7j22qL47m6J58l38N9k0K59k25l54N79j46K57m86J01
7773h5q3M94j56q7J72k24k25j17L3L27l6j52J36j16K41j12l56L71J20k38K39j09
7795C7j36L09k38R7l80N19j85j49Q4n3q0J91j48j21K92J77k71K96k9o8J46l49
7817e9k31L98K47l14K12m07J54m2J90l70M82j33k9n5j15L08j04kr1O8j25L10k47
7840D5m55K68J76k81J43P8K71j83k07M0L23j17j7Q9l00J49l23M28k87K69r4m41
$$ y = [-73, -76, 6, -101, -96, -290, -60, 131, 8, -225, 2, 129, -270, -157, 99, 93, 116, -76, -121, -81, -16, 131, -231, -12, 222, 259, -262, -154, -135, 484, 76, 105, -132, -9, 37, 123, -245, 172, 268, -32, -153, 28, -226, 133, -76, 228, 202, -1, -146, 137, -117, -43, -60, 112, 160, -90, 41, -13, -34, 97, 298, 92, -129, -159, -39, 67, 16, -149, -147, -105, 168, 50, -53, -239, -13, -100, -222, -230, 117, 71, 229, -109, -50, -70, 189, -36, -390, 189, 43, 300, -186, -85, -168, 326, 170, 83, 255, 31, -194, -311, -278, 49, 13, -139, -3, -119, 122, 10, -346, 25, 145, -93, 146, 37, -99, 210, -28, 69, -311, 208, 23, -126, -42, -95, -175, 16, -132, -253, 39, 216, -55, 241, 212, 144, 290, -59, -290, 108, 355, 41, 253, -154, 0, -42, 148, -222, 260, 127, 98, 43, -72, 236, 132, 130, 39, 107, -18, 292, 45, -410, -142, 34, -247, -104, -26, 245, 62, -145, -105, 218, 101, 84, 173, -127, 22, -301, 127, -160, 109, 15, -426]
7862d26M85K38k84k10K2M09l15K40mN7k21K35j56o3j03L3J44j59k60L80p9J6L36
7885C15m33J63k00J11j04K49j82K94m62J17J37Q5P8k20kj36K74L4k66L00l41L8
7907a51R9m5M3nJ36k26R7k87K89k32L59k13n7J03j27N3o8J84o3MJ02qJ05Q6q3
7932I5q7j18K23J19m82l0L18L7j61K17mJ4k84L41r3k27j25L16K0l5lK4Q4K3p5
7957A07j34j2R9l6l1L1J53p1j82N8j14QJ69j80R6K83l85J47j75M14m1J4m31J90
7981b3J57j12J95m02P9J05K3Q9j12k57N18n59K81j40J26J02N0k49jM35n39J23
8003a11K05j64o0L96l22j25J7M42k53k67K10j05J92k98K77J50k91M1P5J2l0j23
8025a32J60j64K17K2J27m79K21j03K02ON9j1j12J59k37R7lk1M3m24M59k91Q6N7
$$ y = [-426, 59, 297, 13, -197, -175, 234, -81, 159, 155, 212, -9, 226, 70, 7, -96, -63, 81, -78, -338, 42, -37, -21, 315, -118, 45, -155, -44, -148, 101, -81, 213, -249, -132, 5, 90, 168, -52, -54, -190, 84, 118, -148, 152, -189, -151, -52, -97, -54, -59, 77, -149, -52, -339, -50, -282, 77, -136, -193, -90, -217, -164, -232, -48, -111, -107, -5, -13, 92, 178, 95, 8, -110, 113, 232, -250, -280, 38, 75, -86, 131, 127, 141, -143, 198, 105, -122, -247, 69, 89, 54, 51, 75, 159, 182, 107, -27, -39, 60, 24, -7, 24, 177, 106, -76, -18, -132, -124, 45, -135, -39, 244, -141, 6, -169, 245, 204, 218, -213, -23, 134, 22, 217, -185, -106, -1, 22, 111, -1, -258, 260, -299, -18, -158, -32, 70, 120, -129, -130, 305, -234, -111, 94, -70, -130, 266, -56, -181, -164, 278, 25, -242, -32, -137, 55, -243, 34, 184, -107, -66, 9, 21, -9, -132, 28, -136, 81, 103, 230, -249, -28, -131, 71, 77, 136, 125, 13, 172, -65, 32, 29, 8, 51, -373, 86, -205, -119, -62]
8049f2J18J74k19R4N1p7j40L7k1R4L4j49k0L02k15J53l94L64r0Q9n8j9N0o1J22
8074A57k43J52j04K17r6J38o9k10j60K43l6J61J5r6j03K56j29N5m3j44N4k80N00
8097B35r6k59K11L2m5j99L18l8j31q4k9L63j81l1q3MJ84L6j68P8k9k33LR1K58
8122B07m07L92n6l50M98k57j73j19J77J32O8k42K44j14K84m23p2J99Q2k97L72
8143A45J6o6r8l33M08j12o6J46k93Q5M37k04k09J23k88L35L9j00O6M4Nl73M58
8166A65k05j63J2oQ9L97j47P5l14J69L4o2J93j69K5r1K11l90q0N73k46j82roK80
$$ y = [-62, 56, 230, 11, 105, 156, 79, -61, -24, -45, 49, 83, -66, -86, 216, 1, 154, -240, 124, 34, 123, 65, 46, 96, 35, 157, -86, 66, -38, 179, 83, 221, 152, -58, -218, 25, -11, 150, 165, 69, -34, 222, 93, 148, 105, -39, 15, -265, 235, 139, -120, 91, 123, 78, -121, 197, 159, 28, -56, -85, 278, 97, 66, -17, -13, 171, 207, 39, 117, 88, -145, -142, -51, 207, -200, 192, 136, -214, 284, 27, -146, -265, -88, 44, 112, -130, 114, 0, 284, -139, -211, -12, 70, -227, 145, 161, 95, -3, -336, 72, -40, -106, 40, -253, -168, 269, 65, -144, -21, -309, 26, 65, -35, 31, 75, 80, -293, 165, -40, -203, -191, -197, -108, 289, 142, 217, -97, 72, 106, 44, 237, 68, 93, 2, 213, -177, -257, 316, 70, -112, -121, -127, 153]
8191A53
$$ Imaginary data points
##PAGE= N=2
##DATA TABLE= (X++(I..I)), XYDATA
0@%%%%%%%%qJ6j6J6j6K4l2L5m3N4o3P3q8J03j18J35j57J79k04K33k64K98l34L75
32A98m21M71n26N86o51P24q04Q90r86J091j207J337j482J646j828K033k273K550
50A348k873L261l737M338n119O183p727J0184j4726K5943j02510k22924N5449
63b52910J04931N8198l1858k990K5069J2154m2668l3643j877K380m6267m6162
75b55643K8230J11095Q3028k7252j03657o8782P039L6093J1227J74R411J1172
87a57865k707R53J5573Q978k8258n5419l2024K4894O2823N3126J2592k3887l5203
100a56424j6338J2435J8437n948k7307j3998K4731N0582L6293l191l0761l2225
112a43714k1236j1050P795L4777M1246Q748k3672n379M2667M3525k2408p4059
$$ y = [0, 0, 0, 0, 0, 0, 0, 0, 0, -8, 8, -8, 8, -8, 16, -16, 19, -24, 30, -33, 40, -48, 55, -63, 72, -85, 94, -110, 123, -141, 157, -177, 198, -223, 248, -278, 308, -343, 381, -423, 467, -519, 572, -635, 702, -780, 866, -962, 1071, -1202, 1348, -1525, 1736, -2001, 2337, -2782, 3401, -4326, 5858, -8868, 17075, -85435, -308359, -252910, -147979, -89781, -121639, -124629, -99560, -87406, -130074, -163717, -165594, -163214, -209481, -255643, -227413, -116318, -33290, -60542, -164199, -232981, -225942, -189849, -178622, -178448, -169037, -157865, -160572, -159619, -144046, -135068, -163326, -218745, -250769, -225875, -163052, -109926, -97334, -121221, -156424, -172762, -160327, -141890, -147838, -175145, -189143, -164412, -113830, -77537, -80728, -111489, -143714, -164950, -176000, -168205, -133428, -92182, -83434, -107106, -112485, -69818, -26293, -48701, -122760]
124a22760m2314L2354O2727L4364K774K959O728j2886l1789j1002L1100L0231
136a7514k1184m5978N318P1945N8202k3263p0532l1792K7379L2993N586O400K7775
149B5335J5979k5349l4726P109M2429J4684m0544m2610J7223O1967L6851j8219
161F0129l5135j1726N000m558q866J2249K7838P672k0216j1023K2077K7239o182
174F4498l3684k1982Q870K2537J3458J316j098j237l351k799q64k066n461n493
188C2644k74P631J0008M567k711m693n820p779N58J2744R919r119j5186M501K0953
203E7943N306k3031k4181M856K1362M393j3011j786J6520M725k4634k5077O920
216A0305K8528N266k7979j8127K3095L4928m436l6454j7995J8998J6791j6343
$$ y = [-122760, -165074, -132720, -69993, -35629, -32855, -29896, -23168, -36054, -67843, -78845, -47745, -17514, -38698, -84676, -79358, -7413, 50789, 27526, -43006, -74798, -47419, -14426, -8840, -2440, 25335, 41314, 15965, -18761, -11652, 30777, 45461, 4917, -37693, -20470, 41497, 78348, 60129, 24994, 13268, 18268, 13710, 4844, 17093, 44931, 52603, 32387, 21364, 43441, 70680, 64498, 30814, 8832, 17702, 40239, 53697, 55013, 53915, 52678, 49327, 46528, 45664, 43598, 38137, 32644, 32370, 40001, 50009, 54576, 51865, 47172, 41352, 33573, 34131, 46875, 56794, 47675, 32489, 36990, 57943, 63249, 40218, 16037, 20893, 42255, 46648, 33637, 31851, 48371, 53096, 28462, 3385, 10305, 38833, 44099, 16120, -2007, 21088, 56016, 51580, 15126, -2869, 16129, 32920, 16577]
228A6577k1065J4110L3003O18l6163k1833K0182K7080r850l0736m202L0489K1158
241C9368j7983k9107R46K3151N086k1631j2562J9201K6857k281k4301r081J3688
254A1351N275j7184j4891J2288K6601J0110j4160j6303N36J0632K497j0726j1232
267e206P34J1354J2919P482N83l858q136j0499q926J217J1759J4576M532r686
281A8845j0907N898J8698L198k5037k8857J827K9277K1111m960j1349M208O308
294B8260j3752k2323q22K1376J0272j7396j5803J9145L7745N405m0766l9846M500
307b4005L0755R784j6642n114K2019J7494j3749k4300Q4J5031p520l0556q255
320c4974L4970M3173K127l6093k7000P372J7931m719k0050m334J6736J4726j44
$$ y = [16577, -4488, 9622, 42625, 43243, 7080, -14753, 5429, 32509, 22659, -8077, -12279, 18210, 39368, 21385, -7722, -6776, 16375, 21461, -170, -12732, 6469, 33326, 31045, 6744, -2337, 11351, 16626, -558, -15449, -3161, 23440, 33550, 19390, 3087, 3623, 14255, 16752, 6026, -5206, -4472, 6882, 19801, 27283, 27866, 24008, 15872, 5373, -3553, -2336, 9423, 23999, 28531, 18845, 7938, 13836, 32534, 35732, 10695, -18162, -16335, 12942, 34053, 29093, 17744, 21952, 28260, 14508, -7815, -8637, 12739, 23011, 5615, -10188, 8957, 46702, 52107, 11341, -28505, -24005, 6750, 16534, -108, -5222, 16797, 34291, 20542, -3758, -3674, 11357, 3837, -26719, -34974, -4, 43169, 45296, 9203, -17797, -10425, 7506, 2787, -17263, -21597, -4861, 9865, 9721]
333I721r3R664J161k4765l4752p178K8658L1863N177j6034j2987L338J0295J737
347E805j3140j8966j1639L949J7809K1934J4714k192j7377k4852j5912L629J8977
360a7261J3459o059j5292r43K3588K6050m516l6061l2755k621K0127J7633R095
373e556Q796L909j2433k2435o232J8528J3125j9158l1840j7M1561M0821j865l6044
387h840k8541j460P761N08L292J5834J1933j0480j6206Q886K6728L908l8227m1938
401f6842K374M2448L4677l2j8132j0628j032k874n298K775Q088l334j5706j348
415c4864K8121L2952l74l6325l6165m062K2578K1315M816m760n883l584K340Q851
429e044O139p405k0503j6597L195K5056K8843J0337j5248k7047j6428P794K0495
$$ y = [9721, 9628, 19292, 20453, -4312, -39064, -46242, -17584, 14279, 19456, 3422, -9565, -6227, 4068, 5805, -7335, -26301, -37940, -33991, -16182, 5752, 20466, 18274, 897, -23955, -39867, -36238, -17261, -3802, -9861, -25153, -26096, -2508, 23542, 19026, -17035, -49790, -52411, -32284, -14651, -5556, 3240, 7149, -5284, -27719, -33951, -15423, -2298, -21456, -53296, -53313, -11752, 29069, 27204, -8840, -37381, -38841, -31080, -30572, -27280, -11446, 487, -9993, -26199, -17313, 9415, 13323, -24904, -66842, -64468, -22020, 12657, 12625, -5507, -16135, -17167, -20041, -25339, -22564, -14476, -17810, -33516, -34864, -6743, 26209, 25835, -10490, -46655, -50717, -28139, -6824, -2008, -6768, -12651, -16235, -13895, -5044, 1095, -6310, -26813, -43410, -40215, -15159, 13684, 24021, 8773, -18274, -34702, -26908, -6413]
442f413J0795j0317j6704j099J8336J9837M347j2879j6912j3008p231N355K3781
455b112K5633Q51k6373k1323J1553K8773O064k6319k6070N289K4712J5675j11
468A6242j254O7j0690k1751p475K2310K7978m179l1818j3896K5124L2518k155
481C1021l1001k0483P692J5722K442p68J0815Q763j2604k1942j237K2886J6701
494B8007j4221k8523m941K5004K4665k987j9653j2596J766L650R46M514P216P09
508A3556r922q539N166J3530N415j0237j5006o452Q444J6792Q817p183j4933p351
522g903O773J0506J962p635m890K241K788k331j408O744O811o902j5962l314J9076
537F556J7302q427k4272o872J7910J4901q923j5416K799J5564J780j6237p977
$$ y = [-6413, 4382, -5935, -22639, -23738, -5402, 14435, 18782, 5903, -11009, -24017, -31248, -25893, -2112, 23521, 24372, -2001, -23324, -11771, 17002, 23066, -3253, -29323, -24034, 678, 16353, 16242, 14988, 15055, 4365, -17386, -24861, -2551, 25427, 21248, -10570, -24466, 658, 33176, 31021, 20, -20463, -12771, 2951, 5393, 4625, 15440, 24203, 11599, -10343, -11580, 11306, 28007, 13786, -14737, -19678, 5326, 29991, 27004, 7351, -5245, -3479, 171, 1117, 5631, 12847, 13556, 3634, -4905, 261, 13791, 19206, 8969, -6037, -12489, -4045, 12747, 21564, 14381, -552, -7903, -1130, 9376, 11338, 3703, -1187, 1054, 3842, 1511, 103, 6847, 13658, 6756, -9206, -12520, 6556, 23858, 15431, -8841, -15713, 2197, 17098, 8175, -7241, -4442, 11122, 12902, -3335, -11312]
550a1312J3833J3657j1169k1308J256K5701J5204j6099k3752J085K1356O014j7400
563b934j1968J3364J7691l141j6131j444J4109M666j6788j5526Q833K1057N876
576A7664j2971r661Q074J1367l539j5077o409Q734R477O17j664L891M580l644
590A1439r300m589K869L613l37o71K552N632L965J026n683j0739p360L714J0348
605F479O687l363m180L686Q238q67j1422q447K260N109j079j048R699J3980q19
620B4913j9573j4176Q266J5459k302j7771m146J8983J8063l247j5444m182N838
633A0681l310j4536k594J9305J8473n371j9825k587J7678J0016j7715k4223R1
646a3917K1261J1783n625l847Q390M781j3967j7652J596J6567N825j3070r286
$$ y = [-11312, 2521, 16178, 5009, -16299, -15043, 10658, 25862, 9763, -13989, -12904, 8452, 14466, -2934, -14902, -1538, 16153, 13012, -3119, -4563, 9546, 14212, -2576, -18102, -9269, 11788, 17664, 4693, -4968, 3106, 14473, 10934, -4143, -10552, -1818, 7659, 8276, 6612, 10503, 15083, 11439, 2139, -2450, 419, 4032, 3695, 3024, 5576, 11208, 15173, 16199, 10516, -223, -7583, -3869, 6479, 13166, 9803, 5623, 9309, 17547, 16680, 5258, -3189, -929, 4180, 3101, 2053, 11752, 25732, 24913, 5340, -8836, -570, 14889, 12587, -5184, -9330, 9653, 27716, 24469, 9025, 4843, 10681, 7371, -7165, -9759, 9546, 28019, 22648, 2823, 236, 17914, 27930, 10215, -14008, -13917, 7344, 19127, 13502, 9655, 18045, 22826, 8859, -8793, -7197, 9370, 15195, 2125, -7161]
659g161J2317K1509K645j8191j6997j013O808J778p35O473R073l36r566n043N335
674F896L637r074j3717k450J1925J5016O870l446r326j0198n210K478N779N72
688b48n066j239N889Q991L417l986p951r045r665l476J0209J8047P698j1826j5863
703a4114J033J5396M895j5403j7872J797J4868Q125j123K946O266n688k0672j3369
717c2915J2846K3144J257k2569j2348J7366K4886m37k3811j6595N086R142k700
730a7648k693J2612J4727p783k2329o576J8640J6194j2393k6355n472K3213K2584
743F721o28j4750p389J431j471n972K790J1758N456r450j1141O564J9135P678
757A0732j4462k1027o248J0947J5409P833j420p307o595j389N524O393k27p515
$$ y = [-7161, 5156, 26665, 29310, 11119, -5878, -6891, -83, 1695, 960, 7433, 16506, 16170, 6604, 1561, 6896, 10533, 1459, -12258, -14708, -2783, 12233, 19103, 15657, 6331, -3867, -9077, -6599, -820, -248, -5314, -6553, -664, 8327, 11744, 7758, -193, -9238, -18903, -22379, -12170, 5877, 13575, 1749, -14114, -13081, 2315, 7210, -8193, -26065, -24268, -9400, -1275, -2398, 548, 6814, 1126, -19546, -32915, -20069, 3075, 4332, -18237, -30585, -13219, 11667, 11230, -12581, -29176, -24090, -14948, -17648, -20341, -7729, 6998, -785, -23114, -29690, -11050, 5144, -7249, -33604, -39076, -15863, 6721, 6093, -8657, -16046, -14615, -16086, -22058, -19268, -7510, -2054, -11504, -22645, -16081, 3054, 10732, -3730, -24757, -31005, -20058, -4649, 3184, 1764, -5543, -12138, -13527, -8003, -1610, -1837, -9352]
771i352p253n34P128J1971Q787j077j3878j6341k851J5254J7813k55j7040j0184
785a7812R244J6915L401j0111q419k11p44m415M887J8321J1613j3663k5051l642
799a9687K2745J9020r923k4638o979J7408J6082k555q271O84K735r128j2116O047
813h576K1768R767j8947k2627N379K5738J2247j5452k0369k039J2511P270k125
826D545L92M764k588j1673n671J1643J5240j567j7934j2464Q444J8368O863q422
840I940j0593l298J853L889N494L235l018q016n640M464J0612N156l016q464p188
855d590m10O696Q668K937p449j0537j234J0911J0235k348j0761o425L179L543
869B415m28K295O740J841r584r659M775J4500M234j4291j4276N997J6479O084
$$ y = [-9352, -16605, -17139, -10011, 1960, 10747, 9670, -4208, -20549, -23400, -8146, 9667, 9412, -7628, -17812, -8568, 8347, 11748, 1637, -6782, -6993, -7737, -12152, -7265, 11056, 22669, 9006, -16045, -19687, 3058, 22078, 12155, -12483, -19462, -2054, 14028, 11473, 3202, 3886, 6621, -2507, -14623, -8576, 13192, 22959, 4012, -18615, -13236, 12502, 24749, 9297, -11072, -13111, -600, 6670, 4545, 4937, 9701, 7113, -4560, -10231, 1412, 16652, 15085, -2849, -15313, -6869, 11499, 18362, 9940, -653, -3951, -2098, 1791, 7285, 10520, 7502, -514, -6154, -1690, 8922, 14078, 11062, 2598, -4590, -5000, 1696, 10364, 13301, 5852, -4685, -5919, 4992, 15227, 12879, 2118, -4307, -1128, 2415, 1987, 4282, 11022, 12863, 3279, -6380, -1605, 12895, 17129, 2838, -11438, -5441, 11038, 17122]
883A7122q478p437L421L878o676q473N591J3658J289j3531p459J2315J4958m575
897A5603j9767q811J0911J2525k557q148L257R099K65j2113n832O996P112o444
911B096j0496K139J6324R478q217j3666j773P130J842o468m204O243P906J81l730
926D785R54K656l000q232n220M180Q337M112j868k663M59J592m04l190m787l276
942e565J783P196O061L84l848k212O37j299m810l309M524O337N23l403K100Q512
958A3611J323j2252j2936K659J4095N396q243n805Q317J1200k144j2858o368N930
972A925M063o718n675J0351J6462J004j6691j1632P369J2686l351j5370m772J2530
986B181J3041j974q361M66N040m549j2640m563J1904J3632j816j2564l804J0285
$$ y = [17122, 8644, 1207, 4628, 8506, 1830, -6643, -1052, 12606, 13895, 364, -7095, 5220, 20178, 15603, -4164, -12975, -2064, 10461, 7904, -244, 3013, 12112, 12377, 264, -5568, 1428, 8540, 2096, -8400, -6261, 10063, 19541, 11324, -2342, -4115, 3015, 4857, -1611, -5815, 428, 8334, 8515, 4785, 5739, 8395, 5395, -2837, -8057, -3877, 4460, 8572, 6704, 4041, 4500, 6092, 5688, 2498, -2289, -5565, -3782, 3414, 9475, 9859, 6011, 3799, 4436, 3137, -1673, -4982, -458, 5879, 6402, 2999, 5099, 13611, 14934, 2682, -10254, -7595, 6500, 11896, 3653, -2152, 6165, 17365, 15221, 2363, -4005, 1925, 5988, -730, -6405, 3946, 20408, 21412, 4721, -6911, 458, 13144, 9793, -5577, -10349, 2181, 15222, 13248, 4887, 5353, 10393, 5844, -6796, -11359, 545, 14177, 12361, -203, -4007, 6278]
1000F278Q849n640j3654n563N257O578J900J271L499J283o278q710k006M918M585
1015B567k220m781j322O136Q559K062p438j2133n915M044Q076L242k318j623J957
1030a107J892k279l808k91M20m714p260J777J4204J1540n785j6747p025R324Q928
1045i31l911j1516j094R303O353l279k780M388K008r917j2945K078J7129J0935
1059E821r374j5036L24J4025O665r095j1859p26O942K566j864L572Q219k66j2410
1074a2496j0056N475J2675L331r569r097M091J2634N554m842o919l771r56m70
1088a4416K920O425M670k785o123k493N421O439o90o757p178J11P163R392L324
1103E423m900p988k739L952N072O58k628j930K30J8K338N006M583l617j0708o659
$$ y = [6278, 15127, 9487, -4167, -9730, -4473, 2105, 4005, 5276, 8775, 10058, 3780, -4930, -6936, -2018, 2567, 347, -4434, -5756, 380, 8939, 11001, 3563, -8570, -14485, -10441, -2365, 877, -1441, -3064, -1107, 785, -1494, -5302, -5593, -5173, -9887, -17147, -15370, -1166, 10374, 4589, -12158, -19183, -9859, -931, -4842, -16358, -17452, -8149, -1796, -5075, -7855, -3467, -1459, -11376, -24321, -22243, -5114, 5821, -3553, -18589, -18265, -4240, 2425, -6670, -18529, -19255, -12313, -9747, -11611, -8039, 180, -86, -12496, -22552, -17077, -4402, -1071, -10640, -19737, -15646, -3012, 2542, -2300, -9219, -12990, -13946, -14416, -11496, -5071, -401, -3186, -9309, -11802, -6381, 58, -632, -7389, -14567, -14456, -7293, 2099, 5423, 523, -7465, -10204, -6252, -1180, -522, -3150, -5080, -4850, -4832, -2494, 2512, 7095, 3478, -7230, -13889]
1119a3889O768J3615M431r437j0005K650R497L630m354l720R44l55l814M19R813
1134F193R155n428j5381n839J1979J4318j142j3993p457O527R575J253l642P41
1148F859J515n779p949L244J3494P079j0213j4585K31J4156J1042n088j2111m640
1162b745L720M340J152J764K696j753p118m094O194J0123R90j0185j0271J010
1176d177R918R020m22o280n871j629L023M425J736k810m228j888J781L929M655
1191A1182J400m172q301n799L728J0387N818n834r884j201Q361O764l865q464
1205A20k797L042J441j290K885Q058K082j0869j1435K747J3970N205j0806j1845
1219i492M013J4115O344p544p817Q04K507m311n382N800J2003K778j2238r259
$$ y = [-13889, -7121, 6494, 10925, 1488, -8517, -5867, 3630, 7260, 2906, -814, 130, -225, -4039, -3620, 6193, 15348, 9920, -5461, -11300, 679, 14997, 13855, -138, -7595, -1068, 8507, 9760, 6118, 6859, 8374, 2595, -5354, -2110, 11384, 18463, 8250, -6335, -6104, 8052, 19094, 14006, 1895, -2745, 975, 5315, 6467, 8231, 10927, 9174, 2056, -2038, 4156, 14279, 15269, 5084, -5187, -4177, 5741, 14761, 14339, 8059, 2188, 559, 3582, 8007, 9743, 6933, 2705, 817, 2598, 6527, 11182, 12582, 8410, 109, -5690, -1962, 8425, 14243, 8409, -1475, -2676, 5685, 12449, 8584, 120, -2677, 365, 1806, 516, 3401, 11459, 13541, 2672, -8763, -6016, 7954, 13159, 2353, -9492, -5479, 8636, 14980, 7436, -381, 423, 2930, -1381, -6763, -963, 11040, 13818, 1580, -7679]
1233g679P108J3455m64j4330r513N729J1590L600m553j123K879q90p238m215N302
1248c42P120q98p533j907P736Q562j459r531o576Q45M361K865J014M80O16K77
1264E630m54o30j313j830j166j68Q0J716M621M334j033o638n486J463N439N00
1280E065n538k985O675Q011m11p812m282L472K309n570n509M633J0273J770q332
1295A769n300O795O473o076j2827k190J1432Q882l898q095J665Q296m75j0210
1309c759o436N517P200k543p318J838J2042L972j0489j1590J235Q738J851o760
1323f502k984O049O394j623o291q57K910j807p030k269O234Q375R54o305m062
1338h814J836K477j608l791j928Q37J783K608M014J854l043n779l476P52K652
$$ y = [-7679, -571, 12884, 12420, -1910, -11423, -5694, 5896, 9496, 4943, 3820, 6699, 5809, -1429, -5644, -342, 6778, 5880, -1653, -3560, 4176, 12738, 11279, 1748, -4828, -3983, 378, 3243, 4257, 4737, 5353, 5630, 5176, 4546, 3233, 1403, 237, 69, 149, 1865, 6486, 10820, 9787, 3149, -2337, -874, 4565, 5065, -473, -3458, 3217, 11228, 10817, 3005, -1277, 2195, 4504, -1066, -6575, -1942, 8331, 10101, 1769, -3531, 3264, 9737, 3661, -9166, -11356, 76, 8958, 5060, -3035, -1370, 6926, 6451, -3759, -10195, -4678, 2522, -21, -7339, -5501, 6541, 10513, 24, -11566, -10331, -1593, 258, -6502, -9486, -3437, 2957, 1334, -4957, -5814, -2904, -4711, -11741, -14010, -7776, 599, 1553, -4752, -8814, -6978, -4501, -6109, -9900, -11828, -10991, -9208, -6600, -2586, -732, -3775, -9554, -13030, -12278, -9626]
1353i626J504R45O70r40j247J638M238p1o657q200L88R108P105j300n567r41K542
1370f411j23m389l1L994J007n964l647P895J2035k77j2983r916M767J0273J576
1385b194o767j973N829L534l783m003N301N459n284j2112j804J3544J1875l790
1399C832j2650l472Q478O071m786o574J644M955k14m127K469Q739K552r638j0529
1414a3250K225J1312N456n758o664O40O067K988k461k019R7j404l023L49O033
1429E88N825j518n605l620J416M620K226j118l739l264R96O155N449o58o567m748
1445c562K014M386J692j776o06J179m35k991J095P083L361o918j0763P7J1356
1460E192R360n411j1007n70Q480M323n345l795L205L826m773o514M399J2396K841
$$ y = [-9626, -8122, -7177, -6507, -7447, -8694, -7056, -2818, -2889, -9546, -17746, -17358, -8250, -1145, -2445, -8012, -8953, -6411, -6534, -10923, -10954, -6960, -5953, -11917, -15564, -7669, 4366, 4089, -8894, -18810, -14043, -3770, -2194, -8961, -10934, -5105, -1571, -5354, -9357, -4056, 1403, -3881, -15993, -17797, -4253, 7622, 3832, -8818, -12290, -3812, 2259, -2527, -9101, -7457, -2502, -2716, -6843, -4374, 4365, 6917, -2721, -13250, -11025, 287, 5743, -15, -6679, -6039, 28, 3016, 555, -1464, -1367, -2771, -5794, -5445, 588, 6413, 4895, -710, -4330, -2914, 1706, 3932, 2814, -925, -4189, -3193, 2962, 8411, 7753, 1186, -3562, -1548, 2838, 4530, 2754, 2148, 3327, 2892, -99, 996, 8079, 11440, 4522, -6241, -6164, 5192, 14552, 9141, -1866, -2436, 6044, 10367, 5022, 1227, 4432, 8258, 3485, -3029, 1370, 13766, 16607]
1475A6607j1639j1908M615J4499L735j0406r064L946R257J401n380l86M199n54
1489H922q262m063P964J0073j192j1683n595P784R904k4q959n500J736L483J411
1504E999O04K164O12l629m847P07N723K713l710o138j549M129N928L215k539n934
1520C448m763K26N349L736j417m209j460K706K409j69m48p19k459n267j992O342
1536A313R398J118r795p743L420R154J348p939n583K906N141K23j937K705M294
1551H023l935j1047l667Q900J0730j953j1462m382Q876Q701k444q832l629L197
1565b924J164l007J289P703M408o812r970q9R368N188o264r152K25P899N678j247
1581C457l583p35j381l500k325M131N837K59n329l467L729N950L15n923n147j138
$$ y = [16607, 4968, -6940, -2325, 12174, 15909, 5503, -3561, 385, 9642, 11043, 5663, 5277, 9476, 8922, 660, -3403, 4561, 14634, 13442, 1759, -3836, 3948, 13852, 13828, 4869, -631, 1105, 4588, 5999, 6603, 8767, 9379, 5750, 903, 1610, 7333, 10046, 6336, 198, -1351, 2778, 8706, 11921, 9382, 3448, -1315, -1089, 4260, 7996, 6579, 2370, 910, 3616, 6025, 5856, 5408, 4689, 2230, -3037, -5029, 1313, 10711, 11829, 2034, -5709, -2289, 6865, 8213, 274, -5309, -2403, 2738, 2961, 1024, 3729, 8023, 4088, -6959, -10626, -1726, 9004, 7051, -4411, -8793, 83, 8784, 6340, -2492, -6121, -2924, -1760, -4767, -3478, 4225, 8633, 1821, -8149, -8238, 1130, 6318, 54, -9098, -8873, -974, 4704, 3457, -126, -861, -2242, -5742, -8067, -3936, 1901, 2160, -3169, -6636, -2907, 3043, 3358, -2565, -7712, -8850]
1597h850L084L374L317J032j888k875j554Q54J350l31j989j116R42K002K387K789
1613B528j11m609n680j184M905M234j357l767P8M956K491l745m164O92J516k005
1629e222k658J983P783L444o022p429J804O553M06o852m522N025P707L94n531
1644c137q48M349P93o574n788M611P968J221o355l047O124O283l921r253k347
1659i921N710M719j999l356K951N040q28n812l032L254L131k869m214J840O542
1674A156L789l097n559j610K080J731j228j328O57J764J648R07n33p33j526k213
1690d095j107M55K515L082J195k254l288m5L935K413m291n951m00O067N878j223
1706B886m275j202K304k26l913o98M808L138l984n276J986R380L425p587r611
$$ y = [-8850, -5766, -2392, 925, 1957, 69, -2806, -4360, -3506, -2156, -2487, -4476, -5592, -4650, -2648, -261, 2528, 2417, -2192, -7872, -9056, -4151, 83, -1274, -5041, -4963, -7, 2484, -1261, -5425, -4733, -3217, -5222, -7880, -5897, 1886, 5330, -692, -8121, -6317, 236, 642, -6210, -10732, -5707, 2000, 2394, -3137, -3985, 364, 1157, -5417, -11205, -6594, 1374, 2595, -3760, -6807, -683, 5600, 1679, -7574, -9921, -4211, 508, -1491, -4847, -1896, 3144, 2316, -3496, -6528, -3274, -143, -3012, -7226, -5386, 1156, 4945, 1848, -3711, -5321, -3241, -1510, -2738, -4066, -3409, -1645, 3, 910, 377, -356, -1882, -4095, -5202, -4747, -2232, 850, 2045, -209, -3497, -3542, 393, 2806, -1485, -7436, -7836, -1769, 4109, 2886, -1389, -2591, -287, -513, -4426, -5124, -316, 2822, -1162, -6438, -4452, 4928, 8353, 766, -8845]
1721h845L76Q538M010l692m184K650M541j489m960L79N707Q16o995n838N541J0519
1737G074K573p700p254J859O316J226m254j831K607J923j432q20L099M093k416
1752E063p068l367M203P171J627m131m064M42L555K380r76k198k478r54J057K873
1768C135K736R18j077k982k416K67L744K634j151m696l207M207O557K292n288
1783E673n804k26L356J798q67k73K088m6l612j507M241N581k592q880m869O769
1799H30Q822Q99p077m001K620L483j195l010R43K369j914m298K78P774N262n543
1815F242r391k304P189N463k312n326n43L374J765j430m10J528p08m366l943L654
1831a518O534K531n131n014M70M232K162k141l540j318Q93J617K107J830j32k915
$$ y = [-8845, -8469, 69, 4079, 387, -3797, -1147, 3394, 1905, -3055, -2676, 3031, 3847, -3148, -8986, -3445, 7074, 9647, 1947, -5307, -3448, 2868, 4094, -160, -1991, 616, 2539, 1107, 287, 3386, 7479, 5063, -2005, -5372, -1169, 6002, 7629, 3498, -566, -124, 3431, 5811, 4835, 2637, 159, -795, 262, 3135, 5871, 6789, 5712, 2730, 314, 581, 4325, 6959, 5808, 1112, -2095, 2112, 8669, 10961, 5673, -131, -357, 2999, 4797, 3930, 3657, 5745, 5699, 2087, 580, 4821, 10402, 7810, -1070, -5939, 830, 9652, 10551, 3474, -527, 2093, 5576, 4381, 1371, 2314, 4683, 2769, -1529, -1251, 6523, 11785, 6242, -3149, -5453, 1736, 7199, 4887, -439, -982, 2392, 4157, 2727, 2317, 3845, 3137, -1229, -5172, -1518, 5016, 7547, 2416, -2598, -2128, 2104, 4266, 2125, -1415, -2733, -1840, -223, 1884, 3714, 3582, 667]
1847F67l292o85K024K198M81j835j488n95K414L379R85l878n375j351L959M400
1863B008N11k629j118J185J66j216j9J719q8m213l339L935Q124K411n935p857
1879f355Q90N838K320l960k952K104L450r39k023K048M255k077q296m465O423
1894c739R254O49p686m249M200N646r48n282k063K340Q45k163Q27N500L791m041
1910B881q051k596O372N634k303n679j962M460M530K85k537k218j202j766o63
1925d815K661M018J386k925k844k59K386K009j198l342l233R00M424N069P6l844
1941D69m488J4K748N33j486k95J508Q95j286l98L549K955l943p411k823O396P557
1958D494o93o080k111M759L510l815m464J356L486j061m654Q18P165N456n006
$$ y = [667, -2625, -3310, -1286, 912, 1393, -442, -1930, -2525, -111, 3268, 4253, 375, -5000, -6351, -2392, 2008, 2519, -110, -1228, -43, 123, -1093, -1112, 607, 519, -3694, -7033, -3098, 5026, 7437, 1502, -6355, -5465, 373, 2693, -1267, -4219, -2115, 1335, 396, -1627, 421, 4676, 2599, -5697, -10162, -3739, 5515, 6164, -1522, -5771, -1571, 4075, 3127, -2155, -4218, -1878, -1033, -3196, -2369, 3131, 6922, 2881, -5170, -7766, -1394, 4240, 1937, -3742, -5704, -1244, 3286, 3571, 1034, -1184, -2386, -4152, -4815, -2154, 1864, 3250, 325, -2519, -2778, -392, 1617, 419, -2923, -6156, -5256, -832, 4237, 4313, 469, -4019, -4005, -1257, -724, -2210, -2505, -997, -102, -1388, -1786, 1763, 4718, 775, -6636, -9459, -3063, 4494, 3801, -2279, -4390, 369, 3879, 64, -4400, -3044, 442, -619, -5273, -4455, 2710, 8166, 3160]
1973C160r521j095O923M505m011n615J656O604J290l588k829K497J922m367m514
1988f983K608P402K691m859n167J841M898L66m590k921J408L351N90l55J044R25
2004B249j130l164j694J634K417j57j713j76J418J742Q65j233k412k667J92K441
2020a388K644k42k068j80K106J037k218k431M56J455l59j766J412M101J382m008
2036f7m440J181M910J256n465l416L648N901J41m237k416L225J467m108l056L359
2052b117N485o87n457j714N216N099l288p052j976N458M235j946l681K004L257
2067B836j051m356m83M355K327m357m818K029P262K491l939n191N38K987P08j634
2083b96k87J813M96j875j198L401K782j711m922k479K815M085J337j332j834m98
$$ y = [3160, -6361, -7456, -533, 3972, -39, -5654, -3998, 2606, 3896, 308, -2521, -24, 1898, -2469, -6983, -4375, 3027, 5718, 859, -4308, -2467, 2431, 2797, -1793, -4714, -3306, 45, 635, 280, 1324, 2249, 1119, -2045, -3739, -2105, 312, 155, -1558, -1734, -316, 1426, 2291, 1058, -1354, -4021, -3829, -1388, 1256, 1014, -1054, -1234, 872, 1909, -309, -2740, -2284, -829, -1188, -2954, -1542, 2559, 3941, -67, -4507, -3326, 1584, 2840, -2625, -6041, -2393, 3508, 3649, -588, -3004, 221, 1688, -2420, -5476, -2117, 3368, 2681, -2776, -4490, 726, 5825, 2537, -4515, -6491, -1033, 3202, 1256, -2425, -421, 2836, 1785, -2571, -3054, 1301, 3628, -729, -5547, -3518, 3744, 6235, 2296, -2895, -2357, 630, 1338, -296, -583, 1230, 1726, -149, -1347, 2054, 4836, 3125, -1797, -4276, -1461, 2624, 3961, 2629, 795, 297]
2099B97k76J027J646J56j773k927J02K942K847K63j583j439j105j226J068L341
2115C360J734k860m542N71N372M084k300n934k175L275K384j098m09K496Q58l306
2131A510l282K076O371J098p419o455L531Q774K617n166n022J855L548j010l378
2146c52R51M203l48n601k215N668P122j793r030m662M745O336L56m552j469K567
2162A926J836k207j352K503J477l399m809O44O248M329k087n251k458K148K742
2177B290m2j858j100R5M41J094K319M99j578l113j905P09J550K322N96j347k257
2194a285n64K344L228p67n596l485K202N507J785k177k143Q82Q54k338k232K028
2210a757L640j299m772j218O406N726k538q225l681M657M667j421l910R49L913
$$ y = [297, 21, 1048, 2694, 2850, 1077, -1850, -1748, 1194, 4041, 4304, 2721, 1282, 177, -1049, 19, 3360, 5094, 2234, -2308, -1737, 3635, 7719, 5419, -515, -2690, 585, 2969, 1871, 1462, 3958, 4816, 1510, -1772, 304, 6675, 7773, 354, -6101, -2570, 6204, 8821, 3655, -1367, 488, 4036, 3026, -352, 599, 4802, 4454, -1147, -3362, 2306, 9428, 7635, -1395, -6057, -1312, 5024, 5380, 828, -641, 1926, 3762, 1555, 203, 2706, 4183, 784, -4025, -3381, 2867, 7196, 5109, -142, -2600, -452, 2290, 2248, 390, -710, -615, -174, 920, 3239, 3738, 2160, -953, -2858, -2149, -599, 1723, 2319, 972, -1285, -1849, 495, 3723, 2956, -2640, -6125, -3923, 1584, 3369, 1192, -951, -69, 785, -1553, -3785, -1757, 1883, 584, -4188, -5406, 1000, 6726, 4188, -4037, -7718, -3061, 1606, 185, -3725, -2776, 1137]
2225A137M83l749j246L535K158m150o151J118Q328M573l864o682k33M568J641
2240A466l406k792K036K236o06j011J858L543o92n627l882K260M965K085k943
2255e10k384J198K542P29j165j424j521r57n7K105L363J218k110k305p88O08O75
2272g83N47k08j443j386J733L536K539k224m959j861K116K401O2j257N84J433
2288H30m9k011M22K455m4m187m134K572P010K578l585m909K49L548n2l152p02
2305c161K236J267k213j434L449M652k263o612l684M103N492J33m351j541L147
2320g80K450k061k107O98J380j586l897J087N527L412k894n767r70L671K494j556
2336h99l112J01K035R88K9N66O89j012l230j381J587L237R42j858j773M44J733
$$ y = [1137, 1620, -2129, -3375, 160, 2318, -1832, -7983, -6865, 1463, 6036, 2172, -4510, -4743, -175, 1466, -1940, -4732, -2696, -460, -1066, -2077, -219, 3324, 2632, -2995, -6877, -4617, 348, 2433, -510, -2894, -1696, 846, 1575, 410, -1014, -2535, -3492, -3549, -1444, 1919, 3137, 1027, -1278, -2066, -1458, -783, -236, -444, -1887, -3273, -1540, 1996, 4535, 2311, -2648, -4509, -2393, 8, 70, -1187, -603, 830, 781, -1230, -808, 1647, 1603, -2584, -6718, -4146, 2864, 5442, 1857, -3052, -2803, 745, 693, -2459, -3161, -925, 342, -1871, -3305, 144, 4796, 2533, -4079, -7763, -3660, 1832, 1965, -2386, -3927, -780, 1670, -391, -2498, -1800, -420, -2006, -5903, -4816, 711, 4123, 1229, -4538, -5508, -1837, 657, -899, -4011, -3910, -1875, -887, -858, -292, 397, -615, -3845, -5226, -3639, -402, 540, -1318, -3091, -2647, -914]
2353i14Q24k8j858j835p29K192K294N93p69j264j80J034o37n35K83J169q62j350
2371b572O73L371K051k422m409p56M024K720k211k728R55L561R25l323j156K162
2387H65J890k409l746J972M985J897m128l776J946M543N92m513k896K801L907
2402C930n66l423N95L413L81l522k883K214M314j60m116j880L506L868p88l597
2418A286j681J781J156n16q38R02J347o23j533Q1J559R36j124k454r28J906K133
2435C390J170j273k240q83J319J929lj922k049R51J784P14n33j80R40j060k492
2452d38j211L041L321j363m474j417M082M236r06m997k261K047K394q11j380J544
2468A407K283j411l688o78M302L173l722n825RN686M022j583m102j288K089M96
$$ y = [-914, -90, -118, -1976, -3811, -4540, -2348, -54, 539, -230, -1494, -1674, -640, -1277, -1812, -1529, -360, -1222, -2572, -1899, 1472, 3523, 1101, -3308, -4064, -40, 2680, 469, -2259, -1304, 2257, 3182, -141, -1297, 865, 2755, 346, -3400, -1428, 3557, 5454, 1326, -2450, -504, 4039, 4631, 118, -2778, 23, 3930, 3364, -59, 536, 3949, 4330, 808, -2075, 139, 4453, 4293, 177, -1703, 1803, 5671, 4883, 1286, -395, 1386, 2542, 2026, 1188, 2090, 3437, 2814, 1281, 1362, 2921, 3857, 2733, 279, -649, 1257, 3390, 4560, 3287, 1047, 164, 1483, 3412, 3409, 1487, -562, 389, 2173, 2887, 2354, 2174, 3114, 2054, -438, -1649, 1392, 4713, 3350, -1124, -2541, 1541, 5777, 4871, -126, -2387, -340, 2054, 1243, -137, 1407, 3690, 2279, -1409, -2087, 2215, 5388, 1666, -4159, -4150, 1536, 5558, 3975, -127, -1415, 674, 1170]
2484A170j885k68K243J030k421k332K049M264J326m528m965N41L753K667m88j712
2500D44l26K94k69O8O29K71j389k498K02K600L506J23k474k631j367J348J545
2517G6J377r07j939o23J763K389K86k060k155j202L72Q08J894K191L65k876k996
2534c237R35K960J531l524l497O56M357K502j086j863n27r2j619j707J787L809
2550A385L28l632k458L157M717o26m939l973J719L754N89j168N01J707p89l026
2566b754r99K468K381k126m189K37M305M586k084m043j393R67J188n75o51J346
2582a336J115p05j817J118K552l58l102k704N86L694J901m19j528o53k84M52M29
2599a059m75m38j154J71J740J330P09r39j046j039j408M45J918J490q27k314j13
$$ y = [1170, -715, -983, 1260, 2290, -131, -2463, -414, 3850, 5176, 648, -4317, -3776, -23, 2644, 2156, 444, 118, 412, 143, 211, 840, 1111, -278, -2776, -2574, 26, 3532, 3655, 1181, -1450, -2817, -1469, 76, 1453, 546, -1393, -2016, -253, 2136, 2422, 362, -1793, -2995, -2623, -1815, 79, 2270, 2635, -241, -3237, -2302, 658, 2189, -1335, -4832, -4176, 181, 2683, 1597, -266, -793, -885, -2504, -4211, -2424, 1385, 1713, -1919, -4377, -1220, 3497, 2871, -2068, -6041, -4322, -568, 21, -1147, -646, 1061, 272, -2754, -3753, -1285, 1096, -1030, -5219, -4982, -677, 3909, 1825, -2218, -3611, -2644, -1456, -2031, -2682, -1336, -221, -926, -2743, -1625, 927, 569, -2533, -5237, -4651, -957, 944, 525, -1003, -1656, -1940, -1488, -1059, -1534, -1972, -3126, -2955, -1215, 115, 824, -115, -1161, -2200, -3608, -3163, -1245, 245, -582, -2896, -3009]
2616c009L082K356j607l951j372J828K163m21r25J551J754j546k938j46L257J942
2632B018l193m314J523N488K914l592m025N31K950K7k809J32K709J658k509k576
2648c068K030M344m2n508l372K769N403O82l299j928J545J733p10j515L66J481
2664I11m06k319k15L269K793j000l691k147J892K186P69j487r23J63L63J216P95
2681B169l21j670j046l45J020J404L57N32n97j537q24J128K586m7k824k587J445
2698a157L603J865k647k187J14J908n6j908K73K220Q11l093j779K726M027l61
2714D359n058k784L004M176l33l582q28K831J110j956j995J937K484j343l884
2729a862n01M396L068j956m449o21L470J917k127k273Q90J964l74j792M51K319
$$ y = [-3009, 73, 2429, 822, -3129, -4501, -2673, -510, -931, -1856, -305, 1449, -97, -3035, -3181, 76, 2018, -1175, -5489, -3966, 1522, 4436, 844, -3181, -2650, 300, 327, -2482, -2350, 359, 2017, -492, -3068, -1038, 3306, 3264, -2244, -5616, -2847, 2556, 3238, -61, -1989, -444, 1289, 579, -936, -570, 911, 505, -1814, -2029, 1240, 4033, 3033, -658, -2805, -913, 1273, 2042, 555, -368, -205, 158, 1374, 2169, 1848, 178, -868, -1213, -193, 1211, 1568, 2100, 1503, -34, -858, 270, 2856, 2809, -15, -2602, -1157, 2446, 4311, 1664, -523, -409, 1499, 1443, -465, -192, 2028, 2839, -254, -2033, 693, 4720, 4359, -699, -3483, -479, 3697, 3364, -218, -1046, 1785, 2895, 939, -1056, 881, 3365, 2022, -1862, -2363, 2033, 5101, 3145, -1304, -1925, 1545, 3462, 1335, -938, -48, 1916, 1542, -250, 201, 2520]
2745B520P02k522k488J098L041O71k064j865J221K021K12j028m00p5n08p09R42
2762G69J226K14n75j305N01R60M7p76k52j25n13M3J416J402j92k489j142J638
2780H47J834q30k288l94J806J672j168p48R51N15j564k797O54L905J405k954k799
2797a953J219L735M90l385k693J455K342l86j730R62K864k98l764k209K635L561
2813B845j186m300j262L524L888j245l253r36J434J57j848p56K649K711k066l119
2829b763R7L835J141k891l667k93L072J864l67p72M19k34j570n87Q63J385m90
2846i58k207k10J865K204N01j645k324j074K56J162K269O59j665j542J94K213
2862c02L52j188j695j00L16J94Q05J713J465j840l470j139K982L228j257l662
$$ y = [2520, 3222, 700, -1788, -690, 2351, 3022, 958, -907, 314, 2335, 2547, 1519, 1119, 1044, 536, -173, 769, 1995, 2209, 1634, 329, 830, 1790, 1837, 1061, 809, 684, 171, 214, 1630, 3032, 2840, 351, -791, 847, 2681, 1851, -437, -831, 975, 2647, 1479, 731, 1682, 2197, 633, -2164, -1510, 2395, 3800, 846, -1953, -734, 3001, 3491, 106, -2587, -1132, 1210, 824, -906, 56, 2920, 2622, -1142, -3351, -716, 2845, 1659, -2641, -3903, -379, 3509, 2264, -989, -1925, -491, -334, -2182, -2938, -289, 2422, 356, -2763, -2666, 1169, 2310, -581, -4248, -4541, -1469, 395, 28, -744, -325, -559, -2129, -2716, -1853, -468, -958, -3165, -3375, -1510, 694, 1195, -450, -2774, -3848, -3592, -2430, -161, 498, -1167, -2709, -2515, -302, 50, -1138, -2833, -2933, -2617, -2423, -1618, 95, 1560, -280, -3750, -4889, -1907, 1321, 64, -3598]
2878c598r36L162L446j137k579l47J253r56k232N80M071K494l204m211N36M689
2894A031K380l796m544P17L844J879j595q87J610N97k679k392J544L811M21l486
2910a545k351K553M013N79l132k638L84J553J02m81J167P66l44j642k07J427J043
2927A247j192k232n71J571K117J173r48j115j265n44J369O45K15j401m32J322
2943d1R68Q8l45l31n83o42j358J532K301J354k176k974O48L037J117k558k569
2960b532J030K638L79j159j0J717J84k940k057J962L212M76l561j912K791L528
2976C746k02l403j776J894J241p33j275J514K083r56k535q17L167J994k167l156
2992a381k92L356K048j231k221j17J434j04q09J17J334j5j344q94J458J925m2
$$ y = [-3598, -4534, -1372, 2074, 937, -1642, -1989, -736, -1692, -3924, -3344, 727, 3221, 17, -4194, -3658, 1031, 3411, -385, -4929, -4212, -368, 1511, -84, -971, 639, 1236, -1443, -3835, -2291, 1520, 1941, -1545, -3896, -1343, 2670, 3249, 117, -2521, -2137, -584, -482, -963, 204, 970, 626, -1016, -1223, 204, 1247, 55, -2177, -2748, -1177, 940, 2113, 1165, 50, -1215, -1759, -390, 255, 470, -931, -1363, -41, 927, 1015, 670, 339, -244, -886, -2244, -712, 1589, 2943, 767, -2207, -1559, 1478, 2595, 37, -2532, -1502, 1136, 1515, 356, 346, 2063, 2247, -693, -2750, -788, 2424, 2900, -661, -2573, 218, 3746, 3544, 141, -1635, 259, 1500, 767, -508, 1006, 3089, 2133, -402, -1219, 1948, 3942, 1775, -1381, -1673, 1683, 3731, 2500, 279, 162, 1596, 1492, 683, 800, 2134, 2119, 775, -119, 1339, 3264, 3222]
3009C222k023j620O23J498M19j62k54l38q32Q62Q88J65o44j315m27Q50R15M15
3027B242P4k80p42j066K90J308J109j006k206n41K235K206q54k026p97R21O72
3044A539n98n98J497O44j722j529R72K972O26k762k681L49L094R93j995j617J259
3061D43J829j191j867J069K104m76l009j318K370L361j54l526j759J835K111m23
3077A399j895l57J197L89j393oJ961P72j354k644n71K495J818n36j989p27J207
3094b34J003r2o51n19m92k49L07P60J204l79m15r92k30K55P73k9n19j036l4J935
3114C66J596m15k474j311J060J310P2r07m15J330N96r77r15R70J478j621k299
3131b556l78K892K476j068l213k32K227J187j776j887Q03K077J81j800j46K342
$$ y = [3222, 1199, -421, 202, 1700, 2119, 1957, 1703, 1365, 533, 1395, 2283, 2448, 1804, 489, 62, 912, 1827, 2242, 2316, 2036, 1294, 228, 518, 1826, 2935, 1929, -277, -818, 1417, 3623, 2769, 743, -54, 867, 1539, 941, 343, 1840, 2484, 762, -767, 205, 3177, 3803, 1041, -1640, -1291, 1803, 2796, 801, -816, 443, 2272, 1081, -786, 283, 2387, 1911, -1098, -2416, -46, 3315, 3161, -365, -2124, -289, 1822, 1399, -496, -853, 344, 733, -660, -666, 1295, 2067, 713, -1931, -2502, -7, 1811, 1275, -714, -1441, -234, 769, 677, 26, -493, -985, -1234, -927, -167, 1037, 658, 243, -749, -979, -724, 49, 20, -499, -1535, -1569, 366, 1962, 1547, -927, -2238, -1178, 132, 204, -703, -1118, 212, 808, -169, -1084, -114, 1364, -257, -2556, -2934, -42, 2434, 1366, -1847, -2079, 148, 1335, -441, -2328, -1525, 552, 733, -1067, -1213, 1129]
3147A129J065k526k680N60L089J230k063j649P42K524K62j715j748P30Q30m94
3163g14m21O92J636L77k064j230P71J547j06j479j284Q83J758O13j43j119o11
3180h94n18J15M99M07L0l3j44L75LK72N49p25j829j075R18K412J442j600j730
3199a526j23J558L96r26j419N79R48k19m38J063J628o43k661k081J586K835J042
3216A599k903j665J358K779l30j800q97Q43k02j046L40K186K251j712k970j047
3232c216K671J987j134k592m35J681J623J21j094O21k45j319j560J280K175J027
3248A591j960j577P29K001O70j218j046r78N51M27J105R02j4j075q92l1R03R57
3266A045l30q72l66M2R63J108P36j206k007p42J353J507N39j296r10O18Q33o6
$$ y = [1129, 2194, -332, -3012, -2452, 637, 1867, -196, -1845, -1103, 1421, 1683, -32, -1780, -1050, -220, -714, -1135, -443, 1193, 1570, -494, -1724, -953, 594, 488, -991, -2275, -1392, 366, 979, 836, -283, -894, -1412, -1297, -798, -391, -361, -394, -538, -163, -160, 112, 661, -64, -1893, -2968, -2050, 362, 1804, 204, -1526, -1649, -91, 305, -621, -2040, -1461, -513, -732, -1170, -107, 1521, 878, -1783, -3864, -2278, 557, 1599, -1304, -2969, -1611, 1168, 838, -962, -1859, -1016, -1218, -2264, -1924, 262, 2513, 801, -2169, -3216, -545, 1442, 308, -2284, -2719, -1038, 585, 706, -388, 233, -12, -1331, -2891, -1611, 564, 1591, -369, -1946, -1217, 784, 1454, 236, -810, -1788, -1237, -810, 295, 1197, 1183, 108, -784, -815, 88, 1045, 715, -157, -523, -481, 482, 1590, 2326, 1120, -887, -1629, -276, 1231, 1770, 474, -436, 182, 1015, 949]
3284I49l83K62j19o95j323N90K473J606j781k757j94K288J214j245j413N4J376
3301I02K16r10K11J849j19k401j976J310L465O42l027j979J414K441P4k136p16
3318g40J224O24j485m00J223K389j326k550n97J969J793o50k145r62J726J477
3334A570n69j203j18M11j12n98M20J026J46j172o71M60Q72Q16o72j036k73K59
3352d44N32P64K74j203p39J42J612lm89r58O6P78j08o88N86R66R1j877q72J751
3372A81K058r26k317j063K167K080p86j728o77K031N51j575j164J527J804j089
3388A074k535j19K942J751j925l065J19K517J311j130j631R88J377o25j676J10
3404e17K107L93k188j698J362L132O25k643j658L69J473L86p93m06N34j41l86
$$ y = [949, 566, 828, 709, 14, -1309, -719, 1754, 3360, 1579, -1178, -1372, 916, 2130, 885, -528, -474, 902, 1118, 208, 419, 2268, 2149, -252, -2228, -918, 2547, 3189, 162, -1817, -403, 2038, 2112, -24, -740, 484, 1108, -377, -777, 446, 2835, 1509, -1041, -1638, 331, 2124, 1474, -671, -1633, 93, 1570, 1001, -202, -320, 91, -21, -619, -199, 827, 973, -199, -870, -410, 462, 1278, 606, -430, -703, -444, 88, 852, 1126, -77, -816, -674, 938, 935, 446, -512, -446, 332, 224, -464, 122, 1088, 1179, -698, -1570, 181, 2239, 1313, -1004, -2067, 100, 2180, 1394, -334, -1011, 1020, 1571, -4, -1168, 359, 2163, 1074, -1461, -1580, 1362, 3113, 1188, -1877, -1758, 759, 2070, 940, -691, 297, 1674, 1049, -627, -517, 1590, 1983, -205, -1903, -541, 2591, 3216, 573, -1085, -716, 757, 1143, 350, -56, 478, 337, -49]
3421d9N31P79K25n82j938m92J452J326R0n69o74k19o0N01P65o07j332q17J244
3440d26J628K13p26r86K01j91j79j98O03R92r79j376M50K054J185j935l040M44
3458b266K080R74j166r28J316J152j242j524K58K002N1k583j000K114K771r9k331
3475d21j838J302R76m02j265K83J619J83j272o61J788J328j526k493m82K403J608
3492A130n74j585J2J313J44j521m10J046K07p04o19J235J404J01j822j209P06
3509a146Q48J0m32J2J39M68L1L31M79p68j190p32J011J059J35j55l63J01k46l65
3529g73K49M88n20r40k01J561J566l35j862j098R99R34m33r11K25J157K98j400
3547i96j48K019K01j733k326O44L143R66j976j569P84J707J91j987n69J367P63
$$ y = [-49, 482, 1261, 1486, 904, -1034, -1526, -74, 1252, 1342, 773, 99, -120, -180, 321, 1086, 479, -853, -1670, -426, 1202, 1415, 689, -297, -96, -287, -466, -664, -61, 931, -48, -1424, -974, 1080, 2265, 330, -2710, -2266, -186, 788, -378, -1306, 10, 1162, -80, -1604, -1346, 656, 707, -1876, -2876, -762, 2009, 1910, -421, -2259, -957, 19, -383, -1648, -1365, 254, 437, -835, -1496, 292, 1620, 94, -2399, -2881, -478, 1130, 556, -1029, -1017, 296, 440, -1081, -1491, -445, -238, -942, -1561, -326, 1078, 1179, -643, -1852, -1146, -298, -288, -720, -708, -569, -101, -70, 261, 740, -28, -1218, -1950, -939, 120, 255, 100, -263, -162, -408, -773, -524, -36, -556, -1496, -1697, -136, 1430, 1095, -767, -1865, -866, 68, -365, -1276, -1051, 106, 404, -996, -1144, 875, 1076, -657, -2983, -2339, 804, 1770, -206, -1775, -991, 716, 907, -1080, -1649, -282, 481]
3564D81j725p58J554K334m76k723j683J909K247j63k100o62J327J431m99j221
3580g27J77J125r65j262j64J998J469j104k034J37J110J011l98j323K7O0N86K95
3598A8O47K47p05j104k08N45Q48N06q34J91m80p2N35J036r3j447j243J86K258
3617H31R00j025j606M59J154j67n26L39L53K51j533p34K041K061n63l030j060
3634a855J648K504k78k161l53J132O78q14o78J174J348j393k146Q6K448J793j260
3651A873k556m42K414R84p28j444M57M73k97j001R21J437n7j422j328N94K252
3668B130L95j494j625J01J208P52j07j37m08m10k27J36J115k94l38o25j36P67
3686H03K56R7r0o40q79R2R22R86j53j247r28R52J077m7j412P2L19K81m06j85R03
$$ y = [481, -1244, -2002, -448, 1886, 1410, -1313, -2996, -1087, 1160, 997, -1103, -1765, -438, 993, 494, -727, -550, 575, -390, -1652, -1816, 182, 1651, 547, -1487, -1350, -240, 771, 373, -950, -923, -863, -277, 18, 665, 912, 207, -897, -1105, -560, 288, 794, -40, 151, -329, -401, 134, 1170, 1077, -370, -1613, -1427, 831, 1731, 706, -900, -441, 713, 546, 20, 359, 712, 963, -570, -1304, 737, 2798, 2235, -795, -1855, -207, 2297, 2019, -142, -495, 637, 1315, 501, -177, 997, 2345, 952, -1194, -1108, 1340, 3133, 1873, -683, -1125, 1289, 2273, 1545, 101, 558, 1031, 734, -267, 654, 2091, 2034, 612, -716, -122, 2130, 2525, 1031, -594, -493, 715, 1467, 1360, 1223, 815, 405, 178, 314, 1429, 1135, 797, 172, 36, 803, 1059, 1156, 1066, 426, -453, -361, 561, 1547, 1394, 147, -781, 171, 1248, 1201, -211, -139, 180, 461, 55, -130, 773]
3707G73N71o27j991L24J549J075j237j737L43J850N68j493p03O65R59j085j080
3724a276O64J574L62j986j084J406J412k42j542j088J289J435o96p82J70R49k02
3741C63j217n63J510O78q05j421L84J628J009r90j562k66J011K60n07K52K85l0
3759A9n47J64N92J40k83j185j85R04N26P06j16r69n97l8O92M39J5r50m62P83Q59
3780E07N46n86p22k61K22q15L16O73J215q66j209J13J183P89q80j977k4J346P65
3799C35K37j108O53Q6m23j372M10J884M94j899j205O35K138P60k063j595M71J122
3817d40K75q51j82J653K3j244q64P80J472l97j972r85J215K317j15j142o33Q2
3835a008M55j71n67N42K11m43l75J38J057M90p08j077p68O30Q14Q17j0m52p78
$$ y = [773, 1344, 717, -1274, -950, 599, 1674, 437, -1300, -957, 893, 1461, -32, -735, -70, 889, -196, -1276, -612, 962, 1324, -662, -1746, -340, 1072, 830, -712, -1800, -511, 924, 228, -554, -384, 565, 363, -854, -1417, 93, 771, -34, -1455, -1071, 557, 1566, 576, -986, -1252, -241, 19, -488, -236, 49, 19, -528, -364, 228, 368, 85, -1100, -1285, -381, 145, 851, 735, -234, -831, -869, -177, 262, 277, -673, -1135, -352, 507, 1053, 467, -255, -516, -294, -1109, -793, -120, 1095, 229, -980, -867, 316, 1105, 225, -1752, -1776, -430, 335, 572, -536, 117, 203, -220, -1592, -1182, 702, 1196, -703, -1908, -1273, 865, 1625, -438, -2033, -1562, -440, -165, -1016, -1198, 455, 478, -766, -1630, -850, 622, 225, -1747, -2732, -1517, 800, 685, -457, -1090, -1008, -553, -724, -1291, -749, -538, -981, -1356, -1218, -161, 329, -379, -1456, -2224, -1594, -780, 37, 27, -425, -1203]
3854a203J75P69K60m34j050j81P89K90K72K6J80J56r26j045P88J483J22j560q86
3873a975J342J592J1j527r69N32O45m3l80L79J269j85j288p68J256J525p33j976
3891a293l74J936J517j206r21l83J098K27r10k49P47Q07n51r78K54J365M64j104
3909D46j302J11J647K65m39n41J13L79L07n26K47M9k56l88n7J030Q3M27q85n69
3929A41p9K40M98N23o39m58k67J009L71P0j003o64Q07K64N7m41K48J10k53o19
3949h5k26J749L18p13k144Q04J079J046o66j320J23O28K04l54r6P87L3j205o06
3968f44M49K195J89k306j128R76J708J48j222n31J72N08n43pR77Q89r79j599l99
3987a147J991P73l87j668j97R51P28l32m89R2K59p66q4M21J264%j172j187P43
$$ y = [-1203, -1028, -259, 1, -433, -1483, -1664, -875, -585, -313, -287, -107, 49, -877, -1922, -1134, 349, 471, -1089, -1975, -633, 959, 970, -557, -1526, -994, -349, -392, -772, -393, 876, 691, -597, -1365, -109, 1416, 683, -1293, -1667, 269, 1786, 580, -341, -724, 374, 601, -309, -558, 189, 996, 445, -533, -279, 1086, 1550, 446, -856, -745, 902, 1167, 728, 187, 300, 679, 986, 460, 707, 756, 500, 112, 55, 1085, 1168, 1595, 710, 141, 62, 302, 800, 1323, 684, 226, -41, 968, 1339, 1409, 406, -258, 549, 813, 870, 429, 677, 787, 534, -85, -311, 1438, 1756, 1043, -1101, -297, 782, 1828, 1162, -158, -35, 593, 797, 443, 347, 1134, 1167, -38, -644, -195, 2000, 2189, -117, -1245, -269, 1439, 1587, 365, -166, 6, 514, -29, -36, 941, 1830, 851, -748, -1147, 844, 1617, 1230, -438, -635, 316, 1044, 712, 223, 315, 574, -192, -276, 145, 1409, 1409, 237, -950, -207]
4006b07J175Q9o39o03m35N58M16K14O42m94q54m49O40O57R1o72l38M04l21K81
4026A55M85J79m70r83m57P61J703l50j304n16L01J034j20p60K08K81L6j014m0
4045h71J457J296j561j830j34J812J126j106j442K79J353L77j158r52J184N35
4061C65p07j343N21J803Q43j947j334P83J449L32j491o17M19R69q9p69L15P39
4079B41l55j178l30J047Q73j20j140m49J197O67q69k44n05M46K0J75J02O11m86
4098b97k82l34K90J79m28R0J31K61m92M64N94J43r63q44J13J504J14n81q89M05
4118h22J259J64j165n85O77N66o65j069R77J266K28j474j182J265J339l19j664
4135a204o91J899Q83l28j468N95Q67m37j068l79J203J432p82j634j27J708J008
$$ y = [-207, 968, 1057, 418, -185, -620, -62, 354, 568, 1210, 716, -138, -587, 53, 710, 801, 129, -209, 195, -126, 155, 640, 819, 349, -634, -1091, -330, 1373, 1023, -281, -797, -496, 538, 418, -342, -134, 147, 183, -831, -871, 586, 1882, 321, -1509, -1643, 169, 1295, 189, -1253, -974, 379, 756, -402, -1354, -170, 365, -342, -1685, -1164, 639, 1482, -465, -1799, -1016, 433, 765, -726, -1343, -924, 45, -44, -813, -498, 241, -114, -1292, -1622, -575, 298, 178, -962, -1411, -214, 453, -416, -660, -1165, -719, -699, -524, -422, 189, -297, -579, -913, -623, -444, -872, -782, -651, -390, -882, -418, 176, 319, -644, -1488, -1375, 129, 243, -338, -1227, -822, 437, 601, -564, -1149, -472, 94, -571, -1640, -663, 603, 831, -643, -1825, -560, 779, 460, -1204, -1895, 4, 887, 559, -909, -314, 553, 116, -952, -1331, -128, 1304, 522, -1112, -1239, 469, 1477]
4152A477r82j490M6O11O22m01o6P24K17j087q11P79Q88J71j266l91K92J677j69
4171H41l71l68l44q2R8L93M44j02n81m99K98R79Kn62p33K80J14J09N78O37j39
4192I92j225m84K62J165J04j165n38M10J219j76l48k02N84n32q25k1J339J215
4210A774j512j306L70J672N00j010j274L37O42J28p36O05O63K00j344o50Q23J265
4228A147N92k133q50J170J639l30j223m16Q75L39j014j17O10J070m43j422k96
4245h02J604P59q67j183R5R57L32j42o64M39K88n85m37N37O59L6r57j72N14N86
4265I97J31l58l74o0P2j48L38L12j00p62J0O69N49l46p90l7P14l90l39M06M79
4286I73l22m10m72P97J219m12j880l22J289J096n02j330j5J084K28p53p96J106
$$ y = [1477, 495, -995, -949, -338, 284, -117, -183, 541, 758, -329, -1140, -361, 527, 698, -568, -959, -667, 1010, 841, 470, 102, -242, -324, -226, 167, 611, 509, -72, -571, -273, 706, 708, 146, -587, -307, -193, -84, 494, 1131, 992, -233, -717, -455, 710, 814, -351, -889, -479, 740, 564, 216, 14, 598, 66, -759, -780, 559, 1774, 262, -1044, -674, 998, 1498, 488, -786, -449, 193, 321, -415, 190, 853, 1053, -291, -941, -118, 1147, 1739, -394, -1244, -74, 1565, 1235, 12, -404, 471, 810, -204, -321, 289, 1359, 916, -506, -802, 802, 1561, 694, -489, -394, 563, 895, 753, 89, 528, 816, 231, -206, 331, 990, 1026, 69, -103, 411, 997, 1128, 770, 396, 336, 408, 260, 598, 910, 810, 48, 58, 727, 1276, 930, 140, 103, 817, 427, 88, 494, 973, 651, 241, -231, 566, 1785, 1373, -507, -829, 460, 1556, 1054, -276, -291, 793, 1021, 268, -528, 578]
4304E78Q09j006j189L72J461P33j179j513P7J518O02j297r79O46J140n98n54J7
4322c62J452k40j476q12O63J588J66j397p74N01J289q0q91P7j99J61l48M15N83
4341C16L72p39q77J60pJ003K4o46m02r6N02L11L08j87r08n60N71Q67J90l71m96
4362f65J81K45k30K86M17j16r17r46Q56J350O08j109r21l32J412L30q30l4P0N24
4382A79j90n46N67R52m02j654n72R53J657o2j202q00Q46Q67l35q26J48M69K06
4401B55r56j52J616O88n46j992J20O68J113l18q21R0N43J08k42p7L31k23j021
4420h16J76N83R84k72n33o91M39L01P9m44P4k14n2K7O76M97l64o45m35L87L42
4441I9k63j19K05r1J23l37M05L69l13p97l10N50R37j37n62k40N08Q2l20j10J50
$$ y = [578, 1387, 381, -808, -436, 1025, 1758, 579, -934, -857, 661, 1263, -34, -1013, -367, 773, 175, -379, -362, 1090, 850, -626, -1438, -775, 813, 979, -418, -1192, -691, 598, 518, -373, -296, -495, -334, -682, -267, 316, 688, -51, -928, -768, -775, 228, 252, -394, -796, -892, -390, -79, 229, 42, -866, -1426, -855, 12, 202, -169, -665, -484, -239, -469, -183, 234, 118, -799, -1745, -889, 461, 1069, -40, -961, -1293, 119, 449, -381, -415, -345, 179, -11, -557, 10, 962, 560, -1094, -1666, -713, 944, 882, -320, -1120, -274, 593, 258, -568, -420, 49, 255, -701, -853, 763, 1451, 905, -1087, -967, -299, 814, 496, -325, -235, 308, 416, 174, 97, 428, 205, -816, -640, -57, 927, 655, 122, -569, -130, 171, 250, -194, -120, -334, -386, -359, 317, 814, 450, -195, -630, -243, 99, -164, -283, -78, -169, -46, -383, 22, 391, 78, -719, -1029, -479, 458, 321, -241, -481, 27, 109, -211, -321, -171]
4462a71M33j90j150O16Q16K58o69j045K4J123L99p39o97M41P37j29o95l0R02N5
4482B89j040k48N20J102j4j236n64P86Q99m02p63m32J058k07j0j77N39K90j90
4501B00q05j43P60N29l55q90J32M36M48p3j69m20kJ09J27L41M27n89k80P1K19
4522G3J33J80j39k73m83L1O57P02l13o70p85M11J172j53q10P1K07M20k53k51R4
4543B1P39m31j020J52J059P71o25j218l56J298O14p3j132j10P76K04p13n1N69
4562D74N50r93j038P58J164K04r73j008L90J036J30j70p07J16L82k27n91O10N83
4581F90l70o47n12N89O26O73p86o94Q1N47M53m00j21J02m20q9L60M42l7p63J11
4602a65j2K38K51j8K28n93k56J79M95M77o09n73j09L50O55j97n30M36j56J75o42
$$ y = [-171, 262, 72, -1078, -462, 354, 612, -57, -1102, -1078, 45, 444, -295, -992, -551, 186, 57, -638, -668, 234, 289, -751, -999, -479, 623, 609, -627, -1191, -405, 494, 92, -671, -1103, -45, -252, -262, -439, 100, 390, 200, -605, -748, 12, 541, 186, -704, -572, -136, 312, 239, 70, -350, -352, -243, -116, 225, 652, 63, -217, -146, 73, 206, 386, 247, -26, -509, -478, 179, 881, 568, -102, -887, -476, 696, 543, -267, -196, 11, 431, 178, -73, 21, 760, 329, -691, -539, 520, 1291, 666, -552, -908, 390, 1004, 931, -201, -311, 465, 669, -44, -95, 474, 1024, 31, -1007, -249, 915, 1119, 146, -862, -472, 564, 694, 524, -183, -67, 315, 88, -503, 107, 690, 320, -327, -839, -250, 376, 1049, 263, -431, -350, 197, 650, 250, 129, 231, -189, -278, 82, 524, 487, -276, -165, -177, 61, 312, 294, 522, -71, -327, -148, 347, 824, 215, -358, -467, -117, 538, 341, -189, 247, 91, 266, -376]
4623c76L23P42R7r69n57L67J082M28j091q72N86Q20on57j45R12l14m07o92P27
4643I8O17l42j190j73J352Q59o34r41l81L97P75m63j20J96K25On64R5Q44R4j096
4664c46l25p4J198k96J52k85j85L02l01K20K58k34m37J1K09N50j23j02m72r1l77
4685g48O35J71q3j12k2q1L13K86p5o56l69O2J039j55o31L40L31l04l20K7J66L34
$$ y = [-376, -53, 689, 786, -183, -740, -373, 709, 1137, 46, -826, -240, 580, 574, 17, -128, 784, 470, 63, -629, 98, 715, 373, -817, -990, 362, 1221, 587, -354, -735, -338, 437, -26, -146, 50, 275, 281, -283, -188, 656, 750, -346, -671, -745, 453, 157, 309, 24, -161, 141, -160, 60, 318, 84, -353, -342, -133, 417, 294, 192, -280, -371, -748, -113, 58, -25, -137, -159, -240, 73, 359, 284, -372, -741, -679, 360, 205, -426, -86, 245, -59, -379, -352, -186, 148]
$$ [...]
8191A11
##END NTUPLES=NMR FID
##END=
