##TITLE=1H_LR-695-K1
 CDCl3, 8 sc, 
 23.10.2019
##JCAMPDX= 6.0         $$ Bruker NMR JCAMP-DX V2.0
##DATA TYPE= NMR FID
##DATA CLASS= NTUPLES
##ORIGIN= UXNMR, Bruker Analytische Messtechnik GmbH
##OWNER= root
$$ XWIN-NMR		Version 3.5
$$ Wed Oct 23 15:37:46 2019 Russian Standard Time (UT+4h)  she@DPX200
##.OBSERVE FREQUENCY= 200.1315
##.OBSERVE NUCLEUS= ^1H
##.DELAY= (6, 6)
##.ACQUISITION MODE= SIMULTANEOUS
##.ACQUISITION SCHEME= undefined
##.AVERAGES= 8
##.DIGITISER RES= 18
##SPECTROMETER/DATA SYSTEM= spect
##.PULSE SEQUENCE= zg30
##.SOLVENT NAME= CDCl3
##.SHIFT REFERENCE= (INTERNAL, CDCl3, 0, 15.7039)
##AUDIT TRAIL= $$ (NUMBER, WHEN, WHO, WHERE, WHAT)
$$ ##TITLE= Audit trail, XWIN-NMR		Version 3.5
$$ ##JCAMPDX= 5.01
$$ ##ORIGIN= Bruker BioSpin GmbH
$$ ##OWNER= she
$$ F:/spectra/data/she/nmr/H-F/1/audita.txt
$$ ##AUDIT TRAIL=  $$ (NUMBER, WHEN, WHO, WHERE, WHAT)
(   1,<2019-10-23 15:37:00.85 +0400>,<she>,<DPX200>,
      <created by zg, POWCHK disabled, PULCHK disabled
       configuration hash MD5:
       00 E9 B6 7A A2 85 ED C7 34 08 36 98 17 FE 4E 26
       data hash MD5: 16K
       F6 FC AF 14 A8 2D 52 4C A2 F7 3E F3 B2 D0 15 13>)
$$ ##END=
$$ 
$$ hash MD5
$$ F5 13 40 42 FC 81 1E 50 42 E7 BD F7 17 86 0B 68
##$RELAX= 
##$RELAX= 
##$RELAX= 
##$RELAX= 
##$RELAX= 
##$RELAX= 
$$ Bruker specific parameters
$$ --------------------------
##$DU= <F:/spectra>
##$EXPNO= 1
##$NAME= <H-F>
##$PROCNO= 1
##$TYPE= <nmr>
##$USER= <she>
##$AMP= (0..31)
100 100 100 100 100 100 100 100 100 100 100 100 100 100 100 100 100 100 
100 100 100 100 100 100 100 100 100 100 100 100 100 100 
##$AQSEQ= 0
##$AQ_mod= 1
##$AUNM= <au_zg>
##$AUTOPOS= <>
##$BF1= 200.13
##$BF2= 200.13
##$BF3= 200.13
##$BF4= 200.13
##$BF5= 200.13
##$BF6= 200.13
##$BF7= 200.13
##$BF8= 200.13
##$BYTORDA= 1
##$CFDGTYP= 0
##$CFRGTYP= 5
##$CHEMSTR= <none>
##$CNST= (0..31)
1 1 145 1 1 1 1 1 1 1 1 1 1 1 1 1 1 1 1 1 1 1 1 1 1 1 1 1 1 1 1 1 
##$CPDPRG= <>
##$CPDPRG1= <>
##$CPDPRG2= <>
##$CPDPRG3= <>
##$CPDPRG4= <mlev>
##$CPDPRG5= <mlev>
##$CPDPRG6= <mlev>
##$CPDPRG7= <mlev>
##$CPDPRG8= <mlev>
##$CPDPRGB= <>
##$CPDPRGT= <>
##$D= (0..31)
0 1.2 0 0 0 0 0 0 0 0.06 0 0.03 0 0 0 0 0.0002 0 0 0 0 0 0 0 0 0 0 0 0 
0 0 0 
##$DATE= 1571830620
##$DBL= (0..7)
120 120 120 120 120 120 120 120 
##$DBP= (0..7)
150 150 150 150 150 150 150 150 
##$DBP07= 0
##$DBPNAM0= <>
##$DBPNAM1= <>
##$DBPNAM2= <>
##$DBPNAM3= <>
##$DBPNAM4= <>
##$DBPNAM5= <>
##$DBPNAM6= <>
##$DBPNAM7= <>
##$DBPOAL= (0..7)
0.5 0.5 0.5 0.5 0.5 0.5 0.5 0.5 
##$DBPOFFS= (0..7)
0 0 0 0 0 0 0 0 
##$DE= 6
##$DECBNUC= <off>
##$DECIM= 24
##$DECNUC= <off>
##$DECSTAT= 4
##$DIGMOD= 1
##$DIGTYP= 9
##$DL= (0..7)
0 120 120 120 120 120 120 120 
##$DP= (0..7)
150 150 150 150 150 150 150 150 
##$DP07= 0
##$DPNAME0= <>
##$DPNAME1= <>
##$DPNAME2= <>
##$DPNAME3= <>
##$DPNAME4= <>
##$DPNAME5= <>
##$DPNAME6= <>
##$DPNAME7= <>
##$DPOAL= (0..7)
0.5 0.5 0.5 0.5 0.5 0.5 0.5 0.5 
##$DPOFFS= (0..7)
0 0 0 0 0 0 0 0 
##$DQDMODE= 0
##$DR= 18
##$DS= 0
##$DSLIST= <SSSSSSSSSSSSSSS>
$$ [...]
##$SUBNAM2= <"">
##$SUBNAM3= <"">
##$SUBNAM4= <"">
##$SUBNAM5= <"">
##$SUBNAM6= <"">
##$SUBNAM7= <"">
##$SUBNAM8= <"">
##$SUBNAM9= <"">
##$SW= 24.0689530833862
##$SWIBOX= (0..15)
0 0 2 0 0 0 0 0 0 0 0 0 0 0 0 0 
##$SW_h= 4816.95568400771
##$TD= 16384
##$TD0= 1
##$TE= 0
##$TE2= 300
##$TE3= 300
##$TEG= 300
##$TL= (0..7)
0 120 120 120 120 120 120 120 
##$TP= (0..7)
150 150 150 150 150 150 150 150 
##$TP07= 0
##$TPNAME0= <>
##$TPNAME1= <>
##$TPNAME2= <>
##$TPNAME3= <>
##$TPNAME4= <>
##$TPNAME5= <>
##$TPNAME6= <>
##$TPNAME7= <>
##$TPOAL= (0..7)
0.5 0.5 0.5 0.5 0.5 0.5 0.5 0.5 
##$TPOFFS= (0..7)
0 0 0 0 0 0 0 0 
##$TUNHIN= 0
##$TUNHOUT= 0
##$TUNXOUT= 0
##$USERA1= <user>
##$USERA2= <user>
##$USERA3= <user>
##$USERA4= <user>
##$USERA5= <user>
##$V9= 5
##$VALIST= <valist>
##$VCLIST= <CCCCCCCCCCCCCCC>
##$VD= 0
##$VDLIST= <DDDDDDDDDDDDDDD>
##$VPLIST= <PPPPPPPPPPPPPPP>
##$VTLIST= <TTTTTTTTTTTTTTT>
##$WBST= 1024
##$WBSW= 4
##$XGAIN= (0..3)
0 0 0 0 
##$XL= 0
##$YL= 0
##$YMAX_a= 136756
##$YMIN_a= -121577
##$ZGOPTNS= <>
##$ZL1= 120
##$ZL2= 120
##$ZL3= 120
##$ZL4= 120
##$ABSF1= 10
##$ABSF2= 0
##$ABSG= 5
##$ABSL= 3
##$ALPHA= 0
##$AQORDER= 0
##$ASSFAC= 0
##$ASSFACI= 0
##$ASSFACX= 0
##$ASSWID= 0
##$AUNMP= <proc_1d>
##$AZFE= 0.1
##$AZFW= 0.1
##$BCFW= 1
##$BC_mod= 2
##$BYTORDP= 1
##$COROFFS= 0
##$CY= 11.3945322036743
##$DATMOD= 1
##$DC= 2
##$DFILT= <>
##$DTYPP= 0
##$F1P= 20.1720416913024
##$F2P= 0.152960286110954
##$FCOR= 0.5
##$FTSIZE= 0
##$FT_mod= 4
##$GAMMA= 1
##$GB= 0.15
##$INTBC= 1
##$INTSCL= 1
##$ISEN= 128
##$LB= 0.24
##$LEV0= 0
##$LPBIN= 0
##$MAXI= 10000
##$MC2= 0
##$MEAN= 0
##$ME_mod= 0
##$MI= 1.114404
##$NCOEF= 0
##$NC_proc= 0
##$NLEV= 6
##$NOISF1= 3.799351
##$NOISF2= 2.8
##$NSP= 1
##$NTH_PI= 0
##$NZP= 0
##$OFFSET= 15.70392
##$PC= 1
##$PHC0= -9560.745
##$PHC1= -5.599186
##$PH_mod= 1
##$PKNL= yes
##$PPARMOD= 0
##$PSCAL= 0
##$PSIGN= 0
##$REVERSE= no
##$SF= 200.130013532006
##$SI= 16384
##$SIGF1= 3
##$SIGF2= 2
##$SINO= 400
##$SIOLD= 16384
##$SREGLST= <1H.CDCl3>
##$SSB= 0
##$STSI= 0
##$STSR= 0
##$SW_p= 3612.71676300578
##$SYMM= 0
##$S_DEV= 0
##$TDeff= 0
##$TDoff= 0
##$TI= <>
##$TILT= no
##$TM1= 0
##$TM2= 0
##$TOPLEV= 0
##$USERP1= <user>
##$USERP2= <user>
##$USERP3= <user>
##$USERP4= <user>
##$USERP5= <user>
##$WDW= 1
##$XDIM= 8192
##$YMAX_p= 0
##$YMIN_p= 0
$$ End of Bruker specific parameters
$$ ---------------------------------
##NTUPLES= NMR FID
##VAR_NAME=  TIME,          FID/REAL,        FID/IMAG
##SYMBOL=    X,             R,               I
##VAR_TYPE=  INDEPENDENT,   DEPENDENT,       DEPENDENT
##VAR_FORM=  AFFN,          ASDF,            ASDF
##VAR_DIM=   8192,          8192,            8192
##UNITS=     SECONDS,       ARBITRARY UNITS, ARBITRARY UNITS
##FACTOR=    0.0002076,     1,               1
##FIRST=     0,             0,               0
##LAST=      1.7004516,     0,               0
##MIN=       0,             -121577,         0
##MAX=       1.7004516,     136756,          0
$$ Real data points
##PAGE= N=1
##DATA TABLE= (X++(R..R)), XYDATA
$$ [...]
2460a317J878L029M47k251j639P31J647m01k853j74K227K455p15j721l91J843
$$ -1317 561 3590 4037 1786 147 878 2525 2124 -729 -903 1324 3779 3064 1343 952 2795
2476B795O40k505k414P83K645J509j360j418J048K037k08l238j668J461K294K62
$$ 2795 3435 930 -1484 -701 1944 3453 2093 675 1723 3760 3552 314 -1354 107 2401 2663
2492B663j887l43K240J940j722l245o56K483J276j642j608J287L061M47k224k271
$$ 2663 776 433 2673 4613 2891 -354 -1010 1473 2749 1107 -501 786 3847 4294 2070 -201
2508b01P02J835n23j960q15K339L195r42k558p04J120J567j771k510K21L313J467
$$ -201 501 2336 1813 -147 -962 1377 4572 3630 1072 368 1488 3055 1284 -1226 -1005 2308 3775
2525C775j267j975O57J840j65k845j555J452K513O29j977j036K480J618j797k598
$$ 3775 2508 533 1190 3030 2865 20 -1535 -83 2430 3059 1082 46 2526 4144 2347 -251
2541b51j132K179J790r14j617K94K650O86j807k434m1K337j1j648j111K113K652
$$ -251 -1383 796 2586 1672 55 349 2999 3685 1878 -556 -597 1740 1729 81 -1030 1083 3735
2558C735m24k718j246J494J229j042k464P9L201J667j083k500j93J884O8k136
$$ 3735 3311 593 -653 841 2070 1028 -1436 -1357 1844 3511 2428 -72 -265 1619 1687 -449
2574d49j481Q24K977N30j924j080J435J244r00k389j189J778J994l05j957K13
$$ -449 -1930 -1106 1871 2401 477 -603 832 2076 1176 -1213 -2402 -624 1370 1065 -892 -679
2590f79K118Q47k061k584J51K053Q15j151j661J612K436ok618k136J157K188r79
$$ -679 1439 2286 225 -2359 -2208 -155 660 -491 -2152 -540 1896 1890 -728 -2864 -1707 481 -498
2607d98j711l78K227J830q26k426o38J400J101j798j780P33K893P42j901j587
$$ -498 -2209 -2587 -360 1470 644 -1782 -2420 -1020 81 -1717 -3497 -2764 129 871 -1030 -2617
2623b617J026J675m60k668q31J820J954M7j916k05J207J489j881k237j44K190
$$ -2617 -1591 84 -376 -3044 -3875 -2055 -101 -54 -1970 -2175 -968 521 -1360 -3597 -3741 -1551
2639a551R10p69j304P10K230L19k361j894L65K084K49j753l14J969J795q55k591
$$ -1551 -641 -1410 -2714 -2004 226 545 -1816 -3710 -3345 -1261 -1012 -2765 -3079 -1110 685 -170 -2761
2656b761p13J319J436j291j896Q41K662J458j689k187K52J521K81j897j330J775
$$ -2761 -3474 -2155 -719 -2010 -3906 -3065 -403 1055 -634 -2821 -2569 -1048 -767 -2664 -3994 -2219
2672b219K495K25j821j036J222J557j111k724k94K304K021r60j660M42J813O71
$$ -2219 276 501 -1320 -2356 -1134 423 -688 -3412 -3706 -1402 619 -341 -2001 -1559 254 925
2688I25k011k124N47K104O55j312r04J615J939o59k476j326J620J505n40j735
$$ 925 -1086 -3210 -2663 -559 96 -1216 -2120 -505 1434 775 -1701 -3027 -1407 98 -442 -2177
2704b177K50K268J730j770k615J73J852O78j584j231J298K124J026k239j699J267
$$ -2177 -1927 341 2071 301 -2314 -2141 -289 389 -1195 -2426 -1128 996 2022 -217 -1916 -649
2720f49J672q70k224n37K138K189k62k157j64J442R53k063j750L50K196J485j599
$$ -649 1023 153 -2071 -2608 -470 1719 1457 -700 -864 578 1531 -532 -2282 -1932 264 1749 150
2737A50p66M99K098j61k482j584J210K028J51j575l69J816J759j348k227q63K037
$$ 150 -616 -117 1981 1820 -662 -2246 -1036 992 1143 -432 -801 1015 2774 1426 -801 -1664 373
2754C73R92j174j338R46K424L60j695k079P54J517j96j296j047J903K195J47k421
$$ 373 1365 191 -1147 -201 2223 2583 888 -1191 -437 1080 884 -412 -1459 444 2639 2786 365
2771C65q13J369Q04q37k277M86K565Q80o45j457L24J604K23k261j724J289K351
$$ 365 -448 921 1725 888 -1389 -903 1662 2542 1897 440 764 2368 2591 330 -1394 -105 2246
2788B246M55j573r64J528J392r27k030n92J447J347q45j027L77K094O74j840j943
$$ 2246 2701 1128 164 1692 3084 2157 127 -465 982 2329 1484 457 834 2928 3602 1762 -181
2805a81M15J590K77j248j114J424K126K53j834j449O04J831r84j892K35J823J745
$$ -181 234 1824 2101 853 -261 1163 3289 3542 1708 259 863 2694 1710 -182 53 1876 3621
2822C621j016j912k09J829K45j746j576R44K298P26j319j266R06J225m94k096
$$ 3621 2605 693 484 2313 2558 812 -764 180 2478 3204 1885 619 1525 2750 2256 160
2838A60r97J749J743m03j619l16J847R93j393k211m98J990R52j213j192J302J621
$$ 160 -837 912 2655 2252 633 317 2164 3157 1764 -447 -945 1045 1997 784 -408 894 2515
2855B515J59j948j399P38R40J54j785l87K128J842j365j831n22J297Q87j664j385
$$ 2515 2674 726 -673 65 1005 1159 -626 -1013 1115 2957 1592 -239 -761 536 1423 -241 -1626
2872a626M10K272P92j319j308P98J147m0k073j150J616J759J11k101l50J402J017
$$ -1626 -1216 1056 1848 529 -779 19 1166 1126 -947 -2097 -481 1278 1389 -712 -1062 340 1357
2889A357j193j984l27J645J483j128j318P86J490L15j564j790M81J550L08j193
$$ 1357 164 -1820 -2147 -502 981 -147 -1465 -679 811 1126 -438 -2228 -1747 -197 111 -1082
2905a082q38J117K445r53k231o54Q96J587r52j511J07K438Q71j411j712J85J415
$$ -1082 -1920 -803 1642 689 -1542 -2196 -1300 287 -665 -2176 -2069 369 1240 -171 -1883 -1698 -283
2922b83M14j859j381J465K228Pj391q15R65J130r89k232o6J808J433p51j173K38
$$ -283 131 -1728 -3109 -1644 584 591 -800 -1615 -650 480 -509 -2741 -2807 -999 434 -317 -1490 -1252
2940a252J439J66j437j885M48J813J042j473j065J309J360j48k146r38J022J363
$$ -1252 187 353 -1084 -2969 -2521 -708 334 -1139 -2204 -895 465 317 -1829 -2767 -1745 -382
2956c82j09j415k75K253R70j195j925j7J043O43j239j088N89K585K79j873r76
$$ -382 -491 -1906 -2181 72 1042 -153 -2078 -2095 -1052 -409 -1648 -2736 -2147 438 717 -1156 -2132
2973b132Q38J100p91j208n49J456J450l39j356m61J387J054j244j953j0K280P37
$$ -2132 -1294 -194 -985 -2193 -2742 -1286 164 -175 -1531 -1992 -605 449 -795 -2748 -2758 -478 259
2990B59j034j111Q87J343l25j687j560J198J700k17p52o95J610J396r32j855n10
$$ 259 -775 -1886 -999 344 19 -1668 -3228 -2030 -330 -547 -1299 -1994 -384 1012 80 -1775 -2285
3007b285J319Q82o74j410Q90J642P29j660j281M09J541l92j300m99J413J708j10
$$ -2285 -966 -84 -758 -2168 -1278 364 1093 -567 -1848 -1439 102 -290 -1590 -2089 -676 1032 922
3024I22j468j164J645Q66j033j645j00J823J283m94j360l9J429L28j582j336R68
$$ 922 -546 -1710 -65 801 -232 -1877 -1977 -154 1129 635 -725 -764 665 993 -589 -1925 -957
3041i57J806K30j347l51J380J199q15j523j364J519J647q72j085L77J527P19j050
$$ -957 849 1079 -268 -619 761 1960 1145 -378 -1742 -223 1424 552 -533 -156 1371 2090 1040
3058A040j964N09J278O78j272j069J572J466mj268j176O19J425n44j585q0J654
$$ 1040 -924 -415 863 1541 269 -800 772 2238 2234 966 -210 409 1834 1290 -295 -375 1279
3075A279J221n07j432j87J347K84j183j702J029J899N12j504q67P66J405q6j917
$$ 1279 2500 1993 561 374 1721 2005 822 -880 149 2048 2560 1056 189 955 2360 2274 357
3092C57q61R81J714m25r45l78J443Q01j096j724J5J630N38j168q10J043J476M0
$$ 357 -504 477 2191 1766 821 443 1886 2687 1591 -133 -118 1512 2050 882 72 1115 2591 2631
3110B631j584j273L75J230K97j644l63J596J233n33j658m50J507L95q29j460N36
$$ 2631 1047 -226 149 1379 1676 32 -331 1265 2498 1965 307 -143 1364 1759 930 -530 6
3127FJ558Q98r46j326J89J247J03j596j106J158J475J91j351k92R05P66p96j518
$$ 6 1564 2462 1516 190 379 1626 1729 133 -973 185 1660 1851 500 208 1113 1879 1083 -435
3145d35l23J423J106q51j262M04J713M72j578j293O29J141J82j271o32J224J594
$$ -435 -758 665 1771 920 -342 62 1775 2247 669 -624 5 1146 1328 57 -575 649 2243
3162B243k98k196n33R22R99p76r84j3J946Q63r96j663J16J060M45j518q11J044
$$ 2243 1945 -251 -784 138 1137 361 -623 -636 1310 2173 1177 -486 -370 690 1135 -383 -1194 -150
3180a50J402J69j165o79R68R30q22k043qJ320J059j4j183k91J061Q10j389j715
$$ -150 1252 1421 256 -423 545 1475 653 -1390 -1398 -78 981 967 -216 -507 554 1364 -25 -1740
3198a740Q07J261N35j385m77Q90J042K53j861j201J110J139q7j307l16J229J390
$$ -1740 -933 328 863 -522 -999 -109 933 1186 -675 -1876 -766 373 286 -1021 -1337 -108 1282
3215A282p17j755r0J181K69q93j118N92J942P4j286j021L85J156k04j383p95J620
$$ 1282 565 -1190 -1280 -99 170 -723 -1841 -1249 693 767 -519 -1540 -1155 1 -203 -1586 -2381 -761
3233g61J054l22j293Q3R28N23q80j653N6J625P41j089p90O28J464r3j685q69J49
$$ -761 293 -29 -1322 -1239 -311 212 -668 -2321 -2265 -640 101 -988 -1778 -1150 314 221 -1464 -2333 -2184
3252b184J491L83j623j54J282J186q36j435l87J134O38n90j311M23J752N03j173
$$ -2184 -693 -310 -1933 -2087 -805 381 -455 -1890 -2277 -1143 -505 -1095 -2406 -1983 -231 272 -901
3269i01j146J50R21J46j023o67J085J381K37j691l97P62Q48n64j106k02J465J323
$$ -901 -2047 -1897 -976 -830 -1853 -2520 -1435 -54 183 -1508 -1905 -1143 -295 -859 -1965 -2167 -702 621
3287F21r35j179K94R52N04j337j216P14J082P17j351k73R34Q25m86j543n59J303
$$ 621 -314 -1493 -1199 -247 257 -1080 -2296 -1582 -500 217 -1134 -1407 -473 352 -134 -1677 -2236 -933
3305i33R14k51j416L48J465Q00j083j171k41J331L19p26r79J038J634m18q59r46
$$ -933 -19 -270 -1686 -1338 127 927 -156 -1327 -1568 -237 82 -644 -1623 -585 1049 631 -228 -1174
3323a174N73J234n52j343Q6J207R91k32j304l28J029O06q41j375M71J551K01m12
$$ -1174 -601 633 81 -1262 -1176 31 1022 790 -514 -842 187 793 -48 -1423 -952 599 800 388
3341C88j064P65Q94j19j524p76J044J513l28r72l16J050J247j236j417m0J149
$$ 388 -676 89 983 864 -660 -1436 -392 1121 793 -179 -495 555 1802 566 -851 -891 258
3358B58N92m47j256R20J242J15j050j130M98J156J11j415n06J387J063j45j131
$$ 258 850 403 -853 67 1309 1424 374 -756 -258 898 1009 -406 -912 475 1538 1393 262
3375B62o32O90P55p36q39K54J354Q69p24j302L03R68L34j500n17N97J535p3j242
$$ 262 -370 320 1075 339 -500 -246 1108 1977 1253 -49 254 1222 1556 56 -461 136 1671 1598 356
3394C56j61N32J181q39j199l58R49R11o14r21Q51J282N1j073j410N49J088K55
$$ 356 195 727 1908 1069 -130 -488 461 1372 758 -163 688 1970 2021 948 -462 87 1175 1430
3412A430o40j244J463J079m2j439p63Q69J034m93j326L9J519O33l40j321k19J108
$$ 1430 790 -454 1009 2088 2046 607 -156 713 1747 1254 -72 -33 1486 2119 1779 458 239 1347
3430A347J85q93q75M52J578L46j053j094Q89P63l87j055l00R18J138n33j306N30
$$ 1347 1532 639 -236 216 1794 2140 1087 -7 882 1645 1258 203 -97 821 1959 1426 120 650
3448F50J146L18j173j242J84J328L05o30q87P89Q60N2j359r05Q49P26L4j094J76
$$ 650 1796 2114 941 -301 -117 1211 1516 886 -1 788 1648 1700 341 -564 285 1011 1045 -49 127
3467A27R41R09q18j412o0R14O30r93j027P46R96L87p77o74N9J090k35j193m86
$$ 127 1068 1977 1159 -253 -313 601 1231 238 -789 -43 953 1340 563 -111 -52 1038 803 -390 -876
3486h76N35J468k39j249o5O61M36m33j554K64J340L37k93j061M45Q83j3j214q82
$$ -876 -341 1127 888 -361 -426 235 671 238 -1316 -1052 288 625 332 -729 -284 599 586 -628 -1510
3505a510N63J137K63j471k39J167O47k85j382j29N71P09n72p60K90R07P10p31
$$ -1510 -947 190 453 -1018 -1257 -90 557 272 -1110 -1239 -668 41 -531 -1291 -1001 -94 616 -115
3523a15j225K43J021p9q19p87N74J535K91j599j38J03J147n53j004j90J012O34
$$ -115 -1340 -1097 -76 -155 -974 -1761 -1187 348 639 -960 -1098 -995 152 -401 -1405 -1595 -583 51
3541E1l47p98K17R83k20q96q80Q05P88J47p25n10Q14R74l56j279n82P43R58l02
$$ 51 -296 -1094 -877 106 -114 -1010 -1890 -1085 -297 -150 -875 -1385 -571 403 47 -1232 -1814 -1071 -113 -415
3561d15j275N39R69N85r13r87k10J542K15j062p48P45J095P2q73r31Q18N25r0
$$ -415 -1690 -1151 -182 403 -510 -1497 -1707 -165 50 -1012 -1760 -1015 80 152 -721 -1652 -834 -309 -399
3580c99j003O0J019Q01n33j116r8Q51P47j066j039L07J392K63n10r24N40P99J5
$$ -399 -1402 -1342 -323 478 -55 -1171 -1269 -418 329 -737 -1776 -1469 -77 186 -324 -1248 -708 91 106
3599A06j115j037Q98J096J70q02j88P16L98o32q40k04Q88O68n59r07M46R09M38
$$ 106 -1009 -2046 -1148 -52 118 -684 -872 -156 242 -390 -1230 -1434 -546 122 -437 -1344 -898 11 449
3618D49q77q63L74R81k17o45l73O23J196m87j059j69O26P20n87j049K85J242N88
$$ 449 -428 -1291 -917 64 -153 -798 -1171 -548 648 161 -898 -1067 -441 279 -308 -1357 -1072 170 758
3637G58r63m97j23J198k6j415l05N77J309m9j114L9P74P55o21j392k34J163R37
$$ 758 -205 -702 -825 373 347 -1068 -1373 -796 513 464 -650 -611 163 918 297 -1095 -1329 -166 771
3656G71o06n66J18J232J0n67j242L21R91J03m85p73R84J059l09q23p89Q29O73
$$ 771 165 -401 -283 949 959 392 -850 -529 462 565 80 -693 291 1350 1041 218 -571 258 931
3675I31n40o13K70R38O42n30j293L45O73M50r22r07P28J026J50o28p25N36P89
$$ 931 391 -222 48 986 1628 1098 -195 150 823 1273 351 -556 172 1198 1348 720 -5 531 1320
3694A320k38q66j43L56R13J86j233J09Q46K38m36j160O7J086O95j025n64M61Q25
$$ 1320 1082 216 73 429 1342 1528 295 404 1250 1488 1052 -108 -41 1045 1740 715 151 612 1437
3713A437J42r54p92P42P04l03p25p1J264L36o41q77r4M07R70o68j054M40J099
$$ 1437 1579 625 -167 575 1279 976 251 180 1444 1780 1139 262 168 575 1545 877 -177 263 1362
3732A362M58r55p37L8Q47K21j004n12R78O54j88r50l47J051N78q05r50l62J233
$$ 1362 1820 865 128 166 1013 1234 230 -282 696 1350 1162 212 -135 916 1494 689 -261 -623 610
3751F10N64o91n76P17Q96j06j140r37Q41O18K09j097J07L66R39k61j255k79Q90
$$ 610 1174 483 -93 624 1520 1414 274 -663 178 796 1005 -92 15 381 1320 1059 -196 -475 415
3770D15O30n28p35J6Q95K40k60j276J76Q49N3n83q48J066P55k5j207k16R04L16
$$ 415 1045 517 -218 -202 693 933 673 -603 -427 422 475 -108 -956 110 865 840 -367 -583 321 637
3790F37o56q61Q9P91O27j11j041N21N23L6o43n94L9R49J78o25m67M56O49Mj007
$$ 637 -19 -880 -791 0 627 516 -525 -4 519 555 -88 -682 -643 306 484 -141 -608 -152 497 501 -506
3811e06m51P49P74m32r46M18M57O61m19j117J43P13Q0n61p22Q64P09K5q62j32
$$ -506 -957 -208 566 134 -812 -394 63 724 305 -812 -669 44 124 -437 -1159 -295 414 439 -423 -555
3831e55K13P83m64p61o02J075Q17m49p59m16P93O29q52o27j05J142L14n19n35
$$ -555 -342 441 -23 -784 -1386 -311 506 57 -702 -1118 -325 304 -548 -1175 -1280 -138 176 -343 -878
3850h78M84L98P2j427j52N41J067l65n44k73O20O76o51p15l78Q23O12n08n48K56
$$ -878 -394 4 76 -1351 -1503 -962 105 -260 -804 -1077 -457 219 -432 -1147 -1525 -702 -90 -598 -1146 -890
3870h90Q63K56r85o47K52N90J39o27n24Q17Q54k59r84j44N29P35q84p21J62Q51
$$ -890 -27 229 -756 -1403 -1151 -561 -422 -1049 -1573 -756 98 -161 -1145 -1289 -760 -25 -909 -1630 -1468 -617
3890f17N38m24q05M18O70J4o52p77L94J328l61p08j3K93M09J1r70P1N94N82l37
$$ -617 -79 -503 -1308 -890 -220 -206 -858 -1635 -1241 87 -274 -982 -995 -702 -293 -282 -1252 -1181 -587 -5 -342
3911c42q34M03P18K95o06j144O02P65K5m63n12O92O57l74n92j91K89P62l75o51
$$ -342 -1176 -773 -55 240 -366 -1510 -908 -143 -118 -581 -1093 -401 256 -118 -710 -901 -612 150 -225 -876
3931h76m1P09R10n88n12j86Q78J23o99p90L54J253j80m51l16L6J091j51j060m96
$$ -876 -917 -208 702 114 -398 -584 294 417 -282 -1072 -718 535 355 -96 -412 -376 715 564 -496 -992
3951i92O17J119l43n65j7O40L86r30o93K0J110L63m95n87L94R35k54n74p51L83
$$ -992 -375 744 401 -164 -181 459 845 -85 -778 -758 352 715 220 -367 27 962 708 134 -617 -234
3971b34O82K24r24j46R30P52n96q04l31J034K88o81o43J44J234J18m17n35M2N85
$$ -234 448 672 -252 -398 532 1284 688 -116 -447 587 875 194 -449 -305 929 1047 630 95 137 722
3991G22L8p44m02M46J349j84j406M43N89J53k92j147K39Q01L65P7j086L12O47
$$ 722 760 16 -386 60 1409 1225 -181 262 851 1004 712 -435 -196 605 970 1047 -39 273 920
4010I20J84o56o34P9Q82K06q11l01O17Q17n63o39l66M92N94l96n85L34Q82L69
$$ 920 1104 448 -186 -107 775 981 170 -131 486 1303 740 101 -265 227 821 425 -160 174 1056 1425
4030A425r06m30J63P35Kq80n30O53R35M48j054m70M53O94o15p36l2Q09N60j44
$$ 1425 519 89 252 987 989 109 -421 232 1167 1615 561 91 544 1238 623 -113 -145 664 1224 1080
4050A080j220M48M82K69o99p00O00N41N86q27n42M93J018n35r00n63P36J017p74
$$ 1080 -140 308 790 1059 360 -340 260 801 1387 560 18 511 1529 994 94 -469 267 1284 510
4069E10j68j71O61K23k66o96n69R56M21l83o91J12Q02L88q23n48M20O52k83q94
$$ 510 342 171 832 1055 789 93 -476 480 901 518 -173 -61 741 1129 306 -242 178 830 547 -347
4089c47O3N27Q04l74n12k12M11N40q60l42k34J184J74q76l14M50Q22q9j111n29
$$ -347 -284 243 1047 673 161 -51 360 900 40 -302 -536 648 822 -54 -368 82 904 815 -296 -825
4109h25M58P01j19r9o82P71O04p02q12j16Q91L22n30n54K32O42O28j037n88K60
$$ -825 -367 334 215 116 -566 205 809 107 -705 -821 70 392 -138 -692 -460 182 810 -227 -815 -555
4129e55N68J5r32k82J061L10J60j050k38L40Q00n86p12J60P77N44p38n43J56Q21
$$ -555 13 28 -904 -1186 -125 185 345 -705 -943 -603 197 -389 -1101 -941 -164 380 -358 -901 -745 76
4149G6j03n20q40L40Q29K57k55m66K89M69m67p58q8P13J10M0n52L36N27M24n62
$$ 76 -27 -547 -1387 -1047 -218 39 -216 -682 -393 76 -391 -1149 -1237 -524 -414 -374 -926 -590 -63 361 -201
4170b01q45K84L68K75m09o74N27J033j73r15n47N54P58l47p95L22O39M82m19m90
$$ -201 -1046 -762 -394 -119 -528 -1202 -675 358 185 -730 -1277 -723 35 -312 -1107 -785 -146 336 -83 -573
4190e73k20O33J19n71n60L44Q04J6m46k00L5J010o86n43k76O29N83j23q30K99
$$ -573 -793 -160 -41 -612 -1172 -828 -24 -8 -454 -654 -619 391 -295 -838 -1114 -485 98 -25 -855 -556
4210e56M44K65k49r02P5P10M92o36n51M37Q12K68q30o88qP49l3m93r4P81M10j87
$$ -556 -112 153 -96 -998 -923 -213 279 -357 -908 -471 341 609 -221 -909 -917 -168 -201 -694 -788 -7 403 216
4232B16o99l12Q00j01k19l52l77J043L66m56l49M6Q17n5q62n10P01N46J85p32
$$ 216 -483 -795 5 -96 -315 -667 -1044 -1 365 -91 -440 -394 423 368 -494 -1004 -303 243 428 -304
4252c04l16L85N18j63j009O2Q88j45K15l52j37Q23J8m33p44M31M23j12k77m78
$$ -304 -620 -235 283 120 -889 -827 61 -84 131 -221 -358 465 483 50 -694 -263 160 48 -229 -707
4272g07N84Q47kq53r01R03O67l40n64O3P31M90o52o53J30O34M86r37m87O00Q05
$$ -707 -123 724 722 -131 -1032 -129 538 198 -366 -303 428 918 266 -387 -257 377 863 -74 -561 39 844
4293H44m5k76p59N75O55o39o29j27O09N09k75n02N00M06K8o10m81K69N39J47n08
$$ 844 799 523 -236 339 994 355 -274 -401 208 717 442 -60 440 846 874 264 -217 52 591 738 230
4314B30k31N64M29L99j093n74M89N69k60n0m75R67L90m23o17m96J051N3m21n68
$$ 230 -1 563 992 1391 298 -276 213 782 522 472 -3 964 1354 931 314 -182 869 922 501 -67
4334f7L68N06N02r35m49M80J72M91q46k97P28N43k25q29k38Q14M36p90m80L54
$$ -67 301 807 1309 374 -75 405 577 1068 222 -75 653 1196 971 142 -96 718 1154 364 -116 238
4354B38O59p4N2q14M66M39l02n68n40N01P12p7n00k43O09O83o31n96j13L42J10
$$ 238 897 823 875 61 527 966 664 96 -444 57 769 692 192 -51 558 1241 610 14 -99 243 353
4375C53j84m83Q0R80L70j016n57L64L79N0l91j74N01M28j18n39m17M74N94n33
$$ 353 169 -314 -234 746 1116 100 -457 -93 286 336 -55 -229 272 700 582 43 -374 100 694 161
4395A61m55q3P30K55k98p29K17P77j03n85o43M38O64K33q20j13O13L72l02r31
$$ 161 -294 -377 353 608 310 -419 -202 575 472 -113 -756 -318 346 579 -241 -354 259 631 329 -602
4415f02l2O08O28r5j098K79N84N63r17l35L3M59K71o35l63J01Q74j04n01o36Q43
$$ -602 -634 -26 602 507 -591 -312 272 835 -82 -417 -384 75 346 -289 -652 -551 323 219 -282 -918 -75
4436g5K02J3o76k95Q84N54m36n34k47Q17K12o01n95K49M44K25m81m11L94M89j13
$$ -75 127 140 -536 -831 53 607 171 -363 -610 207 419 -182 -777 -528 -84 141 -340 -751 -357 132 19
4457A9m99j50kP63k8o62K7M99Q5l01n84J44O20L45p04k78K34P88p0q07l38K87
$$ 19 -480 -630 -632 131 103 -559 -532 -33 52 -249 -833 -689 -69 276 -428 -706 -472 316 246 -561 -899 -612
4479f12O57j73o9p88O46M31m0n92n98P50M68p03m22L70K88R41r73m65K03L27L91
$$ -612 45 -128 -197 -985 -339 92 52 -540 -1138 -388 80 -623 -1045 -675 -387 554 -419 -884 -681 -354 37
4500C7p20n30O15M65K68m77m59O18K65k29j068K11O91K76m54n27N47M75K39p81
$$ 37 -683 -1213 -598 -133 135 -342 -801 -183 82 -147 -1215 -1004 -313 -37 -491 -1018 -471 4 243 -538
4520e38m52K94O82J01l56n41L03N98K07p05o26O55K89o7p38J20R08L47m43p94
$$ -538 -990 -696 -14 87 -269 -810 -507 91 298 -407 -1033 -378 -89 -156 -894 -774 134 481 38 -756
4540g56M06M63j53m00n84Q25L11L8l03m63Q0P91k79p23K03J27R94l63o18J95K58
$$ -756 -350 113 -40 -440 -1024 -199 112 150 -153 -616 -536 255 -24 -747 -544 -417 577 214 -404 -209 49
4561D9L10k43p07L83M14K53l92j11Q1L20K16p35j49M06K03l87o2k41O80L38m66
$$ 49 359 116 -591 -208 206 459 67 -44 37 357 573 -162 -311 95 298 -89 -151 -392 288 626 160
4582A60m05p2M96M22m80l01K2O28J86l17n10L12M83Q1q32k59M48O99O3o27j76
$$ 160 -245 -317 179 601 121 -180 -158 470 656 339 -171 141 624 705 -127 -386 62 761 824 197 21
4603B1L05N89p33m62n1Q77J03j65m70J09P80k52m13p77M28P23k18j60j50M57K35
$$ 21 326 915 182 -280 -331 546 649 484 14 123 903 651 238 -539 -111 612 394 234 84 541 776
4624G76m43l23j29K90M89k89p12K67Q81n8j90q66J88M66L49m04m47M66M71k98
$$ 776 333 10 -119 171 660 371 -341 -74 807 749 559 -307 -119 347 696 292 -155 311 782 484
4644D84n06m43P59N68o22k16j03O12K85m33k32k30M44L32n20m69P9M68M74o38
$$ 484 -22 -465 294 862 240 24 -79 533 818 385 153 -77 367 699 179 -290 -211 257 731 93
4664I3j21O5N25j46m03n45O75J02L3m23p5P79M49o01o22j02P14K11m66l65L51
$$ 93 -28 37 562 416 13 -532 143 245 278 -145 -220 559 1008 407 -215 -317 397 608 142 -223 128
4685A28O10k45k97k26J92n8L25o46O4N78M49n13n6m1m1M81l92n83O7Q10m8l75
$$ 128 738 493 196 -30 162 104 429 -217 -153 425 874 361 305 264 223 704 312 -271 -204 606 558 183
4707A83k06R0N80r1p37j7L30O19j75q33P7M05N38l96r05l0P03N00p27l58L02M53
$$ 183 -23 67 647 556 -181 -198 132 751 576 -257 -180 225 763 367 -538 -568 135 635 -92 -450 -148 305
4729C05L06o99k97L98M14k11l77l26K25M77j52m30RN1N44j33p54nR15m8m04l44
$$ 305 611 -88 -385 13 427 216 -161 -487 -262 215 63 -367 -358 -307 237 104 -650 -655 260 212 -192 -536
4751e36Q9P92m38m76k73M97N00L8o80j15J07N63m4n77k57L93M52j99l16J99L69
$$ -536 -447 345 -93 -569 -842 -345 155 193 -487 -602 -495 68 24 -553 -810 -417 35 -164 -480 -281 88
4772H8J95q13k6J31M29J4n33m82O23M35k57N5o51J56P69l28n09P7M91J63j31n18
$$ 88 283 -530 -556 -425 4 18 -515 -997 -374 61 -196 -141 -792 -636 133 -195 -704 -627 -136 27 -104 -622
4794f22j48O29L22q22l16M65L29K09l41n33L58L50K39n74j55K89L60k23k5n87
$$ -622 -770 -141 181 -641 -957 -492 -163 46 -295 -828 -470 -120 119 -455 -610 -321 39 -184 -209 -796
4814g96Q10J89n54n25M52M71J92m68l45K30N30N0l04l67J50N85l63l37l8P66o2
$$ -796 14 203 -351 -876 -424 47 239 -229 -574 -344 186 236 -68 -435 -285 300 -63 -400 -438 328 266
4835B66R7o73j71P20j44q9o50J19N34N45o30m52J60N65j1n42j45N45J41j12K9
$$ 266 363 -310 -481 239 95 6 -644 -525 9 554 -76 -528 -368 197 186 -356 -501 44 185 73 102
4856A02m60O52o8l32m95J29N13M26k27n60K10J17K54l52q19O11L15n2j61k19J50
$$ 102 -358 294 226 -106 -601 -472 41 467 240 -320 -110 7 261 -91 -910 -299 16 -36 -197 -416 -266
4877b66M29Q3n36j92M07R3N5m93J34M58K09j81m83R2L90L10n19m52M67L65O9l71
$$ -266 163 246 -290 -482 -75 18 73 -420 -286 172 381 200 -283 -191 199 509 -10 -462 5 370 439 68
4899F8o32M92N06m6o26q2N49L95k98k30J8M50k87n19j1k00P32K87p39r4M69N73
$$ 68 -564 -72 434 388 -238 -320 229 624 326 96 114 564 277 -242 -253 -453 279 566 -173 -267 202 775
4921G75j98n76m87O44j4N0m16K48K06M66l36k81k25L41K78k03n23L76O16m4n87
$$ 775 577 1 -486 158 144 194 -222 26 232 698 362 81 -144 197 475 272 -251 125 741 697 110
4942A10j83L04RK11m37j41M46L11J17m46k48L52M38o32m52L12N94j8k80l79J73
$$ 110 -73 231 240 451 14 -127 319 630 747 301 53 405 843 211 -241 71 665 647 367 -12 161
4963A61N59k88j74m42L04P28j7m62l17K23N63l91n15J33J41L58l53n24L19P83
$$ 161 720 432 258 -184 120 848 831 369 52 275 838 447 -68 65 206 564 211 -313 6 789
4983G89p2o02n87M70L32q8k57k01K26K96L46o54q5L24R3j62m55K30L47K68L4r57
$$ 789 717 115 -472 -2 330 242 -15 -216 10 306 652 -2 -87 237 330 168 -287 -57 290 558 592 -365
5005c65J26N76N0m53l24K08N08L2m12m85L37N44pp76J50K30K21j33l8MQ0K44j23
$$ -365 -239 337 387 -66 -390 -182 326 358 -54 -539 -202 342 335 -441 -291 -61 160 27 -11 -7 73 317 194
5028A94m53j97M68M13o15m6J15K49J45m52k92M90R9r7j37m83Q93J4k98j61l30
$$ 194 -259 -456 12 425 -190 -236 -121 128 273 -179 -471 19 118 21 -116 -599 294 308 10 -151 -481
5049d81N74l28L72n86N0M95K37m02k00J4N34Q1o75j03P2O82k10k13m22K96L73
$$ -481 93 -235 137 -449 -399 96 333 -69 -269 -255 279 360 -315 -418 -346 336 126 -87 -509 -213 160
5070A60j29k68K06K63Q6l90k19L29J33J47l86k25j77O90kl52k46K64N03k34o66
$$ 160 31 -237 -31 232 318 -72 -291 38 171 318 -68 -293 -470 220 218 -134 -380 -116 387 153 -513
5091e13l0J56M56j16k70l08Q16j25J2m01m5N17l21p2l2P6M43j11j89l56L31K76
$$ -513 -543 -387 69 -47 -317 -625 191 66 78 -323 -368 149 -172 -244 -276 -200 243 132 -57 -413 -82 194
5113A94k26m93J18L63j09J16o75K48M14Jk1l84J59L95p4j95l33K29J51J48l57
$$ 194 -32 -525 -407 -44 -153 -37 -712 -464 -50 -49 -70 -454 -295 100 26 -169 -502 -273 -122 26 -331
5134c31j71M8L76j40l01M6N91K25n55m44K94K85Q8l95m0K74J08P3j61l07J25K69
$$ -331 -502 -454 -78 -218 -519 -473 118 343 -212 -656 -362 -77 11 -384 -424 -150 -42 31 -130 -437 -312 -43
5156d3j16m70LL19L22j90k36j1O55j07l04j85J6N41j0l28l06L31L27N4m84j85
$$ -43 -159 -629 -626 -307 15 -175 -411 -422 233 126 -178 -363 -347 194 184 -144 -450 -119 208 262 -222 -407
5178d07N10K34L8p92O7L86K38k66l93K03Q7O15l26k18J32L46L7m90j1J28K16k36
$$ -407 103 337 375 -417 -350 36 274 8 -385 -182 -95 520 194 -24 108 454 491 1 -10 118 334 98
5200I8l13QL05K02J43n27j26K85K55r2q06M74K95L54m39k48O4L21O1l11k70J06
$$ 98 -215 -207 98 300 443 -84 -210 75 330 238 -568 -94 201 555 116 -132 -68 253 314 3 -267 -161
5222a61O31R3m91j73N86j44j40k23k08K40L29j41r4k4M82k33m8m27J60M91l44
$$ -161 470 563 72 -101 485 341 201 -22 -230 10 339 198 104 80 562 329 281 -146 14 505 161
5243A61n5m61N51L78m03K67p84N88K45l74l10J04M21k8k74j14J89M3K31j58m21
$$ 161 106 -355 196 574 171 438 -346 242 487 113 -197 -93 328 300 26 -88 101 144 375 217 -204
5264b04J25Q7K46m67J39K76R6J02m33l27K35L19j17l51J31N19J32k76p10N70K00
$$ -204 -79 8 254 -213 -74 202 298 400 -33 -360 -125 194 77 -274 -143 376 508 232 -478 92 292
5285B92J46m57n17N72O18m82k09j51R8K15j61K49n98M39K95m0n00o7N49J30k97
$$ 292 438 -19 -536 36 654 172 -37 -188 -90 125 -36 213 -385 54 349 309 -191 -258 291 421 124
5306A24m13M47K38m4m97j77M02N38o9m71m36L99N44k40l93m2L63R6p8m39k5L50
$$ 124 -289 158 396 352 -145 -322 80 618 549 78 -358 41 585 345 -48 -90 273 369 291 -148 -173 177
5328A77K99p93M83k18M89J10m86kj69L11j50m21M1L64K53k93L01m74K16L17m46
$$ 177 476 -317 166 -52 437 547 61 59 -110 201 51 -370 -329 35 288 -5 296 -178 38 355 -91
5349i1m81J87M13K97l86k02K53L95l76l8l53K08N17m41q9L34k93L16j65j91k24
$$ -91 -572 -385 28 325 -61 -263 -10 385 9 -29 -382 -174 343 -98 -187 147 -146 170 5 -186 -410
5370d10N91J96p05N3L33o6K50m86j56J13M69j05Pl79j15M89k4m69J1M69o8l00
$$ -410 181 377 -328 -275 58 -8 242 -244 -400 -287 182 77 84 -295 -410 79 55 -414 -403 66 -2 -302
5392c02J11J28j42K77k67l70M34n5J93j75n93M03L09l5n30k20O59J26o6n95K68
$$ -302 -191 -63 -205 72 -195 -565 -131 -186 7 -168 -761 -358 -49 -84 -614 -834 -175 -49 -115 -710 -442
5413d42J70O70l16l34J09K9J24l78Kj43O14km49j59N24J36l6l12n56O62K06k8
$$ -442 -272 398 82 -252 -143 -114 10 -368 -366 -509 105 103 -346 -505 19 155 119 -193 -749 -87 119 91
5435I1k10j92oN90n74p7R2L28N6Ko66L26M91l20J81k91J07L12K3m84R3j09N09
$$ 91 -119 -311 -317 273 -301 -378 -286 42 98 100 -566 -240 251 -69 112 -179 -72 240 263 -221 -128 -237 272
5458B72K04m84k16L87r5j59m07L75K24p8O5k58P9L12j05j86r4k06O82p2m65J19
$$ 272 476 -8 -224 163 68 -91 -498 -123 101 23 88 -170 -91 221 116 -70 -164 -370 312 240 -225 -106
5480a06J24L18l11k51K0N3L61k37l08P0J20J46nm1j25N33k48j39m14M61j3K13
$$ -106 18 336 25 -226 -206 -153 208 -29 -337 -267 -147 -1 -6 -47 -172 361 113 -26 -440 21 8 221
5502B21k61L0k18M86o2n19J41Q2M44P2m69r2O22l63oj02k30L97j35j66O0j26M36
$$ 221 -40 -10 -228 258 196 -323 -182 -100 344 416 -53 -145 477 114 108 6 -224 173 38 -128 -68 -194 242
5525B42o3m48p9L26OJ64m54M63K01l33K45n87L47J13K37k39l05L13J84P3o37K8
$$ 242 179 -269 -348 -22 -16 148 -306 157 358 25 270 -317 30 143 380 141 -164 149 333 406 -231 -203
5547b03K98L54l93j14J29P8k4M15l68l19N83J01l09n26N72j58J06o6j25j55N50
$$ -203 95 449 56 -58 71 149 125 540 172 -147 436 537 228 -298 274 116 222 156 31 -124 426
5568D26k30l26k45N35K83j16l70l8J93R0P0m48K6J66N55l20l54K92M16k50m42
$$ 426 196 -130 -375 160 443 327 -43 -81 112 202 272 -176 -150 16 571 251 -103 189 605 355 -87
5589h7LJ96K81j61l84L55k84N29k72k27K14j61J03J7j42N8K50P3l57n2r9J55K52
$$ -87 -84 112 393 232 -152 203 -81 448 176 -51 163 2 105 122 -20 38 288 361 4 -48 -147 8 260
5612B60l20j9n1N03k54o4j2j31P58k94n68j0M98j32Rq9J56l7k45k21J62Q5Q4K6
$$ 260 -60 -79 -130 373 119 55 43 -88 670 376 -192 -202 296 164 173 84 240 203 -42 -263 -101 -16 68 94
5636I4j31k00J06J93r4J01l76L4L64km53R6O03K77o09l08K53K1J67l12J11K8P4
$$ 94 -37 -237 -131 62 -32 69 -307 -273 91 89 -364 -268 335 612 3 -305 -52 -31 136 -176 -65 -37 37
5659C7o2k7k17K36L13k61k49J5L06j86k3q9N3M63l40o1J01p1M0K71o19M42p3L70
$$ 37 -25 -52 -269 -33 280 19 -230 -215 91 -95 -118 -207 -154 309 -31 -92 9 -62 -22 249 -370 72 -1 369
5683C69l80m5l90L07L22m83p6j06Q25k11j15k61k15L95K54j99k33J84M85l04K8
$$ 369 -11 -56 -446 -139 183 -300 -376 -482 343 132 17 -244 -459 -64 190 -9 -242 -58 427 123 151
5704A51n97M35J63j88J2l99M05M17j32l21M3N4J9j19j19l12N25mm0j69J57J23
$$ 151 -446 -11 152 -36 -24 -423 -18 399 267 -54 -11 43 62 -57 -176 -488 37 33 -7 -176 -19 104
5726A04K1k99m10L74J45Q8j98J02J12J25j33l02O8M96l41j30j93K33o1L32K5n55
$$ 104 125 -174 -584 -210 -65 23 -175 -73 39 164 31 -271 -203 293 -48 -178 -371 -138 -199 133 158 -397
5748c97L67K4K02l44Rj47M91k76J9j41J70k4j24O9n93O07j6k15N3j17N70j70m9
$$ -397 -30 -6 196 -148 -139 -286 205 -71 -52 -193 -23 -47 -171 -102 -695 -88 -104 -319 -266 -383 187 17 -32
5771c2k63j14N87j07j05k8q5L83k57O0k91K36J49k83Q3j67M27k5j90m5P7K36m0
$$ -32 -295 -409 178 71 -34 -62 -147 236 -21 39 -252 -16 133 -150 -67 -234 193 168 -22 -67 10 246 206
5794B06l57p7LM07J3l4l64K3K66k55j21K99R0k31P1k17J93rL43r1l24mM18jk09
$$ 206 -151 -228 -225 182 195 161 -203 -180 86 -169 -290 9 99 -132 -61 -278 -85 -94 249 158 -166 -170 248 247 38
5819C8P0j89M12k00j38K00l0j24J87l68L37l39P37o28J24J16J59j34n7m11M06
$$ 38 108 -81 331 131 -7 193 163 39 226 -142 195 -144 593 -35 89 205 364 230 173 -238 168
5840A68J99J36k78k79J05J62J47l41J88l98N61J7j69j57J60k2J18m35M5L08j76
$$ 168 367 503 225 -54 51 213 360 19 207 -191 370 387 218 61 221 199 317 -118 -73 235 59
5861E9k1l1K22J02n2n34K21J58q2N8k9k14K02K62o4k71m5M50j10j4j85r3K84k31
$$ 59 38 7 229 331 279 -255 -34 124 42 100 71 -143 59 321 257 -14 -59 391 281 267 82 -11 273 42
5885D2J1j35m6K31j43j83L33k14K98J92o06K70k26L37l77m3j28N30J65k22N3m70
$$ 42 53 -82 -128 103 -40 -223 110 -104 194 386 -220 50 -176 161 -216 -259 -387 143 308 86 139 -331
5907c31M04j21K31o52K83N31j02m24P4R1O2J9R3k94J99qJ81j89j93J74M11k72
$$ -331 73 -48 183 -469 -186 345 243 -181 -107 -16 46 65 158 -136 63 55 236 47 -146 28 439 167
5929A67k81J19O6l1j62J03r5L96J34j59l70O4Q5J1l55J11L20j17K5o7K1o8L39
$$ 167 -114 5 71 40 -122 -19 -114 282 416 257 -113 -49 36 47 -308 -197 123 6 31 -36 -15 -83 256
5952B56k77k75K72J74J8j35k6n7J08j02r4J54K07nm5l16r6M96k4l98l5K54j76
$$ 256 -21 -296 -24 150 168 33 7 -50 58 -44 -138 16 223 218 173 -143 -239 257 233 -165 -200 54 -122
5975a22K11Mq3K89k36J27m19k02N08j76O3QP3j5k27J94j30J04J56k19l9r7J26
$$ -122 89 93 10 299 63 190 -229 -431 77 -99 -36 -28 45 30 -197 -3 -133 -29 127 -92 -131 -228 -102
5998a02K91q2k50l12K04K07J3k99J78j84L72K0k18m25N52N1j7J17l63%J90nJ50
$$ -102 189 107 -143 -455 -251 -44 -31 -330 -152 -336 36 56 -162 -587 -35 16 -1 116 -247 -247 -57 -62 88
6021H8m14L74k74j88J44J66K21j93r4j48J61K43j7j80j39K91J68k33k83n2M33
$$ 88 -326 48 -226 -414 -270 -104 117 -76 -170 -318 -157 86 69 -111 -250 41 209 -24 -307 -359 74
6042G4P6k44o9k64L02J56o5j59L70L7o2l93K14J92k88j9j03K5K12K85k87k00J94
$$ 74 150 -94 -163 -427 -125 31 -34 -193 177 214 152 -241 -27 165 -123 -142 -245 -220 -8 277 -10 -210 -16
6065a6j84M03p4k00j45K97K7j49O0O8J68o3l63j3J83J43kQ6j97L54R0j61m56L1
$$ -16 -200 203 129 -71 -216 81 108 -41 19 87 255 192 -171 -184 -1 142 140 226 29 383 473 312 -144 -113
6089a13M90q9m11j33M9Q54o20r8k34L09K91k35j87k83J95L55L19q00K74j18K94
$$ -113 377 288 -123 -256 -207 647 27 -71 -305 4 295 60 -127 -410 -215 140 459 -341 -67 -185 109
6110A09k39J59m3M43k69J86p63L67j24L31j17k32L53j0j34p4LJ08m2J59m28M5
$$ 109 -130 29 -14 429 160 346 -417 -50 -174 157 40 -192 161 151 17 -57 -54 54 12 171 -257 -212
6132b12K65O0l7o2Q1p7K15m52j9L4J53J8N1P5j0K42l10k75K00j41M12Q7o88K41
$$ -212 53 113 76 14 95 18 233 -219 -238 -204 -51 -33 18 93 83 325 15 -260 -60 -201 211 298 -390 -149
6156a49M73k19j54k02J12M63j11j66l31M89K12k25k02J62n2p2K10l94K49K0Pl1
$$ -149 324 105 -49 -251 -139 324 213 47 -284 205 417 192 -10 152 100 28 238 -156 93 113 120 89
6178H9N6l09L92N2l62Jl97R29k26j26o4J38J15j79k51L64j56L21kl09j68M64P
$$ 89 145 -164 228 280 -82 -81 -478 451 225 99 35 173 288 109 -142 222 66 387 385 76 -92 372 379
6201C79j15j96l33K99L14l70lm0L39k94K1k20J60L90j88k07l98M92O8P1q9j36
$$ 379 264 68 -265 34 348 -22 -25 -65 274 -20 1 -219 -59 331 143 -64 -462 30 98 169 80 -56
6223e6j69N97l98N8j09K99J20l91n6Q7L73j54l8k96K45J81k06o9o8J84j77J38
$$ -56 -225 372 -26 32 -77 222 342 -49 -105 -18 355 201 163 -133 112 293 87 18 -50 134 -43 95
6245I5k83K85Q4k07L68n78k3N05J3k32j95O7M3K08k02k75J38P7j22M4K90k9j17
$$ 95 -188 97 181 -26 342 -236 -259 246 259 27 -168 -101 -58 150 -52 -327 -189 -112 -234 -190 100 71 -46
6268d6J4J9m01O17j29J0j47l29N34k99J74k9n0J59K4k87J55j45O7K0j53J79O6
$$ -46 -32 -13 -414 203 74 84 -63 -392 142 -157 17 -12 -62 97 121 -166 -11 -156 -89 -69 -222 -43 23
6291B3r7J01l39n9J03N40k43k01K1J62L11n08L2n8K45l7l9j36K42k27L01j37k77
$$ 23 -74 27 -312 -371 -268 272 29 -172 -151 11 322 -186 -154 -212 33 -4 -43 -179 63 -164 137 0 -277
6314b77J87K12kk53M2L80k02j89q4J08J54j20J06k54k5J36J71o7l05J06J40L47
$$ -277 -90 122 120 -133 -91 289 87 -102 -186 -78 76 -44 62 -192 -217 -81 90 23 -282 -176 -36 311
6336C11l06J03k30J98K65j27n64L14P9l05o4M59k6J63n4k81r4M27l77J59K14l90
$$ 311 5 108 -122 76 341 214 -350 -36 43 -262 -326 133 107 270 216 -65 -159 268 -109 50 264 -126
6358a26K58r2K51k25j22J86L1r7m2n9L52l50M6mO9P7l23j54M99k43O9J90p99P46
$$ -126 132 40 291 66 -56 130 161 64 22 -37 315 -35 11 7 76 153 -170 -324 175 -68 1 191 -608 138
6382A38J31j34l84j05L84L8k60K44k82L74j03p0m9K01l7j39k20M7L46j6K87k88
$$ 138 269 135 -249 -354 30 68 -192 52 -230 144 41 -29 -78 123 86 -53 -273 -226 120 104 391 103
6404A03l67J46pK52m4l34L60L9j86k93K97J68m7k8j20l21N29Q0k20M4j0n8J4n
$$ 103 -264 -118 -125 127 83 -251 109 148 -38 -331 -34 134 87 59 -61 -382 147 227 7 51 41 -17 -3 -8
6428hP0O3K22k23j36M4jM06o82p6L14J75JL0k41l21P83l84J64m37L57j4n2j82
$$ -8 62 125 347 124 -12 32 31 437 -245 -321 -7 168 169 199 -42 -363 420 36 200 -237 120 106 54 -128
6452a28j0M27j33Kl14L4O0J46K3k76J62L1N1L1k68M3L38N0l0m25M07j94P7j06
$$ -128 -138 289 156 158 -156 -122 -62 84 107 -169 -7 24 75 106 -162 -119 219 269 239 -186 221 27 104 -2
6476bk14J79N05n61K45r1K30K2k52j87j04L89R4k19m28J58J97J38k90N06n00K36
$$ -2 -216 -37 468 -93 152 61 291 313 61 -126 -230 159 253 34 -394 -236 -39 99 -191 315 -185 51
6498E1k2k21M1Q8J11L1l02J67L78j97k13J85k97K32O7j76j73m1M56N5or6M1J12
$$ 51 29 -192 -151 -63 48 79 -223 -56 322 125 -88 97 -200 32 99 -77 -250 -291 165 220 214 118 159 271
6522B71k79J52j06o4K54k16j38p6K78k12K7n13N39N16l41k33N1J95Oj51K0k11
$$ 271 -8 144 38 -26 228 12 -126 -202 76 -136 -109 -622 -83 433 92 -141 -90 105 111 -40 -20 -231
6544b31J16J88k59R4KP3K0p3j87Q1K24P0k91J42n2M0k9O9J66k58K88r4l11J41
$$ -231 -115 73 -186 -92 -90 -17 3 -70 -257 -176 48 118 -173 -31 -83 -43 -72 -3 163 -95 193 99 -212 -71
6568g1J14J33L4k58J03k91J43J37k37K23K37n5P8m91L29O8M9j62j89J70K19m2
$$ -71 43 176 210 -48 55 -236 -93 44 -193 30 267 212 290 -201 128 196 245 83 -106 64 283 241
6590B41m69J49K2J05R4l25L6J19K33j25J77j02j08L14l48r5O6R8L6o6j90j17J33
$$ 241 -228 -79 -57 48 142 -183 -147 -28 205 80 257 155 47 361 13 -82 -16 82 118 52 -138 -255 -122
6613a22K41l87J4J83N0M3j80M1K09m01J78J08o0L07j99K1k13J46K40k82j62K20
$$ -122 119 -268 -254 -71 -21 22 -158 -117 92 -309 -131 -23 -83 224 25 46 -167 -21 219 -63 -225 -5
6635eN7m0J91k50m09N33j02J0K1p1l58M25k24K32r6q2J29O3m17J86L08o1j28j56
$$ -5 52 12 203 -47 -456 77 -25 -15 6 -65 -423 2 -222 10 -86 -168 -39 24 -393 -207 101 40 -88 -244
6659b44R9J73Q3j18k01K16K90l71NN3m6J46K32o33M23j46q2L3J54k33J80Q8j81
$$ -244 -145 28 111 -7 -208 8 298 -73 -68 -15 -61 85 317 -316 107 -39 -121 -88 66 -167 13 101 -80
6682h0l10M74j78K14j21k04L56k47N1r6K48O0q9j85k26J30L43K4m07J72K21K05
$$ -80 -390 84 -94 120 -1 -205 151 -96 -45 -141 107 167 78 -107 -333 -203 140 164 -243 -71 150 355
6704C55l24J73l70K67J7j37j7k33M53j69j33J27q9L74k14r0j21K6J98m1M2r9K43
$$ 355 31 204 -166 101 118 -19 -36 -269 184 15 -118 9 -80 294 80 -10 -131 -105 93 52 94 -5 238
6727B38J61l4k86r7L3J33j27k46L02J27l46K43J09J60j66J21j23l92J50K22k26
$$ 238 399 365 79 -18 15 148 21 -225 77 204 -142 101 210 370 204 325 202 -190 -40 182 -44
6748d4k7jn2J84k29j42K51L65K23n73L11J9o5k61l81J00L95j76m4m9R0l4L66k30
$$ -44 -71 -72 -124 60 -169 -311 -60 305 528 -45 266 285 220 -41 -422 -322 73 -103 -147 -196 -106 -140 226 -4
6772dQ1l2n2k19N86m14j49J97q3K82j70j78N2J78j00k74L76l39K66k17j2L30m8
$$ -4 77 45 -7 -226 360 -54 -203 -6 -89 193 23 -155 -103 75 -25 -299 77 -262 4 -213 -225 105 57
6795E7o1K11m35O8K36N2q9k43L42J31j49k49j48K67K16p3k73K49K13j94j3j25
$$ 57 -4 207 -228 -160 76 128 39 -204 138 269 120 -129 -277 -10 206 133 -140 109 322 128 115 -10
6817a0j1m0J28k49L7L40k36L53k80k25J44L18m38J91Q3J4jj85jL03l64J4K7J20
$$ -10 -21 -61 67 -182 -145 195 -41 312 32 -193 -49 269 -169 22 105 119 118 -67 -68 235 -129 -115 -88 32
6841C2j21J97N7k68k3p7M46l70j3k34K25L72n14J1L42J30j28J62l72o0L11R3l41
$$ 32 -89 108 165 -103 -126 -203 243 -127 -140 -374 -149 223 -291 -280 62 192 64 226 -146 -206 105 198 -143
6864a43K70j20p8M5k82N37j11J32l35J14l2j65J60%K96m41J00J38m85K68K54k54
$$ -143 127 7 -71 -26 -308 229 118 250 -85 29 -3 -168 -8 -8 288 -153 -53 85 -400 -132 122 -132
6886a32N19n22J68k1j23L43m22L44l33L15n2j21N7L3P0J41n74L48l17K46j18O5
$$ -132 387 -135 33 12 -111 232 -190 154 -179 136 84 -37 20 53 123 264 -310 38 -279 -33 -151 -86
6908h6K43j2j40L61p12M99mq0L1r6K6J82j52r5j40J4M19m36j6PK67K62k62m2K28
$$ -86 157 145 5 366 -346 153 149 69 100 4 30 212 60 -35 -175 -161 258 -178 -194 -187 80 342 80 38 266
6933B66k20L61l82p2j72K33p6j53rK54K15l17J33k74L28M0l19J84k06L96j02j85
$$ 266 46 407 25 -47 -219 14 -62 -215 -224 30 245 -72 61 -213 115 155 -164 20 -186 210 108 -77
6955g7K82m4K6J83n26O2R8K1J20o7O7k73J47J1LJ75J06p4o6Qq7j67Q6p2Nk74K44
$$ -77 205 161 187 370 -156 -94 4 25 145 78 145 -128 19 30 33 208 314 240 174 182 95 -72 14 -58 -53 -327 -83
6982h3R7q9nJ80o7k58M3M1J73Q8N9o8ro3L0o2k74J86q4L27j02l2R4K01j66r5k9
$$ -83 14 -75 -80 100 33 -225 -182 -141 32 120 179 111 102 39 69 7 -267 -81 -165 162 60 28 122 323 157 62 33
7009C3K38k27q6P6k55M97k74MQ3l61L61K4o2j63k92L65J01j01j24J88mK41m79
$$ 33 271 44 -42 34 -221 276 2 6 89 -272 89 113 51 -112 -404 -39 62 -39 -163 25 21 262 -217
7032b17N6l5K77K2k39Q8K15K2j38r2k8K36l0j32k02P6J18K73k9m14J89J80p5M2
$$ -217 -161 -196 81 103 -136 -48 167 189 51 -41 -69 167 137 5 -197 -121 -3 270 241 -173 16 196 121 163
7056A63m5m0LJ1l43J99K31j94Rn8O2L2k6K37j8j63j46L28k33m67N71j30j23L3
$$ 163 118 78 81 92 -251 -52 179 -15 -6 -64 -2 30 4 241 223 60 -86 242 9 -458 113 -17 -140 -107
7080a07M5J95j37J36j17L7K59k88P3k65M3J01j29L22j55R4j08N9j08j6L0J38k6
$$ -107 -62 133 -4 132 15 52 311 23 96 -169 -126 -25 -154 168 13 107 -1 58 -50 -66 -36 102 76
7103G6j98L03j59j3J3l08L75Mj14O9k1J12M8j3j63k14M44q2j60j52K04j81L29
$$ 76 -122 181 22 9 22 -286 89 93 -21 48 27 139 187 174 11 -203 241 159 -1 -153 51 -130 199
7126A99k01K1j80n0J83j73L78j19l4J99k45k09o4O9L33Q6r5N0j5Pm17J39K41K42
$$ 199 -2 19 -161 -211 -28 -201 177 58 24 223 -22 -231 -295 -226 107 193 98 148 133 140 -277 -138 103 345
7150C45m08k04L41k36J52P6j44n5L02O4l77N8M2O0K9J10k21J70j91o0N1J8k3J61
$$ 345 -63 -267 74 -162 -10 66 -78 -133 169 233 -144 -86 -44 16 45 155 -66 104 -87 -147 -96 -78 -101 60
7174F0n1J50l23j16M11k52j73K71J09j95L34m77K64l39L01n2o8N57o88K87J26
$$ 60 9 159 -164 -280 131 -121 -294 -23 86 -109 225 -252 12 -327 -26 -78 -146 411 -277 10 136
7195A36j28k6J17k95Q4N4P3K04j22n6J42M3o7j18Nj84K61j96K14L7q3n2j39m8
$$ 136 8 -18 99 -196 -112 -58 15 219 97 41 183 226 159 41 46 -138 123 -73 141 178 95 43 -96 -144
7219a44j31N34j92q7k57K56J95l04L62j18j39o7K66k85n8K53N9n03K22J43j50
$$ -144 -275 259 67 -20 -277 -21 174 -130 232 114 -25 -92 174 -111 -169 84 143 -360 -138 5 -145
7240a45K18q5k35J52Rq9K48l10J92q4L89n17M28l26L57R2l21L7J14k12L09k72
$$ -145 73 -12 -247 -95 -86 -175 73 -237 -45 -129 260 -257 171 -155 202 294 -27 10 124 -88 221 -51
7262e1j45J07L5M39n83M2M15l39j5k16L05K06q2k33j72RN20k11j52J42k83K80
$$ -51 -196 -89 -54 385 -198 -156 259 -80 -95 -311 -6 200 118 -115 -287 -278 242 31 -121 21 -262 18
7284A8K5o3j06K07j47N2R6k84J71j95M3M44k54M7L8n5J80n08M15m76N09k83J03
$$ 18 43 -20 -126 81 -66 -14 82 -202 -31 -226 -183 261 7 54 92 37 217 -291 124 -352 157 -126 -23
7307b3J27j79K46l47L94m11K90r4P2Q3q5m9k49M16j38K8p2j87m4K28L8o2J54l56
$$ -23 104 -75 171 -176 218 -193 97 3 75 158 73 24 -225 191 53 81 9 -178 -222 6 44 -18 136 -220
7331b20N98k16N1j92m9J16l21J12J15J91Ml61k0l9L43Q1j04K20k38J53l58L09
$$ -220 378 162 213 21 -28 88 -233 -121 -6 185 189 -172 -192 -231 112 193 89 309 71 224 -134 175
7353A75k52N4J71M6j25j37J78J16j35K39k19p9PJ56L2m33L20j17K5k45M65n7l87
$$ 175 -77 -23 148 194 69 -68 110 226 91 330 111 32 39 195 227 -206 114 -3 22 -223 242 185 -202
7376b02K74j46K92j34J78j64m5K63n54K63j78j82K65J02J35M1l77L93k7l50R3
$$ -202 72 -74 218 84 262 98 53 316 -238 25 -153 -335 -70 32 167 208 -169 224 197 -153 -60
7397f0L5N2l24J72J99l66M40q3J82m46M08%m2j69o6mQJ25k51k4M4k7J07J49k12
$$ -60 -25 27 -297 -125 74 -292 148 65 247 -199 209 209 167 -2 -68 -72 -64 61 -190 -214 -170 -197 -90 59 -153
7422a53Q3L46l25k88M72k60K63l53M8K47K4l77M17l27K48K53n98K01K9p2K67j88
$$ -153 -70 276 -49 -337 135 -125 138 -215 -167 80 104 -273 144 -183 65 318 -280 -79 -50 -122 145 -43
7444d3R2J89k01O9n3j66L41m46J15J08K22k10L4k83K37J21O5l7L3m19L54o0J7
$$ -43 49 238 37 106 53 -113 228 -218 -103 5 227 17 51 -232 5 126 191 154 187 -232 122 62 79
7467G9k67M02o4j73M4n2R7J76l14J34Qj03j37q6M06k37K23K04m28J14m66O58k85
$$ 79 -188 214 150 -23 21 -31 66 242 -72 62 70 -33 -170 -256 150 -87 136 340 -88 26 -440 218 -67
7490f7L07k73K2k04J88K37j07k53l4K09j99J15O2Q0L1j83r3J07J27N8JM6n8k25
$$ -67 240 -33 -11 -215 -27 210 103 -150 -184 25 -174 -59 3 83 114 -69 -162 -55 72 130 131 177 119 -106
7514a06P5j4j23l8K79j71M01k89k32M39l11N9J23J34q2r7j5k27K09L50l22k49
$$ -106 -31 -45 -168 -206 73 -98 303 14 -218 221 -90 -31 92 226 144 47 32 -195 14 364 42 -207
7536b07Q3j85K97l25L60j07R7R9l80K65O7j56J4J46j90j15K65J18j45j78K43K38
$$ -207 -124 -309 -12 -337 23 -84 13 112 -268 -3 64 -92 -78 68 -122 -237 28 146 1 -177 66 304
7558C04j50r0j03k1J12j74k08N28L6N5l17j14K42j55J87k35j9M01r5j30j8Q7l24
$$ 304 154 64 -39 -60 52 -122 -330 198 234 289 -28 -142 100 -55 132 -103 -122 279 184 54 36 123 -201
7581b01r3J62j19L91J10j45L3l49K63r5J59l61L18l10M53k80J8k6lPR3j17r0K28
$$ -201 -294 -132 -251 140 250 105 138 -211 52 -43 116 -245 73 -237 216 -64 -46 -72 -75 -68 25 -92 -182 46
7605D6q3N4Q7k4P2j06r6K10m18J51Q7J18j46j6K99J0m64K83n8j36J35k2K46j12
$$ 46 -37 17 104 80 152 46 -50 160 -258 -107 -20 98 -48 -64 235 245 -219 64 6 -130 5 -17 229 117
7629A17Kn6j42j33M06k17l45M69Q2l03L27j43k36j30K84j43J20j87L51J7Q2k19
$$ 117 119 63 -79 -212 194 -23 -368 101 183 -120 207 64 -172 -302 -18 -161 -41 -228 123 140 222 3
7651Ck21R7R1L21m19pK06k05Q5P8p3qK62j68j47k4NJ89l11o3K97L2J04j17Pq6
$$ 3 -218 -121 -30 291 -128 -135 71 -134 -49 29 -44 -52 210 42 -105 -129 -124 65 -246 -309 -12 20 124 7 14 -72
7677g2m5K91l03m6L89k46J43k13J53j19J66j90J37N0j26M2M7J5L87o91K94j81
$$ -72 -117 174 -129 -175 214 -32 111 -102 51 -68 98 -92 45 95 -31 11 58 73 460 -231 63 -118
7699a18K07j76J90k21K58NQ4l50J09L2J2r5j28J21j57K72k62L05k30K16j15J06
$$ -118 89 -87 103 -118 140 145 229 -121 -12 20 32 -63 -191 -70 -227 45 -217 88 -142 74 -41 65
7721F5m9k31K89k32N2kJ68J75j34j39J70L3k12J48J4j34j59J68J12K7k45N7J38
$$ 65 16 -215 74 -158 -106 -108 60 235 101 -38 132 165 -47 101 115 -19 -178 -10 102 129 -116 -59 79
7744G9P7Q3l8j45JJ17l70K11l2KQ3P2Q8j78q4j87M18q5P9k72j59J28K73l50J20
$$ 79 156 239 201 56 57 174 -196 15 -17 -15 68 140 228 50 -34 -221 197 112 191 -81 -240 -112 161 -189 -69
7769f9j26J73j50J20Q9k26J74L56l28j71K49k65K15RJ79k32j62K53k2J7M7M7r7
$$ -69 -195 -22 -172 -52 37 -189 -15 341 13 -158 91 -174 41 50 229 -3 -165 88 66 83 130 177 80
7792H0q7l11L88Q2k05J0l39K50K45n5k03K27K28n7l9r2j39j26r2R7r3K65J67j50
$$ 80 -7 -318 70 152 -53 -43 -382 -132 113 58 -145 82 310 253 214 122 -17 -143 -235 -138 -231 34 201 51
7816E1k36J51L74l56R0q5k17J96R8Q0m45L68l72N25k70p9K05o3K64j84k29m2O
$$ 51 -185 -34 340 -16 74 -11 -228 -32 66 146 -299 69 -303 222 -48 -127 78 15 279 95 -134 -176 -170
7839a70L58J51l26r8o7K18k00M7J39K47j63J15k52QJ13pj75P5K92k12j65l8Q4
$$ -170 188 339 13 -85 -152 66 -134 -87 52 299 136 251 -1 7 120 113 -62 13 305 93 -72 -110 -26
7862b6J10J46m52L12k89K33J57l00R2m6K16p0l04K80j11j87Q9J40J38m64L28K10
$$ -26 84 230 -222 90 -199 34 191 -109 -17 -63 153 83 -221 59 -52 -239 -150 -10 128 -336 -8 202
7884B02k96r0L73k66L3L43l25k7L08l92o9j70N29j43j0R8k1k38J0J3J80j2R1k02
$$ 202 -94 -184 189 -77 -44 299 -26 -53 255 -137 -206 -376 153 10 0 98 77 -161 -151 -138 42 30 121 -81
7908h1K47j95q6K74J04l47m0k57L72k6j2l7N1%P2j47L01j4l29j92N16P9l3j83
$$ -81 166 -29 -115 159 263 -84 -124 -381 -9 -35 -47 -84 -33 -33 39 -108 193 179 -150 -342 174 253 220 37
7932C7j41O3KJ83k31J41L6k99j54K05J26r6P9k00L21J55m05K43j11k79L22M09
$$ 37 -104 -41 -39 144 -87 54 90 -209 -363 -158 -32 -128 -49 -249 72 227 -178 65 -46 -325 -3 406
7954D06l02j0l00K62n5R6P7l00J63o3Nl4m3r6J54k86L08K2K87m67L39k32k75L41
$$ 406 104 94 -206 56 1 97 174 -126 37 -26 -21 -55 -98 -194 -40 -326 -18 4 291 -176 163 -69 -344 -3
7978cK28m79K37p6q9N07l89K11l71K36j62J51j73L77m09J54L9N5%J03Jl21K38
$$ -3 225 -254 -17 -93 -182 325 -64 147 -224 12 -150 1 -172 205 -204 -50 -11 44 44 147 148 -173 65
8001F5L8j62j2k52J86j54M24j07r4J30n3K64k34j4l27Q7L42k02K25j65m3L76n92
$$ 65 103 -59 -71 -323 -137 -291 133 26 -68 62 9 273 39 25 -302 -215 127 -75 150 -15 -58 318 -274
8024b74K83j51L44k54M7j11K65j04k00L6j39J19J53J47m15L86j83J87L9J22k25
$$ -274 9 -142 202 -52 -5 -116 149 45 -155 -119 -258 -139 14 161 -254 132 -51 136 175 297 72
8045G2r5m2p2j87K30J75J69l51J6P3K66l07j56L64k24J63l48L74j39M3k46L59
$$ 72 -23 -65 -137 -324 -94 81 250 -101 -85 -12 254 -53 -209 155 -69 94 -254 120 -19 24 -222 137
8067A37N0k23l1R3LJ2j99K69p7m0J9L3j76l78K11L88J51l96M1NR1K83j97j04M7
$$ 137 187 -36 -67 26 29 41 -158 111 34 -6 13 46 -130 -508 -297 91 242 -154 -113 -108 -17 266 69 -35 12
8092A2L3J54l54J73rL2q4JJ80j21r2l7K21j46K79l5n36L52J49k23k03M09k40O0
$$ 12 45 199 -155 18 9 41 -43 -42 138 17 -75 -112 109 -37 242 207 -329 23 172 -51 -254 155 -85 -25
8116b5j70K51j92Q6L08k89J31Q0j58J51l45N49j51q2m72K00J69L0j17j74j02M57
$$ -25 -195 56 -136 -50 258 -31 100 180 22 173 -172 377 226 144 -328 -128 41 71 -46 -220 -322 135
8138A35l8k61L22J78l97j07J5J40o9Lk8L5K95l16j31L81j46l6j67r3L17m75N49
$$ 135 97 -164 158 336 -61 -168 -153 -13 -82 -79 -107 -72 223 -93 -224 157 11 -25 -192 -285 32 -443 106
8161A06j70j60k3K47J59k98k01J48K45J0l9r4j14n1N2M2J62R5k48q1j27L11j18
$$ 106 -64 -224 -247 0 159 -139 -340 -192 53 63 24 -70 -184 -235 -183 -141 21 116 -132 -213 -340 -29 -147
8184a47L23k2k71J54p4J88j10
$$ -147 176 154 -117 37 -37 151 41
8191D1
$$ Imaginary data points
##PAGE= N=2
##DATA TABLE= (X++(I..I)), XYDATA
0@%%%%%%%%%%%JrJ6j6J6j6K0k8L2l6M4m9N7o7P6q7R8j11J26j43J61j79K01k28
$$ 0 0 0 0 0 0 0 0 0 0 0 0 1 -8 8 -8 8 -8 12 -16 16 -20 24 -25 32 -35 41 -46 52 -59 67 -76 85 -94 107 -121
35a21K52k78L10l45L83m25M71n22N78o39P10p90Q77r79J098j239J408j612J871
$$ -121 131 -147 163 -182 201 -224 247 -275 303 -336 374 -416 461 -518 580 -659 749 -863 1008
54A008k205K660l322M372o311J1078m3577q5280M2508N1358J389l7998R108M8792
$$ 1008 -1197 1463 -1859 2513 -3798 7280 -36297 -121577 -79069 -27711 -26322 -64320 -55212 -6420
68f420K6819l7387n1263j4482K4703J1552j7651j6759K4608M7943J8589l7770
$$ -6420 20399 -16988 -68251 -82733 -58030 -46478 -64129 -80888 -56280 -8337 10252 -27518
80b7518m8801n436K9758M018l4222j9536L8570N6029M493m6753k7270K2847J9117
$$ -27518 -76319 -81755 -51997 -47979 -82201 -101737 -63167 -7138 -2645 -49398 -76668 -53821 -34704
93c4704l4781m6491J0042N9999L3835k3322l1646J0023K8622r540m8075l0351
$$ -34704 -69485 -115976 -105934 -45935 -12100 -35422 -67068 -57045 -28423 -37963 -86038 -116389
105a16389K0755M0973J3149j5151q054J8291K0683j5810m6727k5712K5364L9848
$$ -116389 -95634 -54661 -41512 -56663 -64717 -46426 -25743 -41553 -88280 -113992 -88628 -48780
117d8780M0k9480K697M7449K5565m1330n6918q17M0227J1080l0104j1009L8583
$$ -48780 -48740 -78220 -75523 -28074 -2509 -43839 -100757 -101574 -61347 -50267 -80371 -91380 -52797
130e2797M3846n310m1578k2499J6396J7643j6010k8054M707M1816L5682q596l4301
$$ -52797 -8951 -14261 -55839 -78338 -61942 -44299 -60309 -88363 -83656 -41840 -6158 -14754 -49055
143d9055j2094K0641J1782k6396l1883J2455M8487K5346k3136k5705J6433L1580
$$ -49055 -61149 -40508 -28726 -55122 -87005 -74550 -26063 -717 -23853 -49558 -33125 -1545
155a545j1845m9606k0310L6629M1693l663k7252L055L4208J3618l1968l7053P49
$$ -1545 -13390 -62996 -83306 -46677 -4984 -8647 -35899 -32844 1364 14982 -16986 -54039 -53290
168e3290K8980J4706j1668r144J8245L1088O017l0739l2902M275K8577O760k5069
$$ -53290 -24310 -9604 -21272 -30416 -12171 18917 24934 -5805 -38707 -34432 -5855 905 -24164
181b4164j0193L3850M0407p337m2862j6246K5467J6466k5128k8403J6338M4749
$$ -24164 -34357 -507 39900 32563 -10299 -26545 -1078 15388 -9740 -38143 -21805 22944
193B2944J8734k2881k3778Q471K1137o408l1698j6817K1769L5292Q020j9840j1807
$$ 22944 41678 18797 -4981 3490 24627 18219 -13479 -30296 -8527 26765 34785 14945 3138
206C138J7205J8620j4647l7341j2563K8827L0289p104k4138N260L5018J2445l4938
$$ 3138 20343 38963 24316 -13025 -25588 3239 33528 26424 2286 7546 42564 55009 20071
219B0071l7105Q018L4402O768k5798q885K9786L1315r523l5178j4958J7121J4756
$$ 20071 -17034 -9016 25386 32154 6356 -2529 27257 58572 49049 13871 -1087 16034 30790
232C0790j2471j9044N698L1072K2197j0980k7953p303J9487Q424k2806k4790J5094
$$ 30790 18319 -725 4973 36045 58242 47262 19309 12006 31493 39917 17111 -7679 7415
245G415L9935J4671k5207k0865J5728K3052j3735l7103j0151L0283K8114o583
$$ 7415 47350 62021 36814 15949 31677 54729 40994 3891 -6260 24023 52137 45554
257D5554k0435L508K5214O835k6746k9550K958K5760J2215j2318j1772J4342K6014
$$ 45554 25119 28627 53841 60676 33930 4380 7338 33098 45313 32995 21223 35565 61579
270F1579J950k9558k6002P914K3399J004k1638n313K9227K8481j2297l6424r797
$$ 61579 63529 33971 7969 15883 39282 40286 18648 13335 42562 71043 58746 22322 12525
283A2525K2884J1441k3392k3219J5488L6510J1846k2902k0244Q030J4851q655
$$ 12525 35409 46850 23458 239 15727 52237 64083 41181 20937 28967 43818 35163
295C5163k5715j0286J9728K6683L057j9013r149J4974J3568j7763l3435p289K8200
$$ 35163 9448 -838 18890 45573 48630 29617 20468 35442 49010 31247 -2188 -9477 18723
308A8723K3623j0226k0011O894K7047K233l2914k7172J0086K5089J009j9249l039
$$ 18723 42346 32120 12109 19003 46050 48283 15369 -11803 -1717 23372 24381 5132 2093
321B093K5386K1149j2735l2102j2842J4408J1881j0493j5871O524K6921J6038
$$ 2093 27479 48628 35893 3791 -9051 5357 17238 6745 -9126 -2602 24319 40357
333D0357j4932k5704m502J4853K531k1176j6171J7694L3354P201k5210j7545J3622
$$ 40357 25425 -279 -4781 10072 12603 -8573 -24744 -7050 26304 33505 8295 -9250 4372
346D372J6277j5652l2146l898K8269K2869p600j7479L298J7477Q1k5793k2029
$$ 4372 20649 4997 -27149 -31047 -2778 20091 12491 -4988 -1690 15787 15868 -9925 -31954
359c1954N927K3010J0443j0739j0138J2833K0895l917l0563k1936J0681K2805
$$ -31954 -26027 -3017 7426 -3313 -13451 -618 20277 16360 -14203 -36139 -25458 -2653
371b653m56j6872J99K6195J7630j8133l0447n425J8609O349j8236j3086J8162
$$ -2653 -3109 -19981 -19782 6413 24043 5910 -24537 -29962 -11353 -5004 -23240 -36326 -18164
384a8164L0277N700k2680j9038N109J1337p290j9534l784K1231K2484k15j8170
$$ -18164 12113 17813 -4867 -23905 -18796 -7459 -14749 -34283 -38067 -16836 5648 5433 -12737
397a2737p459J0750O577j7673k5031K147K8240J9578j0783j7618O323J9676l249
$$ -12737 -20196 -9446 -2869 -20542 -45573 -43426 -15186 4392 -6391 -24009 -17686 1990 -1259
410a259k9797j8936J4045K3049J422j3863L83J9997J1353j6318k7458p256J5190
$$ -1259 -31056 -49992 -35947 -12898 -11476 -25339 -24956 -4959 6394 -9924 -37382 -44638 -29448
423b9448J2900o867j1424P677K3408J0249j8439k4708k167J5529L008j5892p554
$$ -29448 -16548 -23415 -34839 -27162 -3754 6495 -11944 -36652 -38819 -23290 -20282 -36174 -43728
436d3728K0516K6350o82k4776j3938J2331J0697j3870k1615L575K7822J8765q841
$$ -43728 -23212 3138 2456 -22320 -36258 -23927 -13230 -27100 -48715 -45140 -17318 1447 -7394
449g394j7418O01J2989k354k0814j4220J1252K2637Q586j0062q396J0424J3279
$$ -7394 -24812 -24211 -11222 -13576 -34390 -48610 -37358 -14721 -6135 -16197 -24593 -14169 -890
462h90q529k5983j2815J5966K2202j47j4314J857K0991R668j9958k4758J056J8788
$$ -890 -9419 -35402 -48217 -32251 -10049 -10196 -24510 -22653 -1662 8006 -11952 -36710 -35654 -16866
476a6866N946j2768n364J7494K1514j446k1838j5038P156J2070m024j3346M53
$$ -16866 -10920 -23688 -29052 -11558 9956 8510 -13328 -28366 -21210 -9140 -13164 -26510 -26057
489b6057K0972J8607m672j9200o911J1147N769j4835j5649R051K6827J2794j3645
$$ -26057 -5085 13522 8850 -10350 -17261 -6114 -345 -15180 -30829 -21778 5049 17843 4198
502D198j4852O476J5020n890k3306j0140J7521K2352P75j3019r49J4977P221j6332
$$ 4198 -10654 -4178 10842 4952 -18354 -28494 -10973 11379 12154 -865 -1814 13163 20384 4052
516D052k1087q52J7544J2176o049q110P517J8115L519j9591j9704L423J7658L701
$$ 4052 -17035 -17887 -343 11833 5784 -2326 5191 23306 26825 7234 -12470 -9047 8611 12312
530A2312j2682l753J8637J9322o513k3238q885J3036Q482j1375j3692Q625K3390
$$ 12312 -370 -4123 14514 33836 27323 4085 -4800 8236 16718 5343 -8349 276 23666
543B3666J0433j2254j5474J692J0784j591j6242q187J2892K0745M790j3212q033
$$ 23666 34099 21845 6371 8063 18847 17256 1014 -7173 5719 26464 31254 18042 10009
556A0009Q833R527j0151k0470m545J8422J7138m350j3192K566J6728L425j9528
$$ 10009 18842 28369 18218 -2252 -6797 11625 28763 24413 11221 13787 30515 33940 14412
569A4412j9352N343J8752N231j1032m853J4369J4859n934k0963j0271Q898J0956
$$ 14412 -4940 403 19155 24386 13354 8501 22870 37729 31795 10832 561 9459 20415
582B0415l845j0606K482J7704J2410r186j9623m545J2176N225j2515j1556J0453
$$ 20415 16570 5964 8446 26150 38560 29374 9751 5206 17382 22607 10092 -1464 8989
595H989K2096O135j5848j3050P321J0874p957j8530l747J7890J6647l607j3487
$$ 8989 31085 37220 21372 8322 15643 26517 18560 30 -3717 14173 30820 27213 13726
608A3726j663J2352L860j4732j6767K075J7009R454p803p933O571J3649k051j9255
$$ 13726 12063 24415 28275 13543 -3224 -1149 15860 25314 17511 9578 16149 29798 27747 8492
622H492j3754P882J5410L82j2303k243J6603J3110j0060k1353n646J2883P476
$$ 8492 -5262 2620 18030 18412 6109 3866 20469 33579 23519 2166 -3480 9403 16879
635A6879j0311j0309Q969J8612M763j4471j3259L033R485l308j3678n426J3272
$$ 16879 6568 -3741 5228 23840 28603 14132 873 3906 13391 10083 -3595 -9021 4251
648D251J7132N02j4201q198P756P899r886j7089m88J7134J2881p181j2193L400
$$ 4251 21383 21885 7684 -514 7242 15141 5255 -11834 -12322 4812 17693 10512 -1681 1719
662A719J3093j093j8891j3379P467J6070K831j0629m574J1563J1253p418j8707
$$ 1719 14812 13719 -5172 -18551 -11084 4986 7817 -2812 -7386 4177 15430 8012 -10695
675a0695p589R719R046m046q991L153J5528P215j2494j7047r14J1424L059j2229
$$ -10695 -18284 -8565 481 -3565 -12556 -9403 6125 13340 846 -16201 -17115 -5691 -2632 -14861
689a4861q229J1221J8372K110j6054j1116P174Q325p579j5247L79J7001J2352
$$ -14861 -23090 -11869 6503 8613 -7441 -18557 -11383 -3058 -10637 -25884 -25505 -8504 3848
702C848o464j2018L41R795P19j4267j3171M888J6416P465p588q178O536J0713
$$ 3848 -2616 -14634 -14293 -4498 -3779 -18046 -31217 -26329 -9913 -2448 -10036 -18214 -11678 -965
716i65m385j7489r088J0122J3468j982j0120Q79J5243P887j2535j8448j410J2727
$$ -965 -5350 -22839 -31927 -21805 -8337 -10319 -20439 -19560 -4317 3570 -8965 -27413 -28823 -16096
730a6096O009q590o980Q931J5604K410j4366j0762L701Q623k905j0947j493J4122
$$ -16096 -10087 -18677 -25657 -16726 -1122 1288 -13078 -23840 -20139 -11516 -14421 -25368 -26861 -12739
744a2739J4203k418j4085n439P931N968r443j3414K598J7674J0422p214j0412
$$ -12739 1464 -954 -15039 -20478 -12547 -6579 -16022 -29436 -26838 -9164 1258 -5956 -16368
757a6368L915J0263k637j6631q341J0698J4974J727r833j837J0878P661r066j6443
$$ -16368 -12453 -2190 -4827 -21458 -29799 -19101 -4127 -2400 -12233 -14070 -3192 4469 -4597 -21040
771b1040l932J0727J0046l088o760M682J3309L711j3302j4344K456J2013J677
$$ -21040 -24972 -14245 -4199 -7287 -14047 -9365 3944 7655 -5647 -19991 -17535 -5522 -3845
784c845r732m197J3278J5795k407j6410q156P800P114o731j0765L711J6302R621
$$ -3845 -13577 -17774 -4496 11299 8892 -7518 -15674 -7874 -760 -7491 -18256 -14545 1757 11378
798A1378p440j0817P73Q441m30j2897q331Q553J6000N255q653o854N798Q315n999
$$ 11378 3938 -6879 -6106 2335 1905 -10992 -19323 -10770 5230 10485 1832 -5022 776 9091 3092
813C092j5101n447J1729J3052j648q975J971J2801L414j3899j4573J816J2999
$$ 3092 -12009 -17456 -5727 7325 5677 -3298 -1327 11474 14888 989 -13584 -11768 1231
826A231N110o873m112Q993J2052j156j4004r980M719Q628j471q199R84J3597J0982
$$ 1231 6341 -532 -4644 4349 16401 15245 1241 -8739 -4020 4608 3137 -5062 -4078 9519 20501
841B0501o042j4297m105Q572M112r086r025O623J6991O972r722j0157L444Q289
$$ 20501 14459 162 -3943 4629 8741 -345 -9370 -2747 14244 21216 11494 1337 4781 13070
855A3070m230j3482m301J2546J3430m58r686j347Q593M241j0822j3005j99J2919
$$ 13070 8840 -4642 -8943 3603 17033 16575 6889 5542 14135 18376 7554 -5451 -5650 7269
869G269Q601l705o457M021J1022K36j3990j1705M323J1993K121q546j540J2085
$$ 7269 15870 12165 5708 9729 20751 20987 6997 -4708 -385 11608 13729 5183 3643 15728
883A5728J0746o160j6120m941Q267O422o045p165M705J4390O246r323j1191J03
$$ 15728 26474 20314 4194 -747 7520 13942 7897 732 5437 19827 26073 16750 5559 5662
897E662P224m19r685m566R398J3514K403j0997n852M757N650o243j2456j741J3116
$$ 5662 12886 12467 2782 -1784 7614 21128 23531 12534 6682 11439 17089 10846 -1610 -3351 9765
912I765J0716l034r494R44R079J075j2975j1381M395J2892L760o980l910P870
$$ 9765 20481 17447 7953 8897 17976 19051 6076 -5305 -910 11982 15742 8762 4852 12722
926A2722Q475m724j4062p087O944Q537j717p297J189J1936O620q387j3822k241
$$ 12722 21197 16473 2411 -4676 2268 10805 9088 1791 2980 14916 21536 13149 -673 -2914
940b914Q416L864q068o502Q083J4220J414j2002r053M704O547m107j1246j578
$$ -2914 5502 9366 1298 -5204 2879 17099 18513 6511 -2542 2162 8709 4602 -6644 -8222
954h222J2027J0895k889j0097k386O628K313r388j0115L268J2161O058o064o774
$$ -8222 3805 14700 11811 1714 -672 5956 8269 -1119 -11234 -7966 4195 10253 4189 -2585
968b585L913Q078k278j3218q079O529J1330J282p975j592R288O572p900j3456
$$ -2585 1328 9406 7128 -6090 -14169 -7640 3690 4972 -3003 -4595 4693 11265 3365 -10091
982a0091k707Q968N485n406n855N162J1620K236j0701r676J580P364p7p848k911
$$ -10091 -12798 -3830 1655 -3751 -9606 -4444 7176 9412 -1289 -10965 -9385 -2021 -2098 -9946 -12857
997a2857R030J0775p98j0953n221N292M662o127j0328K168J2931P782o504r035
$$ -12857 -3827 6948 6150 -4803 -10024 -4732 -70 -6197 -16525 -14357 -1426 6356 -148 -9183
1011i183J548Q558p34j1493p724O190J1854K159p142l416O729N988o181j2327
$$ -9183 -7635 923 189 -11304 -19028 -12838 -984 1175 -5967 -9383 -2654 3334 -2847 -15174
1025a5174l106R164P355l380o327J948J0306L974r392j1618L97Q971K364o179
$$ -15174 -18280 -9116 -1761 -5141 -11468 -9520 786 4760 -4632 -16250 -15853 -6882 -4518 -10697
1039a0697m024P405J0634j117j1453o159N331O179m353q719Q91J1393Q187m770
$$ -10697 -14721 -7316 3318 2201 -9252 -15411 -10080 -3901 -8254 -16973 -16082 -4689 3498 -1272
1053a272r545j154O329J675p935p052L909J1480M226o367n970M140P039l357j1975
$$ -1272 -10817 -11971 -5642 -3967 -11902 -18954 -15045 -3565 661 -5706 -11676 -7536 -497 -3854 -15829
1068a5829m789Q654R910l87q214k99Q872M490q030j1231N5Q858M536n005m337
$$ -15829 -20618 -11964 -2054 -2441 -10655 -10954 -2082 2408 -5622 -16853 -16798 -7940 -3404 -8409 -12746
1083a2746N997R692l05j0958p642M121P844p98p527j062R709R083l069j0550l434
$$ -12746 -6749 2943 2638 -8320 -15962 -11841 -3997 -4795 -12322 -13384 -3675 5408 2339 -8211 -11645
1098a1645N919M278o337p248M163J2074N045o999p741L094O854j568j0533m309
$$ -11645 -5726 -1448 -7785 -15033 -10870 1204 6249 -750 -8491 -5397 1457 -111 -10644 -14953
1112a4953Q017J0415J050o918k420O406M090o168r845q14R184O333l145n517L050
$$ -14953 -6936 3479 4529 -2389 -4809 1597 5687 -481 -10326 -11140 -1956 4377 1232 -4285 -1235
1127a235R194J603j0010r203L097R092K053n935k692Q054Q593l101j0241m327
$$ -1235 7959 9562 -448 -9651 -6554 2538 4591 -1344 -4036 4018 12611 9510 -731 -5058
1141e058N635N071l866o561K557J1268N768o428q680N6O648P76p382m932O282
$$ -5058 577 5648 1782 -4779 -2222 9046 14814 8386 -294 -238 6410 7186 -196 -5128 1154
1156A154J0694K660p565m909M610M689m398j0012j923J0085Q654k390p553R39
$$ 1154 11848 14508 6943 2034 6644 11333 6935 -3077 -5000 5085 13739 11349 3796 4735
1170D735Q078J415r299r023K544R323L632m976l066N710P524k793j0664n624N095
$$ 4735 12813 14228 4929 -4094 -1550 7773 11405 6429 3363 9073 16597 13804 3140 -2484 2611
1185B611O724j156o149L45R733O016n641j0256j982O567K386n567m848N180J0504
$$ 2611 9335 8179 2030 2375 12108 18124 12483 2227 245 6812 9198 3631 -1217 3963 14467
1200A4467K565p908o863K846N312l012q555j814Q723Q989j273p710k099N567K356
$$ 14467 17032 9124 2261 5107 10419 7407 -1148 -2962 5761 14750 13477 5767 3668 9235 11591
1215A1591o925q219J638R148N448l803n413L164O595j345j0234o913M799R060
$$ 11591 4666 -3553 -1915 7233 12681 8878 3465 6629 13224 11879 1645 -5268 -469 8591
1229H591O86o078j379Q075N495n605j0673k985O475M742l363m814L556R235K939
$$ 8591 9277 3199 1820 9895 15390 9785 -888 -3873 2602 7344 3981 -833 2723 11958 14897
1244A4897q414p954J189N863j02o974k805P411R524k79r046m691M649L670m888
$$ 14897 6483 -1471 -282 5581 5479 -1495 -4300 3111 12635 12356 3310 -1381 3268 6938 2050
1259B050q036P95J0015O417l711o891Q37N593m59r130n936M451R082K237n262
$$ 2050 -5986 -5191 4824 11241 7530 639 1476 7069 6610 -2520 -8456 -4005 5077 7314 2052
1274B052l226N308M684m279r678l915O018O547j158m981Q29P836K924p275r155
$$ 2052 -1174 4134 8818 4539 -5139 -9054 -3036 3511 2353 -2628 -1799 6037 8961 1686 -7469
1289g469o8O517K478n145l537N913Q654m48q779n966L106M672k386o242l09Q608
$$ -7469 -7537 -1020 1458 -3687 -7224 -1311 7343 6895 -1884 -7850 -4744 -72 -2458 -8700 -9009 -401
1305d01O510l136q247j350M689J637o904o132L392R398M147n366n358K461N433
$$ -401 6109 2973 -5274 -6624 -1935 -298 -7202 -13334 -9942 -544 3603 -1763 -7121 -4660 773
1320G73k429q903m315O058P758J87n964r86O860L029o420r480l82P506M019l592
$$ 773 -1656 -10559 -14874 -8816 -1058 -871 -6835 -7821 -961 2068 -4352 -13832 -14214 -6708 -2689 -6281
1336f281m232L925P737L62q557o644K363N678j13n441m88P104O745k366q727l441
$$ -6281 -10513 -6588 1149 1511 -7046 -13690 -11327 -5649 -5762 -11203 -11691 -4587 2158 -208 -8935 -12376
1352a2376M751L414m179n566K058R478L993m497o682J323M512o97p192l334N394
$$ -12376 -7625 -4211 -8390 -13956 -11898 -2420 1573 -2924 -9606 -8283 -3771 -4468 -11660 -14994 -9600
1367i600Q733O77n882k408M889L654m651q533j409P654O171j833m898J534N954
$$ -9600 -867 -190 -6072 -8480 -3591 63 -4588 -13121 -14530 -6876 -705 -2538 -7436 -5902 52
1382E2J384o810p339J987P353K000m854k109N781P320k343r090m113M668M872
$$ 52 1436 -5374 -12713 -10726 -3373 -1373 -6227 -8336 -2555 4765 2422 -6668 -10781 -6113 -1241
1397a241j868n099R17P948M913m327p183l79N010J176n177m142M518Q973J857
$$ -1241 -3109 -8208 -7291 657 5570 1243 -5940 -6319 -1309 -133 -5310 -9452 -4934 4039 5896
1412E896o159m812L259M746k557p580j969O972P070q70n646m70N488J732o475
$$ 5896 -263 -5075 -1816 2930 373 -7207 -9176 -2204 4866 3996 -1650 -2120 3368 5100 -1375
1427a375o467J834P281L347l830l543L840N966o91p582n412L853N530K62m762
$$ -1375 -7842 -6008 1273 4620 790 -2753 1087 7053 6362 -1220 -6632 -2779 2751 3013 -1749
1442a749l00O456N251m145p466j690N214L012m257m543L352Q422K663n977n899
$$ -1749 -2049 4407 9658 5513 -1953 -3643 1571 4583 326 -4217 -865 7557 10220 4243 -1656
1457a656J766M862j041o124j905N867P261o93n962j677M104K934m630o827M22
$$ -1656 110 4972 3931 -2193 -4098 1769 9030 8337 2375 698 4802 7736 3106 -3721 -3299
1472c299P702M596k879m605J440N464O39p336n375K941O794J274m569j535N480
$$ -3299 4403 8999 6120 1515 2955 8419 9058 1722 -3653 -712 6082 7356 2787 1252 6732
1487F732N001l385q022k537M914M550k366n023K366P271K741m953o587N65M622
$$ 6732 11733 8348 326 -2211 2703 7253 4887 -136 2230 9501 12242 7289 702 1267 5889
1502E889N25m683k484M772P164L26o439l735L638L590l347o267k25O999N673k573
$$ 5889 6414 1731 -753 4019 11183 11509 5070 1335 4973 8563 5216 -1051 -1276 5723 11396 8823
1518H823n055L62M269J017o372n185K530O817K137l945k930L837M635k192p345
$$ 8823 3768 4130 8399 9416 3044 -2141 389 7206 9343 5398 2468 6305 10940 8748 1403
1533A403m084M497N468q10m631M39O002L309n176p049l61N357K034m173l111L762
$$ 1403 -2681 1816 7284 6474 1843 2282 8284 11593 6417 -632 -993 4364 6398 2225 -886 2876
1549B876O826R34o830n022K299M342j786n267j174O642N604k039n949j630L839
$$ 2876 9702 10636 3806 -1216 1083 5425 3639 -1628 -2802 3840 9444 7405 1456 -174 3665
1564C665J231m792m957J722P217K972l327m615J948M339j167o970m198M081O250
$$ 3665 4896 104 -4853 -3131 4086 7058 3731 -884 1064 5403 4236 -2734 -6932 -2851 3399
1579C399N25m652r99M492L313m162p284j020M964L363k539l637K618N951J144
$$ 3399 3924 -728 -1727 2765 6078 1916 -5368 -6388 -1424 1939 -600 -4237 -1619 4332 5476
1594E476o350n453J032M739j93m103j352N374N827j723o632l049L705K173l160
$$ 5476 -874 -6327 -5295 -556 -749 -4852 -6204 -830 4997 3274 -3358 -6407 -2702 -529 -3689
1609c689m657J484O806M262l643n371O80L758k29o145l531L921O613J554m271
$$ -3689 -8346 -6862 -56 4206 563 -4808 -4128 -370 -599 -6744 -10275 -6354 259 1813 -2458
1624b458k368K953L395l531o347j857M967N166j011m171Q48M960J533n107o475
$$ -2458 -4826 -1873 1522 -2009 -8356 -10213 -5246 -80 -1091 -5262 -4414 546 2079 -3028 -9503
1639i503O14N551J666l107k094L960N609j129o491l787K535L599j423l980P11
$$ -9503 -8889 -3338 -1672 -4779 -6873 -2913 2696 1567 -4924 -8711 -6176 -2577 -4000 -7980 -7269
1654g269O069M430l005n934j276M012J219m288l827L276O565K248m367l873K001
$$ -7269 -1200 3230 225 -5709 -6985 -2973 -1754 -6042 -9869 -6593 -28 2220 -2147 -6020 -4019
1669d019L362k187n783j725M991O357r45m341p60L975K123m751o125M27N800L083
$$ -4019 -657 -2844 -8627 -10352 -5361 996 51 -4290 -5050 -1075 1048 -3703 -9828 -9401 -3601 -518
1685e18k095k716K354M887n42o520m333K293M721K85l401m07M884M543k691o060
$$ -518 -2613 -5329 -2975 1912 1370 -5150 -9483 -7190 -2469 -2184 -5585 -5992 -1108 3435 744 -5316
1701e316k360L326L067k958k850J922O293K324m260m666R17L569k72m700k398
$$ -5316 -7676 -4350 -1283 -4241 -7091 -5169 1124 3448 -812 -5478 -4561 -992 -1264 -5964 -8362
1716h362N035N708O52m901k305K741K371k695n365J86N478M345j926l662J020
$$ -8362 -3327 2381 3033 -1868 -4173 -1432 939 -1756 -7121 -6935 -1457 2888 962 -2700 -1680
1731a680M365j09m879n193K496N586J610l130j783L692M295k043o381k200L576
$$ -1680 2685 2576 -2303 -7496 -5000 586 2196 -934 -2717 975 5270 3227 -3154 -5354 -1778
1746a778L742j496k625J256N065K605m149n161K4L828J498l670k305L507N970
$$ -1778 1964 468 -2157 -901 4164 6769 2620 -2541 -2517 1311 2809 -861 -3166 341 6311
1761F311Q02m792l146J664K948j565m713p8N542M320j388m657k69L958Q94m181
$$ 6311 7113 2321 -825 839 3787 2222 -2491 -2569 2973 7293 5905 1248 979 4937 5831 1650
1777A650m394J377O079K398k854k511J930L435q54n596k665L084M525l10l062
$$ 1650 -2744 -1367 4712 7110 4256 1745 3675 7110 6256 660 -2005 1079 5604 5294 2232
1792B232l09M276K865l371n263j329M244K413k491k739K219N457J000m568m459
$$ 2232 1923 6199 9064 5693 430 -899 3345 5758 3267 528 2747 8204 9204 4636 177
1807A77J795K878l65m110q90M994M414j089m964j671K685K111k792m243P47N524
$$ 177 1972 4850 4485 375 -515 4479 8893 7804 2840 1169 3854 5965 3173 -1070 -323 5201
1823E201K801k613l593Q99L639p61m757l290K998M994O15l773j187L611K875k971
$$ 5201 8002 5389 1796 2695 6334 5573 816 -2474 524 5518 6133 2360 1173 4784 7659 4688
1839D688n664j154L830L447j864l013J656M135J428m388m732J101L811K01l243
$$ 4688 -976 -2130 1700 5147 3283 270 1926 6061 7489 3101 -1631 -530 3281 3482 239
1854B39j736L852M464l36m754l131K299K617j872l902K20M964L476k553m047L42
$$ 239 -1497 2355 6819 6483 1729 -1402 897 3514 1642 -2260 -2040 2924 6400 3847 -200 142
1870A42L296k13l745l417K530M995J572l625k082K222K493j527m990j783L228
$$ 142 3438 3225 -520 -3937 -1407 3588 5160 1535 -547 1675 4168 2641 -2349 -4132 -904
1885i04L889n35l408N16M187J482m268m749NM129J927k727k199K764M308J56n122
$$ -904 2985 2450 -958 -442 3745 5227 959 -3790 -3785 344 2271 -456 -2655 109 4417 4573 -549
1902e49l226K228K514p98l580j27M703L409k308m122j206K594J571l296l304J800
$$ -549 -3775 -1547 967 169 -3411 -3538 1165 4574 2266 -1856 -3062 -468 1103 -2193 -5497 -3697
1918c697M998K310l181l589J357K772j097m372j856L491L972J5l523n66K929J833
$$ -3697 1301 3611 430 -3159 -1802 970 -127 -4499 -6355 -2864 1108 1123 -2400 -2966 -37 1796
1934A796l527m385l79L866K904k065k279J646L621L41m653l830J511L275O71k537
$$ 1796 -1731 -6116 -6495 -2629 275 -1790 -4069 -2423 1198 1539 -3114 -6944 -5433 -2158 -1487 -4024
1950d024j069L566L519j776m779k183K915K049j937k967J109M817K453l193l689
$$ -4024 -5093 -1527 1992 216 -4563 -6746 -3831 -1782 -3719 -6686 -5577 -760 1693 -1500 -5189
1965e189K97K658J6l689j783L034M681N02l569j895K210K252k485m618l81M123
$$ -5189 -4892 -2234 -2218 -5907 -7690 -4656 25 527 -3042 -4937 -2727 -475 -2960 -7578 -7959 -3836
1981c836L664j076l268N93L741M67m309l832J601M021J264k359j505K966L767
$$ -3836 -172 -1248 -4516 -3923 -182 285 -4024 -7856 -6255 -2234 -970 -3329 -4834 -1868 1899
1996A899j790m646k238K440K709n10k835P64M346K563l107m241r0L065N50k303
$$ 1899 109 -4537 -6775 -4335 -1626 -2136 -4971 -4207 139 2702 -405 -4646 -4736 -1671 -1121 -3424
2012c424k187K492M884J111l772k842J319K778j227l721j117M317L860n75l381
$$ -3424 -5611 -3119 1765 2876 -896 -3738 -2419 359 -868 -4589 -5706 -1389 2471 1896 -1485
2027a485n56K779Q50l231l426P17M603K118k079j743J821K676p88m490k683K776
$$ -1485 -2041 738 1588 -1643 -5069 -4352 251 2369 290 -1453 368 3044 2256 -2234 -4917 -2141
2043b141L382K69k397k31L324K640k834m585o62L070K196k008k133J607M840Q71
$$ -2141 1241 1510 -887 -1118 2206 4846 2012 -2573 -3235 -165 2031 23 -2110 -503 4337 5208
2059E208l933l444Q57L248o42k632q93L363L782n05l379j578K144J312k257l430
$$ 5208 1275 -2169 -1312 1936 1294 -1338 -2231 1132 4914 4409 1030 -548 1596 2908 651 -2779
2075b779R12M597K168j690k870O09L017k3l930k652J734M325R75k682j165K294
$$ -2779 -1867 2730 4898 3208 338 947 3964 3941 11 -2641 -907 3418 4393 1711 546 2840
2091B840K450k320l810j393K957K809j019k218N51L887J338l552l493K77K873
$$ 2840 5290 2970 -840 -2233 724 3533 2514 296 847 4734 6072 2520 -973 -696 2177
2106B177J200k446j346K634L807l72l918k571K174K308j374l068K53M066L039
$$ 2177 3377 931 -415 2219 6026 5654 1736 -835 1339 3647 2273 -795 -542 3524 6563
2121F563j951l365n09K806O29l203k636J741M282R65k295j904J532K502j463m167
$$ 6563 4612 1247 738 3544 4173 970 -1666 75 4357 5322 3027 1123 2655 5157 3694 -473
2137d73j166K832L531k28k874j04L097J543l177l684JL230J608j888j643J707
$$ -473 -1639 1193 4724 4496 1622 1518 4615 6158 2981 -703 -702 2528 4136 2248 605 2312
2153B312L582l08l773k946J633K659l00k642o25L284L178j581l508j130K150J071
$$ 2312 5894 5586 1813 -1133 500 3159 2859 217 -408 2876 6054 4473 965 -165 1985 3056
2169C056k106k170J188L789J780k380k831N26K325j21l795j898K475L886J27k898
$$ 3056 950 -1220 -32 3757 5537 3157 326 852 3177 3056 -739 -2637 -162 3724 3851 953
2185I53j148K597J074k338l423l24L252K353j443k458P63L658J31l946l429J493
$$ 953 -195 2402 3476 1138 -2285 -2609 643 2996 1553 -905 -142 3516 3647 -299 -3728 -2235
2201b235K982N01k204j101K585K839j386l525j378J762J567j406k620J254L731
$$ -2235 747 1248 -956 -2057 528 3367 1981 -1544 -2922 -1160 407 -999 -3619 -2365 1366
2216A366J789k525l247K18K132K00k709j807K011L752O16k850j784J502J976k130
$$ 1366 3155 630 -2617 -2399 -267 -67 -2776 -4583 -2572 1180 1796 -1054 -2838 -1336 640 -1490
2232a490k951n75L090K998j131k616K03K523R69l183l151P00L295J379k411j047
$$ -1490 -4441 -5016 -1926 1072 -59 -2675 -2472 51 1020 -2163 -5314 -4614 -1319 60 -2351 -3398
2248c398J890K662p65l768k035J973K303j70k509L49K942K057j833l837k62K230
$$ -3398 -1508 1154 389 -3379 -5414 -3441 -1138 -1308 -3817 -3468 -526 1531 -302 -4139 -4401 -2171
2264b171J109k092j869J995L299J349l104k404J172K223r62l094p67L042L264
$$ -2171 -1062 -3154 -5023 -3028 271 1620 -1484 -3888 -2716 -493 -1455 -4549 -5316 -2274 990
2279I90o04l081m78K192R51k258k790L29L472J733j508j742J073K417l27l604
$$ 990 386 -2695 -3173 -981 -30 -2288 -5078 -4749 -1277 456 -1052 -2794 -1721 696 369 -3235
2295c235k232J820L258r3k416l56K777K381j894l582p85K251J627j123k149J022
$$ -3235 -5467 -3647 -389 -482 -2898 -3254 -477 1904 10 -3572 -4357 -2106 -479 -1602 -3751 -2729
2311b729L452J327k649k994Q45J756J85k232j152K351L571k2l344j384J742J584
$$ -2729 723 2050 -599 -3593 -2748 -992 -807 -3039 -4191 -1840 1731 1709 -1635 -3019 -1277 307
2327C07j841k350j99L717J903j012k394L00K231qk933k390J557L532Q74k168j092
$$ 307 -1534 -3884 -4083 -366 1537 525 -1869 -1569 662 654 -2279 -4669 -3112 420 1294 -874 -1966
2344a966K008K261j419l753r58K287K305o75j942Q36K853J182k756l184N05K562
$$ -1966 42 2303 884 -2869 -3827 -1540 765 90 -1852 -1016 1837 3019 263 -2921 -2416 146
2360A46P23j824j307K294L037L73l447j856J420J849q28k361j50L295K314j147
$$ 146 869 -955 -2262 32 3069 3442 -5 -1861 -441 1408 580 -1781 -1931 1364 3678 2531
2376B531k615n96K291Q02k527k123J108L260J783k009k072J592J949p74l048j521
$$ 2531 -84 -680 1611 2413 -114 -2237 -1129 2131 3914 1905 -167 1425 3374 2600 -448 -1969
2392a969K435K771p1k424j80K919R50k197l430L5K858J772j546j528Q97L327J71
$$ -1969 466 3237 3166 742 562 3481 4431 2234 -1196 -1161 1697 3469 1923 395 1292 4619 4790
2409D790k738k358R20J894k2j769n84L095J956p31k992j273J991R80j586k228
$$ 4790 2052 -306 614 2508 2486 717 133 3228 5184 4453 1461 188 2179 3159 1573 -655
2425f55J173K713K118j992k247O02J852m45k846j378K101L043K10k485j030K114
$$ -655 518 3231 5349 3357 1110 1712 3564 3119 273 -1105 996 4039 4249 1764 734 2848
2441B848J330j571l369m16K882J995r45j851P38K128L21k672k555Q16K264Q49
$$ 2848 4178 2607 -762 -1178 1704 3699 2754 903 1641 3769 4090 1418 -1137 -321 1943 2792
2457B792k080p50J822K844r89l227j577J735J623q55k080M54K727J577j807k384
$$ 2792 712 -38 1784 4628 3639 412 -1165 570 2193 1338 -742 -288 2439 4016 2209 -175
2473a75l67K030K16k185j559J628L337N72k596j592J378J484j032k895m27K331
$$ -175 -542 1488 1704 -481 -2040 -412 2925 3497 901 -691 687 2171 1139 -1756 -2183 148
2489A48K509r81k284J92K396J84k167k748P99K671J304j865j241J483K437r30
$$ 148 2657 1676 -608 -416 1980 2164 -3 -2751 -1952 719 2023 158 -1083 400 2837 1907
2505A907k595k087J182K446l66k014R8K265J995j769l013j54J817J010j623j820
$$ 1907 -688 -2775 -1593 853 487 -1527 -1429 836 2831 1062 -1951 -2105 -288 722 -901 -2721
2521b721J689K909N93k412j929P77J570m11k512n44J832K575l30k151p79J883
$$ -2721 -1032 1877 2470 58 -1871 -1094 476 65 -2447 -2991 -1159 1416 1086 -1065 -1844 39
2537C9J017k169k366J49L298J188j327j626O74K184k84k652k027J432K300Q1j821
$$ 39 1056 -1113 -3479 -3330 -32 1156 -171 -1797 -1123 1061 777 -1875 -3902 -2470 -170 -89 -1910
2554a910k36J981J928j703l128o16K008J039p39j712O76K793R99j968k565M84
$$ -1910 -2146 -165 1763 60 -3068 -3684 -1676 -637 -1376 -3088 -2412 381 1380 -588 -3153 -2669
2570b669J837k11j969p21K113K227p3k724p82J550J000j428k080N4K693J870j413
$$ -2669 -832 -1043 -3012 -3733 -1620 607 534 -2190 -2972 -1422 -422 -1850 -3930 -3876 -1183 687 -726
2587g26j715q0J935J89k078k051J008K646Q25j993q36J656J788j173k549j141
$$ -726 -2441 -2521 -586 -397 -2475 -4526 -3518 -872 -47 -2040 -2876 -1220 568 -605 -3154 -4295
2603d295J840K210o57j958N16K423J125k151k522J08K257M32j301j332J581K566
$$ -4295 -2455 -245 -902 -2860 -2344 79 1204 -947 -3469 -3361 -1104 -672 -1973 -3305 -1724 842
2619H42K56k558j721J237J863r54k252K80K338J921m93k498j46J457O01j560j801
$$ 842 1098 -1460 -3181 -1944 -81 -1035 -3287 -3007 -669 1252 759 -1739 -1885 -428 173 -1387 -3188
2636c188R36K926Q27j832j435J082J999n71k577j130J608K304M3j681k22J759
$$ -3188 -2252 674 1501 -331 -1766 -684 1315 744 -1833 -2963 -1355 949 992 -689 -911 848
2652H48J413j243k842k71K046J482j274j359J015K583M24k407k215J164J858m2
$$ 848 2261 1018 -1824 -2095 -49 1433 159 -1200 -185 2398 2822 415 -1800 -636 1222 1180
2668A180j721o22K281J755l60k482q48J150J321j231j706O14K547J610k025j522
$$ 1180 -541 -1163 1118 2873 2513 31 -817 333 1654 423 -1283 -669 1878 3488 1463 -59
2684e9K72J741m1j889j552J672K559P9k060n89J419J422j359k178n55K135J825
$$ -59 213 1954 1913 24 -1528 144 2703 2782 722 133 1552 2974 1615 -563 -1118 1017 2842
2701B842j127j686N86K216M46k134j946M59K275K25j440o06J391J867l51k400
$$ 2842 1715 29 615 2831 3277 1143 -803 -344 1931 2156 716 110 1501 3368 3017 617
2717F17r47J025J459p57j908N56K417J284j374j947j46J302P53j952j227J182
$$ 617 -330 695 2154 1397 -511 45 2462 3746 2372 425 279 1581 2334 382 -845 337
2733C37K398L48j786j272J159J492m82k453o81K026J822m80j574k40J807N72j850
$$ 337 2735 3083 1297 25 1184 2676 2194 -259 -940 1086 2908 2428 854 614 2421 2993 1143
2750A143k084L39K208J080j415j085J211J892l92k351j550J040K221l89j818j23
$$ 1143 -941 -602 1606 2686 1271 186 1397 3289 2897 546 -1004 36 2257 1868 50 -73
2766g3K183J612j530k021m28J498Q41j166j528M53K710M96j571j439M99J382j77
$$ -73 2110 3722 2192 171 -257 1241 2082 916 -612 -159 2551 3047 1476 37 536 1918 1741
2783A741k441p34K165J846J39k262m93J547P24j525j873J51J982J170j086j388
$$ 1741 -700 -1434 731 2577 2716 454 -39 1508 2232 707 -1166 -1015 967 2137 1051 -337
2799c37O61J801j72k264j617R62K289K33j774p34J678J677j156k222q71J288J736
$$ -337 324 2125 1953 -311 -1928 -966 1323 1556 -218 -952 726 2403 1247 -975 -1846 -558 1178
2816A178j443j092L08K331O31j634j808j05K011j87j628r53J340K340K52j906
$$ 1178 -265 -1357 -1049 1282 1913 279 -1529 -1634 377 190 -1438 -2391 -1051 1289 1541 -365
2832c65j405R63J051j155j731R8J950J655j038j642nJ485M75k138j442O35K301
$$ -365 -1770 -807 244 -911 -2642 -2544 -594 1061 23 -1619 -1624 -139 336 -1802 -3244 -2609 -308
2849c08M49j473r31J163J564q15k310o99J526J454o50j166J81J927R19j629k135
$$ -308 141 -1332 -2263 -1100 464 -351 -2661 -3360 -1834 -380 -1030 -2196 -2015 -88 831 -798 -2933
2866b933J41J430M97r71j246J576J657K5j657j412J115J077l85j500o32J970J824
$$ -2933 -2792 -1362 -865 -1836 -3082 -1506 151 176 -1481 -2893 -1778 -701 -1086 -2586 -3218 -1248 576
2883E76q43j837k74J271R82j578j634Q74J748J353j246j488N83J662l32k231q34
$$ 576 -267 -2104 -2378 -1107 -125 -1703 -3337 -2463 -715 638 -608 -2096 -1513 149 -183 -2414 -3248
2900c248J315J600N32k028p6J746Q52j057j960k39J461R47l68j386P28K139lj889
$$ -3248 -1933 -333 199 -1829 -1905 -159 693 -364 -2324 -2563 -1102 -155 -523 -1909 -1181 958 955 -934
2918i34j664O31J768nj587p20J678K268p31k079j69J010Q48q71j929R30J959J062
$$ -934 -2598 -1967 -199 -204 -1791 -2511 -833 1435 704 -1375 -1544 -534 314 -557 -2486 -1556 403 1465
2936A465j543j299N90J378o4j625j590J387J755O35j896l85J021J335r05j932
$$ 1465 -78 -1377 -787 591 527 -1098 -2688 -1301 454 1089 -807 -1192 -171 1164 259 -1673
2952a673k40J494J478q75j081M05J634N21j735j636L80J497N03j309n75J226J749
$$ -1673 -1913 -419 1059 184 -897 -492 1142 1663 -72 -1708 -1328 169 672 -637 -1212 14 1763
2969A763k60j874r83P39J531p12j320J5K036J046r66j691j55J436M80j257j133
$$ 1763 1503 -371 -1354 -615 916 204 -1116 -1101 935 1981 1015 -676 -831 605 1085 -172 -1305
2986a305P64J930O73j104j405R64J220o76j394q41J475J798n96j646Q0J627L56
$$ -1305 -541 1389 2062 958 -447 517 1737 1061 -333 -1174 301 2099 1503 -143 -63 1564 1920
3003A920j002k025Q6K022J112j393r54Q60J765J52j686j608R88J525J30j637k35
$$ 1920 918 -1107 -1021 1001 2113 720 -234 626 2391 2543 857 -751 237 1762 1892 255 20
3020B0J721J367q95j712o90J373O77p97j110L56K054L94j320j193M99J304j02
$$ 20 1741 3108 2213 501 -189 1184 1861 1064 -46 310 2364 2758 1438 245 744 2048 1946
3037A946j661q45J729J259K68j602o72J141J077j100j736m19K111P81n19j452
$$ 1946 285 -560 1169 2428 2696 1094 422 1563 2640 1540 -196 -615 1496 2277 1758 306
3053C06N87J444N1j435j149M01J632N7j139n54J175J228n82j725o04J080J085
$$ 306 893 2337 2388 953 -196 205 1837 1894 755 201 1376 2604 2022 297 -307 773 1858
3070A858n30j596K93J803J007j410j710K08J120J57j366o46J014J869l7j922o31
$$ 1858 1328 -268 25 1828 2835 1425 -285 -77 1043 1200 -166 -812 202 2071 2034 112 -519
3087e19O28J426o22j741m86J926J233n84j328k09J192J90q71j713K82J846N44
$$ -519 109 1535 913 -828 -1314 612 1845 1261 -67 -276 916 1106 235 -1478 -1196 650 1194
3104A194j390n48P89J174k27j817r84J049J821q10j361M46J369N55q62j861J89
$$ 1194 -196 -744 45 1219 992 -825 -1809 -760 1061 251 -1110 -664 705 1260 398 -1463 -1274
3121a274P65J075j044p26P23J542j24j672r69O66J240j23j394l47J397J089m79
$$ -1274 -509 566 -478 -1204 -481 1061 937 -735 -1704 -1038 202 79 -1315 -1662 -265 824 345
3138C45j220l42Q21P10j099j476N09K035P38j413r79K31J408j88j293j293J412
$$ 345 -875 -1217 -396 314 -785 -2261 -1752 283 1021 -392 -1371 -1140 268 80 -1213 -2506 -1094
3155a094J100%r43m16J129Q63j152j338k62J014J012p12j129P43J597M91j758
$$ -1094 6 6 -937 -1353 -224 639 -513 -1851 -2113 -1099 -87 -799 -1928 -1185 412 903 -855
3172h55j768R16J282L16j366l26P72J857n20j611o92J226O90o40j458J51J733
$$ -855 -2623 -1707 -425 -109 -1475 -1801 -1029 828 308 -1303 -1995 -769 -79 -719 -2177 -2026 -293
3189b93Q21j048j086k08J528K47j375p48J62J863K04j419m36R37J156j076j547
$$ -293 528 -520 -1606 -1814 -286 -39 -1414 -2162 -2000 -137 67 -1352 -1788 -851 305 -771 -2318
3206b318k21J313J237m17j124j44J568P12j392j545L9J394Q99j464l59P95J626
$$ -2318 -2539 -1226 11 -406 -1530 -1674 -106 606 -786 -2331 -2292 -898 1 -1463 -1822 -1027 599
3223E99m88j446r69J044R52k57j102J0J292R96j000j019m4R92N01j138o73K69
$$ 599 111 -1335 -2304 -1260 -308 -565 -1667 -1657 -365 631 -369 -1388 -1432 -440 61 -1077 -1750 -1481
3241a481J762M79j005j316Q83J004j98j371q50J100J710l06r93k59J206M09r14
$$ -1481 281 760 -245 -1561 -678 326 128 -1243 -2093 -993 717 411 -582 -841 365 774 -140
3258a40j261J68J473M97p24q66M98J638l0j542j037M45J545k0r62l01J221J162
$$ -140 -1401 -1233 240 737 13 -853 -355 1283 1253 -289 -1326 -881 664 644 -318 -619 602 1764
3276A764m64j500n70R18Q57m58j306N01J346J049j456j096M65J178k3j080p76
$$ 1764 1300 -200 -770 148 1005 547 -759 -258 1088 2137 681 -415 50 1228 1205 125 -651
3293f51J151J137J08j267l10Q63M63p08j017j21J276J020l09j381J27J468J37
$$ -651 500 1637 1745 478 168 1031 1494 786 -231 -352 924 1944 1635 254 381 1849 1986
3310A986j047j504M65J599J18r79m63J294R34n16j468o13Q72P78n35q49K46J399
$$ 1986 939 -565 -100 1499 1617 638 175 1469 2403 1887 419 -194 678 1456 921 72 318 1717
3328A717P40j264j361K19J201L62j420m71J247Q58L47j307p29M93Q19l44j067
$$ 1717 2457 1193 -168 51 1252 1614 194 -277 970 1828 2175 868 139 632 1451 1107 40
3345D0m68J535J091n98j527L12J283k89k71j546J94J575M92r94o01P13Q36k19
$$ 40 -428 1107 2198 1600 73 385 1668 1379 1108 -438 -244 1331 1823 829 228 941 1777 1558
3363A558j380o14O40J173Jj103J18J140M52o78j514r5Q46O69q18p34L79J484R0
$$ 1558 178 -436 204 1377 1378 275 393 1533 1985 1307 -207 -302 544 1213 395 -339 40 1524 1614
3382A614j388r59O27J127N0j082r61J441J420k17j378m60O73P43j119n89J97J173
$$ 1614 226 -733 -106 1021 1071 -11 -972 469 1889 1672 294 -166 507 1250 131 -458 -261 912
3400I12M44r27o35L69J141m87j069p06N80J489J99j121n33R76P25l82j617m48
$$ 912 1356 429 -206 163 1304 817 -252 -958 -378 1111 1310 189 -344 632 1357 975 -642 -1090
3418a090J279N88p02n74M34Q90M46j102j214K70J328k60r36l96R90J124j40j511
$$ -1090 189 777 75 -499 -65 825 1271 169 -1045 -775 553 293 -643 -1039 -49 1075 935 -576
3436e76o86Q17Q35n33j343K16J558Q28o48j326J63R37l3q51j159N75J377K33j131
$$ -576 -1262 -445 390 -143 -1486 -1270 288 1116 468 -858 -695 242 209 -642 -1801 -1226 151 384 -747
3455g47o83P84J010n33j206o54R51J032m33q24J49J169J17r16r69p0J410M49j251
$$ -747 -1430 -646 364 -169 -1375 -2029 -1078 -46 -479 -1303 -1154 15 132 -784 -1753 -1823 -413 36 -1215
3474a215n68N16J548Jj434r86O46Q56p0j181J13J280R52o34j365P8J000j18n69
$$ -1215 -1783 -1267 281 282 -1152 -2138 -1492 -636 -706 -1887 -1774 -494 458 -176 -1541 -1463 -463 -581 -1150
3493a150r35K00J657P9p08o97L91M16K17j141k71Q62Q36K20j310j10J074N13r17
$$ -1150 -2085 -1885 -228 -149 -857 -1554 -1163 -747 -530 -1671 -1942 -1080 -244 -24 -1334 -1444 -370 143 -774
3512g74q49j60R61Q86m53r12L26J189J36j074p79M84R04jj168l22J397J020n55
$$ -774 -1623 -1783 -822 64 -389 -1301 -975 214 350 -724 -1503 -1019 -115 -116 -1284 -1606 -209 811 256
3531B56j435JO94P10o73q90K62J126P90q69p56K31P24j49q42n08R65R87k9j030
$$ 256 -1179 -1178 -484 226 -447 -1337 -1075 51 841 -28 -784 -553 171 22 -820 -1328 -363 624 595 -435
3551d35n16J143L22m28j628L54J282M43J55j600M01J138N1r64q81L26J355M4q82
$$ -435 -951 192 514 86 -1542 -1188 94 537 692 -908 -507 631 682 -282 -1163 -837 518 562 -320
3570c20n10R75J231o29j211p45J055N94l26q11K49J364P80j207q73j15R33J60
$$ -320 -830 145 1376 747 -464 -1209 -154 440 114 -697 -448 916 1696 489 -384 -499 434 594
3588E94p92k86N13J201j28p44r84P72R06m69j093j22J273O80l25j418L12Q44M19
$$ 594 -198 -484 29 1230 1102 358 -626 146 1052 583 -510 -632 641 1321 996 -422 -110 734 1153
3607A153r10q20J70J098O41q27q08N93J042j29j264n85Q71R55l66p68J19J215
$$ 1153 243 -577 -407 691 1332 505 -303 290 1332 1203 -61 -646 225 1180 814 46 165 1380
3625A380M32p45r86o49J211N61o14q23O11J055L55r72r48M77P63o2j293M0J196
$$ 1380 1812 1067 81 -568 643 1204 590 -233 378 1433 1788 816 -132 345 1108 1046 -247 -207 989
3644I89Q63k25j153l98P79P24q51q42o9J368N65k21j362M01J082m20p23p29O22
$$ 989 1852 1627 474 76 855 1579 728 -114 -183 1185 1750 1529 167 568 1650 1230 507 -222 400
3663D00Q98J21r95j47P57P90n71j226n3R98J97o7r25K19J006K61r36p25J37R15
$$ 400 1298 1419 424 277 1034 1824 1253 27 -26 972 1169 1102 177 396 1402 1663 727 2 139 1054
3683A054K01q49n60P94O71L88j427m62O13P68m91r53k7O38J216p21r51j17J025
$$ 1054 1255 406 -154 640 1311 1699 272 -190 423 1191 700 -253 -280 358 1574 853 -98 -215 810
3702H10j0p52q99N47J020N38j090n63O21Q28o25r99m87J084R23n05j038J31R99
$$ 810 800 48 -851 -304 716 1254 164 -399 222 1050 425 -574 -1061 23 946 441 -597 -466 533
3721E33M44o97j450M62R10J28m62r01M44J337j59j163m22M27R78n22p70j74R31
$$ 533 977 280 -1170 -708 202 330 -132 -1033 -589 748 589 -574 -996 -569 409 -113 -883 -1057 -126
3740a26R05o41r07l77J138P4q65o01N34R85J33o49o31M17Q34m07p23p01P77Q05
$$ -126 779 138 -769 -1146 -8 66 -799 -1400 -866 119 252 -397 -1028 -611 223 -184 -907 -1608 -831 -26
3760b6L6r23kO50N58l77j294R8J118P4m00o28N72O69K13j117r35O50O45P8p64
$$ -26 10 -913 -915 -265 293 -84 -1378 -1280 -162 -88 -488 -1116 -544 125 338 -779 -1714 -1064 -419 -341 -1105
3781a105j16Q29J025m22j161m40R07N44n24q42L12O58Q86r01r14L19P76Q2j068
$$ -1105 -1221 -392 633 211 -950 -1390 -483 61 -463 -1305 -993 -335 551 -350 -1264 -945 -169 -87 -1155
3800a155k77O71J001r7j043k12P19R49r57p02l52Q78O96j09q86L8O90K05p98n29
$$ -1155 -1432 -761 240 143 -900 -1112 -393 556 -401 -1103 -1455 -577 119 10 -876 -838 -148 57 -741 -1270
3820a270N61N28J1q62k87R41M02j13o21j054P36J011m56q20M39L85R54p74q46
$$ -1270 -709 -181 -170 -1032 -1319 -378 24 -89 -710 -1764 -1028 -17 -473 -1293 -854 -469 485 -289 -1135
3839a135K1J067K20r40l83J02J231j29n88n48L83R01j33j119m44R94J059p53m88
$$ -1135 -1114 -47 173 -767 -1150 -1048 183 54 -534 -1082 -699 202 69 -1050 -1494 -500 559 -194 -682
3858f82k84J053K63n92j069K52J153L01q71j25K57Q31J5j271l20M44J226m12q72
$$ -682 -966 87 350 -242 -1311 -1059 94 395 -476 -601 -344 487 502 -769 -1089 -645 581 169 -703
3877g03j59J195L85l54o04n77J107J71m78p33L62R59J45m47p29J58Q22K5r55k22
$$ -703 -862 333 718 364 -240 -817 290 461 -17 -750 -388 571 716 269 -460 -302 520 545 -410 -632
3897f32Q70Q07j45r00k30Q65Q5m31j049N19J059K76n59q36M56J043Q5p15r13K90
$$ -632 238 1045 900 0 -230 635 720 289 -760 -241 818 1094 535 -301 155 1198 1283 568 -345 -55
3917e5Q90K92o60o50R60L03j61q71k64Q83M29k04p80J61R14K29q05n91J05P57
$$ -55 835 1127 467 -183 777 1080 919 48 -216 667 1096 892 112 273 1187 1416 611 20 125 882
3937H82J99o56m24P57O70l41p12k39L40O63l29r42L04Q06N26l11q77q7P98mp66
$$ 882 1081 425 1 758 1428 1087 375 136 476 1139 810 -132 172 978 1504 1193 316 229 1027 1023 257
3958B57n66O27N76P38q47o92O16N53l01j250M8L20Q28J31r25j5O75O66o08r08
$$ 257 -309 318 894 1632 785 93 709 1262 961 -289 -241 79 907 1038 113 98 773 1439 831 -77
3978g7p7P32M09p45l27K92R89l45l67r91O13O92q1p39l08J118N60n66r43j85J118
$$ -77 -154 578 987 242 -85 207 1196 851 484 -507 106 798 717 -22 -330 788 1348 782 -161 -346 772
3999G72J39q28m32J23N39O65o80o03J49P38K25r98p5K89Q30k66o66m00R25O33
$$ 772 911 83 -349 -226 313 978 298 -305 -156 582 807 -191 -266 23 853 587 -79 -479 446 1079
4019A079n39q84j23O26M87j77p08J11J046l49m48r30M93Q66o1q93K34L59L92j09
$$ 1079 540 -344 -467 159 646 469 -239 -128 918 569 121 -809 -316 550 489 -404 -170 189 581 472
4039D72j009j80M33O98n53o27N04O95M46n29q21j18Q39K61r39m24L78J034j85
$$ 472 -537 -717 -284 414 -139 -766 -262 433 879 350 -471 -589 250 511 -428 -852 -474 560 375
4058C75q81m64Q11N08j82r32j25Q06L81m32p63N14K84L67r19p25N34N40M38p89
$$ 375 -506 -970 -159 349 167 -765 -890 -84 297 -135 -898 -384 -100 267 -652 -1377 -843 -303 135 -654
4078f54j52P20L55j67p37m07J47P12j52q26M02N45M40m38q41K8O47K14m93p83
$$ -654 -806 -86 269 102 -635 -1042 -895 -183 -335 -1161 -759 -214 226 -212 -1053 -1025 -378 -164 -657 -1440
4098a440L67J113Q5p81k80J22M87J75r14l68P28O94j41p58j84N27M59q53l10o0
$$ -1440 -1073 40 125 -656 -936 -814 -327 -152 -1066 -1434 -706 -12 -153 -911 -1095 -568 -109 -962 -1272 -1332
4118a332Q31O62n34r42L94R02N8r52l73M43R32l32q86J41M04Q68n65o80j04O05
$$ -1332 -501 161 -373 -1315 -921 -19 39 -913 -1286 -843 89 -243 -1129 -988 -584 284 -281 -961 -1065 -460
4138d60L76l37p70J91J157K61o86p38L57P69j85q17l69J016O94j03r03m40P29
$$ -460 -84 -421 -1191 -1000 157 418 -268 -1006 -649 120 -65 -882 -1251 -235 459 356 -547 -987 -258
4157b58M82l49p92J53N68M82j64n03K38M44n8m55j092O67R87P8o27j01L30N42
$$ -258 224 -125 -917 -764 -196 286 122 -381 -143 301 243 -212 -1304 -637 350 428 -199 -300 30 572
4177E72j59j157K96K33O19n28l53k07J107L22n40n57j56P03on26j08L27N55L82
$$ 572 413 -744 -448 -215 404 -124 -477 -684 423 745 205 -352 -508 195 189 -337 -445 -118 437 819
4197H19p79n54M01Q64p80l83jP93K81l00q09M28K99L56n44m99K88R00j36l93m29
$$ 819 40 -514 -113 751 -29 -412 -413 380 661 361 -448 -20 279 635 91 -408 -120 780 644 251 -178
4218a78L15O47J13r78p19Q50O96o7p08j33R26jm4r52P5N74M93o57m13K12R44%
$$ -178 137 784 897 -81 -800 50 746 679 -29 -162 764 763 719 -233 -158 416 909 252 -161 51 995 995
4240I95o10n54N8Q99l8m66p12J010M76k45n25j0K85K98l85p62J99Q50K54k17q42
$$ 995 385 -169 -111 788 750 284 -428 582 1058 813 288 278 563 861 476 -286 -87 763 1017 800 -42
4261d2L04N06j41p22k45N86R20j76o53j30L51O12n04o17l00P56K97l82m82L86
$$ -42 262 768 627 -95 -340 246 1166 990 337 207 558 1170 666 49 -251 505 802 420 -62 324
4281C24N42M10p16q60M23O62J05n59l28N48O01p4p80j32L48K90n04n17K02O34
$$ 324 866 1276 560 -300 123 785 890 331 3 551 1152 1078 298 166 514 804 300 -217 -15 619
4301F19L87m30m83m0M12J27l35m09K87M73N07j058m05O10M52j61j066J50L48N82
$$ 619 1006 576 93 53 465 592 257 -152 135 608 1115 57 -348 262 714 553 -513 -363 -15 567
4321E67j3j096L62M75N44o80n51J67P01ko83j88L71O29k50o76l32O33L18L7j069
$$ 567 554 -542 -180 295 839 159 -392 -225 476 474 -209 -397 -26 603 353 -323 -655 -22 296 333 -736
4342g36J28R64J05k52q14OM04N31n78o70N60Q19m06j70o50J54J116l83p28j51
$$ -736 -608 356 461 209 -605 -599 -195 336 -242 -912 -352 467 61 -109 -759 -605 511 128 -600 -751
4362g51L43Q05m15n07ML27M00n49q83J57R23L13n58m21K93N12m2n55o99P33M89
$$ -751 -408 397 -18 -525 -521 -194 206 -343 -1226 -1069 -146 167 -391 -812 -519 -7 -49 -604 -1303 -570 -81
4383h1J29q64j67Q27L73j29o71k80O93K52m47n23L50N76L91p97l38J93J54L74
$$ -81 48 -816 -983 -156 217 88 -583 -863 -170 82 -365 -888 -538 38 429 -368 -706 -513 -359 15
4403A5q63l15O26Q11n73j61p8K08O41l78p12J9P65L14l59r61L41Q39p9o76l30
$$ 15 -848 -1163 -537 274 -299 -460 -538 -330 311 -67 -779 -760 5 319 -40 -1001 -660 179 100 -576 -906
4424i06K76L44L03l09l52K78M54p2q39k21O78L90j52p22l0R00M9j93o77k39Q78
$$ -906 -630 -286 17 -292 -644 -366 88 16 -823 -1044 -366 24 -128 -850 -880 20 69 -124 -801 -1040 -162
4445a62P9k75m42M1O27L12m78m90N52N25l78n93k10N96M22j10m86j5O21K33p04
$$ -162 -83 -358 -800 -759 -132 180 -298 -788 -236 289 -89 -682 -892 -296 126 16 -470 -485 136 369 -335
4466c35p49L96N61M95p92K1K26M94p2q05j67O64K20J51r46m6M35M58j64p31J29
$$ -335 -1084 -688 -127 368 -424 -403 -177 317 245 -560 -727 -63 157 308 -638 -684 -249 209 45 -686 -557
4487e57P02j2n60J00J37N80J01o53k75j2P51L6p54j94L80R39m68l69j75M15K20
$$ -557 145 133 -427 -327 -190 390 491 -162 -437 -449 302 338 -416 -610 -230 709 241 -128 -303 112 332
4508C32n13k03J95N50K75m44m92J01M71J72m73k05J67N04M30o91k43N36M36m58
$$ 332 -181 -384 -189 361 636 192 -300 -199 272 444 -29 -234 -67 437 867 176 -67 469 905 447
4528D47n63r3P29J33j24n41J44L25P21r38n00K82N51L69j209K65M95L76J19r76
$$ 447 -116 -209 520 653 529 -12 132 457 1178 240 -260 22 573 942 -267 -2 493 869 988 12
4548A2r8L74N61k38p35J13P11M26n99n70N48L53K72q90n61N21O58k02k48m86M92
$$ 12 -86 288 849 611 -124 -11 700 1126 527 -43 505 858 1130 240 -321 200 858 656 408 -78 414
4569D14L67p5p90P0M06N02n3o78M6N92K9j11r05J68O28J33k92o62M28P20l50m19
$$ 414 781 706 -84 -14 392 894 841 163 209 801 830 719 -186 -18 610 743 451 -211 217 937 587 168
4591A68m25L52M54j20k96m61P24M27j64n39m66N63N51n83p02M63N47k97N9m38
$$ 168 -257 95 549 429 133 -328 396 823 659 120 -346 217 768 185 -517 -54 493 196 255 -183
4611a83K25O14j83o34l49M53M27J30m78j33K58M60k85o48L2M42J04j98j70Q9L99
$$ -183 42 656 473 -161 -510 -57 370 500 22 -111 147 607 322 -326 -294 148 252 54 -116 -27 372
4632C72K12n31k28k9P43k85o73r4N01N77j79m62k08L58K29l52m42K03M84K31m2
$$ 372 584 53 -175 -204 539 254 -419 -513 -12 565 386 -76 -284 74 303 -49 -491 -288 196 427 385
4653C85r13K66M31J07o70q9J45O17J41j39q01L37M51l97k81j30N14N96m31o81
$$ 385 -528 -262 169 276 -394 -483 -338 279 420 281 -520 -183 268 -129 -410 -540 -26 570 139 -542
4673e42J66O11K87p39m48L00N07r6r8k55J26O55m06j78o48L43N63j62m87l1L93
$$ -542 -376 235 522 -217 -665 -365 142 46 -52 -307 -181 474 68 -110 -758 -415 148 -14 -501 -532 -139
4694a39K81j51o20r4P09J96n35l29L21P54j42l03p52M38J01K27p12K5M37L08K54
$$ -139 142 -9 -629 -723 -14 182 -353 -682 -361 393 251 -52 -804 -366 -265 -38 -750 -725 -288 20 274
4715B74r68j9O92j14l53m62K78M97R3k53m61K96P60M5o22p16O23O3M18o42k1N09
$$ 274 -694 -713 -21 -135 -488 -950 -672 -175 -82 -335 -796 -500 260 305 -317 -1033 -410 -347 71 -571 -592 -83
4737h3q5N3o73l0M86L45k51m45N2P83j13m81m07N3Q42l0n86k49L96L86P8m35l03
$$ -83 -168 -115 -788 -818 -332 13 -238 -683 -631 152 39 -442 -849 -796 46 16 -570 -819 -423 -37 41 -394 -697
4760f97M10L63l57k28J20L92J93m05m96M30N03k95K3p31K91M39J15p6l75L75M71
$$ -697 -287 76 -281 -509 -389 3 196 -209 -705 -275 228 -67 -44 -775 -484 -45 70 -6 -381 -6 465
4781D65n28l15k2M91K30l1n94J60M05lj12p98L31N94k25k52k61M50N77k23n61
$$ 465 -63 -378 -400 91 321 290 -304 -144 261 258 146 -652 -321 273 48 -204 -465 -15 562 339 -222
$$ [...]
8191h
##END NTUPLES=NMR FID
##END=
