##TITLE=1H_LR-695-CR6
 CDCl3, 8 sc, 
 25.10.2019
##JCAMPDX= 6.0         $$ Bruker NMR JCAMP-DX V2.0
##DATA TYPE= NMR FID
##DATA CLASS= NTUPLES
##ORIGIN= UXNMR, Bruker Analytische Messtechnik GmbH
##OWNER= root
$$ XWIN-NMR		Version 3.5
$$ Fri Oct 25 14:29:42 2019 Russian Standard Time (UT+4h)  she@DPX200
##.OBSERVE FREQUENCY= 200.1315
##.OBSERVE NUCLEUS= ^1H
##.DELAY= (6, 6)
##.ACQUISITION MODE= SIMULTANEOUS
##.ACQUISITION SCHEME= undefined
##.AVERAGES= 8
##.DIGITISER RES= 18
##SPECTROMETER/DATA SYSTEM= spect
##.PULSE SEQUENCE= zg30
##.SOLVENT NAME= CDCl3
##.SHIFT REFERENCE= (INTERNAL, CDCl3, 0, 15.7039)
##AUDIT TRAIL= $$ (NUMBER, WHEN, WHO, WHERE, WHAT)
$$ ##TITLE= Audit trail, XWIN-NMR		Version 3.5
$$ ##JCAMPDX= 5.01
$$ ##ORIGIN= Bruker BioSpin GmbH
$$ ##OWNER= she
$$ F:/spectra/data/she/nmr/H-F/1/audita.txt
$$ ##AUDIT TRAIL=  $$ (NUMBER, WHEN, WHO, WHERE, WHAT)
(   1,<2019-10-25 14:28:45.42 +0400>,<she>,<DPX200>,
      <created by zg, POWCHK disabled, PULCHK disabled
       configuration hash MD5:
       00 E9 B6 7A A2 85 ED C7 34 08 36 98 17 FE 4E 26
       data hash MD5: 16K
       F4 3D 78 2C AF AD 7A 99 B9 56 4C FC FA F7 8C DB>)
$$ ##END=
$$ 
$$ hash MD5
$$ 1A A6 0F 28 D4 B5 63 3F DC 07 D9 A3 01 F7 B0 82
##$RELAX= 
##$RELAX= 
##$RELAX= 
##$RELAX= 
##$RELAX= 
##$RELAX= 
$$ Bruker specific parameters
$$ --------------------------
##$DU= <F:/spectra>
##$EXPNO= 1
##$NAME= <H-F>
##$PROCNO= 1
##$TYPE= <nmr>
##$USER= <she>
##$AMP= (0..31)
100 100 100 100 100 100 100 100 100 100 100 100 100 100 100 100 100 100 
100 100 100 100 100 100 100 100 100 100 100 100 100 100 
##$AQSEQ= 0
##$AQ_mod= 1
##$AUNM= <au_zg>
##$AUTOPOS= <>
##$BF1= 200.13
##$BF2= 200.13
##$BF3= 200.13
##$BF4= 200.13
##$BF5= 200.13
##$BF6= 200.13
##$BF7= 200.13
##$BF8= 200.13
##$BYTORDA= 1
##$CFDGTYP= 0
##$CFRGTYP= 5
##$CHEMSTR= <none>
##$CNST= (0..31)
1 1 145 1 1 1 1 1 1 1 1 1 1 1 1 1 1 1 1 1 1 1 1 1 1 1 1 1 1 1 1 1 
##$CPDPRG= <>
##$CPDPRG1= <>
##$CPDPRG2= <>
##$CPDPRG3= <>
##$CPDPRG4= <mlev>
##$CPDPRG5= <mlev>
##$CPDPRG6= <mlev>
##$CPDPRG7= <mlev>
##$CPDPRG8= <mlev>
##$CPDPRGB= <>
##$CPDPRGT= <>
##$D= (0..31)
0 1.2 0 0 0 0 0 0 0 0.06 0 0.03 0 0 0 0 0.0002 0 0 0 0 0 0 0 0 0 0 0 0 
0 0 0 
##$DATE= 1571999324
##$DBL= (0..7)
120 120 120 120 120 120 120 120 
##$DBP= (0..7)
150 150 150 150 150 150 150 150 
##$DBP07= 0
##$DBPNAM0= <>
##$DBPNAM1= <>
##$DBPNAM2= <>
##$DBPNAM3= <>
##$DBPNAM4= <>
##$DBPNAM5= <>
##$DBPNAM6= <>
##$DBPNAM7= <>
##$DBPOAL= (0..7)
0.5 0.5 0.5 0.5 0.5 0.5 0.5 0.5 
##$DBPOFFS= (0..7)
0 0 0 0 0 0 0 0 
##$DE= 6
##$DECBNUC= <off>
##$DECIM= 24
##$DECNUC= <off>
##$DECSTAT= 4
##$DIGMOD= 1
##$DIGTYP= 9
##$DL= (0..7)
0 120 120 120 120 120 120 120 
##$DP= (0..7)
150 150 150 150 150 150 150 150 
##$DP07= 0
##$DPNAME0= <>
##$DPNAME1= <>
##$DPNAME2= <>
##$DPNAME3= <>
##$DPNAME4= <>
##$DPNAME5= <>
##$DPNAME6= <>
##$DPNAME7= <>
##$DPOAL= (0..7)
0.5 0.5 0.5 0.5 0.5 0.5 0.5 0.5 
##$DPOFFS= (0..7)
0 0 0 0 0 0 0 0 
##$DQDMODE= 0
##$DR= 18
##$DS= 0
##$DSLIST= <SSSSSSSSSSSSSSS>
$$ [...]
##$SUBNAM2= <"">
##$SUBNAM3= <"">
##$SUBNAM4= <"">
##$SUBNAM5= <"">
##$SUBNAM6= <"">
##$SUBNAM7= <"">
##$SUBNAM8= <"">
##$SUBNAM9= <"">
##$SW= 24.0689530833862
##$SWIBOX= (0..15)
0 0 2 0 0 0 0 0 0 0 0 0 0 0 0 0 
##$SW_h= 4816.95568400771
##$TD= 16384
##$TD0= 1
##$TE= 0
##$TE2= 300
##$TE3= 300
##$TEG= 300
##$TL= (0..7)
0 120 120 120 120 120 120 120 
##$TP= (0..7)
150 150 150 150 150 150 150 150 
##$TP07= 0
##$TPNAME0= <>
##$TPNAME1= <>
##$TPNAME2= <>
##$TPNAME3= <>
##$TPNAME4= <>
##$TPNAME5= <>
##$TPNAME6= <>
##$TPNAME7= <>
##$TPOAL= (0..7)
0.5 0.5 0.5 0.5 0.5 0.5 0.5 0.5 
##$TPOFFS= (0..7)
0 0 0 0 0 0 0 0 
##$TUNHIN= 0
##$TUNHOUT= 0
##$TUNXOUT= 0
##$USERA1= <user>
##$USERA2= <user>
##$USERA3= <user>
##$USERA4= <user>
##$USERA5= <user>
##$V9= 5
##$VALIST= <valist>
##$VCLIST= <CCCCCCCCCCCCCCC>
##$VD= 0
##$VDLIST= <DDDDDDDDDDDDDDD>
##$VPLIST= <PPPPPPPPPPPPPPP>
##$VTLIST= <TTTTTTTTTTTTTTT>
##$WBST= 1024
##$WBSW= 4
##$XGAIN= (0..3)
0 0 0 0 
##$XL= 0
##$YL= 0
##$YMAX_a= 263075
##$YMIN_a= -200073
##$ZGOPTNS= <>
##$ZL1= 120
##$ZL2= 120
##$ZL3= 120
##$ZL4= 120
##$ABSF1= 10
##$ABSF2= 0
##$ABSG= 5
##$ABSL= 3
##$ALPHA= 0
##$AQORDER= 0
##$ASSFAC= 0
##$ASSFACI= 0
##$ASSFACX= 0
##$ASSWID= 0
##$AUNMP= <proc_1d>
##$AZFE= 0.1
##$AZFW= 0.1
##$BCFW= 1
##$BC_mod= 2
##$BYTORDP= 1
##$COROFFS= 0
##$CY= 11.3945322036743
##$DATMOD= 1
##$DC= 2
##$DFILT= <>
##$DTYPP= 0
##$F1P= 19.5091578491511
##$F2P= -0.509923556040331
##$FCOR= 0.5
##$FTSIZE= 0
##$FT_mod= 4
##$GAMMA= 1
##$GB= 0.15
##$INTBC= 1
##$INTSCL= 1
##$ISEN= 128
##$LB= 0.24
##$LEV0= 0
##$LPBIN= 0
##$MAXI= 10000
##$MC2= 0
##$MEAN= 0
##$ME_mod= 0
##$MI= 1.114404
##$NCOEF= 0
##$NC_proc= 0
##$NLEV= 6
##$NOISF1= 3.799351
##$NOISF2= 2.8
##$NSP= 1
##$NTH_PI= 0
##$NZP= 0
##$OFFSET= 15.70392
##$PC= 1
##$PHC0= -9579.611
##$PHC1= 28.80083
##$PH_mod= 1
##$PKNL= yes
##$PPARMOD= 0
##$PSCAL= 0
##$PSIGN= 0
##$REVERSE= no
##$SF= 200.130013532006
##$SI= 16384
##$SIGF1= 3
##$SIGF2= 2
##$SINO= 400
##$SIOLD= 16384
##$SREGLST= <1H.CDCl3>
##$SSB= 0
##$STSI= 0
##$STSR= 0
##$SW_p= 3612.71676300578
##$SYMM= 0
##$S_DEV= 0
##$TDeff= 0
##$TDoff= 0
##$TI= <>
##$TILT= no
##$TM1= 0
##$TM2= 0
##$TOPLEV= 0
##$USERP1= <user>
##$USERP2= <user>
##$USERP3= <user>
##$USERP4= <user>
##$USERP5= <user>
##$WDW= 1
##$XDIM= 8192
##$YMAX_p= 0
##$YMIN_p= 0
$$ End of Bruker specific parameters
$$ ---------------------------------
##NTUPLES= NMR FID
##VAR_NAME=  TIME,          FID/REAL,        FID/IMAG
##SYMBOL=    X,             R,               I
##VAR_TYPE=  INDEPENDENT,   DEPENDENT,       DEPENDENT
##VAR_FORM=  AFFN,          ASDF,            ASDF
##VAR_DIM=   8192,          8192,            8192
##UNITS=     SECONDS,       ARBITRARY UNITS, ARBITRARY UNITS
##FACTOR=    0.0002076,     1,               1
##FIRST=     0,             0,               0
##LAST=      1.7004516,     0,               0
##MIN=       0,             -200073,         0
##MAX=       1.7004516,     263075,          0
$$ Real data points
##PAGE= N=1
##DATA TABLE= (X++(R..R)), XYDATA
$$ [...]
2604b67l504M76L260J278l018k448J445L834L3l445j911K041K624r62l483r83
2620e030K618K990j312l184k39K914J579k909l286J087L519J059k882j944K006
2635c014L089m11m128j754K002K898m78k917l04L644J937j743m196j57K998J302
2651a232k443k341K084L781R01k991k734R87K882j140l038n74K964L521p27k840
2667b940j036K517J319k673l288M97M021K183j671k274J629K115r91l616j926
2682f134J958L418L87k033o70K729K295k235m231j039L134K017r93j743J556L616
2698B032N60l556l255Q30K408K91k554q66L809L585p85l970j719J538J523j738
2714a867k332J197M212K467k077l062O1K299p78l110j965K811M248J198k514j720
$$ y = [-267, -3771, -3295, -35, 1243, -1775, -4223, -2778, 1056, 1089, -2356, -4267, -2226, 398, -564, -4047, -5030, -2412, 578, -734, -3918, -4157, -1243, 336, -2573, -5859, -4772, -1253, -194, -3076, -5020, -3014, 75, -336, -4464, -6218, -4216, -1318, -1796, -4713, -5017, -1373, 564, -1179, -5375, -5532, -2534, -1232, -3675, -6016, -3932, -151, 750, -2241, -4975, -3988, -1106, -2246, -5284, -5858, -2894, 627, -100, -2940, -3976, -1459, -140, -2813, -6101, -5604, -1583, 600, -1071, -3345, -1716, 399, -592, -4208, -6134, -4176, -758, -371, -2404, -3074, -345, 1950, -285, -4516, -5555, -2421, -404, -1397, -3140, -1584, 2032, 2592, -964, -4219, -3389, -981, -690, -3244, -4110, -301, 3284, 2499, -1471, -3190, -1652, -129, -1867, -4199, -3002, 1210, 3677, 1600, -1462, -1401, 898, 120, -2990, -4955, -2144, 2104, 3302, 788, -932]
2730i32J783J361k329l639n19L303L293m85k070Q64K551J40l738l375P99L290
2746B97J678j863p58K697K815j322m549k189J807K679l87j758O40L767K084k384
2762C254l899p87K129N87k005q44K251M706J6l085k552J042J886j321l049j58
2778a829M137L402j183k641o05J874N09l187k643J333M087K001j722j599J054
2793B988J901j023m380j484K523K999K81j674MK685J309l003l775q8K650J690
2809C603j522j078J926K627P0l161l164R26K582k35k391mL252K805j158l838j041
2826A99J505J223j781k263J535L430J689k085k665J92K114n27k693j565K368L580
2842D256k10k785j146K313J093k093l140k05L462J975j458k336N52L110k05k902
$$ y = [-932, 851, 2212, -117, -3756, -4275, -972, 2321, 1836, -234, 630, 3181, 3321, -417, -3792, -2993, 297, 1975, 112, -646, 2051, 4866, 3544, -1005, -3194, -1387, 1292, 905, -853, -213, 3554, 5638, 3254, -645, -1432, 697, 1284, -721, -1565, 686, 5392, 5408, 2323, -229, 813, 2699, 1378, -1671, -1829, 2308, 5710, 4527, 1886, 1281, 3155, 3664, 477, -2166, -833, 3254, 5255, 3533, 1934, 2988, 4889, 3866, -514, -1998, 525, 3524, 3805, 2131, 2135, 4820, 6129, 3126, -649, -737, 1913, 3603, 2081, 1003, 2929, 5556, 5626, 2465, -699, 227, 2809, 2574, 183, 179, 3431, 6236, 5078, 1240, 199, 1704, 2927, 1146, -1117, 418, 3848, 5537, 3452, 787, 979, 3093, 2566, -127, -1692, 676, 4256, 4046, 1261, 115, 2428, 3521, 1428, -1712, -1917, 1545, 3520, 2062, -274, 278, 3388, 3183, 281]
2858B81k723J259K753M38k087j162K136K700j720l424r78K274J732j475j816K30
2874a582L105R75k250k453J96K392Q07k810j340J908K764k53k848j285J686K217
2890A229j296k786j92K422K315j576k632J05L029M23k182k440J163K938J3k264
2906a731j383J673K865q08l223p72K182K094q62l022k99L003J427j544k670L47
2922b723K749P52k590k405J843K675K42k479j222K118K062p06l309o28J919K285
2938E83j420k356M22K888J418k636k345M13K831L04k339j051J652K949P6k790
2954a401j648J343J748r54k760k82L276J874q67k696J63J857P70k692j958J021
2970c206L699M99j706j827J472J945j209l154r43K242K343K2k514N49K288O40
$$ y = [281, -2442, -1183, 1570, 2008, -79, -1241, 895, 3595, 1875, -1549, -2527, -253, 1479, 4, -1812, -1582, 1523, 2498, 248, -2205, -2009, 383, 1190, -1620, -2960, -1052, 1712, 1459, -1389, -2674, -988, 1229, -67, -2853, -3045, -623, 1692, 116, -2516, -2411, 618, 1041, -1141, -3581, -2418, 520, 533, -1731, -3114, -1441, 1424, 616, -2607, -3379, -1197, 897, 35, -2987, -3286, -283, 1144, -400, -3070, -2723, 26, 778, -1812, -4217, -2374, 301, 543, -1936, -3158, -1040, 1022, 316, -2993, -3621, -1702, 583, -837, -3193, -2771, 117, 1535, -1101, -3446, -3033, -202, 102, -2237, -3288, -1636, 1313, 1389, -1401, -3049, -1706, 42, -912, -3672, -3954, -678, 1196, 329, -2367, -2204, -347, 423, -2269, -4227, -3206, 493, 992, -714, -2541, -1069, 876, -333, -3487, -4430, -2188, 155, 177, -2337, -1788, 500, 1140]
2986A140k039k942l95L165J157j539j197J743K549k09l260k048J227K208m48j799
3002b687O6L034K028j340l198q48K074Q86j986j592J480L481J334k223k333O00
3018a224K000q64k775q08K548L299k04j803p33J377J058k376k852L50L112K492
3034B597j256j587J003J615N7l213k543J727K763O21j548j49K099J614j726l511
3050a437j248K082K026r20j267J397L139L34k611k356R9J742K56j700n88K702
3066A650K804m65k664j736J048J429j393k061N91L282K106j087k795j19J668m3
3082B215k510j596J774L043N17j735r56J331J128j688k834q21K552K055l12j495
3098F68J95K266K18k357l193N69K910Q65j527q09J673K565j222l147j587J358
$$ y = [1140, -899, -3841, -4236, -1071, 86, -1453, -2650, -907, 1642, 1433, -1827, -3875, -2648, -440, -888, -2687, -2621, 413, 2441, 1101, -2097, -2945, -871, 15, -1971, -3563, -2083, 1398, 2732, 509, -1824, -1224, 776, -88, -2863, -3671, -1123, 2176, 1972, 169, -564, 813, 1871, -505, -3357, -3007, 105, 2597, 1341, -246, 757, 2372, 2429, -784, -3327, -1600, 1163, 1784, 236, 87, 2186, 3800, 2074, -1437, -2685, -603, 1423, 503, -764, 633, 3772, 4106, 1495, -861, -762, 980, 1236, -464, -1052, 1650, 4454, 3989, 1325, -411, 637, 2066, 673, -1388, -797, 2485, 4591, 3504, 709, 590, 2258, 2215, -295, -1891, -117, 2926, 3443, 1708, 752, 2083, 3211, 1523, -1311, -2132, 420, 2475, 2163, 668, 863, 3129, 3347, 990, -2203, -1634, 1276, 2141, 614, -195, 1478, 4043, 2821, -326, -1913, -555]
3114e55K199p57j644L47K601J382j437k836l38J671P62j917j508J845K954N49
3130C318k397j700Q38J569r03k292m18K459K313l27k249o91J770N57j900k461
3146b514R71K698J244j575j859J330K136n74k828j392J900K131k66j572k83J620
3162A167J452j504k743M3J896J859j711j486R17K338N59k503j848P11K347l9j951
3179d96j317K444J876n46k670o67K104J351j695j945M19K333J103j723j600N79
3195d50K153K87k449j222J301J859M76k647o56J798K015j247k430l22J996J176
3211A638j348k038L83K401R56k039j953Q70K255J97k606j147J679J758p2k119
3227a185n04J528J693j378k128j53K161J194j685j639R19K042N27k248j854Q99
$$ y = [-555, 1644, 887, -757, -410, 2191, 3573, 2136, -700, -1038, 633, 1395, -522, -2030, -185, 2769, 3318, 921, -779, 59, 1628, 725, -1567, -1985, 474, 2787, 2460, 211, -480, 1290, 1847, -53, -2514, -1543, 1155, 2399, 824, -1035, 295, 2431, 1857, -971, -2363, -463, 1668, 1402, -170, -453, 1167, 2619, 1115, -1628, -1585, 311, 2170, 459, -1027, -110, 2228, 2787, 284, -1564, -853, 1494, 1455, -496, -1813, 631, 2507, 1961, -709, -1376, 728, 2079, 384, -1561, -1142, 1191, 2294, 571, -1029, -450, 1703, 1990, -459, -1681, -380, 1479, 1955, -692, -1348, 450, 2465, 1218, -1212, -1534, 462, 1638, 290, -1748, -1365, 1036, 1992, -47, -2000, -1130, 1125, 1322, -1284, -2431, -752, 1006, 934, -1185, -1689, -161, 1532, 154, -1974, -2127, 34, 1228, -457, -2096, -1177, 865, 1392, -856, -2710, -1811]
3243a811K086k64j617p56J812J802n06k216p44J441Q87r04k144M46K578J190j533
3260b53k125P48J573J11k415r66J495K560K18k145r38J556J338j311k541O0K074
3277i61J536p19j548P15J650L50k160k209P09K327Q39j723n40J663J466l49k697
3294a651j160J059J890o76j123L24K473Q96j764k251l3J645L48j477q92J955K477
3311B040l51j852j509Q41J326q26k207j17K557J993p57k097j3J294N68k261j622
3328b993J070K386J200j363r76R97R98p54k623r88J741K057J66j794L50J777R49
3345B200k087k571j43K200O97r42o98J289K042L6k486j810O78J594J33j957L62
3362a463K165J769j217k126p60J357O51j404j691J210K862J001j580k041O05J463
$$ y = [-1811, 275, 11, -1606, -2362, -550, 1252, 746, -1470, -2214, -773, 114, -790, -2934, -2488, 90, 1280, -253, -2378, -1630, -57, 54, -2361, -3327, -1832, 728, 946, -1199, -2137, -581, 757, -554, -3095, -3035, -961, 575, -144, -1692, -977, 673, 1023, -1137, -3346, -2637, -310, 529, -1194, -1734, -71, 1395, 1046, -1651, -2811, -1752, 138, -538, -1661, -1337, 1136, 2032, 268, -1983, -2016, -371, -23, -1500, -2392, -437, 2040, 1689, -163, -1672, -831, 495, -331, -2538, -2655, -98, 1895, 1138, -959, -972, 322, 890, -1371, -2993, -1923, 463, 1663, 300, -676, 321, 1319, 565, -2058, -3046, -1305, 752, 918, -876, -526, 1251, 2200, 113, -2458, -2601, -401, 296, -646, -1344, -55, 1987, 2023, -463, -2273, -1595, -1, 132, -1825, -1463, 702, 2471, 1254, -872, -1632, -275, 376, -1028, -2719, -1509, 1353, 2354, 774, -1267, -662, 801]
3378H01n46k115r21J969K577j26j545o40J301M72j384k086k98K824J116o81j288
3395e70M75J785K03k720j500J050K156L2q61l70J545J312q75k845l81J425J300
3412A161n97j485R62K062Q91j593k245L04J346M09j495n70J468K368k10k050q93
3429a67O73J284p40j754l8K685J102q76j697rJ365M4j680j210R13K335M90j785
3447I35p70J278J052m20k163q31J660J607k50j781J0J951P50j765j608J41J900
3464A696O52j428j192J149K263n73k086r81J134J432l46k043L0J573J590j181
3480A689j994r0K043M38j533j207O95J894J32j359j749J270J418j27j846n04J342
3497E12J225l94j973j83J877N47q88j806J61K124K01j436j183J065J492K11j549
$$ y = [801, 255, -1860, -2781, -812, 1765, 1639, 94, -546, 755, 1227, -157, -2243, -2541, 283, 1399, 718, -570, -95, 1690, 1893, -827, -2327, -1277, 879, 911, 50, -320, 1225, 2537, 1662, -1183, -1564, -139, 1161, 564, -921, 41, 2103, 2994, 1401, -844, -540, 806, 1215, -280, -850, 618, 2986, 2776, 726, -167, 506, 1790, 1050, -704, -742, 1943, 3045, 2169, 472, 463, 1828, 1872, 192, -1018, -105, 2230, 2720, 935, 165, 1443, 2495, 2075, -88, -919, 741, 2348, 2098, 317, 327, 2278, 3028, 1263, -345, -204, 1696, 2348, 920, -272, 877, 3140, 2567, 481, -500, 634, 2066, 1720, -323, -293, 1280, 2870, 1689, -305, -395, 1648, 2086, 553, -654, 41, 1935, 2067, 708, -1041, 229, 1647, 1520, -326, -830, 512, 1737, 1343, -630, -813, 1064, 1611, 723, -1083, -922, 1202, 1403, -33, -1216, -151, 1341, 1552, 3]
3514Cj265J044J435o74j757k43J859J170j062j167m3J359R20j435j584K43J902
3531G05M54j453j021R82J783m55j914o05Q88J623o00j677j53J799J394r56k300
3548a506j07J641O90j274j436Q58K204J97j345j661Q09J357j18k312m0J382J781
3565A120n27j614m39J242P65j308j512k09K219Q19r74j123R21J391r0k154j144
3582b617P26J901K78j395n34J598J253j577j859n18J391J084o15j206N97J970
3598D77M11j702j888L09J702J19j702l63K081J422k46k381n40Q28Q06j014j436
3615c117O45K125J018j348j313K15J183k82j641q42J195J871M92j509n10Q46R13
3632e9j031k141M3J708J605p31j088O47J199K75j566j988M95J664O38j124k17
$$ y = [3, -1262, -218, 1217, 543, -1214, -1457, 402, 1572, 510, -657, -700, 659, 1579, 144, -1440, -1197, 705, 1159, -294, -1315, -333, 1450, 995, -919, -1524, -636, 987, 387, -1290, -1443, 356, 1750, 794, -1506, -1613, 28, 718, -556, -1992, -1134, 1070, 1267, -78, -1739, -930, 427, 309, -2003, -2043, -661, 1120, 593, -1021, -1460, -218, 547, -761, -2273, -2482, -263, 556, -418, -1541, -620, 771, 681, -1473, -2617, -1891, 10, 288, -1107, -1641, -43, 1210, -367, -2226, -2744, -1353, -269, -884, -2090, -1493, 477, 888, -814, -2702, -2393, -691, -572, -2274, -2637, -556, 866, 620, -1761, -2301, -1473, -667, -1681, -3117, -2472, -347, 671, -677, -1990, -1775, -592, -874, -2515, -3357, -2162, -291, 201, -1308, -1818, -972, -59, -1090, -3231, -3188, -1480, 125, -606, -1694, -1047, 152, 427, -1139, -3127, -2632, -968, -330, -1454, -1671]
3649a671J302J574p07k244o43R77J068k28j521Q20J888J227j342j905j08J381
3665a32K08j362p27J270J984N92j517j254L34J306m24j787m2J833J489r5j567
3682A09m14J403K6j076j584O13K141O80q00j041Q36J417r68j730j073J203J753
3699A495J25j239J81J357O66r67j738m69J366P72r96l27P69J540J21j782j065
3716a91M21J493r3j601K07J100J457l39j672o57Q06P84r43j137M87J835Q97j360
3734A494j132K08J210j51j419o94J036J759l5j292n74J144P84q32k136M97J659
3751A526J027j103j291M82J598r8j577j086O51J343J07j034o91J379J340m46k256
3768a29j32R72J358j127j093L23J654P98j616j011L00J176K55j054j071Q41J431
$$ y = [-1671, -369, 1205, 498, -1746, -2389, -1412, -344, -572, -2093, -1273, 615, 1842, 500, -1405, -1513, -132, 76, -1286, -2013, -743, 1241, 1833, 316, -938, -604, 702, 278, -1509, -1551, 282, 1771, 1676, 109, -305, 1098, 1124, 48, -1536, -923, 1218, 1898, 1098, 57, 893, 2310, 1342, -388, -1461, -258, 1495, 1620, 381, 562, 1919, 2585, 1618, -120, -589, 777, 1549, 553, 226, 995, 2535, 2656, 874, -191, 230, 1723, 1630, 29, 236, 1336, 2793, 2454, 782, 125, 931, 1715, 772, -365, 122, 1957, 2854, 1494, 362, 570, 1780, 1629, 210, -484, 552, 2311, 2276, 984, 410, 1554, 2338, 1506, -630, -133, 1526, 2553, 1450, 159, 641, 2239, 2141, 564, -522, 129, 1472, 1579, 545, -146, 1233, 2573, 2127, -129, -261, 711, 2069, 942, -151, 172, 1826, 2624, 1008, -3, 297, 1473, 1728, 674, -397, 444, 1875]
3785A875L7j423r18J256J097p91j376k24J610O40m41j750K26J534O66j624j030
3802f36M25J455K99j440o58R76J177j22j591p92J205R22l87j480j07J456O81j091
3820B92q39K10J325L32j694r85L03J980j90j155o79R51J337k59j925m72J067Q89
3838D88o80j296M72J098P81r55j545K03J143L63r43j040Q87J538J35j416r84J047
3856g04Q70q10j486m2J101J218m57j182j61J297K75j317j341P12J509M51j014
3873a081o81P63R31m11j898m42J438J073l73j089k45J540O06j255j192j71J437
3890a050M51q66r61J331J135Nj694p54O05P02K3j078o6J833P32o78j319m01Q33
3909a217P50r98r99N75J985M59q20j339L57R67j39j329n62J409J145J27j079o02
$$ y = [1875, 1912, 489, -429, 827, 1924, 1133, -243, -467, 1143, 1783, 1342, -408, -182, 1352, 2018, 394, -636, -211, 1244, 1543, 103, -555, 421, 1598, 1476, -115, -907, 298, 1220, 833, -647, -754, 702, 1383, 292, -547, -337, 988, 1320, -374, -1359, -1056, 924, 734, -421, -1100, -149, 1188, 929, -996, -1468, -401, 488, -192, -1488, -1016, 82, 863, -92, -1637, -1434, -291, 72, -871, -1911, -1024, 514, 649, -767, -1751, -704, 166, -644, -2130, -2172, -1071, 147, -310, -1492, -1653, -356, -81, -1398, -2739, -2027, -518, -67, -1081, -1762, -999, -68, -479, -2377, -2819, -1381, -308, -681, -1770, -2015, -475, 131, -1124, -2316, -2487, -1050, -599, -1465, -2426, -1095, 40, 45, -1649, -2403, -1798, -1096, -1073, -2151, -2217, -384, 348, -330, -1649, -2050, -1217, -467, -1465, -2464, -1889, 96, 555, -265, -1604, -1247, -280, -419, -1748, -2310, -901, 244, 371, -708, -1310]
3927a310J469L14j324r23j93J713R90q89m12K85J130L3j752j203J001J493K57
3944F79r29k07J212Q90q31j514o13R53O66j17q49N82J559K89j117j513J62R08
3962B10M35j249j70R06J817k91j592n79Q59N38p17j208N92J391R86r13j086L52
3980B81N99J16j174r77P43J608L98r70p03Q99N30l55j410o53J353Q54j72r98N42
3999E11Q84L74j101j363L85R30M49n95p57J067J237k35j562j003O78J350m82q37
4017g0k92J519Q84r84j243J65J047K41r19j054Q15J709K43j245r14Q14Q63n22
4035A057j251l32J169J166m17q60k20R63L66q49j116K79J243M46o56r80O40J306
4053A954o99j068o14M97J388j95q98j92J278L80q76j001n56J157Q62p26q64J21
$$ y = [-1310, 159, 473, -851, -1774, -1967, -254, 736, -153, -565, -280, 850, 883, -869, -2072, -1071, 422, 679, -250, -457, 755, 1645, 814, -700, -1313, -360, 306, 189, -660, -78, 1481, 1770, 653, -860, -698, 210, 645, -604, -774, 132, 1949, 1658, 66, -513, 346, 884, 167, -1041, -449, 942, 1928, 1015, -71, 281, 880, 996, -178, -1155, -412, 1196, 1594, 624, -79, 820, 1350, 995, -415, -1068, 285, 1139, 967, -31, 511, 1395, 1769, 668, -695, -310, 620, 1069, 474, -283, 784, 2021, 1786, 224, -779, -101, 1249, 767, -70, -362, 1157, 2041, 1057, -186, -21, 1026, 1267, 348, -706, 109, 1818, 2061, 816, -98, 716, 1579, 1057, -194, -526, 643, 1809, 1392, 532, 312, 1275, 1641, 792, -324, -45, 1198, 1644, 988, 8, 648, 1954, 1255, 187, -427, 70, 1458, 1263, 365, 173, 1451, 1831, 955, -46, -602, 555, 1417, 691, -173, -52]
4071e2J133O49j081j101N19Q28L04j196m62J126R01l23j165m84J184O29j222j110
4089i23K53J524K94j009p28J71J495k00r90q18P27R88j66r26p83R15R95k56j396
4108h33o7J021Q66j286p60J26J022M73j044n54K58J188l8j312n13N82J276m10
4126ej096j06Q85P88n60j062k69J241J78p84p85M39J353m3j115m69K84R63r8q48
4146a109n43J093R38l04j241q9O40J065p55j541M73J373N23n67j321N13J184k14
4164A18j249p37Q35J275K13j140l39P38R24m71j420m10J370O66l81p86K23J214
4182F43J27j189q33j37J552q8o25k56O80R12n9j427o40J118N85n14q84N14J070
4201E49O83j202p34K15O84J79p82q86R33J215J41r00j022Q03M51l27j052p1J211
$$ y = [-52, 1081, 1730, 649, -452, 67, 895, 1199, 3, -459, 667, 1568, 1245, 80, -404, 780, 1409, 187, -923, -670, 854, 1148, 139, -589, -418, 1077, 877, -113, -931, -204, 784, 618, -308, -1091, -176, 819, 563, -833, -900, 121, 987, -299, -1059, -933, 89, 562, -482, -1036, -778, 410, 372, -940, -1453, -871, 405, -5, -1101, -1207, -322, 466, -94, -1156, -1425, -184, -6, -790, -1575, -1136, 217, 174, -941, -1410, -1126, -163, -261, -1109, -1652, -559, 379, 75, -1166, -1255, -615, 450, -305, -1846, -1373, 0, 523, -44, -1365, -852, 332, 118, -1131, -1868, -1033, 242, 455, -685, -1024, -286, 638, 167, -1253, -1663, -293, 373, -8, -794, -571, 643, 770, -419, -1252, -1389, 163, 75, -550, -806, -126, 786, 727, -700, -1340, -222, 363, -151, -1035, -521, 549, 1232, 30, -704, -489, 195, 374, -408, -1294, -361, 854, 995, 95, -927, -124, 327, 0, -1052, -1123, 88]
4220H8J115m71j150o4Q83K58j176p36K10J238L15m11o44O86P43k26j489m12O33
4239f10J005j98r13J28J290O01p50j577k25R96N64l89q99Q41J343mj303p28J69
4258f59R85k91p28k07J120Q30m06r88n20N80O13o15q66K92J509P13p22j110M23
4277d7L11K19j169o84J028J337j80r40l29R36M35q20r85k10J568N59m99q46L94
4296G8O77M85j461r92L95J250L28j053J52Q93P33n08j515k27P86R97j091o13L80
4315c06J381M74j092r45j30R92K08n53o75Q07J405l43j101j79M43M45m71j036
4333f76J60J069P52n89j134N02P14%p47r00N00J280j23o97o51P07R20m31j250
4352e94r6N53J108m74r49N6Q67P41r92q16j09R52M62p85n47Q48Q18l20j031m55
$$ y = [88, 1203, 732, -418, -482, 401, 659, -517, -1253, -1043, 195, 510, 99, -545, 141, 884, 658, -831, -1243, -610, 395, 197, -716, -588, 702, 1303, 553, -1024, -1249, -253, 311, -78, -977, -136, 1207, 1203, -100, -828, -659, 326, 35, -693, -900, 220, 1050, 644, -344, -864, -284, 329, -286, -1152, -860, 649, 1362, 640, -470, -47, 264, 483, -686, -1370, -342, 995, 815, -125, -454, 482, 917, 97, -888, -1098, 470, 1029, 530, -316, 78, 755, 1240, -221, -1213, -818, 432, 760, -293, -141, 752, 1485, 977, -538, -765, 21, 1018, -73, -686, -306, 1075, 1549, 457, -488, -618, 374, 582, 29, -646, 161, 1566, 1223, 122, -57, 386, 831, 360, -676, -516, 553, 1305, 716, -418, 84, 798, 798, 51, -849, -349, 931, 808, 111, -540, 167, 1087, 656, -594, -690, -137, 971, 497, -452, -396, 471, 1212, 220, -596, -705, 247, 709, -76, -623, 225, 1043, 723, -308, -763]
4372g63O06Q16k13j004j44J101M28n03j022J17O98O89r77p08N02J125j35p20p02
4391h09P01N97P2j136rN59O63k56r68j89J459J68q07n34j58J115K17p09o17N42
4411i9R73k33j030j0J94R47j19j237R1L14J089o37l28l54P64L76m86o38L21M73
4431C71N08n40j038P80J003k48j102l61O08O98j37r14m2J023L57m58p52N1O34
4450D41N30r80m84L10Q13L97p15n68J66J020m26q56m62J002Q62m52q78k6Q93K59
4470H46o03j196J76J176K75n72m77K10R77k22p85p69M81O68J10p33p5P45O73l48
4490E57j611K67O05M91p04p10M06J129M07j102n10J90M75j21m06n61Q03R24J16
4509F45j098m64R27J84n91q41K56Q77P80n38o38%P89j91p82q03N37J464k23r73
$$ y = [-763, -157, 659, 446, -558, -702, 399, 827, 324, -698, -581, 117, 806, -171, -879, -377, 748, 613, -107, -809, -108, 489, 561, -575, -584, -25, 638, 382, -586, -775, 684, 852, 45, -489, -647, 468, 685, -24, -641, -99, 874, 641, -389, -399, -205, 742, 623, -614, -523, -209, 880, 243, -85, -439, 325, 701, 215, -423, -102, 371, 879, 339, -699, 81, 1084, 836, -266, -627, -19, 679, 542, -372, -414, 609, 966, 508, -244, -193, 441, 971, -9, -493, -183, 630, 1027, 312, -256, -90, 930, 504, -352, -814, 188, 1050, 598, -280, -306, 587, 846, 243, -953, -777, 399, 674, 102, -375, -165, 812, 590, -195, -964, -483, 185, 295, -438, -513, 232, 905, 557, -1054, -787, -182, 309, -395, -1105, -699, 430, 837, -265, -775, -585, -110, -231, -637, -1198, -395, 529, 645, -453, -917, 10, 194, -397, -1238, -982, -105, 675, 137, -501, -501, 288, 97, -685, -1488, -951, 513, 290, -683]
4529f83J86K72N32n37j093q3J126O12l61q81L93Q44K42p02q38KN55K13m86r9P47
4550c9R30n84r05n96O26O24l75o19P7J240O96o73r47k87J016J29q59m71O06Q49
4570D38J87n91p10L64P29n56n03m52R19P74l98p94N0P43M17q38p98M69O62L09
4590D21k94n07L07J020k45j235m73P65M01P3m17m73P32N63m79q82m0P03L30n42
4610b72m05L49Q56J9n17r11M49M78m9o84j02Q52P93n20o93j23M93L91n14p07M22
4631c95P44L41n21n95J68P82j75q36k57K42J026m9q36l85R43M33m87p81K92L94
4651D8L83j81l51J1P91j50n95m20L24N92j31m50j79N71J69J1m68j11M30M67n15
4672B46o15L53Q02K45m84q19N08O46Nq05l61L34R78M5j082o8N19M42r2r32K7J153
$$ y = [-683, -497, -225, 307, -230, -1323, -1406, -280, 332, -29, -910, -517, 327, 569, -133, -971, -969, -414, -201, -687, -786, -39, 891, 307, -598, -1194, -568, 56, -319, -938, -861, 379, 1075, 402, -545, -832, 184, 313, -546, -1017, -411, 438, 625, 34, -676, -312, 417, -139, -642, -1094, -175, 599, 201, -593, -543, 200, 617, -221, -1019, -550, 112, 421, 127, -380, -73, 947, 702, -533, -1006, -241, 160, 233, -184, -657, 75, 638, 159, -723, -763, -60, 270, -272, -677, -328, 528, 547, 30, -881, -432, 46, -3, -687, -789, 63, 856, 336, -357, -480, 13, 404, -110, -817, -395, 349, 690, 169, -426, -258, 524, 349, -487, -744, -502, 524, 475, -361, -746, 197, 630, 143, -638, -346, 48, 431, 250, -101, -90, 701, 551, -44, -464, -140, 452, 321, -129, -308, 263, 432, 443, -25, -136, 294, 761, 246, -369, -16, 786, 1031, 547, -272, 236, 882, 887, 82, -279, 55, 1033, 1078, -4, -72, 447, 889, 797, -135, -108, 1045]
4694A045J50n51j045O15L45N64n64p07J57P39M17r32k17K46O01J3q17j42M88N79
4714I84m20n46j54O75P54p62m08J26N08N4m95p53M46N21J38p94j01N59N88l51
4734E69r11j30O40M12l61n17O2P00K77l21q61P6P09J76l91r11N57R40R9r05n72
4755f63Q55L17l26j032L97N60M88m25o54K94M92Q5o77n43K02O36K48k64j74n8
4775b42P14k99o21j91J71P12m71J6j70N89N93r35n02j52Q29O8j53o41M45O28j21
4796B67l67n21J87Q69k00n68o28R53P69m69n88l04N62J86o64m80K03Q57K24l97
4816a09m72J97P79Or18o39Q15P73j02p87J05O11K24p32m75q4N51M24k42l88J12
4837c51N19J77p82n80K19P33n9o36J05Q10O36o94p65l71Q33K04n08l03L65O13
$$ y = [1045, 1195, 644, -401, 214, 559, 1123, 559, -148, 9, 748, 1165, 233, 16, 262, 863, 876, 59, -83, 405, 984, 564, 18, -136, 539, 1293, 531, 123, 249, 757, 811, 316, -437, 9, 530, 668, -126, -227, 332, 920, 569, -342, -472, 168, 580, 219, -298, -236, 464, 741, 420, -441, -365, 344, 520, 129, -782, -225, 715, 814, -91, -663, 192, 509, 183, -849, -452, 108, 596, 171, -483, -189, 303, 388, -289, -832, -630, 6, 254, -10, -184, -242, 472, 173, -448, -639, -468, 244, -227, -211, -381, 208, 801, -134, -636, -788, 41, 109, -44, -685, -240, 388, 267, -100, -621, -434, 435, 235, -333, -961, -8, 761, 292, -296, -600, -38, 148, -516, -996, -793, 64, 288, -109, -581, -384, 395, 401, -517, -1156, -341, 432, 330, -457, -352, 259, 483, -249, -724, -808, -257, 167, -75, -463, -351, 168, 345, -437, -1017, -798, -65, -124, -760, -655, 155, 791, 97, -668, -1039, -206, -2, -510, -813, -448, 165]
4857A65J73n87q01Q4N53J70o32N5J80R38j20o61j49L20K38j93q31Q4R79J89j39
4878A5n94M10j89J82n88p3J17O88J29p48J09L74N66l99r68J29M15M71l61j67K12
4899b70L20P12j067m72L27M55j04j74l02O96K45J50j042j16M13L55j92n52J94
4918d24P95M97n45p90P9P39Rl28n21K56P00K24q65j72O40K64k02o62j38Q79L86
4939H21l21m83k8O48N20o42j118K43P09K20K33r86N31N21k22p33j67L61O35L7
4959G79p51L7N02O06p46o61J63M62K01l86m37P68L07N2o14n94M62O02p0o42n6
4980a6N99nj5p32k6J023l15j30o04L74L83J82m99k54M6L22K04m97k64L03O52r1
5002F40n79j45M78j73L21q45L52L72L16m70o85K97N49M56n93p19M38L06M04p88
$$ y = [165, 338, -249, -1050, -966, -413, -243, -875, -820, -640, 298, 178, -483, -632, -312, -74, -267, -1098, -1014, -35, 154, 15, -579, -169, -358, -176, -764, -837, -720, -32, 97, -651, -542, -168, 398, -1, -969, -840, -425, 46, -315, -482, -270, 50, 762, -305, -777, -450, 5, -99, -273, -575, 121, 366, 516, -526, -642, -229, 126, -66, -618, -424, 371, 868, 323, -467, -388, 351, 360, 32, -489, -233, 467, 691, -174, -346, 294, 558, 356, -306, -444, 435, 821, 500, 17, -11, 637, 1157, 515, -603, -360, 349, 569, 802, -184, 347, 868, 646, -87, -254, 107, 742, 779, 28, 65, 567, 1173, 427, -234, -71, 391, 592, 206, -231, 537, 844, 896, 282, -312, 150, 752, 682, 40, -16, 583, 578, 563, -169, -195, 828, 513, 383, -221, 153, 536, 718, 219, -35, 11, 333, 537, 40, -224, 79, 731, 640, 61, -84, 394, 221, 542, -303, 49, 421, 737, 267, -418, -121, 428, 884, 291, -428, 10, 316, 720, -68]
5022f8m05N34M41j98n64N62k34Q09m64l48l56N77K57n15l99J29N89M26o19n54
5042d00M27O59l25m75l50O29O02l98l10l1J19K65k97n85J94N86K78j75q29K50
5062a66M70K59o10o50N50P57J06r21K5N24L07n98o34J67L26M75j69j84l60O22
5082B96L06m01q50K92O02k91k62j11M70L87l3m89p36O28j2J16n83j82J207q2k35
5103C7n93J53J67K73o67O4j63J060j20j00o26L64J31J68r60j04M59M85M3n52J80
5124c01l6J85m95j13q7P14R6m85k11K32N11j22n01n60O65J11j3k24j70R67pk12
5146e6p52k39P64J73m05k59L66N13J0p70o8%N39ql33l15L93O92Q1n50j68K62J56
5169B6l16k34j93P10M70o22l9K3K35R5q91%N16O86p3n00J76L10J63n04n86O9O15
$$ y = [-68, -473, 61, 502, 304, -260, 302, 68, 877, 413, 65, -291, 286, 543, 28, -371, -242, 347, 773, 154, -400, 27, 686, 361, -114, -464, 165, 767, 369, 59, 28, 147, 412, 115, -470, -276, 310, 588, 413, -416, -166, 304, 563, -47, -697, -147, 610, 716, -205, -180, 344, 651, 53, -581, -414, -88, 387, 218, 34, -326, 296, 602, 201, -649, -357, 245, -46, -308, -419, 51, 438, 405, -84, -820, -192, -204, -88, -671, -853, 354, 272, 37, -556, -403, -236, 37, -630, -566, -729, 331, 211, 111, -515, -151, -20, 148, -812, -916, -457, 28, 71, -481, -301, -337, -152, -647, -760, -847, -133, -37, -522, -733, -501, 10, -112, -613, -1173, -508, -397, -410, -634, -804, 163, 156, -56, -808, -1047, -283, -110, -515, -774, -408, 105, 115, -655, -723, -723, -184, -192, -525, -840, -447, 245, 326, -224, -392, -130, 26, -290, -524, -717, -7, 463, -159, -198, -175, 60, 155, -736, -736, -220, 466, 393, -107, 69, 379, 542, 38, -548, -479, 136]
5192A36K63k40n17L34N50n8l85n79L10N59n17k86J68L05K81J21m80j20N74N4n23
5213e0L8J9N44Kk53m84J22K60Q9j48l56K29O84k14l10j75J92J52k46k48j64M39
5235A22L64J11n70j7J82L47n46l35J64P17n3l11m55L23O77m28m96j68L49M43p2
5256C48o09J52M45M10l23o99K44J78M34l12m28K77P55j83o74m84N34L38k26k87
5276a10k9N90M63q27n33M77J47M87n78n39M20M81K03o05l31M72L07k63m21l9O44
5297D16K70n07q9n4K65K00r4m24K6N69J37q04K4J76L48N7k42o00L93M24j35k92
5319F4j46M40J12j99m66K07L12L21l41n04L28J75M4l43m8r2N69j9k05k78J85J66
5341B82J71m94k66M26M72j30p93N84j33J76k89o84M13K67M75k50m43j16N98r0
$$ y = [136, 399, 159, -358, -24, 526, 468, 83, -496, -186, 373, -144, -430, -262, 43, 324, 445, -35, -155, 419, 473, -50, -12, 7, 551, 553, 300, -184, -62, 198, 287, 139, -217, 12, 696, 482, 172, -3, 189, 341, 95, -153, -317, 122, 486, 597, 27, 10, 192, 539, -7, -342, -178, 539, 486, 175, -280, 43, 720, 292, -204, -372, -23, 420, 348, -261, -109, 336, 746, 423, -276, -32, 146, 580, 268, -160, 117, 872, 689, 15, -469, 65, 403, 177, -110, -139, 451, 914, 87, -446, 31, 178, 665, 87, -452, -32, 449, 652, 47, -284, 188, 495, 232, -189, -228, 416, 686, 179, 90, 36, 301, 501, 407, -17, 9, 578, 715, -89, -65, 111, 459, 516, 274, -326, 67, 491, 356, 64, -82, 358, 470, 271, -195, 12, 324, 645, 304, -200, 128, 303, 347, 4, -44, -136, 433, 414, 209, -69, 116, 282, 453, -41, -307, 119, 591, 461, -332, 252, 119, 295, 6, -678, -265, 2, 477, 227, -216, -332, 266, 176]
5361A76m68k83N06K59r4k63o0K16J72r4o53J5M42Q1m8j59J72L02k9p90K13K54
5383a33K86k12m77K66L55J12m4o88r6M65M2jo17L28K49M95q43j66kN06j71k56
5405f02R8K85L5J85m74l4K94K11l41l11K53L28K23j65p36O25K10j97j06m30K57
5426c92M95l1j52j07K79N02o12m21j51N43M11l27n26L04L73L71p48p4J56J32j09
5447h4k26q7O13K21k05k26m94J46M50r4m16r6Q19J61j68n04k17O84j59j71n40
5468e93O07M54j54l62l43M16J39j82n96J53K74P09k84l42k33K87L03l32k31p5
5488c85L03M93p48kK36N07k18m82l13M34L26J60n86L58L13M7j87n80k04N73l6
5509Ik87n4K94L70r3k16l84L29P1r6m88J93L06L19j4o18m4M65Q3k42n17L96L90
$$ y = [176, -292, -575, -69, 190, 96, -167, -227, -11, 161, 67, -586, -571, -129, -48, -96, -255, -83, 219, 190, -600, -387, -133, 153, -59, -536, -270, 85, 197, 153, -535, -631, -166, -124, -125, -742, -414, -165, 330, -513, -679, -681, -175, -346, -602, -504, -219, -184, 1, -473, -507, -213, -2, -343, -654, -401, -73, 150, -15, -751, -126, 84, -113, -219, -649, -392, 103, 72, -80, -187, 92, 594, -18, -439, -590, -47, 364, 37, -489, -185, 188, 559, -189, -263, -107, 25, -84, -310, -397, 216, 437, 232, 6, -488, -342, 108, 14, -402, -498, 321, 482, 314, -190, -407, 277, 118, -53, -593, 14, 468, 314, -48, -391, 25, 164, -18, -614, -461, -187, 522, 238, -104, -337, -50, 253, -79, -310, -385, -82, 411, -337, -339, -103, 404, 186, -296, -609, -175, 151, 311, -275, 83, 396, 443, 256, -324, -528, 45, 9, -278, -332, -38, 332, 239, 23, -361, -32, 39, -57, -545, -352, -46, 273, 259, -359, -403, 62, 145, -97, -614, -218, 172]
5532A72J38l56k81N83L2m7k10k62J66M57l45k62L6K47M05m16l5j45K40K81j77
5553B21n39M93L17K6m91k13L13K70j62j79k83M06K27q7k36q4O9K42L4n31N4O66
5575E33q1k19m29K16M04J73l25m03L37L78j9n27k1J9L79r7j27l68J60N31l64k25
5597g5%O54o2m25n39K70O17J07n86p0J60J18j14k81Q0J86N20m51m08J1L18J58
5619A88k14j88J33K44K27m76k24P9L54J43n56l8M02p8J68j33l02P5L59j19l29
5640b85q7O33J69n50j18M5M90l00m70J92J49M61l27l56K23O76k73l11m92J82M08
5661E9L19m13l83K55K12K72m67j25p5O26On3l53l0L71J17j91l79O31l94J4l81
5683c62J5L39M56j95l67p1P29l13j31k81R6K71J1o1k54K14K89k06n00j3N70K00
$$ y = [172, 310, -46, -327, 256, 288, 241, 31, -231, -65, 392, 47, -215, -179, 68, 473, 57, 22, -123, 117, 398, 221, -318, 175, 492, 518, 27, -186, 127, 397, 235, 56, -227, 179, 406, 319, 83, -1, 68, 310, 344, -187, -133, 533, 452, 233, -196, 20, 424, 597, 272, -131, 206, 584, 565, 38, 17, 36, 415, 318, 191, -177, -17, 514, 150, -75, -75, 579, 517, 92, -447, -177, 440, 547, -39, -109, 51, 169, 55, -226, -146, 40, 560, 109, -299, -288, 30, 188, -26, -214, -81, 163, 390, -86, -310, -231, 123, 266, -290, -328, 74, -4, 164, 31, -271, -196, 163, 44, -285, -372, 261, 430, -120, -238, -193, 297, -3, -473, -281, -132, 329, 2, -354, -131, 545, 272, -39, -531, -349, 59, 378, -35, -418, -163, 49, 321, -146, -271, -346, 280, 286, 233, -120, -150, 221, 338, 147, -232, 399, 5, 19, -362, -347, -8, 448, 253, -114, -185, 544, 231, 100, -181, -85, 186, 197, 136, -118, 96, 385, 179, -321, -334, 236, 436]
5705D36j74j21m76N99m6no68K86J65L70k95k19M66Nk62m45J82N2O55j82l39j72
5727a88L01J68l46m89M16P7K13l56J37j5M02Nm29m35K40R1J61m30O3M7P81l28
5749H6l20L6J05J70k58j48q3N82N3l09k96J77N3Rj60r2L34K85k45k81n1M79K37
5772C63m90m10J39M55j21P4n29K63K21rkl79L14LJ19L4k75K98k9P5m51k35J50
5795d22O54m8l52j27M63K62k48n30K72k4K41m39k06P45j19J31j16k67k80L42J52
5816H4k71oJ42J30j78J6r1K81J18k57o38L07O92M0k43n73O91K3j97j07n07L66
5838a78L39q5k48o4L43M27p26k4L0K89q4k64p0O08k27M3j61l67N10J46q8l09j53
5861c13K37L19l7l71R0N3J29jl41O7L51J0k12j04l5K76J29o42K00L41K14k87l44
$$ y = [436, 262, 141, -335, 264, 218, 213, -455, -169, -4, 366, 71, -148, 318, 323, 61, -384, -202, -150, 505, 323, -16, -188, 113, 281, -65, -554, -138, -61, 152, -204, -67, -82, 320, 325, -104, -539, -299, -208, -47, -477, -414, -367, 414, 86, -234, -198, -93, 77, -181, -329, -412, 170, 223, -86, -382, -205, -152, -143, -303, -395, -61, 224, -21, -302, -353, 126, 363, -127, -537, -398, 57, -64, 10, -519, -256, -35, -44, -46, -425, -111, -108, 11, 45, -230, 68, 39, 114, -337, -572, -422, 232, 184, -168, -295, 168, 430, 182, -348, -76, -100, 141, -298, -504, 241, 122, 253, 137, -130, -410, -68, 84, -187, -193, -51, 79, -99, -83, -174, 107, 225, -32, -670, -363, 329, 369, 126, -447, 244, 267, 70, -37, -544, -178, 161, 76, -172, -236, 107, 534, -192, -216, -186, 103, 19, -245, -315, 293, 66, 109, -52, -419, 91, 237, 149, -160, -313, -76, 243, 206, -165, -75, -22, 107, 106, -235, -168, 183, 193, -19, -123, -158, 118, 247, -395, -195, 146, 360, 73, -271]
5884b71P9L90J9j26l61J65N95l19k42k46K11L46p6j49k84K38J47J09l64j94K65
5905f8L88l40k45J88K06M43m31j56r0L57m5l23M6L0P33n82r6k87J89L01j90J35
5927A63n23L94L29j57m6l22J50K69k07j71J84J84P4k05j07J30M07k86j94J56K36
5948D58J13j27m24Q3o7M52n70K9K26K09J46n63J1K14k4J13l17P0J93j69l4K33
5970B55j21J50J11j38n77L91P9k49J95j63P7L99m44K7N5J6k7K66m56l1J91L46
5992C52l98J23n15L18L45j60l99J78J28K05J56o23M70k9k37j53j81q3O35Q3n24
6013c09j04K83q3O8l78J23j3M53O6m38L40L7J15m48p4L7O2K31n5j29K68k00L74
6036B26p11R6J2L55K13l67j17L52K10k63k22j31K14J58l64j83N09K8n8K11n76
$$ y = [-271, -192, 198, 217, 91, -270, -105, 490, 171, -71, -317, -106, 240, 164, 15, -269, -31, 116, 225, -139, -333, -68, 320, -20, -265, -77, 129, 572, 141, -15, -105, 252, 207, -116, -70, -40, 693, 111, 15, -272, -83, 218, 28, 163, -360, 34, 363, 206, 160, -162, -12, 257, 50, -121, 63, 247, 321, 116, 9, 139, 546, 260, 66, 222, 458, 571, 444, 20, 103, 36, 488, -82, -53, 173, 382, 528, -35, -24, 190, 166, 279, -38, 32, 225, 56, 22, 255, 134, 284, 395, 257, -320, 71, 150, -99, 96, -67, 10, 409, -35, -8, 47, 63, 36, 302, -154, -185, 6, 352, -46, 77, -438, -120, 225, 65, -334, -156, -28, 177, 333, -290, 180, 151, -86, -239, -420, -503, 132, 215, -309, -413, -130, -213, -145, -523, -400, -413, 40, 106, -332, 8, 45, 160, -288, -362, -325, -263, -32, -87, -216, 52, -148, 226, -485, -389, -377, -22, 191, -176, -293, 59, 269, 6, -216, -347, -133, 25, -339, -522, -13, 15, -43, 168, -408]
6057d08M27K41o86k2M6L29M72l53m27K84J16K7k31M6o4J8M72j14n85J59M80l08
6079h1J53m66L19K65l27K33k82L70J54l62k50KJ74L77l02k53K32L8j4j20j49J84
6101a05J02K07j94k85M46j4q3k11m12L95L14l54R1Q0P6K85o96K03J51J12pk73
6123a72k36M4M70q0j26j06j74M25j96o2n1K23O0m1K73o35K83J55n00J17K41L68
6145B80k39k35k1j32O03k75j7j30O6L84o03K19l2O4L15j57k62L3N8K06j52r8K3
6168a02M25m08J80qn6K97l70J29k63J68J50L80n77J53N72l00J6m96M22r3L15p09
6190a75K11J06K1J22r8k79L34K98j25k03p5K31j15Rk63K11J86L6j16j77q5L64
6212D18J18m33K52l6n1K73m12j25J37k1p0RJ18Q9K16m24n9j5K25O8l62L0L7M14
$$ y = [-408, 19, 260, -426, -448, -402, -73, 399, 46, -381, -97, 19, 46, -185, -139, -203, -185, 287, 173, -412, -253, 227, -81, 72, -394, -75, 190, -137, 96, -186, 184, 338, -24, -274, -272, -98, 279, -23, -276, -44, -6, -20, -140, -289, -105, -3, 204, 10, -275, 171, 157, 74, -137, -549, -154, 160, -194, -103, -23, 53, 338, -358, -155, -4, 108, 101, -172, -408, -364, 106, 26, -100, -206, -380, 45, -151, -213, -264, -41, 19, -22, 251, -384, -101, 54, -446, -329, -88, 280, 41, -194, -215, -347, 256, -19, -36, -166, -100, 284, -319, -100, -132, -68, 247, 90, -172, -139, -81, 125, -27, -125, -102, 323, -85, 95, 87, 31, 328, -42, 87, -176, -8, 142, 522, -55, 98, 670, 370, 386, -110, 312, 219, 534, -175, 36, 142, 163, 285, 187, -92, 242, 540, 415, 212, 137, 368, 253, 262, -1, 210, 396, 432, 316, 139, 54, 418, 536, 103, 355, 319, 268, 541, 129, 4, 141, 120, 50, 59, 177, 266, 482, 58, -1, -16, 209, 277, -85, -55, -18, 396]
6236C96r6k09M8J36K63k89k43l74N85j69L33l30O9K24k74K97m33J31J94P2l36
6257ej52K91q9l29l3J05R8J36J37k73q3L00K1j45r6LJ78L2j68j36O8M06j55n9
6281E2k47J21J03l6k26L42j70L91k48j04j21J91Q8o8l69K69K23j2M4m45R5J67
6303D0k1q0j18K08J62J30m47o1J90K85l71k69J23K91r1P3k67J63J81j33r9l86
6325d97K33K31l9j3l9r4N89l39r6r4L2L28l58j2J82K06j44r9j63k45M08J04l32
6348b51k1J45J58K80o23j16K48M0r8k14K62L17j55j06j3N6k56K08K7k80Q2K02
6370a08J1Ok85J24N57l93o06O7M82Q1m4J16j58P3J02k61k59R8L43jj54p2K30q8
6394a39R7l60m49O15L7Pk2J99q5J9L24l61p6p4M12pn50M55L18k43m46K1k8M42
$$ y = [396, 300, 91, 139, 275, 538, 249, 6, -368, 217, 48, 381, 51, 120, 344, 70, 367, -66, 65, 259, 331, -5, -157, 134, 45, -284, -317, -212, -114, 22, 159, -114, -197, 103, 124, -21, -117, -114, 64, 96, -72, -208, -140, 266, 111, 52, -195, -74, 29, -7, -233, 109, -61, 330, 82, -22, -143, 48, 136, 68, -301, -32, 191, 179, 223, -222, -127, 40, 19, -61, -179, 29, 191, 321, -126, -187, 3, 288, -83, -352, -229, 62, -29, 44, -223, -60, 121, -12, -111, -497, -264, -33, -72, -85, -124, -218, 371, 32, -64, -158, -126, 202, -156, -168, 14, 220, 76, -23, -186, -431, -23, 81, -251, -272, -127, 31, 311, -312, -428, -180, -140, -238, -452, -190, 127, -28, -134, -147, -91, -347, -139, -112, -392, -310, -108, -97, -91, -376, -252, 305, -88, -694, -627, -145, -64, -108, 8, -150, -77, 25, -236, -495, -397, -54, -55, -209, -281, -51, -139, -42, -402, -851, -236, -199, -192, -214, -15, -100, -81, 243, -118, -194, -268, 144, 137, -413, 42, 360, 117, -329, -308, -336, 106]
6418A06n7K0j95J68J05K3m54OK38j4K52n51J35L57k3K47n60K22K80j54j20k6L03
6441C08m59K35j92J57J33K8R1j56l20L76L57n22k08K65K82r9l67p8K13L52l85
6462A1q8L24l14K96l2m5l82J34L80k90m8K38J30j4m37M79l98L13k11n0L39k45
6484I0K22P2k02p0J97m6j13k67J39J68Q0k63j08L25j03J49j03k64P3M10R5l60
6506A21j77J39J3P1l41J71K7L54j53j12l89N18N0l10l1L0K79j7k79K10k9r3L76
6529D28m99L5O5L68j41k11M1K34j48j16N0o1R6K27k97O6l05L76k61J17k90K05
6551b1o1J54L09k29j51K0K61k91j7J4L49J20o16J83m5K13j83j77J35J53K34k80
6573G4pj90L92j95j64j74L56m2J17k71J84J30J93j29l08j05M17k30k21K35j0J82
$$ y = [106, 49, 69, -126, 42, 147, 170, -284, -278, -40, -54, 198, -353, -218, 139, 116, 363, -197, 25, 305, 151, 31, 5, 308, -151, 84, -108, 49, 182, 210, 301, 145, -175, 201, 558, 36, -172, 93, 375, 276, -91, -169, 44, 396, 11, -77, 247, -67, 229, 197, 152, -230, -96, 284, -6, -54, 184, 314, 300, -137, 342, -56, 257, 46, -4, 335, 90, 312, 384, 182, 112, 309, 263, 150, -117, 22, 190, 270, 7, -101, 224, 121, 270, 167, -97, -24, 386, 481, 121, -56, 83, 96, 167, -174, -3, 24, 378, 225, 113, -276, 242, 292, -18, -49, -19, 260, 243, -36, 174, 145, 52, 428, -71, -36, 29, 397, 256, 45, 86, 320, 172, 56, 106, 45, 141, 368, 71, 137, -168, 208, -53, 64, -226, -21, -82, 72, 381, 152, 1, 21, 282, -9, -26, -12, 337, 457, -159, 24, -21, 192, 9, -168, -33, 120, 354, 74, 67, -123, 269, 74, -90, -264, 92, 50, 167, -104, 80, 210, 403, 274, -34, -139, 278, 48, -173, 62, 52, 234]
6595B34L5j3m83M83k73q8j83K21J12J24Qo0J6k79K65l63J12J68M3l5m9L4LK65
6619B97l73k36M4k02N03J03m98L74R6Q0m87J61J88r5l27L30K9l50M85k9k65k79
6641d51R7K70o3n3J68L2M2j31K6m35M49r8J13j65j26O09o44K57R1J41m25M99m10
6664b07j99K91j22L58l38K27j66L00j89j42J58l8P0J62n07L08K37m1m65Q2J16
6685a05J78j63R2r9R1P5k0l43p9J24K34N36m68j35L0M21m17k38L10j02J29k40
6707a89J75p5J17k8j27J2j46M24j00k28J33J54Q9K0l30K90L1%j9K33m55j48K89
6730A22l60K52k7J36j37J56j28k11K38q3n4j79J25K45K5j51p3R5K43m73M83n38
6752b94M50k34J38j85J06k8j59J3J86J00o2k3O5l72K84L09p3l18K5K32k7k84j48
$$ y = [234, 269, 256, -227, 256, -17, -105, -288, -67, 45, 169, 177, 117, 133, -146, 119, -244, -132, 36, 79, 44, -5, 29, 32, 297, -76, -312, -268, -470, 33, 136, -362, 12, 108, 188, -299, -138, 50, -45, -372, -42, -13, -363, 122, 93, -172, -451, -354, -84, -147, -200, -32, 0, 42, -89, -63, -498, -49, -147, -34, -199, -325, 284, -360, -103, -12, 129, -296, 203, -207, -406, -115, -237, 121, -217, 10, -156, 144, -45, -187, -29, -67, 3, 165, -342, -34, 203, 162, -303, -221, -105, 73, -90, 2, -97, -6, 69, 49, -294, -373, -249, -15, 521, 53, -82, -52, 369, -48, -286, 24, -78, 51, -189, -14, -89, 28, 0, -127, -115, -261, 163, 63, -165, -32, 122, 211, 231, -99, 191, 222, 222, 203, 436, -19, -167, 122, -238, 14, -13, 123, -14, 142, 14, -197, 41, -42, -96, -275, -150, 95, 120, -31, -104, -9, 234, -239, 244, -294, 156, -78, 60, -125, -19, -47, -206, -193, -7, 93, 31, 8, 73, -299, -15, 294, 221, -97, -72, 160, 133, -151, -299]
6775b99K21J01N4j52K30n5j2k65P3k67K24N25m64j27J96l2K03k5n2O8k1M5j13
6798E6j02J90j5q6K5k7J06j64L34k80J4J43K0J58k83J79k66J79M2m02K27Q8O9
6821B05j17k25L27K02m93J8j87K54K15K26o57K48M85k74k82j05L17k70K25j16
6841dj56J65j40J84j94j67M24j98L27O9l79K25J82k11j09J46j75J19J85k55J19
6862A57J62j37j17j24J2K12k70l13K80l3K47j6k2n7K13L6o6j11k24P4K22j69N3
6885Ip8M0J16j17N8p4n7J4J5j54PJ41L4J3R0k13L13j37j25k20M32j96k10K54j85
6910b30L76Kj63j38J7o9R2q8K50J3k66J85K19n91M60on6k3j04J68oO4n38L94L3
6935ej16j22n6K94k40K50K71k27N5j26J80k38J3L47m20M3k9p9J87j33L45j46J69
$$ y = [-299, -78, 23, 77, -75, 155, 100, 88, -177, -104, -371, -147, 378, -86, -213, -17, -49, 154, 129, 77, 145, 124, 169, 56, -46, 144, 129, 43, 68, 41, 147, -17, 317, 37, 51, 194, 214, 372, 89, 268, 2, 181, 223, -179, 48, 136, 205, 88, -137, 190, 392, -101, -83, -270, -16, 199, 425, -232, 16, 501, 227, -55, -160, 157, -113, 112, -4, -160, 5, -135, 49, -145, -312, 112, -86, 241, 310, -69, 156, 338, 127, 18, 164, -11, 108, 293, 38, 157, 319, 182, 65, -59, -47, 165, -105, -418, -138, -171, 76, 60, 38, -19, 194, 230, 164, 53, -171, -97, 125, -44, 9, -69, -29, 87, -30, 28, -46, -103, -89, -74, -228, -221, -80, -46, -33, 57, -156, 157, 20, -105, -325, 107, -89, -299, -45, -230, 146, 148, -15, -153, -136, -205, -113, -201, 49, 62, -204, -19, 200, -391, 69, 63, 7, -16, -120, 48, 42, 106, -432, -38, -5, -121, -243, -299, -5, -245, 5, 276, 49, 104, -22, 158, -80, -67, 280, -140, -97, -126, -205, -18, -151, 194, 48, 217]
6958B17l99M29m43P3Q4K92j62m06K39L3n8J10JK26j72j54L3J11k67J96j60j56
6980c33J99J46J90j08O5j41k0o5J28l17J83o1K87j84k75M56j1p3k11p7QL76p8
7003H4j79j50K08L43q0m36q5K10J26J10l86K07Q6L2J34m89j01K20K35k96j79K63
7025a23%J11P3r0k33K02n7l59L91J12j87k07L91j51L0R5L4j97N0P5R9Q6k25K4
7049e6Rn3j5p0J11J42q1L0L0N7N5m4k30J66J0J72j7j25j91l0J55j23L7J80K3N3
7075A95l18K15n0J24L6l46J21rK03j70j98J46K29j40R5k20J03P6K5j19o5n0L53
7098B36J4m28K68p4J53J21j5k88J40M5l02r9M51n26L90j2N0k85L07k04N9K54l08
7121e3J91j49j35J20J39J05m39K94j0J64l44M9m8m4O7K49j23m7J89m86J14K35
$$ y = [217, -182, 247, -196, -123, -39, 253, 91, -315, -76, -43, -101, 9, 10, 236, 64, -90, -57, 54, -213, -17, -177, -333, -134, 12, 202, 94, 159, 18, -2, -67, 61, -256, -73, -134, 153, -31, -306, 150, 139, 66, -145, -222, -214, 162, 84, -95, -245, -37, 306, 226, -210, -295, -85, 41, 151, -235, -28, 58, 90, 224, -265, -366, -146, 89, -207, -386, -123, -123, -12, 61, -29, -262, -60, -117, -476, -85, 27, -160, -367, 24, -127, -97, -2, 32, -165, -115, -40, 59, 145, -80, -56, -47, -100, -115, -185, -74, 68, -13, 17, 47, 104, 159, 115, -115, 51, 61, 233, 216, 91, -100, -130, 25, -98, -61, 119, 142, 195, -123, 92, 42, 166, 202, -144, -23, -32, 171, 1, -197, -51, 178, 38, 133, -87, 16, 92, 117, -2, -67, -117, 236, 250, -178, 90, 16, 169, 290, 275, -13, 127, 172, -130, -229, 222, -304, 86, 74, 124, -161, 146, -58, 1, 255, -53, 138, -11, -146, -26, 113, 218, -221, 73, 63, 227, -117, -68, -116, -160, -93, 156, 33, -14, 175, -311, -197, 38]
7143C8q8p1K7m1K49j8l61L83j91p1J14k75J91L9l53N06M2l37K29J39j43J42K6
7166A76L9j98j28K3K5o2P8L0M7L55n48K23K29k92j51M5J3K13J40k83j61M59j43
7189A29l1j59O5m9L62j33k95K41k47R0N2p8N5j89L53p2j9k0J43k13j56K74K02
7212C05J16n29n8P3p7K61K0k98K86K19m80K14k93L10m5r2p3J17J6K83l03J06j16
7235c8J54k57p1M9K34%l01K76k51K58J62j97j51k40N02m6k1k44K17k40K37M5l97
7258c20L62k19L6J57k99K53O3j11k83K42Q0J9J7k53M4l2K18N1J9l16m0L06M1n3
7282a8P2k19L02k53j75K51k45J97j50L83j69L3q6l98K66J4K25k97j40L94l6r9
7304a48n8K67l56L92Q3m36n4L05J02N6l28l3k1R1J43l02K83J59p2l2j22l74M24
$$ y = [38, -50, -121, -94, -135, 114, 96, -265, 118, -73, -144, -30, -305, -114, -75, -428, 78, 120, -217, 12, 151, 8, 150, 176, 215, 17, -111, -88, -63, -125, -47, -17, 30, 385, -163, 60, 289, -3, -154, -109, -96, 117, 257, -26, -187, 272, 129, 98, -61, 4, -45, 317, 184, -111, 130, -117, -27, 25, -53, 2, -187, 166, 94, 75, 55, 198, -15, -171, 103, 305, 421, -108, -166, -93, -170, 91, 111, -187, 99, 318, -162, 52, -241, 69, 24, -68, -141, -24, -8, 275, -28, 78, -38, 116, -141, -212, -163, 71, 71, -230, 46, -205, 53, 215, 18, -133, -373, 129, 83, 62, -182, 35, -205, 32, 77, -320, 42, -177, -141, 16, -283, -30, 33, -78, -361, -119, -39, -20, -3, -256, -212, -244, -26, 25, 44, -272, -312, -6, 35, -18, 54, -165, 137, -116, -291, -40, -285, -88, -238, 145, -24, 9, -77, -475, -209, -195, 30, -267, -407, -13, -49, -148, -206, 61, -295, 97, 180, -256, -310, -5, 97, 153, -175, -208, -229, -138, 5, -297, -14, 145, 73, 41, -81, -455, -31]
7327c1J53j70k54K54J56R7q6Jk41m2N3mq4l0L64N3k16m5R1j71L23j06R5k07K01
7352A54l29jJJ51%R7k03l56L71N8P4o5J11m4j25j6J10j4k6Q9j46J1K20k84J18
7377d4R8L6k2m9l34k7L11p3M1J19k26J39m9k7l56M67j66j65L19r9m1J27M2J22
7401A43l23O19j39j93j61K57M0l61m8L12r3j72k0K24J74l78j09N05l45J65j48
7422e1J63j96L10j95m41N12k18K50j39J53J02m26L5K12k03K88k26JK20L0j03P0
7444A48n5J01l24L56k45P5J36r1R9j03j4j03K50k40K76l57L10k4j70J55l6k50
7466a06L86l27R6J76k00K52k62J54K35l75J88j91k41L99j5QK9j27q3L00n24M24
7488A96k73J05pJ27m7m54M14K8K57k22k30q5L9Qn9N67j57l63O9M57k90O2l5l72
$$ y = [-31, 122, -48, -302, -48, 108, 205, 119, 120, -121, -163, -110, -114, -198, -228, 136, 189, -27, -72, 19, -152, 171, 65, 160, -47, 154, -175, -176, -175, -24, -24, 73, -130, -486, -115, -57, 17, -48, 63, 19, -106, -122, -12, -26, -52, 37, -109, -98, 122, -162, -44, 54, 90, 68, 19, -315, -342, -31, -104, -63, 56, -170, -31, -80, -107, -463, 4, -162, -327, -8, -107, -148, -21, 21, 143, -180, 439, 300, 107, -54, 203, 243, -118, -166, 146, 53, -119, -139, 85, 259, -119, -228, 277, -68, 97, -51, 112, -84, 226, 31, -410, 102, -116, 134, -5, 148, 250, -176, -141, 71, -132, 156, -70, -69, 151, 181, 78, 148, 93, 194, -130, 226, -19, 56, 192, 101, 200, 97, 83, -20, 230, -10, 266, -91, 219, 195, 25, 180, 144, -106, 280, -47, 49, 225, 25, 277, 15, 169, 404, 29, 217, 26, -215, 184, 169, 177, 206, 79, -4, 296, -228, 196, -77, 28, 21, 148, 101, -353, 61, 89, 346, 124, -106, -191, -152, -144, -203, 364, 207, -156, -87, 370, 80, 142, 107, -265]
7512b65J72O9K23l98K78l58M88j15j41O3J35j01j19K24q9k3k43L23k20K17j87
7533f7r3K32o5j18Q1r1k11M23j28J31m4J06l21J31J54m83PN5M28J12l18J36j63
7556a06J63k38J87K32k81L8j79J73k23j1J14n8K98J5k02j21K86k5k69J60J7R2
7578F2j21k8Q3k03K75j55L2J91k98j72j18N90j16J11r8k07K10N1l1j00j89k0L08
7601E7k3j69j41j59N07j45O8j27K41J07j03j84K7J68k07J75r2k58M04m0l28M2
7623a80L45k4m15N1k7M92n4k54J78j38L70k80k48K41j61L95m30p9J33K3M6n1j74
7646b41K39L5n3j75O2J25L2Q5m28L16J2k00Q3M0J01R6M9k11j67J70q5j8K04J29
7670B00l97K72q0j81K16m2J99m23L97k28K54l86N87m23J12J29N8j75k82J22J81
$$ y = [-265, -93, -24, 199, -199, 79, -279, 209, 94, -47, 16, 151, 50, -69, 155, 66, 43, -200, 123, -97, 120, -67, -160, 72, 7, -111, -30, -121, -332, 91, -37, 94, 50, 156, -165, -34, 120, -363, -356, -301, 127, 239, -79, 57, -106, 57, -181, 6, 238, -43, -5, -184, -11, -234, -245, -131, -189, 109, 124, -78, -199, 87, 62, -207, -47, -30, 62, -59, -87, -4, -207, 68, -87, -55, 136, -162, -334, -452, 138, 22, 133, 35, -172, 38, 89, 58, -42, -231, -251, 57, 34, -135, -276, -435, 72, -73, -5, -132, 109, 216, 113, -71, -44, 124, -83, 92, 0, -258, 146, 106, -222, -180, 165, 141, -274, -223, -250, 242, 188, -66, 112, -26, 344, 64, -184, 57, -104, 291, -139, -218, -85, -62, -16, -67, -241, -2, 33, -20, -195, -133, -8, 24, 109, -319, -3, 9, -191, -108, -68, 33, 129, 178, -33, -200, -30, -115, -133, 71, 200, -197, 75, -5, -186, 30, -12, 187, -236, 161, -67, 187, -199, 388, -35, 77, 206, 264, 89, -193, -71, 110]
7691A10j07K11k02j77K39l8J39q6j27R5j2j13K30p6m7l9n3J13k16K78j41j51P
7714a63J10O9j85J6N04k56o7J85l92l7J79K67k53J43K20l36O5p2J44q3j09N7q7
7737h1Jj4N92l41K17m59J6J50J69l68J05J60p8J68k65K79l18NK28k2k7J18n70
7760c35M40J59j71k63J97j24j8L65k37J82k08J42j10k8J3p2j75M35k98J94J19
7781B07l45K36k73K25l3M5l08L54o0J53m31K71K4j46Q2J70m60J77Q2J31L76k90
7803A87k35J73j04K46l80p9L59K12k33k9l4j84R6N3k65K01J58k44L54n73L8K58
7825b5J61J1j70Qj65J57L0j74J09l24N57m21J02L60j62j07k1J16j3J36P7k53K68
7848B57l79L29o8j15j68R9o1rp9J82k44K83l29L21J75j17L5k02N9r9P8R8M3l5
$$ y = [110, 3, 214, 12, -165, 74, 36, 175, 89, -38, 57, 45, -68, 162, 86, 39, 0, -53, 60, -156, 122, -19, -170, -163, -53, 16, -169, -153, 351, 95, 28, 213, -179, -216, -37, 230, -23, 120, 340, 4, 69, -3, 141, 58, -51, 6, -81, -80, -94, 498, 157, 374, -85, -69, 81, 250, -118, -13, 147, 69, 237, -28, 251, -67, -62, 166, 144, 117, 235, -335, 105, 264, 93, -170, 27, -97, -115, 250, 13, 195, -13, 129, 19, -9, 4, -68, -243, 192, -106, 88, 207, -138, 98, -175, 50, 17, 62, -246, 108, 48, 201, -230, 41, 65, -81, 1, 171, -289, -112, -30, 101, 477, 187, -48, 125, 21, 267, -113, -192, 167, 379, 146, 117, 83, -101, -5, 48, -217, -16, 142, -102, 252, -321, -283, -25, 136, 147, -23, -15, -180, -23, 7, -167, -58, -382, 175, -246, -144, 216, 54, -53, -74, 42, 29, 165, 242, -11, 257, -122, 207, 139, 24, -144, -45, -106, -115, -194, -12, -256, 27, -302, 19, 194, 77, 112, -90, -31, -130, -52, 46, 89, 54]
7872E4j60m7l30K86Kk56M96l59J24J9J72J30l33K12n5K2Q1k22m5J59j35L8m9K62
7896F6M0l28J80J10l01j79Q0J05On9L52k52oJ68j01J43LN9j12j73qMo2J79jK01
7922A14l00L28o7j04m8j51L7O6J36R8Lj47L43l37j00O7K17j88o7J38k93L84k17
7945h8O3R2Q1m03M51k37m80L29M56j12n05jN7J66K52J00k74J69n9o3J34l88K02
7968e8J07m7k9j28J45J39R0j79k60qJ22K80l39K18J04j16k07L43J3j85K72k59
7990A8k05j46L22N0J10Q4l07j05J26q2jJ30k29J45K00q2j6J0Q5l30M9J99j59P4
8014f0K19k44L69j44m8j20j4RL8J14l1j12L56j31J54l01l0J33j58M1K28j74j24
8037c0QJ91q2J68M5k10j59p5L93p5k58J1j42N83k87j40j1J41j16J3o3LK42k43
$$ y = [54, -106, -153, -483, -197, -195, -451, 45, -314, -190, -171, 1, 131, -202, 10, -45, -23, 58, -164, -209, -50, -185, -147, -196, 66, 106, -222, -42, 68, -233, -412, -332, -227, -221, -280, 72, -180, -186, -18, -119, 24, 27, 86, -26, -199, -207, -203, -265, -86, -87, 114, -186, 142, 75, -29, -77, -228, -191, -125, 11, 109, 112, -35, 308, -29, -129, -62, 155, -33, -100, 38, -255, 129, -88, -25, 67, 148, -255, 196, -41, -521, -192, 264, 152, -353, -354, -297, -131, 121, 221, -53, 116, 57, -6, 128, -260, -58, 49, 2, -27, -155, -10, 129, 219, 40, -220, -228, -106, 174, -165, 53, 157, 41, -166, 177, 190, 5, 277, 18, -187, -333, -11, 39, 149, 233, -74, -179, -53, -135, -136, -6, -235, -90, 110, 28, 12, 22, 107, -223, -174, 25, -134, -60, 159, -85, 284, 140, 92, -28, -42, -33, 5, 119, 88, -24, 332, 201, 355, 54, 24, 157, -1, 40, 268, 94, -30, -22, 169, 87, 255, 300, 90, -69, -144, 249, 174, -84, -73, -215, 368, 81, -59, -70, 71, -45, -32, -95, -92, 150, -93]
8061i3L20k26L0K70j22l47L44j43P8n7J24j2j07m5r5L70o9k71J94J61k70J9J58
8084B11r6n8q8N59m92j38L25k77j26P2M69m21r3K75j89K2J12L5K37m79L26j7q
8107A61j84k31L39k09N6j57K81j13n9J59k46L35j60J87j58K01k92j34j09N74l31
8128i0N1n1P5j5K37k16k49M80k07j11j47J84J53PP4k52p8J52j83J54Q4j5j64M07
8152B80k17%j00J09j49n6L95l52k50K95m2k13M42k13J6j65qK50k75L49k20k87
8174d11M81m58L62n9Q5j11R8R4j42J38M5q2K3k51L00L9j08
$$ y = [-93, 227, 1, 31, 301, 179, -168, 176, 33, 111, 54, 178, 166, 59, 14, -81, 289, 220, -51, 143, 304, 34, 53, 211, 115, 57, -31, 528, 36, -102, 223, -54, -180, -108, 361, -60, -153, 122, -67, -45, 67, 102, 339, -140, 186, 169, 161, -23, -254, 85, -124, -68, -225, 56, -57, -116, 43, -203, 132, -28, 159, 1, 202, -90, -224, -333, 241, -90, -39, -90, -15, -30, 207, -9, -258, 222, 15, -96, -243, -59, 94, 101, 175, -77, -155, -3, -186, -32, 52, 37, -127, 280, 63, 63, -37, 72, -77, -133, 262, -90, -340, -45, -87, -300, 142, -71, -55, -220, -228, 22, -253, 96, -124, -411, 70, -388, -26, -85, 0, -111, -13, 81, -61, 77, 122, 40, 63, -188, 112, 151, 43]
8191D3
$$ Imaginary data points
##PAGE= N=2
##DATA TABLE= (X++(I..I)), XYDATA
0@%%%%%%%%%%qJ6j6J6j7K5l2L2m0M8n6O9p8Q9j04J20j37J56j77K00k25K52k83
33a50L18l54L95m42M91n43O02o68P39q18R06j004J112j235J375j536J722j941
51a031K206k528K931l455M168n202O845r871J7297o6183j45250L5379N5974K6461
65h2259j4889K9157N4322J9952n8482p8821l6934K2212K5094r06l227M1668N7925
78b5188P201o4378o4155p070K7485K095k0973N199N0889M5494q565n0424l3424
91a35814O103J0185k3633l2679J1718N9222M2659j8524m1880j839K9845k267n1930
104a48834l6120K8955N6026J4883k4693p253K9828K0246k9501n2866j6102L6678
116a28753M0042K11j8787J5620M6451J2894m7166n2934K271L8695J5032j5749
$$ y = [0, 0, 0, 0, 0, 0, 0, 0, 0, 0, 0, -8, 8, -8, 8, -9, 16, -16, 16, -24, 24, -32, 37, -41, 48, -56, 64, -73, 83, -94, 106, -119, 133, -150, 168, -186, 209, -233, 258, -285, 317, -351, 388, -430, 476, -528, 584, -651, 724, -812, 910, -1031, 1175, -1353, 1578, -1877, 2291, -2911, 3934, -5937, 11360, -54823, -200073, -164694, -108720, -82259, -97148, -67991, -13669, 6283, -52199, -131020, -167954, -145742, -120648, -121554, -124781, -83113, -25188, -17987, -82365, -146520, -153590, -126105, -124010, -144983, -139784, -88895, -43401, -51966, -102390, -135814, -129711, -119526, -143159, -175838, -164120, -104898, -62239, -80763, -122643, -124482, -94637, -96904, -148834, -184954, -155999, -99973, -85090, -109783, -117036, -87208, -66962, -96463, -149329, -165431, -128753, -88711, -88500, -107287, -91667, -45216, -32322, -79488, -132422, -130151, -91456, -76424, -92173]
128i2173K315M2959M1305r331n0031l3069J2834K4756p184k5011J0947N4034L5358
141G709k5950n0360r838K6343O498l0085j6504L4571N0661Q374l4843k5549J3414
154d5559K0736j4356l5005m560M0783L8920n770l1423m349K8178J2349k9210l2174
167f1440J1996L9793J5252k2340j7364J9143L0673j075l3042k0447K0412L2301
179A3862l52k7971o896L3928L0517j6777l7358k965L2012J4787k5877k5501J6818
192a773L9873J1001k7413k3145J3878K7583l994l4830j5305K8991L4952o557l2497
205A0764m921L0790J8269k4830l2856N961L4661J4451k1931k0789J4345L0399
217E4313L525k9816k0689J7211K9219j920k9004r577K8620K8145j1546l0944l307
$$ y = [-92173, -89858, -46899, -5594, -14925, -64956, -98025, -85191, -60435, -67619, -92630, -81683, -27649, 7709, -18241, -68601, -78439, -52096, -45598, -75683, -92187, -57616, -6955, 1419, -33424, -58973, -45559, -24823, -39179, -74184, -78744, -37961, 959, -4811, -36234, -40583, -12405, -56, -29266, -61440, -49444, -9651, 5601, -16739, -34103, -14960, 15713, 14638, -18404, -38851, -18439, 13862, 13510, -14461, -21357, 12571, 43088, 26311, -11047, -14012, 18000, 32787, 6910, -18591, -1773, 38100, 49101, 21688, -1457, 12421, 40004, 36010, 1180, -14125, 14866, 49818, 43261, 10764, 5843, 36633, 54902, 30072, -2784, 3177, 37838, 52289, 30358, 9569, 23914, 54313, 57838, 28022, 7333, 24544, 53763, 51843, 22839, 13262, 41882, 70027, 58481, 27537, 24230]
230B4230K8469J4461k1885k7002P456L2480J4613j8557j9220J2268K6440o67l2687
243D0399k1969J8547L1795pk4478m182K8166J9968k0683l6917p006K4785J6690
256F5108j3422j6570J3839L3329P937l0355l1819M783K4384M18k5126o780L1477
269E7203L3697q067l5376j5186J6210J0673j9459k3800J0357L7820K0489j7281
281F7280k6619R43J8079m148l2629k0295K2489L7565O970k2386r857J7074J1101
294F5567k3375l6047o976K6307K3135n825j5168O485K2934K507l2762l4733R66
307f985K5607R422j5588n888K3784K5187j1081l8307k2020R550J4339q457j6235
320a6672Q993L4830J9952j9101l4937j0199J3835J109k3250j4603K3705L9334
$$ y = [24230, 52699, 67160, 45275, 18273, 25729, 58209, 72822, 54265, 35045, 47313, 73753, 73086, 40399, 18430, 36977, 68772, 68765, 44287, 40105, 68271, 88239, 67556, 30639, 23633, 48418, 65108, 51686, 35116, 48955, 82284, 90221, 59866, 28047, 32830, 57214, 57632, 32506, 25726, 57203, 90900, 82833, 47457, 32271, 48481, 59154, 39695, 15895, 26252, 64072, 84561, 67280, 40661, 41604, 59683, 55535, 22906, 2611, 25100, 62665, 69635, 47249, 37392, 54466, 65567, 42192, 6145, -831, 25476, 48611, 42786, 27618, 34103, 57037, 59544, 26782, -7951, -6985, 18622, 28044, 12456, 6568, 30352, 55539, 44458, 6151, -15869, -6319, 8020, -437, -16672, -7679, 27151, 47103, 28002, -6935, -17134, -3299, -2190, -25440, -40043, -16338, 22996]
332B2996R458k5479k0437O268Q185j8169l0260k080L2911L1287j806k0819m602
345a2547J4379m52l1385l0393P539L5762J8493j0958r480J4853J5592j6079l8552
358d3228j9643J6137K5579K701j1006N451K5346J2114k4119l7696j0809J8401
370d0772J3367j0053p285K1242L1463K180l1074k6646K334J2819m196j7169K315
383e1475L0865K9084m908k8366j5089R118N205j8534j9750J2851L6810J9403j3963
396h749j9184L566J1710r704k9814j3170K2033L2530P115j4918o142J4962Q651
409a114k1282l2368m409K7425K1317o686j1314J2437K2132k804l1091k4780P302
422d5235K2429N748j2409r85K2381K0385j0706l1248j4566J3405J4436r090j3919
$$ y = [22996, 32454, 6975, -13462, -7194, 991, -17178, -47438, -49518, -16607, 14680, 12874, -7945, -12547, 1832, 1380, -30005, -60398, -52859, -17097, 1396, -9562, -19042, -4189, 11403, -4676, -43228, -62871, -46734, -21155, -18454, -29460, -24009, 1337, 13451, -10668, -48364, -59173, -40772, -27405, -37458, -44743, -23501, 7962, 10142, -20932, -47578, -45244, -32425, -36621, -53790, -51475, -20610, 8474, 3566, -24800, -39889, -30771, -25566, -44100, -63850, -50999, -14189, 5214, -8749, -27933, -24367, -12657, -22361, -52175, -65345, -43312, -10782, -3667, -18585, -24727, -9765, -1114, -22396, -54764, -59173, -31748, -10431, -17117, -28431, -15994, 6138, 3334, -27757, -52537, -45235, -22806, -17058, -29467, -30452, -8071, 12314, 1608, -29640, -44206, -30801, -16365, -25455, -39374]
435c9374J1792L0131J2180k0162k4435O7J5247K88j7928q174J9755K8060L437
448A0884k0273j4126R307J1541j1236k2976K95K6932K0242q428j8241J727J7466
461C114K147k1480j8842R612K4787Q565j3999j0109J3264J7473o707k5631j0461
474b8267J7649J9392p113j7448K796K3315J1300j7808k1822K573J9318O263j5524
487e376j2123J2927K2585K009k0297j2297J2805J6704p387k1676l500K1917J6542
500B2833r104j8493J334J8809P483j6266j8083N286K0534O541j4755j1042J1985
513G062J9907j026k2136j0875J3844J6816o423j8629n41K1070J4894j0989j9296
526C678p99J6356N578j5325j5300Q324K3465O711j6445j3070J0696J5745o607
$$ y = [-39374, -27582, 2549, 14729, -5433, -29868, -29801, -14554, -14266, -32194, -40368, -20613, 7447, 10884, -9389, -23515, -14208, -2667, -13903, -36879, -36584, -9652, 10590, 2162, -16079, -14352, 3114, 5261, -16219, -35061, -25449, -662, 7903, -6096, -16205, -2941, 14532, 7825, -17806, -28267, -10618, 8774, 1661, -15787, -12991, 10324, 21624, 3816, -18006, -15433, 3885, 10148, -5376, -17499, -4572, 18013, 20022, -275, -12572, 233, 16937, 9550, -12126, -15626, 6291, 22833, 13729, -4764, -3430, 15379, 22862, 6596, -11487, -6201, 14333, 20874, 6119, -4923, 7062, 26969, 25943, 3807, -7068, 6776, 23592, 17169, -1460, -2001, 19069, 33963, 22974, 3678, 2879, 19235, 24813, 9488, -5812, 2512, 25977, 32688, 16243, 3173, 13869, 29614, 23007]
539B3007k3416q146J7857J8788n067j5750M68J7729Q102j7099k1261O19J8753
552A4584Q961j1560j0279J2455K0687j600k3861j5670R134J5205m284j4878J106
565@K1744J5905j0529k1675o140J1306N037j3184j2741J0871K5921R616j5931
578B0200j6020L497J1697o968k0787o684J9928K2499O79j5012n102J1141M401
591B3469j7168k1757P31K2462J6240o114j0841P190J5320m054k5660j8343Q952
604i573K0121M323r940J70J7001J2336j3491k5726j0777J2286J1496n953r335
617g062J0571K4157P119j9976k2224m33J2094j194j4065k104K0984K2978j156
630B9689j9399j2180N790M740j2021j6334M880K5634J7958p173j5414o45R362
$$ y = [23007, -409, -8555, 9302, 28090, 23023, 7273, 7741, 25470, 33572, 16473, -4788, -4169, 14584, 23545, 11985, 1706, 14161, 34848, 33248, 9387, -6283, 2851, 18056, 13772, -1106, 0, 21744, 37649, 27120, 5445, -695, 10611, 15648, 2464, -10277, 594, 26515, 36131, 20200, 4180, 7677, 19374, 12406, -8381, -15065, 4863, 27362, 28041, 13029, 7927, 19068, 23469, 6301, -15456, -14725, 7737, 23977, 17863, 7022, 14212, 29532, 25478, -182, -18525, -9573, 10548, 14871, 4931, 5101, 22102, 34438, 20947, -4779, -15556, -3270, 8226, 2273, -7062, 3509, 27666, 34785, 14809, -7415, -7848, 4246, 3052, -11013, -13117, 7867, 30845, 29689, 10290, -1890, 3900, 8640, -3381, -19715, -14835, 10799, 28757, 21584, 6170, 5525, 14887]
643A4887m555k2379j3696J3096K4189Q532r405n634Q997P041j3548k4896q312
656b5683J5972J8698K18r068N240J7242K313k2305k3557m38J6488P219p807k139
670g607J5819J7272m566k3751j6671N208J0873l585j0790N807K3135J5084j1708
683A4520k2344o078R285J164j4209q486J4404K4229O970j4199j3265L008O223
696A222q984j8816l269K0126K0264q84j3575k463J0612J199j8229j8569M372K0491
710f503J1149o667o769Q041J1264o190k2004j3522Q716J7054J505r703K14J7238
724C823R874j3472k2501n214J2417Q023p639p647R972J9121M382j6584j5602J880
738a9167J1513j874j3299l146J7279J9096l600j7278p478R858N747j1457j4364
$$ y = [14887, 10332, -12047, -25743, -12647, 11542, 20074, 10669, 5035, 14032, 21073, 7525, -17371, -25683, -9711, 8987, 9205, 137, 5377, 22619, 24932, 2627, -20930, -21368, -4880, 2339, -5468, -7607, 8212, 25484, 20918, -2833, -19504, -14296, -3423, -7008, -17798, -11991, 11144, 26228, 14520, -7824, -13902, -4617, -3453, -17662, -26148, -11744, 12485, 19455, 5256, -8009, -5001, 1222, -7762, -26578, -29847, -9721, 10543, 9659, -3916, -6379, 4233, 5432, -12797, -31366, -26994, -6503, 4646, -2021, -8790, -749, 10515, 4325, -17679, -31201, -22485, -5431, -3926, -13629, -13415, 3823, 13697, 225, -22276, -27490, -15073, -7050, -14689, -22336, -12364, 6757, 11139, -5445, -21047, -19167, -7654, -9528, -22827, -25973, -8694, 10402, 6802, -10476, -17954, -8096, -2349, -13806, -28170]
751b8170M779K0394J1120r401j1872L186J1136k433j7122j0590J1383J8765K245
764C420j2536m721J1792R583j0819j8078l013J4986J0939o759r920M861J4612
777D347K822j5025j4365M901J4592K434j2841n614J2017J4946l676j6753o219
790a8434J0887R399p019j3434J774J5468Q803r568j3016K248J3941L105j3442
803i288j2124P883J6234J392j3628p140J1576J2491n349j6098m075J2376R718
816C968p084j2514K530J5842P471j1169j3835K986J3305K613j3508r018J0661
829g752J6094J73j3892o244J0284Q690p689j4962j118J4997J1104n584j1526K320
843e105J3026L255j3729j3686N099J5450M011j0326m631J0945J2525n159j6795
$$ y = [-28170, -23391, -2997, 8123, -1278, -13150, -9964, 1172, -1261, -18383, -28973, -17590, 1175, 3420, -9116, -13837, -2045, 7538, -3281, -21359, -24372, -9386, 1553, -5206, -15126, -10265, 4347, 7169, -7856, -22221, -17320, -2728, -294, -13135, -18749, -6732, 8214, 4538, -12215, -18434, -7547, 1852, -5167, -18601, -16827, -1359, 7444, -2124, -15140, -12892, 1049, 4154, -9288, -21412, -13529, 2705, 4097, -9531, -16671, -5095, 7396, 2047, -14051, -18126, -5750, 3968, -3116, -15630, -13100, 2742, 10213, -956, -14791, -11805, 1500, 4113, -9395, -18413, -7752, 8342, 8515, -5377, -11621, -1337, 7353, -336, -15298, -16416, -1419, 9685, 4101, -7425, -5105, 7921, 11176, -2553, -16239, -11140, 4310, 8321, -2005, -6636, 4309, 16834, 11675, -5120]
856e120p268R513J0805m177j0013K986J6108R082j0124j6058r24J0925L195j0599
870a669p272J1172J8302K614j3740r580O070P474o326j3894j015J6187J5639l160
884B0802j2429j887R473K218j4299j4256N724J8734Q184p718n940P480R237o477
898A8846j8925r185J0728J4613J286p640J462J3352O100j2853j9022l499J1873
911G136P427n700l941J0587J5587j23j6720j4119K572Q572j563q832J304J6114
925A8301J4496n196j6248o947N555L101r575r693P560J9429R071q668j1875J253
939A0564O304n234j5535o287J2472J8018L312r736m204P769L629j2785j7870r17
953a0500J5306J1915l283o026M896J1180k450j8289j4250L723J3003M128n829
$$ y = [-5120, -12388, -2875, 7930, 3753, -6260, -3274, 12834, 21916, 11792, -4266, -5190, 5735, 8930, -1669, -8941, 2231, 20533, 23147, 9407, -173, 5897, 13371, 7045, -6849, -7864, 8323, 23962, 20802, 8373, 6486, 15959, 18177, 3878, -10378, -4654, 14080, 22264, 14546, 8606, 16086, 25323, 18846, -79, -9264, 1464, 16077, 17363, 9723, 11185, 24537, 30637, 17784, -1238, -4737, 7136, 14563, 8863, 4922, 15509, 31096, 30973, 14253, 134, 2706, 11278, 9715, 883, 2187, 18301, 32797, 27601, 11353, 4406, 9961, 13062, 3487, -6206, 1354, 20783, 29854, 21186, 9311, 10564, 16868, 11634, -3901, -10188, 2284, 20302, 23614, 13878, 9674, 17443, 21072, 8287, -9583, -10500, 4806, 16721, 13438, 7412, 12308, 23488, 21038, 2749, -11501, -7778, 5225, 9353, 3524]
966C524n04J2220J0930q190j9465r314P251Q039m292o454P406J6892N794j1992
980A1845j5495k022O990p54j0006k833J3158J6866J450j3585r078L751L704q429
994d438j2415K182J6714J2592m143j0462l47O689j719j4783j1011O862J6166O582
1008H469o800n520O630P019p647j7502o659J0723J2112j206p245K566J1857L491
1022A0288j3051j5989n88J1094M983o745m099R140J2891j023j5674j0950M963
1035a4760Q603l424r726J819J4456R974o922j4082k958P826K645r586q653O816
1049a7972J5066N096r752q931L904P505l781j3621m583J1425J2499k063r729q50
1063a5787Q508M465j0042j2803R41J2111O514o177o898M973J0935m03j3038r057
$$ y = [3524, 3020, 15240, 26170, 17980, -1485, -10799, -3548, 4491, 199, -6255, 1151, 18043, 23837, 11845, -3650, -5672, 1318, 564, -9442, -12275, 883, 17749, 19199, 5614, -3464, 287, 3991, -4438, -16853, -14671, 2043, 14635, 10492, 30, -317, 6372, 4653, -10130, -21141, -14279, 1887, 8469, 1669, -3851, 2779, 9798, 2151, -15351, -22010, -11287, 825, -381, -7626, -5060, 6797, 10288, -2763, -18752, -19340, -8246, -3263, -10008, -14107, -4967, 7924, 6901, -8773, -19723, -14760, -6157, -9581, -19307, -17488, -3032, 6942, 20, -14062, -17020, -9194, -6549, -16135, -24788, -17972, -2906, 2190, -7562, -16493, -12589, -5084, -8865, -22486, -27069, -15644, -3145, -5208, -14937, -15787, -7279, -2814, -12856, -25659, -24718, -12607, -6093, -12270, -19168, -14195, -3260, -3663, -16701, -25758]
1077b5758O084J0878r08r805j423J1243Q865n730j3388k466R734O064p068r177
1091b2855L759J3064M979r700r418M284J0469o52j1534n153R745J1265j919j0858
1105a4524k752R823P486o281j1537j91J1328O571p180q849M407J2127K793j0689
1119g468p801N612J0238j347j0362l599J0210J0538k716j0281k295Q571N802o761
1133a659j0549K181J2198O634o477p864M440R538L7j1799p691P023J1397Q45q008
1148B46k148R152Q062n978j2847l093R361P371m396p369M717J2930L619j0938
1162H689j1230K632R360M78q786k766J0535J2541j593j1784o166O200N195o211
1176G094r736K444J4785Q623o018r693J007P340p77j1786p394P480J3824L377
$$ y = [-25758, -19674, -8796, -9704, -19509, -20932, -9689, -824, -6554, -19942, -22408, -12674, -6610, -13678, -22855, -19096, -6032, -1053, -10753, -20171, -15887, -5418, -6070, -17604, -22757, -13012, -1747, -3666, -14524, -17276, -7453, 33, -6248, -17785, -17976, -6648, -77, -7257, -16106, -11699, 428, 3221, -7468, -15269, -9657, 581, -766, -11128, -14727, -4517, 6021, 3305, -6976, -9271, -700, 5102, -1659, -12208, -10027, 2171, 8805, 2328, -5536, -1096, 8442, 8479, -3320, -11011, -3988, 7409, 8254, 246, -1902, 7250, 15312, 9334, -3513, -6606, 2755, 10126, 5730, -1639, 3078, 16008, 19627, 8689, -2541, 91, 9451, 9929, 1143, -1623, 8912, 21453, 19860, 8076, 1910, 8110, 13305, 7094, -2642, -198, 14587, 23210, 17192, 7499, 8506, 15846, 15069, 3283, -4111, 3369, 17193, 20570]
1190B0570o946m351O497N345p312j3731l684J0508J0583j987o407K884J0286J277
1204B3532j2143j2769R98J0314M040m944j635Q648J0155k849j4184r064M651O855
1218A1605k642o279L451J3680Q434p753j3149l380N739J452q273n011R131J4691
1232B1696L976r502q486J794M270n571j1824r85J3040J2811r40r369j796O041
1246A5155M52j1934j0847L127J3302P462m320m419M375O637m526j4957q266O666
1260b093J0964J314n733J129J0183M732r724j4533l469P453N333l944l680P240
1274E172J1727R35j1666j1234P22O070q88p692l91J2054J0841k766j1904n963
1288d983M037K287p493p900M464J3164P752n744q527k24M979k645j1963n940P892
$$ y = [20570, 13624, 9273, 15770, 21115, 13803, 72, -3612, 6896, 17479, 15492, 9085, 11969, 22255, 23532, 11389, -1380, -382, 9932, 13972, 9028, 7393, 16041, 26196, 23347, 9163, 99, 4750, 11605, 8963, 2684, 6135, 19815, 28249, 20496, 7347, 3967, 9706, 11158, 2885, -2126, 7005, 21696, 25672, 16170, 7684, 9478, 13748, 8177, -3647, -4632, 8408, 21219, 20279, 10910, 9114, 15155, 15607, 3673, -7174, -4047, 9255, 16717, 12397, 7978, 12353, 18990, 14464, -493, -8759, -2093, 8871, 10185, 4452, 5581, 15764, 20496, 10772, -3761, -7230, 223, 5556, 1612, -2068, 5172, 16899, 17834, 6168, -5066, -4344, 1726, 838, -6854, -7245, 4809, 15650, 12884, 980, -4983, -946, 1341, -6152, -14052, -9588, 3576, 11328, 5584, -2943, -3167, 1812, -833, -12796, -18736, -10844]
1303a0844J3239K444p467l278N719L319q467j2833k271J0594Q409k788n706L377
1317f553Q630M6j2344j1004K245J0019K394o040j465Q546Q611m725j2898o112
1331b0650N728N724l651o098L544J1501N447p947j0503o09O496Q14p921m162P747
1346a4540J1445R25q801n732L987N288m783r139p42J0302Q299k967p860j48O989
1361g477J848q574q625L726J0694L976o782m641N704P774k443j0974m701P216
1375a3279Q149k017p506Q06R067N449o618r800N15Q892L482o896n687N365J0440
1390C62J051r015n531N602P027k399q529j570Q565P496l506q238j1Q012M175o556
1406c065q521K695R602K974o538n431M789Q536k93q767m524N868O897j788p419
$$ y = [-10844, 2395, 4839, -2628, -5906, -187, 3132, -5335, -18168, -20439, -9845, -1436, -4224, -9930, -6553, 2077, 2123, -10221, -21225, -18980, -8961, -6567, -12607, -14072, -5526, 3085, -1640, -14538, -20650, -14922, -9198, -12849, -18947, -15403, -3902, 1545, -6402, -16905, -17514, -11018, -10204, -18125, -22287, -14540, -3095, -2170, -10971, -16703, -12716, -7428, -12211, -21350, -22092, -11790, -3491, -6458, -14318, -14466, -7477, -5629, -14203, -22828, -19102, -8408, -4432, -11214, -15855, -10151, -2377, -4820, -15794, -20495, -13279, -5130, -7147, -14653, -13847, -4780, 669, -5949, -15749, -15234, -6342, -2860, -9756, -15443, -10078, 362, 1413, -7602, -13133, -7531, -504, -2903, -11432, -13002, -4437, 3059, -447, -8685, -8696, -684, 3491, -3065, -11586, -8891, 711, 3685, -2853, -8284, -3495, 5041, 4748, -4019, -8543, -2675, 4222, 2434, -4985]
1421d985j299Q487O750m053q745r2P703L160o305p306L546R787L094o442n248
1436a948M256P083j647r306m278O930Q400j308o910q03Q053N029o352j0179JQ385
1452E406M419n319m597N189R193N06r721o937L789O836j148o912n07R346Q074
1467A7617l798j0051k551N717K915n724o333M428J1454M182o393o570J317N311
1481A1521k127r035l642Q162J0142O58o831k561N419L155p145r530k13R279O676
1496A3928k242m432K846O846j178j0258q706L558Q687K348m844q21P526O599m903
1511A4954j1106n134N183N413l172m468M364J0460L588p950r607o78N096L3o616
1526C60k370Q427J1071K06q518o304K927K683n578p763J568J1054Q030l586o402
$$ y = [-4985, -6284, 2203, 8953, 4900, -3845, -3937, 3766, 6926, 621, -6685, -3139, 6648, 9742, 3300, -1948, 2308, 9391, 7744, -1562, -5840, 1090, 9490, 8182, 1272, 469, 8522, 13551, 7199, -2980, -2979, 5406, 9825, 4506, -91, 5098, 14291, 14797, 5076, -1861, 1928, 8764, 7616, 704, 197, 9543, 17617, 13819, 3768, 1217, 6934, 9849, 4125, -2208, 2220, 13674, 17856, 11463, 4893, 6210, 11521, 9394, 359, -3283, 4879, 15021, 15679, 8848, 6287, 11706, 14861, 7716, -1814, -2027, 7252, 13928, 11686, 7254, 10100, 16946, 15768, 5510, -3196, 362, 9049, 11397, 6553, 5732, 13258, 19857, 14954, 3848, -1286, 3897, 9310, 6138, 1670, 6034, 16494, 20082, 12132, 2525, 1847, 6943, 6976, 360, -2010, 6417, 17488, 17694, 9176, 2872, 5799, 8482, 2904, -4859, -3291, 7763, 15793, 12207, 5805]
1541E805l10L958j330r612p041M637J0879M561m500l359L588L961n819j1377l844
1556i803O819P922j14l861J791P128J357q908j0703j182O970M175l271k010O142
1571B452P878j139j0565p864K297M999j480n493J859R917P005m838r406l889M281
1586c986J114n679m729N097J1131L687o718o252J811L452l464r163j884Q475R316
1601B208k85o023j630N075J019p428r149J202R236N386k773l792L297O063k128
1616B78j0192o293M216P631Q19m452J03P496M563n195r887l152N461M368l034
1631g270m006M198Q506K838p423p724J001N175l75n722j275P031Q110n20p828
1646e284l822L961L236l781p003J250Q891N927m372n701R01N737r3q049n052M752
$$ y = [5805, 5495, 9453, 8123, -1489, -8530, -3893, 6986, 11547, 7047, 3688, 7276, 11237, 5418, -5959, -9803, -2984, 4938, 4824, 963, 2754, 9882, 11239, 2331, -8372, -9554, -2584, 1591, -1680, -3690, 2452, 10330, 9191, -1374, -9238, -6941, -1942, -3422, -8915, -7056, 2861, 9866, 5028, -4378, -8267, -3986, -2872, -8551, -13280, -8183, 2948, 6635, -83, -6335, -4524, -1072, -4536, -13699, -15583, -7108, 2208, 1923, -4100, -5730, -655, 364, -7064, -16213, -15011, -5775, -389, -3162, -6954, -3657, 2406, 278, -9914, -16207, -11991, -4360, -3541, -7993, -7890, -394, 4169, -1026, -10913, -14065, -8604, -4236, -7270, -11276, -7078, 1428, 4266, -3157, -10881, -9880, -4705, -5080, -10802, -12077, -5046, 3064, 2544, -5284, -9106, -5145, -1909, -5690, -12693, -11443, -2552, 3375, -997, -6698, -5797, -60, -153, -8202, -13254, -8502]
1662h502Q406J446n614k599N080M635l762q681j530O671M989k427n159J335P679
1677A967J627o318o774K102P048J014n679l115M951P514j420p537k913M767M736
1692A970k715o665L15P067M522l846o331J163O277J660o224n155L306O935J305
1707C584n951l000M015O274j859p105k947N309N627k852n921L65P041L746m705
1722A621o399J453O003J561o231m079M536P014O31n928l597M243N391k743p716
1737d240j086O742N565k657n752J096O062K012o094o442J883P157J951m722k892
1752a417M754O143j477p861l893M221N202k091m656P19P509M625m477p634o88
1767a021M982J537n142l281M715P740J614n772m786K246L796k336o928j198P403
$$ y = [-8502, -96, 1350, -4264, -6863, -1783, 2852, -910, -9591, -11121, -4450, 539, -1888, -7047, -5712, 1967, 3594, -2724, -9498, -7396, -348, 666, -5013, -8128, -3177, 4337, 2917, -4620, -7533, -2766, 1970, -745, -7410, -7095, -28, 4494, 648, -5683, -4520, 1757, 3417, -2807, -7962, -4656, 2279, 3584, -2367, -5367, -1352, 4922, 3063, -4042, -6989, -1680, 3947, 1095, -4826, -4461, 2580, 6326, 1621, -4778, -3325, 2678, 4239, -1992, -6071, -1535, 5479, 6110, 182, -3415, 828, 6219, 3476, -4240, -5326, 1416, 6981, 4324, -1428, -332, 5730, 7742, 1648, -4794, -2911, 4246, 6197, 1475, -1417, 3337, 9480, 8003, 142, -3751, 470, 5672, 3581, -1075, -356, 7153, 11778, 7301, -333, -1021, 3961, 5498, 356, -2925, 1790, 9530, 11144, 5372, 586, 2832, 6628, 4292, -2636, -3834, 3569]
1782C569P084j453n881j090M753J093o592o623K106Q029M086l255l387K586M774
1797I799k350r036m161M388O771M67m312N97O331K914n649q378k176N290L481
1812C976k726k729M469P287Q57p884o726J261M371o02m717r9P425P094k420p459
1828A378l461L115J547m557m716K961R068M148l788n259J89K938j423p308l587
1843h755N759Q688J101m319j888L372K136n349q389r05O809N695r02l548K306
1858A811N532m08p993p357J564O826J903k934p26N681N699l432q745m510L280
1873c809M068j939k954K972P611L875n206p771q44L701K53m716k122N986Q495
1888G600P44o135m214J596K443l675n626K24P424O446j677m739o56L589j51o646
$$ y = [3569, 10653, 9200, 3319, 2229, 6982, 8075, 1483, -5140, -3034, 4995, 9081, 5826, 2439, 5025, 9799, 7449, -1587, -5748, -1360, 5411, 5878, 1566, 2163, 8494, 11408, 5759, -2619, -4795, 495, 3976, 1250, -1479, 2990, 10277, 11134, 3250, -3476, -2215, 2156, 1554, -3163, -3262, 4163, 11257, 8837, 1378, -2083, 1032, 2579, -1978, -6694, -3733, 5335, 9483, 5695, 436, 625, 3563, 2140, -5168, -8755, -2996, 5692, 6793, 2474, 586, 3958, 6094, 745, -7644, -8549, -1740, 3955, 3053, -495, 1811, 7343, 6935, -1058, -8415, -6851, -25, 1878, -1056, -1782, 3899, 9598, 6166, -2579, -7089, -3809, 259, -1680, -4634, -1662, 5949, 9824, 4618, -3153, -3997, -296, -43, -4759, -6881, -895, 7600, 8344, 2209, -2005, -409, 2034, -1641, -7267, -7043, 381, 6827, 5150, 411, -245, 3344, 3193, -3453]
1904c453n376K605Q061L033l123k369K786L681l458p397l592M649N593r6l392
1919a848R06N218K319n449p636m89N370K838l617k322M396O294q2o917m890J548
1935d361M283j064m547K63O480M924k496o357j971L755J853m652m162K729P249
1950A926K863m733l990J354M069j882o028k376N033O181k25n123r80M300K397
1965B786m264o405M00N928L205k823l667K428M951m2n932m135K635N024L36m628
1981d203j358M620M610k455o272j530M700L249l380m316J443N992K461m092n113
1996e644J856N184J57n395k923L847N450l51n233k083M676L887k593n890m60N204
2012c11K874l195m128J848N136J718m728m239K390M202R0n037k029M142N405j299
$$ y = [-3453, -8829, -6224, 1837, 4870, 1747, -622, 2164, 5845, 2387, -5010, -8602, -3953, 1640, 1544, -1848, -942, 4276, 6595, 1146, -6490, -6979, -1609, 1229, -2388, -4710, -314, 5980, 5898, -1019, -5909, -4361, -78, -1142, -5689, -5426, 1054, 5978, 3482, -2875, -4846, -1091, 762, -3890, -8052, -5323, 1926, 4789, 56, -3934, -2580, 1489, -393, -6421, -8797, -3764, 2417, 2192, -2931, -3911, 389, 2786, -1478, -7883, -7483, -1555, 1650, -1173, -4840, -2412, 2539, 2497, -3435, -7570, -4935, 89, 425, -4203, -5561, -941, 3669, 1214, -5058, -6588, -1888, 1361, -2019, -6335, -4892, 1100, 3561, -531, -5644, -3788, 1396, 1553, -3842, -6765, -2918, 2532, 2181, -3052, -5135, -459, 3428, 835, -5055, -5515, -311, 2563, -632, -4760, -2912, 2224, 3942, -786, -5025, -2635, 1567, 1657, -3380, -5409, -1267, 4138, 2839]
2028B839n323j571M153L032l491n354O37N460L543l232m018J753M145M08n417
2043b436l845K829N492M21m143j429M341L712k848o193j777M360L473j984l786
2058c813J728N435K077m907n372Q65M240N16m137j785M371N944n34n256l501K818
2074a311L030k918m509M91O569L794k216m816M88L206J85n788l666L462O334J883
2090D218l471k024K741L161l300o555j696M613M822m41l007J304M539J177n262
2105H19o233L28M922J855k273j111L848N347r18o338m270J771L307o91k986J291
2121a332O209M225l111n833j602L009M69l525k666L797P310K079m013m175P92
2136A633K370k148n181r10N888O110J1m227q44K579J066n152n634J135O313L802
$$ y = [2839, -2484, -4055, 98, 3130, -361, -5715, -5078, 382, 3925, 693, -3325, -1572, 2573, 2981, -2436, -6281, -3452, 2040, 2461, -1682, -3111, 1230, 4942, 2094, -4099, -5876, -1516, 1957, -27, -3813, -2085, 3350, 5427, 520, -4852, -3987, 253, 769, -3368, -5153, -782, 5162, 4628, -628, -4129, -1311, 1719, -1199, -5708, -5217, 1352, 5146, 2930, -1886, -1398, 1808, 1993, -3795, -7461, -3999, 2335, 4218, 747, -1277, 1464, 4625, 1325, -5230, -6926, -2313, 2509, 2068, -939, 365, 4904, 6081, 819, -5414, -5086, -164, 1691, -582, -1693, 2155, 7502, 6584, 246, -4024, -2253, 1054, 363, -2623, -1332, 4877, 9102, 5991, 158, -1444, 1565, 2034, -1491, -4157, -360, 6950, 9029, 5016, 841, 1633, 4003, 1855, -3326, -4236, 1652, 7762, 7773, 3546, 2702, 5281, 6347, 1195, -4439, -3304, 3009, 6811]
2152F811j776k300K094L613j621o846l972L013M756Q87k290K74M464K847m116
2167E838o617j974L756K412j510j846L128N544J147n228n306M1K848l9l440k84
2183a530N446N219j079n057k737J585J437l338l976J639O750L759k397m469K84
2198A536K547j234n514k932L974O286J426l709j689K600K098l812n680j495N073
2213e25M328j575k500J289M096K55n408n300J133M315J642k638j173L971M146
2228F056j858n976l040K597K920j276l286J435N107L098l479n202n33L207M65
2243B35l391k694L521N521P00m130l096J989K688j950m672o88M527M280j425l687
2259b272n83L710J084m484l963J344M873K135l383k406K227M064r89n092k628
$$ y = [6811, 5035, 2735, 4829, 8442, 6821, -25, -3997, -984, 3772, 4659, 2369, 2643, 7107, 9954, 5838, -779, -2753, 1003, 3415, 1905, 59, 3187, 8731, 9878, 4650, -656, -615, 2233, 2194, -1246, -1530, 3916, 9135, 8056, 2999, 262, 1847, 3284, -54, -4030, -2391, 4359, 8118, 5721, 1252, 1536, 4083, 2849, -2665, -5597, -1623, 4663, 6089, 2380, 691, 3291, 5389, 1577, -4103, -5598, -525, 3803, 2228, -272, 1017, 5113, 5368, -40, -5340, -4207, 108, 1750, -888, -2061, 1910, 6056, 4198, -1778, -4818, -2221, 699, -577, -3863, -2428, 2679, 5777, 2298, -2904, -3437, -230, 235, -3156, -5850, -2329, 3192, 3892, -238, -3334, -1345, 1343, -607, -5279, -5967, -1440, 2840, 1415, -2272, -2855, 855, 1939, -2545, -6508, -5164, -291, 1844, -1539, -3945, -1718, 2346, 1357, -3735, -6363]
2274f363K974L844q23l658l39M407K569l467m561NM262J624l452k952K438M514
2290A022N74m217k575J524L812r17m472j091M006L384j623l993o06L821J760k907
2306b498m120J068M153J534l155k876J792M048m3m150k609K741L575j073l838
2321e451j011M312L043j915l967n36L472J771k943l848J353M695J701l108k943
2336e375J910L858j096m550k196L184M219m81l434n22M016K264l387m197m52L975
2352b264K591k567k394K287M478Q08n184l570K214L152j03l512j21M203L782j374
2368B426m812j094K389J961k360l184J380N603K089k758l210P25K870p72m188
2383b935j883L748M745Q83l404j172K528J729k814m773j71M350L564j076k538
$$ y = [-6363, -3389, 455, -368, -4026, -4365, 42, 2611, -856, -5417, -5412, -1150, 474, -2978, -5930, -3492, 1022, 1596, -2621, -5196, -3672, 140, -777, -5249, -6340, -2334, 1050, -573, -4566, -5172, -1351, 409, -2498, -6618, -5550, -1397, 137, -3018, -5894, -4102, -54, -97, -4247, -6856, -4115, -540, -1613, -5451, -6462, -2150, 893, -1022, -4989, -5525, -2053, -282, -3225, -7073, -5720, -1025, 676, -2432, -5375, -3465, 393, -703, -5253, -7449, -4265, -46, -527, -3961, -4483, -467, 1797, -1590, -5787, -6239, -2264, 327, -2240, -4634, -2347, 2131, 2939, -2245, -5815, -3601, -449, -552, -4064, -4185, 18, 3800, 2426, -2386, -3480, -1091, 870, -1490, -4674, -3294, 2309, 4398, 1640, -1570, -845, 2025, 1253, -2935, -4818, -1070, 3675, 4558, 1154, -18, 2510, 4239, 1425, -3348, -3519, 831, 4395, 3319, 781]
2398G81J321L773k95m443l917J284M341R16k092p27L427L879k444n090k371K445
2414G88K675j108k488J832N094K407l853m648k78K417M93l463j118L977N090O95
2430H512m254k715J195J978k737l830P04N104L774j199l390J84K071l13m294l335
2446b545J922N116K222k014j712J555K422k569m989k415L426L630L52k079M74
2461B796L554R84m071m677o16L624J839j727j414L032M145k95m951l766J165K439
2477B061m06k738N81M805L411k295m568j319K059M50k815k424K686N216J827l120
2493C411l058P59K076j386m385j503M055M439J88l418n76K154J268l710m419O81
2509c424M076K929j902j802J331L084o20m613l487J484M026K43k199j87L276K829
$$ y = [781, 2102, 5875, 5580, 1137, -2780, -1496, 2845, 3761, 1669, 942, 4369, 8248, 5804, 714, -1657, 788, 3463, 2355, -133, 1699, 6793, 9200, 5347, 699, 421, 2838, 3331, -132, -1250, 2727, 7817, 8512, 4258, 1543, 2738, 4716, 1979, -1851, -1147, 3957, 7731, 6532, 3142, 3326, 5397, 5084, 790, -2545, -623, 4493, 6715, 4701, 2989, 4544, 6966, 4397, -592, -3007, 419, 4049, 4401, 2322, 2796, 6350, 7334, 3263, -1414, -2030, 1594, 3433, 1706, 292, 3324, 7469, 7174, 2223, -1543, -378, 2061, 1655, -1083, -502, 4303, 7714, 5419, 851, -468, 1591, 2041, -774, -3198, -512, 4704, 6531, 3411, 353, 1112, 3188, 1802, -2583, -4086, -31, 4408, 4596, 1178, 602, 2756, 4024, 314, -4105, -3424, 652, 3581, 1679, -123, 1208, 4292, 3672, -941, -4428, -2944, 1082, 1325, -874, -1061, 2215, 5044]
2525E044l002m892j282K635K076j446k338J823L830J528l572l808M31K522Q1l017
2541c387r65L269L826m86m137j438J757J773k235l329L52M377K320j793l141L61
2557b876K574K02l680k891K156M258M41k911j549K466K514k068l908j164L221
2572c215K825j578k874Q38L166Q90k924l142O77L175R60l004j803K210L901n93
2588d91m258j173J926K955j536l346l7L451K313j775l214J96L426R64l104k473
2604f176J380L426P37k909j757K305K671p21l563q00K468K500j206l144K90L276
2620a223K066k577k782P81K834J086k871k303J834L759M43l058j653K293K337
2635I66j121l186j201L402K554r06l021K92L393J316k807l622J302L225Q87k269
$$ y = [5044, 2042, -2850, -4132, -1497, 579, -867, -3205, -1382, 2448, 3976, 404, -3404, -2973, -451, -370, -3387, -4352, -1083, 2743, 2257, -1880, -3318, -1561, 212, -2023, -5352, -5000, -623, 1697, -96, -3237, -2876, -302, -100, -3780, -6671, -4515, -257, 184, -2727, -4276, -1810, 704, -1364, -5272, -6436, -3215, -390, -1968, -4842, -4004, -838, 52, -2872, -6014, -5337, -2162, -1202, -4206, -6009, -3799, 102, -491, -4749, -5922, -3996, -1041, -2577, -5923, -5960, -2509, -196, -1971, -5185, -4989, -1563, -599, -3703, -6176, -4796, -1370, -633, -3542, -5299, -2994, -323, -1044, -4607, -5407, -2939, -439, -1645, -4789, -4499, -1223, 843, -1734, -4516, -3735, -901, 185, -2686, -4989, -3155, 604, 1047, -2011, -3664, -1371, 966, -155, -3341, -4542, -1140, 1414, 508, -2513, -2221, 1172, 2488, -319, -3941, -2639, 586, 1473, -796]
2651g96j602K589L005j73l931k037K378J958o44k513O94L163K627k103l538j89
2667a112K475Q34k533k075K382L827J233k894k426J288K017j171l366r75L585
2682A089L942j007k670n11K438M33k872l535J101L946K218j739k272J960K198
2697D719q36l898k373K086L418K37k116l49L348J906k752m037j038K562K325j563
2713A639j733K047L380J043l869l057Q79J939m79k085n31L479L513p69l607j196
2729E93J493O39k241k449J362M481K413k251k536L53J923n46l799k022K852L853
2745D118P91k333o43J674J261k059m208q43L324L124q90j410N51K829J95l955
2761A526l290M19L145J198j642m86K622K941j598m175k257J646J982o51k121J275
$$ y = [-796, -2398, 191, 3196, 3023, -908, -2945, -567, 1391, 747, -1766, -1072, 2091, 4718, 2615, -923, -1112, 1363, 2197, -336, -2411, -29, 3798, 5031, 2137, -289, 999, 3016, 1845, -1521, -2496, 1089, 5031, 4024, 1354, 843, 3281, 3714, 842, -2693, -1592, 2354, 4572, 2833, 561, 2521, 4719, 3883, -15, -2388, -302, 3116, 3353, 1237, 888, 4236, 6142, 3390, -647, -1685, 877, 3202, 1639, -94, 1953, 5333, 6376, 2507, -550, 329, 2268, 1789, -296, -827, 2652, 6165, 5396, 1789, 593, 2086, 2725, 484, -1965, -603, 3878, 6291, 4040, 1504, 1857, 3780, 3234, -565, -2587, 265, 4118, 4909, 2576, 1933, 3607, 4868, 2809, -1399, -2242, 1082, 4206, 3316, 1906, 2457, 5286, 5481, 1526, -1764, -1345, 1800, 2998, 1356, 870, 3492, 6433, 4835, 660, -1597, 49, 2031, 1380, -741, 534]
2777E34L394J917k173l886j29J867K1k431j408K872L768O43l349j836Q26J646
2793B276j627l264q5L728L277j169k917J9J581M84l235k932J064M049J542j896
2809H95j842J913J601j067l817k062K350K561j58j815J19K638J557k880l629m42
2825d078K668J397j711j833K186L049M92l556k677J070K350q13k189n45L356K533
2841A699j079l394r67J936R79j958k483J228L737J432k427k273P68K362n29l048
2857d017j643K407L487k24k871m95K261J678k434l094K70K731J906j428k013O07
2873b872K846M86k995k209J207K871l8k332n16K387K335j418l092o72K294J795
2889G7j740k162Q30K659J377k104k298O99L185k01k663j460J854K849m87k752
$$ y = [534, 3928, 5845, 3672, -214, -343, 1524, 1545, -886, -2294, 578, 4346, 4989, 1640, -196, 630, 2276, 649, -2615, -2700, 1028, 4305, 3136, 219, 238, 1819, 2303, -932, -3864, -2800, 1249, 2791, 895, -947, 966, 2567, 1500, -2317, -4379, -2029, 532, 374, -1441, -1322, 1316, 2873, -7, -3636, -4078, -1410, -13, -1724, -3557, -1371, 1678, 2170, -1386, -4063, -2993, -643, -1456, -3645, -4190, -834, 1699, 620, -2774, -3741, -1805, -826, -2784, -5267, -4039, -302, 1130, -1297, -3570, -2802, -440, -969, -4017, -5660, -3253, 234, 10, -2861, -3356, -1095, 583, -1851, -4945, -4675, -1944, -38, -1466, -3479, -2872, -26, 460, -2535, -4744, -3537, -666, -704, -3036, -3552, -1165, 1170, -248, -3340, -4012, -1718, 77, -1663, -3825, -2995, -336, 1041, -1063, -3361, -2662, 523, 322, -2341, -3801, -1947, 902, 415, -2337]
2905b337p19K327J941j239k971qK921J285j694k382O37L014P83k229k206J170
2921a707K739l18k495j346K206K792n05k746r10K301J710j689k724j24K903J689
2937A776j570k021O63K566M62k712k199R61L263Q0k175p31J929K281j207l030
2953a664o67K042J595q46k424O96L128J317k615k517N56K159J95k177j112K281
2969e3L229j54k636j442J435J671j579k560j09L366K480j626k251K63J799N67
2985B400k904k304J786L178R57j749j414J545J712j304l153j175K238K600l31
3000B082j756O94K306P26k824k631l67K673J518j584r78J935K379J80l419k025
3016a091J499J433n38j747M32L172K064j480k724j112J877M30j886j812J865L612
$$ y = [-2337, -3056, -729, 1212, -27, -2998, -3006, -85, 1200, -494, -2876, -2239, 775, 1558, -671, -2877, -1707, 1032, 714, -1781, -3127, -921, 1871, 1366, -1380, -2290, 11, 1721, 32, -2692, -2816, 87, 1776, 206, -1815, -1152, 1414, 1876, -836, -3035, -2074, 1189, 1269, -906, -1637, 292, 2573, 1366, -1664, -2331, -289, 1306, 460, -1964, -1268, 1860, 3177, 562, -1955, -1399, 760, 955, -1222, -2334, -53, 3176, 3022, 386, -1056, 379, 2050, 471, -2089, -2198, 1168, 3648, 2022, -229, 34, 1833, 2400, -504, -2808, -1022, 2156, 3113, 1364, -50, 1495, 3207, 1903, -1250, -2425, -187, 2413, 2082, 326, 1020, 3326, 4052, 1228, -1403, -1770, 903, 2421, 837, -141, 1794, 4173, 4353, 934, -1091, 408, 1841, 1303, -444, -12, 3160, 5224, 3744, 1020, -92, 1785, 2215, 329, -1483, 382, 3994]
3032C994Q48k135k154P84J574j241k839l49K755K825n22j889m81J461N69k166
3048A034k764L5L233J566r62j254R96K213p93l336k129J104K613K26j515m8K434
3065B653J651j864l579q81K157J185j122j230J501K709P02k319l098O03J386K8
3081D82k098o51L134K682n02k484j634J077J167j907k188Q08L054J992j106k506
3097f80j79J816l12k489j721J738L201M12j891r21J680R79j255l578k87K385K283
3114A181n82j884N91K262N21k665k662M50K647N30j466p25J985K120m69l190j808
3131c164K163J158n70k067O80K671J829j991k394P2J637L72k049j192J744K505
3147A404N18k174j794J495J543r48k319k57K218J985p47k025J25J685P17k289
$$ y = [3994, 4842, 2707, 553, 1337, 2911, 1670, -1169, -1518, 1237, 4062, 3540, 1651, 1170, 2631, 3200, 1034, -1730, -1695, 1538, 3104, 2142, 888, 1884, 4097, 3304, -32, -2161, -1057, 1556, 1782, 267, 219, 2653, 4304, 2440, -1139, -2020, 137, 1322, 200, -1030, 471, 3180, 3882, 1563, -1535, -932, 454, 482, -1616, -2267, 867, 3549, 3047, 563, -1071, 6, 1173, -734, -2922, -2114, 940, 2932, 1826, -680, -859, 957, 645, -1844, -3565, -1827, 1374, 1786, -105, -1026, 654, 1633, 378, -3200, -3487, -1102, 1181, 599, -1285, -694, 1568, 2089, -576, -3238, -2788, -141, 389, -1077, -1802, 183, 2303, 1834, -1356, -3164, -1001, 157, -413, -2480, -1800, 871, 2700, 709, -1685, -1613, 24, 396, -1653, -2845, -1101, 1404, 1922, -252, -2046, -551, 992, 44, -2275, -2532, -314, 1671, 924, -1101, -976, 709, 1426, -863]
3163h63k088R46K371R33j771j119J063J967l44k746j192J662K212j029j484j68
3179a650J782J804j550k620n2K275J028j530k134J542K017O66k535j703J541J992
3195H73o65j914j059K139J832r25k313n9K097Q90j392k301P67J965J008j962j798
3212b817J209K503k2k149j486J468J997r12j926o56K067J812q87k207n49K325
3228b30Q02j485j828N94K312P22j701j390J212K018k43k720q41J655J558p4j911
3245a550j28J771J267j215k383n7K116J191j528j562J183K451N21k291k104J200
3261a118J740k65j723q06K696J830q85k348r13K031N42j111j976Q22K495J594
3277B605j364j924M04J583j21k314j109J489K678J81j817q77J731J081j475k634
$$ y = [-863, -2951, -2005, 366, 1299, -472, -1591, -528, 1439, 1095, -1651, -2843, -1181, 1031, 2, -1482, -1650, 132, 1936, 386, -2234, -2286, -11, 1017, -513, -2647, -1105, 912, 1578, -957, -2660, -1119, 873, 208, -1706, -2765, -626, 1206, 281, -2032, -2091, 6, 896, -496, -2797, -2030, -65, 943, -1019, -2817, -1608, 895, 873, -1276, -2762, -1294, 703, -209, -2135, -2791, -724, 1088, 201, -2006, -2555, -230, 572, -913, -2741, -2147, 165, 887, -814, -2204, -992, 1026, 783, -1937, -2778, -1123, 435, 361, -1550, -1678, 93, 1360, 145, -2238, -2295, -179, 1012, -516, -2078, -895, 1556, 2077, -214, -2318, -1118, 622, 357, -1366, -2172, 524, 2354, 1469, -879, -1792, 239, 781, -330, -2306, -1484, 1011, 2605, 1241, -683, -279, 1304, 1183, -1131, -2240, -751, 1927, 2108, 291, -586, 1145, 2226, 751, -1883]
3293a883l99K590J588p63j337M40J840L18k139k108L08K320M03j283o32J825K218
3310C306j194k323j645J380J375n17j740Q02K634J248j595k507K17J378k26j222
3326f29j436J953K427N17j899j529J011Q48j233k208J18K819J805n29j735r8J163
3343A365J32k153j950J161K373J076j251p45J177J170j142k325j160J575J976
3358A279J48j305M0J783J043k051k342K00J627J056j619n76J442K123L9k192j828
3375a133J049J401p31j491K40K321J786j072k305l06J032N73j301j736J336K885
3391B548J144j944j403P07J192q68k141q48J795K460k54j651l91J646Q42k196
3407F38k057N42J812J465p87j456Q22J825J6k475j616J081J823n9j326R4J426
$$ y = [-1883, -2282, 308, 1896, 1133, -204, 236, 2076, 2394, 255, -1853, -1545, 775, 1178, -105, -737, 1088, 3306, 2112, -211, -1856, -476, 899, 382, -1358, -556, 2078, 3326, 1731, -776, -559, 819, 593, -629, -2065, -112, 2315, 2832, 933, -596, 415, 1263, 30, -2178, -2060, 759, 2564, 2035, 300, 202, 1365, 1497, -656, -2606, -1445, 928, 2004, 753, 8, 1185, 2355, 1213, -1112, -2272, -697, 1279, 1427, 122, 162, 1945, 2988, 937, -1405, -1205, 422, 1478, -141, -717, 725, 2848, 2887, 695, -1133, -84, 1317, 586, -905, -665, 1656, 3442, 2370, 65, -241, 791, 1364, 63, -1673, -337, 2548, 3692, 1748, 345, 1052, 2244, 1376, -765, -1613, 182, 2642, 2388, 737, 346, 1992, 2834, 638, -1419, -877, 935, 2400, 1613, 157, 979, 2804, 2820, 345, -1271, -190, 1633, 1574, 248, 342, 1768]
3424A768J133j048k444o65J492R28o48j418R14K327M07j717j905L54J610j9j651
3441e82n24J403K015o00j816q93J346P86r84j954J33K134J620j283k027M44K001
3458A219k14k239r67R26K284J75j783q04R57J772p37k421o05J885J200o09j623
3475a584L8J728P11j373j685P26J047N96j413r75R69K082k78k004o82R67J605
3492D75q03j810l41K204J154j483j658L17J758M92j213j516J011J354O6j092j286
3509b371J358J559m71j822q49J997J176p62j848j62J679R95j210j206o1K027L19
3526C48j746j115O10K290k6j513q75J158J501r26j896m57J805J321p59j414M41
3543a253J494O89j620j877O14J824J48j112p65J002J699l56j889j029J177J043
$$ y = [1768, 2901, 1853, -591, -1256, 236, 1164, 516, -902, 12, 2339, 2746, 1029, -876, -522, 1088, 1069, -582, -1106, 297, 2312, 1712, -104, -997, 349, 1135, 151, -1803, -1670, 464, 2084, 801, -1226, -782, 1219, 1005, -1234, -2201, -1275, 1009, 1184, -599, -1403, -446, 1326, 589, -1832, -2437, -552, 648, 39, -1584, -1546, 182, 893, -480, -2165, -1439, -392, 204, -1209, -2184, -1215, 867, 589, -1415, -2097, -1130, 475, -328, -2138, -2479, -275, 879, -604, -2262, -1945, -187, 305, -908, -2424, -1413, -59, 7, -1085, -2371, -1013, 546, 75, -1747, -2596, -599, 577, -185, -2033, -2195, -516, 479, -731, -1937, -1998, 29, 348, -1398, -2513, -1903, 387, 361, -1152, -2027, -869, 632, -294, -2190, -2647, -842, 479, -280, -1694, -1253, 241, 930, -690, -2567, -1953, -129, 19, -1093, -1858, -856, 843, 487, -1402, -2431, -1254, -211]
3559b11l57j546M50J491J292j375j455k14J485N23j255j462R95J989R57j830j042
3576a565M19J310m09j918m33J836J607q0k011M4J289O07j702j522M00J871R49
3593F92j002r78P73J621m07j964j032Q85J611K54j385L4J519J202j010k323k83
3610a793J601M76m53j031Q67K064M52j744j790O55J552l15j568O8J324K002m06
3627A961j841o23J096P46j050j656N54K166J349j219j049R0J152l28j754m21P69
3644e8K057L13o44j090J455N66r40k308p0J498J678o71j001O51J387L97j805j511
3662i6lJ803N06j153j70J049J726o72k191o78O94J063o14r50J18K077J172j312
3680B369j689l94J446J10j415p45J198K147J89j521j455J420L05l82j966J01J424
$$ y = [-211, -568, -2114, -1664, -173, 1119, -256, -1711, -1925, -440, 83, -1172, -2634, -1639, 350, 1307, -523, -1565, -1146, 164, -245, -2163, -2596, -760, 847, 767, -1244, -1200, 89, 696, -1006, -2528, -2128, -257, 692, -310, -1288, -515, 1106, 699, -1265, -2297, -1412, 199, 453, -932, -898, 621, 1823, 813, -1510, -1793, -192, 284, -169, -1200, -333, 1731, 2183, 439, -1351, -696, 856, 541, -1027, -959, 365, 2367, 1961, 120, -503, 593, 1339, 289, -1367, -813, 1353, 2702, 1483, 434, 524, 1676, 1348, -406, -827, -58, 1999, 2312, 1668, 578, 2033, 2599, 1659, -649, -719, 779, 2457, 1786, 785, 1436, 2823, 3220, 1415, -96, -99, 1704, 2210, 1057, 887, 1936, 3662, 2990, 799, 121, 815, 1878, 1264, 314, 432, 2509, 3681, 2369, 680, 286, 1732, 1842, 427, -318, 880, 3027, 3216, 1695, 240, 1660, 1965, 1583, -383, -282, 1142]
3697A142J623r78p50k29J355l61j089j690N45J971O13r58j029R83O70o0j996n35
3715g73P24J693j86j471J92J241Q58j436j679O9J255M10r46o85P26J645K42j607
3733B72j231M32J287k28j002n08J161J729r78j799j68J297M94r96j095L39J659
3750F65P12j416j153R07J067o29j262n91R71J636j60j380l53J140N30p91j518
3767a625P6J430O26p83j187P07J192N64j799j246Q06J505r8j272o63J336J097
3784F66p57j236m59J178J001j065j510K71J630R52j466j047N21J051M32j558p20
3801b116P28J514n31j195n21J571P96n90j863J64J489N94j014j200M12J209O70
3818A17j421j044O32J302r4j235q18J101J197J11j679k86J299O00p27j608K02
$$ y = [1142, 2765, 1787, 1037, 808, 2163, 1802, 713, -977, -432, 1539, 2152, 1194, 165, 1148, 1818, 1758, -238, -773, -49, 1644, 1458, -13, 179, 1420, 2278, 842, -837, -768, 487, 897, -49, -734, -8, 1637, 1879, 272, -959, -527, 760, 532, -470, -978, 183, 1912, 934, -865, -1033, 264, 758, -238, -1333, -994, 665, 1377, -39, -1192, -285, 782, 153, -1109, -1700, -729, 907, 747, -633, -986, 154, 684, -107, -1625, -1549, -119, 507, -276, -1463, -756, 436, 1000, -799, -2045, -1239, 266, 168, -1104, -1767, -431, 666, -91, -1327, -1786, -608, 393, -672, -2182, -1911, -281, 671, -795, -1842, -1321, -270, 162, -1396, -2116, -1388, 126, -405, -1600, -2121, -550, 246, -344, -2207, -2043, -554, 40, -974, -2174, -1762, -553, 117, -1304, -2348, -1716, -414, -508, -1743, -2561, -1460, -263, -152, -1831, -2117, -818, -218, -945, -2553, -2351]
3835b351J556P91j188p63K91J281K58j347j115R44J028L39j408n56J244J365m89
3852a20j656n81J429O04n22j078K33J607P50j220j511N07J191L4j196m13R93J605
3870F56Jj328p17O81J344q49j456J53J402J168p03j343L96J426l6j397j052P49
3888i05J615N35r61p69J223Q95p77j527k83P04J311j73j248K05J779O02j260j656
3906f90K21J332M63r57n04J192J467k72j636r65M96J214m45j330K95J802O11o29
3924A665j100k91J099J81j012q66N59J608N56j029p38L12R34m26j586n09J565
3941I22J142k05r07l44J086P87j781j083j4J602P26q83m37N20J439p28j348j322
3959h28J207P39K12q11k25J043J085j136j242n02Q50Q83n16r11M49J715M23j561
$$ y = [-2351, -795, -4, -1192, -1955, -1664, -383, -125, -1472, -2587, -1643, -615, -276, -1684, -2240, -996, 369, -120, -1776, -2357, -928, -324, -846, -1924, -1691, -84, 666, -554, -2065, -1558, -367, -333, -1529, -1942, -949, 656, 657, -671, -1388, -707, 637, -212, -1668, -1515, -113, 1055, 352, -991, -595, 831, 795, -602, -1654, -905, 710, 1245, 284, -485, 738, 1633, 856, -671, -954, -250, 1061, 888, -360, -155, 1624, 2226, 966, -690, -469, 863, 1326, 369, -135, 1057, 2524, 2252, 616, -349, 147, 1361, 916, -414, -119, 1683, 2294, 1665, 565, 274, 1373, 1554, 542, -324, 235, 1843, 2399, 1370, 632, 944, 1878, 1452, -134, -643, 922, 2064, 1859, 952, 608, 1694, 2481, 700, -383, -397, 1205, 1931, 1048, 611, 1131, 2570, 1842, 494, -828, 379, 1118, 1330, 519, 294, 1337, 2422, 1286, 44, -458, 392, 1275, 759, -152, 297, 2012, 2435, 874]
3977H74j175K76R68j99j011k19J142J207j91j255o02P12M21o73j141J84J672Q70
3995A860n30j137p3J136K7j410o79P09J248J66r12l69P22Q48q67j537J19J069
4013C90R59q64p51P3J249M43j155j489M51J322L0p24m05R99Q77p9j454j115R51
4032b92J042o08r11j24J683R47j282r70l61J075J86o40r89Q47J515k95j211m31
4050h19L27J123m75j225r7Q41Q90n12p27k29J328J82j325q29K85J380M01o48j227
4069a356P23J167j25j532q14R63J041o2j219l5Q93Q60q41j475J41J196O18j112
4087i69p58O57J263j36j275p75R14R93n0j373m56J418M94l37j090k11J100P77
4105A86r30r19J67J220N49j276q74R22R57L16r71j098R19J189o77j051m16J203
$$ y = [874, -301, -25, 943, 744, -267, -486, 656, 1863, 1672, 417, -185, 527, 948, 275, -866, -682, 990, 1860, 1330, 193, 120, 1256, 1283, -127, -806, -97, 1151, 1317, 405, 36, 758, 1606, 739, -798, -679, 390, 1349, 485, -266, -193, 1056, 1499, 344, -1145, -694, 628, 658, -66, -471, 528, 1405, 1326, -128, -1243, -292, 750, 142, -769, -893, 790, 1737, 455, -515, -876, 199, 385, -255, -1244, -397, 1118, 823, -388, -819, -492, 631, 156, -1069, -1166, -325, 565, 53, -674, -903, 425, 607, -718, -1547, -1262, 118, 519, -129, -1356, -633, 534, 409, -1123, -1937, -974, 67, 5, -1214, -1249, -356, 504, -337, -1812, -1671, -475, 143, -969, -1727, -1070, 193, 57, -1218, -1993, -1079, -86, -136, -1509, -1965, -547, -53, -390, -1480, -1691, -591, 186, -744, -1663, -1496, -276, 273, -1003, -1877, -955, 2, 318, -653, -1751, -832, 357, -320, -1371, -1787, -584]
4123e84J043m88r97k61J046P37j231r13N46J037M50p17r50Q34J099k69j088p57
4141a463J372N70j13j209j89R58R57p50j064n8J137O39j136n10N46J295K33j144
4159G1j182R69N96J70j472J24R00J018k16j159l96R18M69l24j428N02J301L99
4177A260p23q54L14P64J08j101q02Q87J254k24o48k17M26Q87p95j196l10R76J143
4196A149q41r44P15R31L32j284r97M43Q12N82j168m48R86J273m93j409l92N08
4214b45P10k51j302N99J423L55k30j555K93O62J55j143o58R07J467J2j059m79
4232c39O06O14o71j213KJ226R45n37r56K74Q16K45j274o74R0J155N51p58j15L33
4252C20J051m07j550m21N31J184m25m75J69P67Q17r81j012l37J280K08o85o84
$$ y = [-584, 459, -29, -1026, -1287, -241, 496, -735, -1648, -1102, -65, 385, -332, -1282, -448, 651, 382, -706, -1463, -91, 479, 366, -843, -1032, -74, 883, 133, -931, -989, 148, 787, -349, -859, -313, 982, 1215, 71, -1111, -142, 454, 624, -848, -724, 176, 1194, 978, -181, -577, 341, 810, 486, -942, -440, 861, 1260, 537, -317, -3, 761, 869, -232, -1034, -147, 1107, 883, 235, 18, 444, 1331, 536, -660, -970, 6, 1149, 308, -636, 79, 1010, 1342, 58, -939, -496, 316, 898, -270, -718, 268, 1541, 1048, -361, -753, -245, 465, 214, -1088, -489, 934, 1289, 1059, -496, -203, 459, 614, -529, -1187, -280, 1187, 1199, 140, -339, 267, 881, 210, -1003, -1001, 225, 1170, 633, -323, -49, 767, 1012, -262, -936, -846, 309, 860, 102, -13, 320, 1371, 964, -586, -1007, -476, 708, 283, -192, -23, 744, 1561, 580, -432, -769, 511, 719, 34, -650]
4270f50O81J590K1j371o95K32R05l48m74j82J056O61j70j256q1M66J67n58r54
4289i60N06J477M16r49o38L82Q31k25j113r38J217R16J8r03q9R18L19o04j318
4308g37J54P82N40l68q58M70R95J06j301r05Q33Q67j6q43j19P23R07p30p76n06
4328g82Q38M39m78n91j1J330K43p06j203N34M84R9q28l79R64R31k93q96l88P26
4348C3N64q34j017M75R20L72k92p75J00P07K38q60j077Q35R07P7p89k35M52Q39
4368F40o78q59n3Q12O03m78p73K09Q56O42r30j095L95J205j29o35n07N42R97k48
4388E16q52o13R56N22k36r19j78Q89R26p96o17n5J046J70j014k29K94J013j12
4407G11q72l82L10Q99j50j221M2Q29N09n15p50J80N90L81m61p56K63R47rq87n91
$$ y = [-650, 31, 1621, 1642, 271, -424, -192, 713, 365, -109, -291, 765, 1426, 1256, 0, -81, 385, 552, -6, -960, -454, 1023, 1439, 490, -148, 234, 1065, 840, -273, -1211, 6, 922, 940, 37, -52, 866, 1185, 581, -737, -583, 199, 739, 371, -487, -17, 978, 1084, -217, -1122, -289, 578, 562, -281, -400, 323, 1230, 500, -276, -782, 56, 495, 17, -574, -585, 745, 988, 282, -921, -387, 97, 196, -632, -1011, -47, 884, 591, -305, -693, 33, 597, -237, -1254, -779, 141, 513, 221, -554, -454, 253, 491, -369, -1446, -611, 296, 373, -416, -651, -199, 640, -38, -897, -950, -138, 465, -13, -786, -577, 279, 921, -9, -1104, -709, 496, 367, -268, -775, -233, 764, 516, -336, -949, 7, 529, 293, -626, -804, 85, 1011, 215, -402, -457, 589, 759, -255, -484, -190, 823, 711, -161, -543, -233, 666, 516, -705, -663, 166, 675, 160, -590, -410, 180, 561, 100, -656, -393, 554, 545, -342, -933]
4428i33O26J112Pj064n74O92O61q1q95k81P47O69m10p81K27N01O53p18p87K1P64
4449A56J86p34k84L01J085o9j127k67L67O58n00q13K6R33O56l73r02j85R54K72
4469C40j018m42J53J107K43p13n86M43M31l5j025m40J118Q28j75r35J99P78K02
4488D73q56r65K35P26O67n79m83O80M68J26j201k10K19N68K7q77K10J183M74n07
4508C78r71k64P25K15j76o16O1J492k92l10q91L01N14n5q59l4Q15R64l29q27l74
4529e33O90N48p91r07L6J555M27o82q04L61P52o1q27n53N16J008j24n34j95O26
4549E08M50m32r22n17J113K56k61l98L38R96p4j181o00P8P64p4k35l74J112N69
4569A116m88p30l42O22K50k82m63N0J210L75p54q57j39R90j08o47n02M05J026
$$ y = [-933, -307, 805, 812, -252, -826, -134, 527, 446, -449, -730, 17, 686, 276, -505, -278, 223, 876, 158, -629, -608, 156, 342, -392, -676, -375, 710, 641, -486, -753, -386, 272, -228, -1041, -1015, -82, 574, 201, -701, -886, 68, 340, -678, -1120, -967, 140, 383, -330, -916, -473, -42, -77, -1102, -1542, -424, 404, 229, -706, -507, 271, 473, -383, -1348, -1113, -387, 280, -299, -782, -102, 366, 492, -709, -919, -700, -132, -105, -982, -772, 411, 885, 378, -593, -857, -132, 83, -93, -709, -648, 844, 552, 242, -649, -348, 166, 111, -748, -782, 33, 997, 668, -159, -533, 157, 705, -86, -993, -957, 598, 1025, 343, -461, -100, 652, 591, -236, -789, -273, 735, 611, 77, -118, 508, 958, 526, -396, -913, 200, 456, 195, -203, 135, 1131, 1057, -124, -724, -646, 118, 44, -191, -565, 547, 1116, 628, -102, -444, 178, 428, 146, -317, -267, 943, 1318, 564, -293, -432, 558, 450, -197, -699, -294, 732]
$$ [...]
8191G3
##END NTUPLES=NMR FID
##END=
