##TITLE=1H_LR-695-CR5
 CDCl3, 8 sc, 
 25.10.2019
##JCAMPDX= 6.0         $$ Bruker NMR JCAMP-DX V2.0
##DATA TYPE= NMR FID
##DATA CLASS= NTUPLES
##ORIGIN= UXNMR, Bruker Analytische Messtechnik GmbH
##OWNER= root
$$ XWIN-NMR		Version 3.5
$$ Fri Oct 25 14:36:06 2019 Russian Standard Time (UT+4h)  she@DPX200
##.OBSERVE FREQUENCY= 200.1315
##.OBSERVE NUCLEUS= ^1H
##.DELAY= (6, 6)
##.ACQUISITION MODE= SIMULTANEOUS
##.ACQUISITION SCHEME= undefined
##.AVERAGES= 8
##.DIGITISER RES= 18
##SPECTROMETER/DATA SYSTEM= spect
##.PULSE SEQUENCE= zg30
##.SOLVENT NAME= CDCl3
##.SHIFT REFERENCE= (INTERNAL, CDCl3, 0, 15.7039)
##AUDIT TRAIL= $$ (NUMBER, WHEN, WHO, WHERE, WHAT)
$$ ##TITLE= Audit trail, XWIN-NMR		Version 3.5
$$ ##JCAMPDX= 5.01
$$ ##ORIGIN= Bruker BioSpin GmbH
$$ ##OWNER= she
$$ F:/spectra/data/she/nmr/H-F/1/audita.txt
$$ ##AUDIT TRAIL=  $$ (NUMBER, WHEN, WHO, WHERE, WHAT)
(   1,<2019-10-25 14:34:59.17 +0400>,<she>,<DPX200>,
      <created by zg, POWCHK disabled, PULCHK disabled
       configuration hash MD5:
       00 E9 B6 7A A2 85 ED C7 34 08 36 98 17 FE 4E 26
       data hash MD5: 16K
       F5 64 12 3C A1 B2 AF 38 7C CF 66 9F AE 7D E1 8F>)
$$ ##END=
$$ 
$$ hash MD5
$$ 9D 09 83 C6 2A 37 77 68 6B 23 86 F3 0A 0D 2C 18
##$RELAX= 
##$RELAX= 
##$RELAX= 
##$RELAX= 
##$RELAX= 
##$RELAX= 
$$ Bruker specific parameters
$$ --------------------------
##$DU= <F:/spectra>
##$EXPNO= 1
##$NAME= <H-F>
##$PROCNO= 1
##$TYPE= <nmr>
##$USER= <she>
##$AMP= (0..31)
100 100 100 100 100 100 100 100 100 100 100 100 100 100 100 100 100 100 
100 100 100 100 100 100 100 100 100 100 100 100 100 100 
##$AQSEQ= 0
##$AQ_mod= 1
##$AUNM= <au_zg>
##$AUTOPOS= <>
##$BF1= 200.13
##$BF2= 200.13
##$BF3= 200.13
##$BF4= 200.13
##$BF5= 200.13
##$BF6= 200.13
##$BF7= 200.13
##$BF8= 200.13
##$BYTORDA= 1
##$CFDGTYP= 0
##$CFRGTYP= 5
##$CHEMSTR= <none>
##$CNST= (0..31)
1 1 145 1 1 1 1 1 1 1 1 1 1 1 1 1 1 1 1 1 1 1 1 1 1 1 1 1 1 1 1 1 
##$CPDPRG= <>
##$CPDPRG1= <>
##$CPDPRG2= <>
##$CPDPRG3= <>
##$CPDPRG4= <mlev>
##$CPDPRG5= <mlev>
##$CPDPRG6= <mlev>
##$CPDPRG7= <mlev>
##$CPDPRG8= <mlev>
##$CPDPRGB= <>
##$CPDPRGT= <>
##$D= (0..31)
0 1.2 0 0 0 0 0 0 0 0.06 0 0.03 0 0 0 0 0.0002 0 0 0 0 0 0 0 0 0 0 0 0 
0 0 0 
##$DATE= 1571999698
##$DBL= (0..7)
120 120 120 120 120 120 120 120 
##$DBP= (0..7)
150 150 150 150 150 150 150 150 
##$DBP07= 0
##$DBPNAM0= <>
##$DBPNAM1= <>
##$DBPNAM2= <>
##$DBPNAM3= <>
##$DBPNAM4= <>
##$DBPNAM5= <>
##$DBPNAM6= <>
##$DBPNAM7= <>
##$DBPOAL= (0..7)
0.5 0.5 0.5 0.5 0.5 0.5 0.5 0.5 
##$DBPOFFS= (0..7)
0 0 0 0 0 0 0 0 
##$DE= 6
##$DECBNUC= <off>
##$DECIM= 24
##$DECNUC= <off>
##$DECSTAT= 4
##$DIGMOD= 1
##$DIGTYP= 9
##$DL= (0..7)
0 120 120 120 120 120 120 120 
##$DP= (0..7)
150 150 150 150 150 150 150 150 
##$DP07= 0
##$DPNAME0= <>
##$DPNAME1= <>
##$DPNAME2= <>
##$DPNAME3= <>
##$DPNAME4= <>
##$DPNAME5= <>
##$DPNAME6= <>
##$DPNAME7= <>
##$DPOAL= (0..7)
0.5 0.5 0.5 0.5 0.5 0.5 0.5 0.5 
##$DPOFFS= (0..7)
0 0 0 0 0 0 0 0 
##$DQDMODE= 0
##$DR= 18
##$DS= 0
##$DSLIST= <SSSSSSSSSSSSSSS>
$$ [...]
##$SUBNAM2= <"">
##$SUBNAM3= <"">
##$SUBNAM4= <"">
##$SUBNAM5= <"">
##$SUBNAM6= <"">
##$SUBNAM7= <"">
##$SUBNAM8= <"">
##$SUBNAM9= <"">
##$SW= 24.0689530833862
##$SWIBOX= (0..15)
0 0 2 0 0 0 0 0 0 0 0 0 0 0 0 0 
##$SW_h= 4816.95568400771
##$TD= 16384
##$TD0= 1
##$TE= 0
##$TE2= 300
##$TE3= 300
##$TEG= 300
##$TL= (0..7)
0 120 120 120 120 120 120 120 
##$TP= (0..7)
150 150 150 150 150 150 150 150 
##$TP07= 0
##$TPNAME0= <>
##$TPNAME1= <>
##$TPNAME2= <>
##$TPNAME3= <>
##$TPNAME4= <>
##$TPNAME5= <>
##$TPNAME6= <>
##$TPNAME7= <>
##$TPOAL= (0..7)
0.5 0.5 0.5 0.5 0.5 0.5 0.5 0.5 
##$TPOFFS= (0..7)
0 0 0 0 0 0 0 0 
##$TUNHIN= 0
##$TUNHOUT= 0
##$TUNXOUT= 0
##$USERA1= <user>
##$USERA2= <user>
##$USERA3= <user>
##$USERA4= <user>
##$USERA5= <user>
##$V9= 5
##$VALIST= <valist>
##$VCLIST= <CCCCCCCCCCCCCCC>
##$VD= 0
##$VDLIST= <DDDDDDDDDDDDDDD>
##$VPLIST= <PPPPPPPPPPPPPPP>
##$VTLIST= <TTTTTTTTTTTTTTT>
##$WBST= 1024
##$WBSW= 4
##$XGAIN= (0..3)
0 0 0 0 
##$XL= 0
##$YL= 0
##$YMAX_a= 248488
##$YMIN_a= -204546
##$ZGOPTNS= <>
##$ZL1= 120
##$ZL2= 120
##$ZL3= 120
##$ZL4= 120
##$ABSF1= 10
##$ABSF2= 0
##$ABSG= 5
##$ABSL= 3
##$ALPHA= 0
##$AQORDER= 0
##$ASSFAC= 0
##$ASSFACI= 0
##$ASSFACX= 0
##$ASSWID= 0
##$AUNMP= <proc_1d>
##$AZFE= 0.1
##$AZFW= 0.1
##$BCFW= 1
##$BC_mod= 2
##$BYTORDP= 1
##$COROFFS= 0
##$CY= 11.3945322036743
##$DATMOD= 1
##$DC= 2
##$DFILT= <>
##$DTYPP= 0
##$F1P= 19.5091578491511
##$F2P= -0.509923556040331
##$FCOR= 0.5
##$FTSIZE= 0
##$FT_mod= 4
##$GAMMA= 1
##$GB= 0.15
##$INTBC= 1
##$INTSCL= 1
##$ISEN= 128
##$LB= 0.24
##$LEV0= 0
##$LPBIN= 0
##$MAXI= 10000
##$MC2= 0
##$MEAN= 0
##$ME_mod= 0
##$MI= 1.114404
##$NCOEF= 0
##$NC_proc= 0
##$NLEV= 6
##$NOISF1= 3.799351
##$NOISF2= 2.8
##$NSP= 1
##$NTH_PI= 0
##$NZP= 0
##$OFFSET= 15.70392
##$PC= 1
##$PHC0= -9569.369
##$PHC1= 10.20083
##$PH_mod= 1
##$PKNL= yes
##$PPARMOD= 0
##$PSCAL= 0
##$PSIGN= 0
##$REVERSE= no
##$SF= 200.130013532006
##$SI= 16384
##$SIGF1= 3
##$SIGF2= 2
##$SINO= 400
##$SIOLD= 16384
##$SREGLST= <1H.CDCl3>
##$SSB= 0
##$STSI= 0
##$STSR= 0
##$SW_p= 3612.71676300578
##$SYMM= 0
##$S_DEV= 0
##$TDeff= 0
##$TDoff= 0
##$TI= <>
##$TILT= no
##$TM1= 0
##$TM2= 0
##$TOPLEV= 0
##$USERP1= <user>
##$USERP2= <user>
##$USERP3= <user>
##$USERP4= <user>
##$USERP5= <user>
##$WDW= 1
##$XDIM= 8192
##$YMAX_p= 0
##$YMIN_p= 0
$$ End of Bruker specific parameters
$$ ---------------------------------
##NTUPLES= NMR FID
##VAR_NAME=  TIME,          FID/REAL,        FID/IMAG
##SYMBOL=    X,             R,               I
##VAR_TYPE=  INDEPENDENT,   DEPENDENT,       DEPENDENT
##VAR_FORM=  AFFN,          ASDF,            ASDF
##VAR_DIM=   8192,          8192,            8192
##UNITS=     SECONDS,       ARBITRARY UNITS, ARBITRARY UNITS
##FACTOR=    0.0002076,     1,               1
##FIRST=     0,             0,               0
##LAST=      1.7004516,     0,               0
##MIN=       0,             -204546,         0
##MAX=       1.7004516,     248488,          0
$$ Real data points
##PAGE= N=1
##DATA TABLE= (X++(R..R)), XYDATA
0 0 0 0 0 0 0 0 8 -8 8 -8 16 -16 24 -24 32 -38 47 -54 64 -73 87 -102 118 -134 157 -179 205 -232 263 -297
30 -297 334 -376 421 -471 526 -587 654 -724 803 -891 987 -1092 1210 -1339 1486 -1648 1830
47 1830 -2039 2278 -2557 2885 -3279 3763 -4374 5173 -6265 7867 -10446 15309 -27795 131448
61 131448 248488 89689 67462 69621 127884 145251 152119 108405 79049 78378 132381 165029
73 165029 144756 65114 87 -13919 39851 106802 143030 114569 54581 5907 8906 45295
85 45295 74486 58215 13949 -18329 -6610 28371 52378 38162 -9535 -65854 -90664 -62644
97 -62644 -3572 31414 13219 -32617 -56566 -45123 -24920 -24632 -46400 -76515 -94412 -79376 -30701
110 -30701 13512 8658 -45052 -99312 -116430 -101344 -77988 -66519 -76347 -100969 -111916 -85441
122 -85441 -40593 -25937 -62451 -118594 -146353 -129094 -84661 -46660 -38275 -61653 -95738 -109485
134 -109485 -89905 -54792 -42570 -71010 -113051 -124612 -92206 -46726 -27158 -44616 -83668 -117442
146 -117442 -121393 -87435 -40700 -22353 -43676 -73889 -80859 -62100 -38804 -30769 -43537 -71194
158 -71194 -90553 -76783 -31489 6981 5438 -28599 -60512 -69578 -60917 -45278 -31198 -28405 -38418
171 -38418 -44528 -29704 -1698 12083 -2543 -30659 -47031 -41555 -21917 -543 11058 9312 -369
184 -369 -7341 -4047 3715 5300 -4344 -13252 -8838 5814 17790 20818 16219 6336 -4242 -6201 5939
199 5939 21539 24112 17382 18672 29498 35192 28399 17610 10911 7591 8250 19576 38165 47510
213 47510 39435 25384 20374 21964 21276 17149 14591 16220 19642 28670 41062 47713 41579 27205
227 27205 16627 14658 18135 21854 27068 32794 35377 32543 28033 25671 24070 17961 10939 11407 20247
242 20247 25831 22537 19012 22573 25432 18915 6653 1289 5501 11714 18449 26990 29162 18634
256 18634 2283 -3858 2606 10343 11132 7103 2722 964 6501 18967 25941 13950 -9926 -25053
270 -25053 -18954 432 17021 20732 13480 -79 -10276 -8242 4609 13533 4833 -15213 -25824
283 -25824 -13377 12236 27161 20144 -1639 -21885 -27975 -16823 3746 16340 9118 -9636 -18560
296 -18560 -8515 8862 14110 2825 -15825 -29917 -26216 -3184 23210 28180 5743 -20548 -26436
309 -26436 -11315 4216 6975 -1591 -13031 -17504 -7911 13609 27230 16508 -13104 -34302 -28748
322 -28748 -2865 20189 22329 5339 -13808 -17355 -2767 14956 17110 -473 -23443 -28249 -8270
335 -8270 20381 34832 23473 -3613 -26470 -26596 -4617 21286 26082 4536 -18922 -16885 8956
348 8956 31210 28817 4938 -21764 -33633 -20288 12072 38847 35801 5104 -22071 -20633 3644
361 3644 25106 23344 1286 -21146 -23238 846 33373 45001 22900 -14030 -34502 -23289 7007
374 7007 29960 28433 6457 -15750 -17781 2654 26211 28337 2700 -27881 -33473 -7002 28019
387 28019 41380 25319 -4546 -25478 -23244 -891 21066 22022 338 -20368 -16854 7758 29465
400 29465 27280 2260 -26935 -38495 -20671 12494 32206 21804 -5553 -22578 -15357 3892
412 3892 15470 9401 -10188 -27888 -26166 -1572 26604 32215 7306 -25875 -38382 -22325 4194
425 4194 16986 7704 -12423 -25150 -19076 943 16994 11183 -14391 -38179 -36602 -9856 18254
438 18254 24994 6747 -20009 -33956 -25122 -2828 11582 3458 -18998 -31652 -20005 3706 18444
451 18444 11953 -10506 -34403 -40887 -23469 5301 19064 6862 -15919 -26094 -15801 1888
463 1888 9146 -656 -18949 -30311 -24151 -2514 17815 18907 -156 -22649 -29831 -17718 1030
476 1030 9045 1986 -11898 -18195 -10180 6331 15228 6708 -12661 -24875 -18836 355 16072 18073
490 18073 7982 -5796 -13655 -8078 5314 12541 4927 -9475 -12378 297 16622 21684 13759
503 13759 -650 -12390 -12230 492 14866 20000 12247 2899 1337 7868 15218 16593 9102 -1379
517 -1379 -6090 2043 17474 27052 22563 9604 105 1034 7953 13500 14178 11780 8822 8522 12216
532 12216 19152 22026 15239 3750 -955 5740 16753 21295 18931 14003 10525 9070 9806 11564 11253
547 11253 7479 5359 7911 13398 16724 15482 11394 6408 2389 1975 6560 10278 9556 7087 8027 11118
563 11118 10915 6290 892 -632 405 2412 4223 5571 5615 3981 1068 167 -64 -1680 -5384 -7054
579 -7054 -4538 1086 5004 3411 -1678 -6887 -9873 -8775 -4765 -2931 -6125 -10263 -8778 -3143 -290
594 -290 -3436 -10020 -15489 -18085 -16967 -10461 -2330 -1913 -9680 -17401 -16641 -9854 -6104 -9813 -16823 -21019
610 -21019 -18398 -10216 -2334 -1106 -8858 -19802 -24918 -20969 -11030 -4298 -6558 -13964 -19957 -17387 -8425
625 -8425 -1868 -4933 -16730 -26879 -24811 -11562 1536 3994 -4141 -15607 -20924 -17482 -7815 260
639 260 -2316 -13833 -21466 -15011 705 10459 5652 -8233 -20522 -21311 -10390 4739 11707 4529
653 4529 -8727 -14200 -6813 6205 11736 4849 -7307 -15551 -10030 5642 19993 19466 5111 -11337
667 -11337 -13503 -740 13623 17865 9156 -2596 -6035 1980 15644 22918 16371 -212 -12876
680 -12876 -8193 10273 26419 25971 11923 -2470 -5478 5665 19428 23059 12780 -2782 -7737
693 -7737 4297 22561 31370 23096 5106 -8682 -7605 8286 25210 27422 12936 -3631 -4465
706 -4465 9585 24647 26366 13335 -3711 -10730 -1896 17321 30384 25598 6999 -9301 -9110
719 -9110 6760 21875 21898 7337 -7536 -8783 4556 20427 25332 13200 -6529 -17561 -9707
732 -9707 9183 21921 18454 2929 -10509 -10960 1391 14951 15927 1093 -15571 -17688 -3028
745 -3028 14780 19810 8780 -7983 -18335 -14447 575 12641 10514 -3422 -15912 -14076 -493
758 -493 13219 12107 -2650 -18782 -22437 -10333 7393 14988 6192 -10580 -19742 -14436 -320 8782
772 8782 4882 -8471 -19186 -17281 -3216 10666 12558 -1312 -18750 -24254 -12642 4326 10754
785 10754 2758 -10818 -17248 -12239 -648 8731 5473 -8221 -19992 -19056 -5194 9525 11971 1501
799 1501 -13030 -18837 -11306 2455 9209 3020 -9649 -15638 -9425 2219 9803 6702 -3992 -14582
813 -14582 -15965 -6405 6426 11510 3892 -8409 -13711 -6445 3960 8593 2103 -7480 -11699 -7074
827 -7074 2525 9515 8904 -201 -9604 -11743 -3692 5808 8212 2465 -5249 -7299 -2347 5375 8525
842 8525 3809 -5648 -10044 -4993 4058 8839 6833 642 -4713 -5336 -1071 5266 6710 1928 -4147
857 -4147 -5149 56 7072 8584 3441 -4051 -6561 -2793 3450 7411 6182 1286 -2417 -1977 1610
872 1610 4908 4627 866 -3022 -3235 606 5918 8178 4910 -1321 -4463 -1393 3372 4638 2152 22
888 22 327 1261 2664 3780 3927 1852 -1998 -2288 1434 4367 4150 1650 -223 -165 1486 1919 1147 -251
906 -251 -757 515 2723 3393 2063 -335 -2168 -1435 584 1895 1594 -331 -1435 -555 1927 4037 2645
923 2645 -2154 -5830 -5090 -454 3849 3858 250 -3176 -3395 -1565 1200 2306 -619 -5364 -7687 -4142
939 -4142 1793 4948 2562 -3363 -7519 -7407 -2588 2785 3175 -2269 -7844 -7724 -2639 2529 2815 -1483
955 -1483 -7164 -9435 -6330 464 5077 2784 -4256 -10666 -9036 -1715 4092 2609 -4096 -9245 -7644
970 -7644 -1327 4891 5107 -735 -8463 -11766 -7328 1541 6630 3139 -4738 -9398 -6186 1461 7057
985 7057 4830 -4012 -11387 -9786 -328 8338 9227 2091 -6406 -9155 -4264 4265 9688 6044 -4147
1000 -4147 -10548 -6059 5272 12698 9861 -1068 -9149 -7897 1317 11166 13098 5650 -4309 -8219
1014 -8219 -2261 8689 14586 9453 -1559 -8050 -4166 7427 16882 14699 3769 -7408 -8026 2032
1028 2032 13298 15725 7730 -1834 -5257 1097 10854 16746 12285 -28 -8596 -5669 7102 17504
1042 17504 16734 5544 -4510 -5504 3095 13447 15227 7117 -3501 -7398 -282 10922 16653 11861
1056 11861 781 -7637 -6012 5004 14753 13894 3439 -7191 -7887 1378 12034 13452 4312 -6777
1070 -6777 -9866 -2922 7861 13184 9210 -2267 -11218 -9909 929 10747 9644 -934 -11272 -10991
1084 -10991 -1302 8933 11041 1665 -10710 -14956 -8478 2935 9172 4875 -5428 -13513 -12373 -2191
1098 -2191 7245 6425 -4144 -15592 -16434 -6742 4920 7305 -722 -11666 -16311 -11075 -1000 5036
1112 5036 1906 -8118 -15864 -14015 -4823 4224 4238 -4914 -14636 -15690 -7873 1950 4859 -873 -10916
1127 -10916 -15349 -11259 -1438 3677 861 -7409 -12706 -11260 -3783 4095 4455 -2953 -12086 -13571 -6125
1142 -6125 3000 6069 45 -7739 -10666 -6411 1589 5919 2845 -4379 -9752 -7789 -444 5960 6307
1157 6307 253 -6904 -7841 -1759 6143 8123 3133 -4382 -6709 -2146 5247 8500 5566 -531 -4329
1172 -4329 -2797 3277 8535 9175 3642 -2956 -4064 1395 8338 9833 5202 -387 -1951 1744 6693
1187 6693 9346 7612 2725 -1265 -496 4450 9064 8870 4532 363 -308 3410 7793 8681 5404 1008
1203 1008 -65 2635 6070 7848 5881 2194 246 1309 4423 6595 5905 3593 661 509 2617
1218 2617 5111 4935 2222 -361 293 2679 4621 3886 1713 -396 -763 820 2440 3116 1407 -549
1234 -549 -912 43 1345 2219 945 -1619 -2901 -1768 1175 2248 135 -2170 -3620 -1708 64 306
1250 306 -794 -2806 -3805 -3271 -1335 268 126 -2327 -4897 -5343 -2618 330 360 -2669 -5384 -5248 -2260
1267 -2260 64 -473 -2720 -5450 -6150 -3585 -851 313 -1489 -4373 -6105 -4892 -2019 875 -219
1282 -219 -4204 -7161 -5798 -966 2046 731 -3669 -6639 -6261 -2490 1021 1999 -921 -5058 -6682 -3982
1298 -3982 1055 3431 961 -4289 -7485 -5150 983 5148 3298 -1950 -6825 -5850 -510 4441 4762
1313 4762 467 -4677 -6200 -2359 3367 6287 3622 -2578 -6787 -4707 2652 7437 5754 -711 -6151
1328 -6151 -4920 963 6432 7143 2325 -3669 -5577 -1477 5461 8209 4614 -1823 -6242 -3449 3524
1343 3524 9205 8084 513 -5674 -4869 1827 8674 8481 2499 -3510 -4933 -376 6499 9575 6410
1358 6410 -1698 -6061 -3942 4283 10649 9040 625 -6103 -4790 2586 8519 8937 3253 -3991 -6057
1373 -6057 -586 6822 10272 6042 -1921 -6807 -4224 3867 10165 8672 426 -6439 -5907 1763 8792
1388 8792 8913 2363 -4970 -7213 -2006 5913 9877 6047 -2473 -7455 -4722 3040 8961 7473 -324
1403 -324 -7138 -6360 1004 8351 8735 2268 -5912 -8428 -3081 5373 8867 5169 -3070 -7934 -5397 2056
1419 2056 7908 6490 -1015 -8401 -8059 -844 7420 8131 1299 -6657 -8458 -3943 3364 6615 3383
1434 3383 -3776 -8302 -5900 1427 6776 5327 -2339 -9170 -9155 -2154 5094 6274 630 -6712 -8598
1449 -8598 -4321 2259 4939 1598 -4942 -9215 -6737 307 5723 4613 -2362 -9096 -9046 -3104 3822
1464 3822 4745 -716 -6480 -8087 -3771 2109 4473 1526 -4931 -9283 -7175 -130 4907 4086 -1915
1479 -1915 -7697 -7609 -2195 2879 3900 -700 -5788 -7477 -3182 2470 5069 2159 -3915 -7369 -5586
1494 -5586 79 4203 4044 -814 -5179 -5143 -698 3871 4193 -344 -4997 -5690 -1808 3133 5457 2811
1510 2811 -1425 -4292 -3019 1157 4429 3826 -310 -3379 -2687 1555 5361 5708 1315 -2651 -3240 202
1526 202 4159 5401 2965 153 -866 -36 2645 4755 4043 648 -2141 -1231 2754 5886 5608 2107
1542 2107 -749 -768 1708 4018 4205 2332 481 -52 1595 3579 4532 3077 230 -1524 -495 2290
1558 2290 4345 3845 1476 -372 5 1857 3392 2043 -291 -1256 -631 1829 2862 2936 1168 -544
1574 -544 -1453 -714 981 2004 767 -1162 -1879 -147 2039 1931 -59 -2480 -3306 -1624 552 1109 12
1591 12 -1535 -2552 -1698 -884 -215 -941 -2834 -4259 -3536 -1053 1228 752 -2102 -4724 -4733 -2508 301 -49
1609 -49 -2470 -4187 -4202 -2054 -123 40 -1577 -4178 -5825 -4346 -984 1271 374 -3029 -5439 -4631 -1230
1626 -1230 1283 219 -3259 -5887 -4442 -1059 1845 1844 -798 -3963 -5399 -3190 559 2748 1314 -2367
1642 -2367 -4727 -2989 1082 3870 2450 -2129 -4880 -3734 704 4247 4195 1198 -2593 -3600 -1131
1657 -1131 3245 5605 3083 -1469 -3531 -1062 3974 6785 5202 40 -3800 -2709 2192 6685 6831
1672 6831 2836 -1326 -2360 1030 5719 7361 4069 -996 -3173 -345 5470 8919 6923 1037 -3072
1687 -3072 -2214 2987 7717 7777 3108 -1757 -2353 1723 6749 8304 4280 -1303 -4072 -1088 5098 8738
1703 8738 6844 647 -3883 -3137 2322 6958 6313 1711 -3203 -3674 1008 5981 7249 3771 -2511 -6100
1719 -6100 -3379 3130 6933 5090 -1051 -5429 -4388 1347 5341 4614 -712 -5502 -5838 -1491 4411
1734 4411 6405 2312 -4537 -7954 -4968 917 5290 3190 -2951 -7182 -5538 449 4461 3588 -2052
1749 -2052 -7610 -7927 -3396 2834 4764 1289 -4636 -7708 -5817 278 3782 2084 -4142 -8313 -6306
1764 -6306 -488 4236 3802 -1800 -7320 -7993 -3864 1741 3797 1054 -4483 -6781 -4415 711 3795
1779 3795 1594 -3710 -7708 -6095 -440 4586 4359 -605 -5545 -6537 -2625 2145 3560 946 -3280
1794 -3280 -5658 -3130 1871 5170 3099 -2467 -6536 -5280 186 4835 4597 561 -4015 -4005 -873 3488
1810 3488 4343 960 -3408 -4765 -1939 3075 5841 4145 -711 -4737 -4171 795 4691 4406 765 -2895
1826 -2895 -2779 811 4179 4518 1460 -2568 -3853 -1826 2545 5382 3944 423 -3084 -2643 1164 3946
1842 3946 3197 -68 -2985 -2463 845 3930 4333 1421 -2443 -3662 -1540 1572 3542 2844 102 -2550
1858 -2550 -1540 964 3592 2757 -786 -3412 -2573 891 3339 3418 1094 -1653 -2411 -1080 1509 2341
1874 2341 799 -1067 -2194 -1234 1847 2669 1597 -940 -3128 -2331 182 2089 1724 -225 -1946 -1354
1890 -1354 239 1297 1086 -273 -1775 -2221 -751 1540 2289 1177 -1077 -2615 -1441 496 1626 693
1906 693 -1085 -1932 -594 762 2012 870 -881 -1995 -2087 -187 1633 1820 453 -1077 -1394 -415 1290
1923 1290 1377 -209 -2058 -1888 201 1908 2294 722 -1301 -2042 -1055 277 1393 826 -564 -1702 -688
1940 -688 1258 2393 1748 -1057 -2701 -1884 448 2295 2288 318 -1483 -1696 -348 1661 1961 623 -1872
1957 -1872 -2505 -638 2044 3173 1703 -1345 -3360 -2327 954 2697 1728 -466 -2471 -1927 552 2622
1973 2622 2168 -259 -2975 -3295 -656 2523 3836 1768 -1525 -3241 -1969 1195 3266 1645 -1409
1988 -1409 -3506 -2289 1349 3682 2919 -176 -3384 -3686 -947 2399 3987 1836 -1698 -3496 -1750
2003 -1750 1992 3893 2103 -2136 -4148 -2126 1537 4269 3720 265 -3163 -3661 -648 2920 4116
2018 4116 1723 -2154 -3553 -813 3151 4932 2575 -1950 -4663 -2865 1746 4952 3989 704 -2931
2033 -2931 -3152 -435 3396 4389 1347 -2353 -3757 -1069 3820 5978 3610 -1350 -4641 -3014 1696
2048 1696 5080 4250 403 -2996 -2711 51 4250 4651 1262 -3212 -4421 -1232 3447 6083 3888 -1363
2064 -1363 -4618 -3556 1372 4721 3555 -450 -3872 -3200 735 4271 4445 1183 -3560 -5115 -2069
2079 -2069 2162 5416 3280 -1392 -4487 -3401 1292 4228 2839 -1410 -4863 -3963 -65 3685 4269
2094 4269 730 -3656 -5788 -3614 1014 3814 2039 -2263 -4930 -3461 754 3222 2489 -2138 -5806
2109 -5806 -5223 -1134 2742 3728 491 -3649 -5362 -3193 662 2895 1073 -3066 -5426 -3742 794
2124 794 3803 2387 -2106 -5766 -5223 -1565 1993 2981 404 -3307 -4553 -2392 1334 3010 998 -2815
2140 -2815 -5242 -3745 1013 4049 3095 -720 -4440 -4206 -1052 2355 2765 203 -2811 -3024 -968 2579
2156 2579 4042 1742 -1888 -4295 -2509 879 3978 3708 364 -2600 -2060 495 3025 2778 453 -2159
2172 -2159 -1883 98 2977 4423 2772 -694 -2610 -1258 1498 3952 3574 221 -1687 -1055 1614 3840
2188 3840 3264 473 -1530 -1794 371 2937 3863 2808 -76 -1536 -564 1789 3262 2104 -210 -1666
2204 -1666 -680 1911 3356 2792 426 -1391 -1521 95 1831 2459 1262 -428 -1530 -51 1614 2295
2220 2295 647 -1231 -2154 -814 1316 2154 1667 -329 -1842 -1413 -52 989 819 -530 -1414 -1631 -297
2237 -297 1068 1545 -349 -1994 -2835 -1209 241 1109 56 -1511 -1932 -1392 114 319 -435 -1755 -2495
2254 -2495 -1916 -211 965 538 -851 -2369 -2359 -812 448 624 -891 -2226 -2293 -376 708 932 -609
2271 -609 -2242 -2216 -1400 586 946 -121 -1157 -1911 -1514 160 1308 519 -1002 -2420 -1551 872 2109
2288 2109 1655 -306 -1738 -1804 -175 1479 1350 494 -810 -1629 -213 1546 2499 1109 -1156 -2227 -1044
2305 -1044 1863 3107 2409 -469 -1622 -1109 795 2619 2410 693 -1178 -1133 525 3005 3502 1617
2321 1617 -968 -2116 -743 1948 3536 2355 -239 -1742 -745 1720 3239 2644 15 -1835 -1539 764
2337 764 3325 3827 1501 -1450 -2678 -1204 2123 3740 2345 -914 -2297 -1141 1795 3547 2540
2352 2540 -436 -2851 -2221 292 2737 3270 1222 -1974 -2857 -1497 1605 3450 1437 -1885 -3501 -1810
2368 -1810 1562 3659 2658 -757 -3404 -3392 -820 2061 3132 788 -2276 -3417 -1454 1829 3173
2383 3173 1124 -2659 -4649 -2784 1083 3546 2414 -1265 -3967 -3959 -856 2131 2473 52 -2962 -3811
2399 -3811 -1168 2031 3447 1032 -2943 -4712 -3272 951 3527 2385 -1008 -3645 -2963 -15 2676
2414 2676 2565 -236 -3279 -3642 -1092 2441 4041 1923 -1972 -4222 -2501 764 3489 2270 -440
2429 -440 -2838 -2465 807 3253 2818 -140 -2871 -3605 -1166 2763 4018 2312 -1284 -3204 -2101 1354
2445 1354 3341 2362 -865 -3321 -2463 1021 3780 3391 389 -2484 -3404 -833 2353 3523 1790 -1105
2461 -1105 -2878 -1348 1789 3542 2093 -1179 -3507 -2282 994 3059 3107 624 -2277 -2909 -992 1931
2477 1931 2953 1119 -1914 -3320 -1015 1778 3279 1711 -1073 -3358 -2561 202 2465 2585 279
2492 279 -2108 -2419 -701 1478 2455 470 -2102 -3135 -1484 1468 2912 1579 -1178 -3079 -2256 249
2508 249 1912 1553 -306 -1924 -2134 -172 1717 2279 421 -2288 -2775 -1555 1052 2431 1278 -894
2524 -894 -2160 -1524 257 1807 1145 -858 -2223 -1904 480 1978 2117 373 -1704 -2412 -1159 1119
2540 1119 2324 1075 -743 -1706 -669 1462 1710 814 -965 -2126 -1046 467 1750 1879 500 -929
2556 -929 -1287 -553 1142 1756 836 -801 -1393 -118 1894 1966 893 -775 -1475 -854 961 1735 1181 20
2574 20 -938 -367 583 1495 1090 88 -1331 -1289 372 1602 1860 403 -1198 -1093 -234 984 915 428 -641
2593 -641 -1212 -595 596 1319 799 -646 -1675 -1323 249 1194 1153 -229 -1857 -1293 67 907 858 -609
2611 -609 -1896 -1429 -483 705 1265 77 -1342 -2141 -1404 77 1045 924 -942 -2401 -1419 407 1402
2628 1402 346 -1352 -2423 -1842 -337 1167 943 -167 -1664 -1838 -829 739 1433 43 -1342 -2422
2644 -2422 -1204 1080 1928 729 -1327 -2259 -1707 439 1862 1388 -56 -1734 -1408 -97 1496 1698
2660 1698 384 -1602 -2266 -691 1657 2814 1421 -746 -2013 -942 1003 2600 1943 -67 -1527
2675 -1527 -1319 757 2520 2622 930 -1306 -1819 -35 2464 3643 2011 -590 -1587 -291 1523 2920
2691 2920 1926 101 -1725 -1253 1281 3256 3227 1112 -1624 -1644 -221 2367 3437 2001 -887 -1708 -439
2708 -439 1963 3222 1988 -526 -2440 -1512 927 3035 3080 779 -1836 -1914 -438 2107 2974 1021 -1318
2725 -1318 -2625 -1095 1811 2989 1958 -1228 -2971 -1995 424 2068 2469 225 -2008 -2652 -682 1958
2741 1958 2322 588 -2853 -3582 -1658 1392 2367 1583 -1178 -3445 -2630 -209 1707 1487 -372 -2737
2757 -2737 -2953 -977 1793 2268 248 -2740 -3987 -2201 945 2444 1306 -1582 -3005 -2336 -104 1647
2773 1647 1326 -759 -3130 -3106 -1042 1991 2430 563 -2182 -3565 -2033 777 2086 966 -1536 -2952
2789 -2952 -1846 229 1920 1395 -971 -3061 -2937 -741 1595 2411 491 -2064 -2773 -1169 956 2571
2805 2571 1003 -1316 -2782 -1513 1072 2351 1778 -39 -2404 -2323 -364 1730 2470 1002 -1488 -2297
2821 -2297 -1011 1545 2344 1339 -1348 -2311 -1121 1183 2444 1813 -193 -1627 -1668 -248 1511 1960
2837 1960 546 -1501 -1831 -385 1884 2219 1323 -1312 -2245 -1001 863 1934 1380 -466 -1688 -1189
2853 -1189 354 1297 1531 77 -1596 -1754 -587 1416 2237 697 -1210 -1955 -889 803 1738 785 -618
2870 -618 -1571 -1189 243 1339 1132 -188 -1318 -1883 -360 1266 1674 326 -1063 -1815 -415 706 1517
2887 1517 263 -1031 -1627 -723 504 1312 916 -401 -1513 -888 132 1131 1250 389 -1067 -1084 -76
2904 -76 1017 1419 370 -1000 -1170 -10 1069 1508 776 -526 -807 -179 661 1514 875 106 -914 -699
2922 -699 628 1720 1509 154 -1084 -744 233 1409 1410 702 -388 -748 190 1194 1357 1086 -200 -772
2940 -772 -338 1060 1792 1149 -189 -887 -375 941 1807 1265 514 -706 -639 253 1392 1328 682 -348 -1291
2959 -1291 -20 1168 1691 1008 -318 -1430 -625 744 1200 1206 -717 -1363 -765 420 1356 1339 184 -1231
2977 -1231 -1663 -236 954 1396 366 -1146 -1845 -752 868 1252 425 -1191 -1743 -1502 328 1215 1067
2994 1067 -676 -1936 -2082 -600 530 1146 -279 -1606 -2140 -875 1003 1300 119 -1683 -2294 -1416
3010 -1416 330 1211 669 -954 -1879 -1636 -442 1103 806 -260 -2150 -2412 -800 1058 1867 391 -1915
3027 -1915 -2481 -1401 510 1850 633 -1042 -1679 -1450 276 1555 1587 -185 -1834 -2327 -140 1869
3043 1869 2181 765 -1401 -2066 -479 1259 1788 1061 -518 -1880 -681 950 2459 2239 291 -1602
3059 -1602 -1946 54 1882 2538 1053 -1020 -1479 -236 1848 2458 1486 -372 -1868 -1209 1336 2585
3075 2585 2042 237 -1493 -1292 192 2258 2529 693 -958 -1766 -287 1837 2468 1375 -897 -2155
3091 -2155 -956 837 2090 1712 -169 -1536 -1446 -133 1967 2170 381 -1962 -2208 -612 1606 2328
3107 2328 1168 -1113 -2651 -1389 590 1477 810 -779 -1719 -1700 -13 1109 1713 -57 -2395 -2621 -1266
3124 -1266 712 2042 661 -1524 -2456 -1691 137 1266 743 -1115 -2479 -2028 -335 1183 1106 -126
3140 -126 -2121 -2522 -1151 778 1249 190 -1627 -2182 -1498 685 1576 599 -953 -2311 -1852 -278 1045
3157 1045 1463 196 -1842 -2252 -705 660 1305 344 -1676 -1788 -968 674 1722 840 -671 -1801 -995
3174 -995 354 1067 1281 40 -1696 -1482 -322 1314 1747 533 -1178 -1386 -500 1168 2127 985 -223
3191 -223 -1399 -471 837 1704 1285 284 -944 -1100 331 1489 2169 305 -848 -886 -2 1361 1894
3208 1894 1072 -322 -874 -497 945 1629 1166 -5 -762 -675 633 1679 1416 93 -817 -966 17 1330
3226 1330 1270 523 -687 -1167 -9 909 1468 952 -229 -962 -779 482 1114 892 -282 -1031 -1029 392 973
3245 973 827 197 -934 -1044 -437 870 1081 191 -735 -1075 -605 553 915 537 -566 -1310 -880 247
3263 247 836 535 -230 -1121 -806 338 533 847 -42 -994 -1129 -317 645 660 102 -866 -1077 -624 306 949
3283 949 579 -627 -1190 -526 568 1111 649 -510 -811 -813 183 632 1064 -3 -897 -823 -243 1076 1009 384
3303 384 -346 -1019 -552 1078 1262 604 -292 -631 -526 813 1163 1034 -240 -650 -797 -26 1553 1264 694
3322 694 -560 -883 261 934 1510 648 -561 -1059 -205 1297 1451 955 -49 -1187 -627 194 1234 1685
3340 1685 183 -745 -946 -118 1115 1512 469 -827 -1410 -564 1088 1548 1122 -719 -1440 -1113 309
3357 309 1200 896 -44 -1260 -1255 -288 1174 1398 69 -1465 -1765 -504 1053 1408 605 -943 -1964 -1008
3375 -1008 330 1273 871 -484 -1935 -1358 -210 941 1324 137 -1438 -1996 -788 1029 1138 381 -1017
3392 -1017 -1752 -1005 362 1243 720 -612 -1402 -1478 -357 1113 1536 1 -1329 -1812 -601 768 1357
3409 1357 238 -1071 -1639 -949 697 1508 1095 -839 -1912 -1511 31 1312 1636 173 -1309 -1254 -398
3426 -398 1212 1607 620 -1112 -1546 -815 626 2005 1415 -93 -1465 -1344 350 1196 1811 101 -1377
3443 -1377 -1225 -23 1355 1709 697 -862 -1446 -428 798 1446 1115 -572 -1191 -1014 426 1638 1506
3460 1506 -184 -1217 -1635 -416 1652 1954 521 -1163 -1729 -705 950 1694 850 -449 -1517 -1249
3476 -1249 321 1471 1039 -147 -1634 -1980 -375 784 1200 245 -1378 -1868 -623 490 1225 266 -1272
3493 -1272 -1851 -1333 71 1094 497 -286 -1655 -1651 -578 1085 885 130 -1302 -1834 -684 572 1031 117
3511 117 -984 -1675 -936 212 809 941 -377 -1480 -1506 -52 1008 817 -14 -1342 -1514 -310 595 1072
3529 1072 556 -1049 -1076 -408 728 1235 549 -230 -1095 -638 388 1236 1117 246 -888 -853 22 1154 1223
3548 1223 154 -561 -655 -83 838 1430 871 42 -544 -267 881 1229 1147 418 -384 -385 729 1561 1577 393
3568 393 -229 -300 602 1428 1435 573 273 -357 302 908 1468 948 59 -269 -8 672 1299 1305 167 -316 -247 573
3590 573 1388 1071 128 -71 -391 116 715 1110 629 -261 -731 -400 518 951 583 -323 -1034 -144 333 755
3610 755 756 -265 -912 -745 160 598 977 -31 -988 -996 -786 248 733 236 -845 -1255 -728 118 651 380
3630 380 -732 -1357 -833 173 444 496 -438 -1314 -976 -338 232 168 -361 -1389 -1345 -215 414 594 157 -899
3650 -899 -1328 -809 191 658 235 -714 -1088 -1032 -253 360 733 93 -1105 -1094 -172 505 1027 403 -1199 -1229
3670 -1229 -293 401 916 611 -730 -1375 -646 173 1480 1070 52 -1009 -960 -96 932 1632 411 -539
3688 -539 -1080 -70 965 1211 622 -438 -856 -352 1226 1713 1282 208 -667 -765 147 1523 1442 472 -513
3707 -513 -479 115 1263 1498 961 -190 -705 -242 1105 1754 1281 253 -1058 -628 573 1371 1281 422 -1072
3726 -1072 -1027 -153 1150 1339 493 -1030 -1313 -418 882 1452 1024 -422 -1074 -950 267 1063 1215 119
3744 119 -1194 -1298 -171 1015 1011 201 -1201 -1689 -856 509 851 314 -753 -1580 -1262 -199 1102 738
3762 738 -461 -1391 -1697 -797 626 483 -282 -1360 -1922 -986 182 682 418 -871 -1696 -1407 -151 852
3780 852 513 -547 -1717 -1557 -344 849 826 -408 -1272 -1731 -816 517 766 511 -960 -1352 -1276 280
3798 280 1192 620 -217 -1353 -1307 60 1100 1182 112 -790 -1360 2 879 1366 470 -759 -1123 -681 434
3817 434 1245 1136 -205 -1075 -1035 210 1017 980 310 -931 -799 -39 1112 1212 672 -351 -920 -342 566
3836 566 1375 1227 137 -634 -508 648 1334 1237 -53 -888 -841 77 1329 1330 514 -624 -856 -223 803
3855 803 1093 655 -263 -832 -602 667 1224 828 205 -768 -702 216 1063 1281 276 -462 -1040 -93 733 799
3875 799 218 -533 -946 -366 147 837 801 -91 -917 -949 178 709 765 190 -717 -754 -113 587 788 390 -543
3896 -543 -1000 -576 303 1149 553 -158 -842 -520 160 653 739 -175 -732 -641 -28 677 561 14 -747 -563 -94
3917 -94 518 645 473 -232 -762 -476 332 1194 490 -121 -810 -474 453 1105 830 -36 -666 -556 103 679
3937 679 713 172 -445 -788 -5 532 873 432 -568 -720 -180 487 748 635 125 -701 -249 152 449 511
3957 511 -90 -821 -569 -6 685 982 119 -441 -810 -403 365 820 397 -249 -727 -245 265 551 429 -194
3977 -194 -704 -634 -74 621 456 -452 -859 -853 -125 593 325 35 -597 -1148 -397 479 714 310 -673 -1063 -866
3998 -866 88 569 473 -456 -751 -1206 -208 605 661 -323 -1090 -1270 -324 566 855 229 -605 -1204 -797 259
4018 259 791 557 -201 -1073 -1188 -253 571 542 -139 -1157 -989 -425 929 754 262 -571 -735 -165 531 867
4038 867 693 -585 -901 -684 61 1111 1119 201 -980 -918 55 787 1318 200 -393 -637 -258 558 1487 441
4058 441 -126 -903 -569 588 1324 1179 170 -749 -719 271 1226 1221 266 -556 -781 234 891 1125 474 -342
4078 -342 -1201 -337 602 1653 1043 161 -757 -758 138 1170 1232 191 -720 -665 -164 878 1072 520 -542 -868
4098 -868 -578 130 913 807 -166 -1149 -894 97 789 894 -358 -1087 -1188 -373 672 542 160 -823 -1433
4117 -1433 -697 97 660 530 -933 -1519 -1252 -144 400 730 -184 -1311 -1397 -584 414 768 -440 -1046 -1315
4136 -1315 -809 -186 443 32 -939 -1531 -1292 -221 344 716 -531 -1147 -1150 -739 659 501 -74 -850 -1240
4155 -1240 -657 232 798 394 -124 -1046 -700 137 957 600 -342 -1246 -1003 -28 957 551 261 -689 -968 6
4175 6 905 994 629 -190 -555 -381 106 998 777 214 -369 -609 560 882 1027 490 -338 -625 203 1104 1067
4196 1067 449 57 -248 25 658 1345 1209 191 -285 -168 740 1257 1220 546 -513 -86 487 761 1137
4215 1137 460 -50 -232 42 525 813 726 -390 -583 -229 627 1281 871 133 -567 -204 552 730 831 172
4235 172 -248 -457 274 746 913 457 -460 -651 -552 474 929 379 -504 -580 -516 191 609 187 -144 -699 -460
4256 -460 -218 314 686 -70 -861 -910 -454 263 591 -126 -425 -1014 -452 -266 277 112 -197 -774 -862 -44 233
4277 233 -18 -376 -913 -904 -565 487 580 -156 -503 -887 -384 212 261 -5 -460 -836 -544 2 628 288 -179
4298 -179 -741 -715 -49 643 511 -26 -591 -681 -49 604 664 87 -632 -723 -122 368 934 372 149 -274 -469
4319 -469 63 530 620 131 -774 -373 74 827 608 47 -87 -563 -101 928 790 439 -329 -467 -133 488
4339 488 872 556 -4 -523 -356 78 1056 1174 -46 -306 -497 54 708 694 378 -468 -555 -395 409 851
4359 851 505 -115 -625 -380 -61 787 554 -61 -812 -595 -73 642 675 -20 -464 -758 -508 510 656 393
4379 393 -404 -743 -611 113 859 294 -423 -1040 -668 -113 484 611 119 -871 -1014 -472 369 326 493 -722
4399 -722 -1077 -861 276 701 338 -416 -1090 -938 -81 604 369 -470 -1067 -981 -428 436 689 114 -536 -860
4419 -860 -691 213 790 456 -584 -1190 -907 -70 441 750 -165 -943 -910 -282 576 818 263 -533 -1080 -170
4439 -170 539 955 542 -146 -631 -745 -188 932 671 -263 -714 -670 368 512 699 382 -715 -840 -238
4458 -238 783 889 621 -292 -715 -420 394 814 508 167 -725 -576 272 730 591 128 -683 -538 -79 421
4478 421 542 431 -583 -798 -362 636 936 700 -207 -701 -626 178 708 643 10 -556 -685 -411 646 746
4498 746 422 -775 -1016 -649 215 874 428 -213 -1020 -810 154 840 352 -198 -702 -782 -193 458 616 204
4518 204 -514 -947 -570 216 544 166 -566 -591 -276 7 621 707 -39 -600 -484 68 714 557 375 -257 -616
4539 -616 -194 390 699 293 -128 -765 12 528 840 336 -69 -359 -347 65 631 522 58 -205 -556 -119
4559 -119 726 833 671 -245 -384 -290 438 909 769 -35 -445 -200 385 927 828 186 -356 -39 338 587 656
4580 656 477 -230 -276 75 574 1005 359 -197 -143 -213 606 619 482 -22 -473 -170 78 539 746 -182 -418
4601 -418 -288 74 529 739 118 -698 -466 -160 196 571 -39 -402 -666 -635 177 545 230 -232 -486 -540 -171
4622 -171 395 342 -227 -481 -290 -535 167 392 -132 -465 -858 -180 33 276 119 -421 -744 -869 -78 237
4642 237 180 -186 -895 -578 -95 522 160 -172 -744 -729 -340 264 355 -119 -399 -737 -354 63 623 265 -204
4663 -204 -534 -789 61 637 184 -43 -592 -390 -17 328 361 33 -475 -520 -384 852 672 400 -325 -584
4683 -584 -489 466 539 549 -294 -363 -348 203 630 974 247 -361 -341 -27 627 720 611 93 -598 38 606 986
4705 986 320 371 -531 -617 241 489 774 -44 -334 -648 334 766 779 234 -142 -561 -19 94 655 557 -72
4726 -72 -626 -340 307 788 474 161 -907 -534 -80 478 522 189 -314 -810 -263 394 728 426 -454 -695
4746 -695 -200 47 758 544 75 -882 -642 -189 375 605 -15 -620 -801 -298 466 705 142 -447 -816 -367
4766 -367 320 428 479 -285 -1092 -860 -207 472 644 -394 -1050 -803 -399 261 379 248 -491 -805 -658 113
4786 113 562 343 -95 -727 -549 -193 503 584 -256 -503 -563 -168 -60 659 201 -356 -819 -464 376 957 -25
4807 -25 -371 -547 -358 361 555 771 4 -386 -642 -272 595 790 452 -59 -499 -268 572 699 554 -282
4827 -282 -578 208 621 849 644 123 -345 -173 272 812 571 33 -250 -263 -96 689 920 569 -241 -604
4847 -604 -150 346 738 457 -25 -666 -344 296 729 545 319 -377 -514 -10 381 561 225 -318 -552 -213
4867 -213 283 726 468 -235 -667 -342 169 584 413 170 -236 -541 -54 131 261 89 -640 -878 -213 252
4887 252 581 132 -237 -654 -576 -42 421 188 -128 -584 -641 -63 275 309 300 -630 -590 -305 344 416 90 -420
4909 -420 -641 -465 237 508 99 -195 -705 -491 -113 402 261 27 -422 -522 36 452 424 -114 -497 -496 -52
4930 -52 166 613 38 -166 -294 -187 273 445 308 -84 -514 -373 223 448 486 205 -550 -298 4 831 292
4951 292 280 -57 -429 -188 495 639 395 -143 -348 -107 100 431 609 -104 -63 -63 -78 583 711 163 -225 -276
4973 -276 -84 519 812 419 -397 -552 -303 436 232 448 16 -254 -321 180 534 760 -99 -450 -238 -71
4993 -71 343 239 -95 -213 -613 -151 278 108 -78 -240 -265 -383 -158 -32 209 -596 -732 -398 146 381 322
5014 322 43 -668 -607 -555 277 157 39 -642 -308 -209 205 483 262 -523 -675 -462 31 247 255 -129 -821 -568
5036 -568 -258 218 443 -71 -705 -621 -173 37 386 91 -193 -440 -391 246 511 338 -393 -536 -255 12 541
5057 541 502 153 -532 -794 -179 295 751 284 -245 -328 -331 120 919 636 -146 -582 -230 353 905 554 15
5078 15 -118 -235 99 288 640 251 -106 -524 -24 254 803 229 93 -768 -231 14 45 519 -145 -237 -555
5099 -555 -175 328 521 78 -249 -446 -215 319 831 512 -580 -624 -246 -303 298 644 -272 -553 -319 -232 423
5120 423 280 229 -424 -990 -244 89 142 230 -390 -623 -645 209 548 397 -150 -519 -506 -144 104 202 100 -472
5142 -472 -879 -405 233 499 -5 -429 -453 -134 223 478 343 -106 -713 -545 90 324 373 -68 -725 -444 12
5163 12 300 555 540 -198 -277 -22 301 492 274 -250 -563 -384 -73 572 639 -265 -205 -406 250 471 759 307
5185 307 -318 -200 -143 78 528 301 -166 -112 26 408 594 611 -36 -292 -363 0 686 598 406 34 -253 -17
5207 -17 440 988 281 -133 -545 -223 412 655 598 -26 -467 -101 108 268 311 -22 -450 -204 25 541 774
5228 774 373 -222 -322 -153 742 180 238 -53 -400 -507 138 224 234 -107 -242 -505 86 704 446 261 -412
5249 -412 -373 -470 316 377 -62 -412 -517 -274 -22 451 -200 -77 -405 -605 51 266 577 -168 -327 -299 21
5270 21 7 191 70 -655 -545 -247 344 188 -38 -250 -526 -417 12 178 137 -276 -722 -475 -25 168 -61
5291 -61 -171 -701 -383 470 144 349 53 -321 -311 -449 121 547 428 -70 -672 -427 36 122 256 -188 -348
5312 -348 -287 -15 442 563 176 -168 -335 -125 98 486 295 -57 -464 -233 397 461 583 147 -14 -161 139
5333 139 647 551 219 0 -162 74 274 347 214 78 -508 -498 276 364 322 -86 -213 58 192 399 347 376
5355 376 -304 -183 103 529 312 448 45 -204 -126 197 497 324 -125 -227 -245 74 495 157 52 -493 -467
5376 -467 -113 372 265 175 -543 -509 -241 223 302 257 -350 -810 -562 -167 257 270 -589 -530 -428 0 -17 254
5398 254 -63 -177 -440 -201 -105 337 -78 -218 -501 -251 435 314 124 -161 -733 -554 -55 330 343 -153 -481
5419 -481 -370 -406 481 150 114 -652 -370 -336 -69 431 502 -359 25 -286 250 114 272 349 -370 -123 -271 381
5441 381 292 3 -511 -603 -186 511 420 375 115 -326 -260 133 452 413 -126 -201 -414 102 643 542 103 -347
5463 -347 7 -209 422 830 305 -68 -210 -340 203 612 416 -280 -304 -222 247 557 698 163 -250 -362 289
5484 289 659 638 268 -430 -508 -170 136 492 371 -240 -379 -56 -46 492 406 -139 -312 -660 72 397 376 -222
5506 -222 -507 -411 99 297 342 24 -363 -560 -235 -86 240 163 -275 -696 -523 94 400 250 76 -377 -411
5527 -411 -40 319 464 113 -79 -338 -272 -98 -71 202 -140 -355 7 69 317 246 -110 -500 -435 -17 407 529
5549 529 68 -178 -395 174 449 258 279 -143 -401 -300 283 355 388 -101 -351 24 143 168 637 197 83
5570 83 -231 76 273 329 58 -216 7 24 130 133 62 276 -221 -324 178 474 434 212 -21 -363 153 633
5592 633 238 -100 -32 142 -40 -39 118 433 -177 -534 -73 -30 394 406 116 -131 -311 117 228 488 82 -33
5614 -33 -445 -88 336 84 183 -562 -247 20 9 278 79 -218 -387 -473 -280 19 218 -461 -421 -478 -153 125
5636 125 377 -59 -459 -378 -255 284 79 -24 -461 -563 -78 -21 478 252 -228 -467 -468 231 1 273 -137
5657 -137 -179 -503 -440 -104 240 -91 -479 -639 -190 170 79 168 -113 -514 -279 82 274 148 -75 -378 -578
5678 -578 -118 324 447 333 -120 -254 -64 501 434 364 -437 -267 -162 137 238 381 29 -115 30 244 234
5699 234 363 -83 -137 -361 -99 128 199 142 -274 -584 -184 357 484 281 -173 -466 -244 163 596 410 -76
5720 -76 -441 -36 58 608 169 438 -43 -398 -41 289 407 211 -166 -132 -34 222 190 377 -36 -141 -351 255
5742 255 211 262 205 -282 -179 -158 158 243 383 -220 -337 -179 -30 373 83 -76 -751 -789 -304 -197 344 -40
5764 -40 -209 -626 -35 -165 63 103 -603 -230 -372 229 327 -20 144 -512 -347 -23 134 208 -193 -535 -420
5785 -420 -156 -35 301 -163 -359 -304 -218 213 127 205 -322 -405 -107 94 415 185 -243 -541 -253 -11 99 205
5807 205 279 -512 -545 276 278 204 134 -31 -354 64 199 436 256 74 -73 -568 45 251 430 -153 106 -235
5829 -235 -121 355 776 211 -103 -35 72 78 379 204 227 -14 -180 267 399 341 51 -64 -28 -93 768 439
5851 439 164 -360 -158 154 222 333 393 -27 -36 -266 232 30 130 151 -536 -291 -103 90 300 -3 -269 -149
5873 -149 -129 82 373 12 -80 -390 -210 -186 305 209 -56 -163 -464 -118 314 370 -156 -214 -347 -331 296 336 -45
5896 -45 -183 -350 -164 -43 288 -44 -155 -559 -196 -159 220 78 -100 -295 -486 -331 169 65 -158 -384 -398
5917 -398 -181 115 -4 199 -454 -571 -180 111 503 76 150 -440 -142 376 -122 239 -245 -221 -562 385 664
5938 664 301 376 60 -222 -94 285 520 298 -199 -142 160 352 198 258 5 -66 -85 235 203 403 130 -36
5960 -36 -192 150 545 336 79 54 2 137 285 231 245 -41 46 12 102 371 454 34 100 -222 123 -195 204
5983 204 294 -59 57 -104 35 219 245 -89 -386 -37 80 152 164 210 -412 -40 61 174 351 -35 -402 -287
6005 -287 -101 188 297 -325 -56 -379 -267 124 146 63 -50 -470 -292 -118 -94 159 37 -251 -466 -291 -78
6026 -78 135 -243 -455 -320 -86 -137 116 67 -250 -217 -158 -281 -154 167 -265 -303 -240 -158 23 202 -256 -381 -172
6049 -172 -373 168 145 37 -222 -134 -179 -121 25 170 -88 -399 2 172 106 245 -155 -301 -386 -290 238 328 105
6072 105 20 -53 -284 317 242 165 54 -102 -82 -137 368 367 290 -197 -334 171 323 469 11 -108 -309 -1 348
6095 348 188 252 -24 -254 -21 384 301 358 69 -186 -264 273 610 323 50 75 -293 162 285 397 218 -289
6117 -289 69 12 -23 191 536 -249 -205 62 122 570 328 198 -272 -44 254 -5 74 62 -483 -174 -187 -147 344
6140 344 245 -339 -388 -422 -7 350 320 100 -239 -242 20 143 222 65 -200 54 -37 450 425 111 -154 -389 -476
6163 -476 -14 219 182 -40 -300 -297 -164 109 442 86 -536 -342 -359 -93 122 18 -62 8 -265 188 65 -2
6185 -2 12 -326 -169 103 132 307 196 -352 148 -75 113 263 365 -429 -342 -162 -235 361 578 38 -72 -133
6207 -133 -3 166 238 -52 -134 90 86 274 90 240 -113 -49 91 211 574 276 -80 -194 7 185 430 434
6229 434 98 -53 -178 -142 348 439 52 -280 -89 -115 484 59 -23 21 -499 -129 56 100 -31 -268 -330 -132
6251 -132 -27 213 34 -370 -243 -72 94 144 162 355 -397 -428 -197 133 376 51 -27 -376 3 -221 127
6272 127 -16 -142 -194 -288 96 367 -71 68 -222 -322 -97 363 -161 80 -217 -151 -219 25 157 -107 84
6293 84 9 -234 77 84 258 161 -215 -187 -99 290 349 -17 -111 -230 -67 -40 289 288 -186 -50 -201 -232 141 15
6317 15 -164 -166 -225 -240 139 -36 -130 -209 -252 258 186 377 -95 94 -37 45 135 75 93 76 -153 -207 -56 156 -87
6342 -87 200 -37 -89 165 440 541 58 -14 -115 210 259 325 183 -56 -37 -106 320 302 70 46 -470 -243 19
6365 19 162 118 -100 -9 -266 -187 45 56 -53 128 -262 187 64 50 -112 -101 -449 30 127 -87 117 196 -417
6388 -417 -248 71 288 253 110 -345 -413 -294 -235 357 -82 -13 -364 -247 -94 -79 -314 37 -458 -108 -99 207
6410 207 229 -182 -188 -363 -52 123 -60 179 -142 -1 -103 -228 -333 63 -16 -220 -58 29 -15 -32 -121 -103 -405
6433 -405 136 235 137 169 -95 -301 45 323 226 -44 -151 -518 -290 139 165 -74 5 -185 -351 40 394 30
6455 30 -81 90 -71 442 158 693 160 34 -225 -150 321 362 205 1 -47 -7 95 88 246 158 -184 -355 -175
6478 -175 -8 669 -7 186 -282 -188 -139 445 290 304 -262 -234 -112 222 280 16 53 34 -391 173 299 189
6500 189 -234 -343 12 143 172 77 -205 -284 47 -6 271 108 134 -318 -285 17 26 1 -249 -426 -278 -168 126
6523 126 114 146 -83 -358 -121 -198 93 -30 -40 -313 -102 -71 -109 247 126 -257 -272 -151 50 291 99 -324
6545 -324 -374 -230 83 41 166 -60 -98 -8 -231 -57 150 93 -87 94 -212 -168 356 101 -102 15 -68 30 267
6568 267 281 -118 7 -251 187 471 242 94 -38 -2 -58 277 221 -77 53 -242 -57 91 334 27 -360
6589 -360 -75 -36 292 234 63 -24 -222 -149 271 361 66 250 -24 -191 1 435 254 90 -109 -203 -100 374
6611 374 455 46 156 -52 9 125 323 268 -257 -87 -160 93 56 416 90 -294 -148 -62 147 214 -65 138
6633 138 -220 -130 237 237 161 -41 -81 -52 -295 -82 262 31 -417 -223 -8 47 187 77 -230 -153 -173 104 151
6656 151 15 -424 -122 -83 -234 241 249 1 -316 -122 -269 125 173 27 -78 -6 -76 -180 -41 -117 -313 -168
6678 -168 -160 -267 150 -153 -49 -134 249 64 -40 454 -33 -317 -83 -2 59 170 -41 212 -20 -242 45 210
6700 210 233 51 -109 -132 114 132 422 -100 -206 -153 89 191 115 318 175 -93 236 390 224 120 -138 -118
6722 -118 88 363 187 367 -83 -100 -313 -98 494 87 -169 73 -216 -304 431 46 321 -176 -105 220 349
6743 349 138 200 -161 -273 -493 7 548 361 321 -645 -13 92 154 143 58 -248 -102 -21 -51 112 230 -107
6765 -107 -94 -322 -64 336 -168 -235 -341 -134 -71 -87 191 32 -380 -350 127 -22 144 -37 -334 -50 -132 -56
6787 -56 23 -60 118 -365 -198 -64 131 -141 97 -258 -254 40 160 178 133 -178 -303 -57 297 349 319 56 -251
6810 -251 -165 112 358 311 -87 -265 -364 51 -59 335 235 150 -191 -434 -63 243 223 -54 -205 -279 200 418
6832 418 533 229 -90 -23 152 53 -69 -199 154 90 -194 308 111 51 10 -313 55 57 5 424 -18 -189 -247
6855 -247 -79 448 343 22 -195 -12 175 37 67 249 -64 -105 -229 161 257 139 93 -180 -446 224 128 -111
6877 -111 -164 -167 223 216 50 13 76 -174 -238 -241 -82 -174 -319 -21 -330 -395 170 268 54 182 -402 -383 -132 -14 -138
6902 -138 -245 -15 -232 -101 241 254 -128 -18 -238 109 130 34 192 106 -200 -233 326 218 -20 -149 -14 -89
6924 -89 -315 205 69 223 -75 16 -42 325 105 44 211 26 -389 -55 -61 220 259 -254 -32 -135 283 205 194
6947 194 -142 -117 25 26 385 -315 -106 -39 -61 255 244 -72 -186 -50 -102 21 298 83 -5 -275 108 42 91
6970 91 176 228 500 118 30 5 388 83 17 50 -274 -14 324 -48 108 -202 33 28 494 210 347 130 -84
6993 -84 85 -42 -82 20 152 -343 -188 116 387 317 75 -203 -400 -79 -355 -26 -271 6 -309 32 88
7014 88 -126 -110 -292 -4 -134 146 4 135 -93 -222 -221 104 177 -146 -156 -49 -363 -222 163 -225 -114 -222
7036 -222 -345 -378 -13 176 181 -113 -413 -97 -164 79 -325 -4 -68 -274 -19 337 -60 34 -273 70 -109 -144
7058 -144 554 -73 201 -178 -328 149 173 -38 -350 -141 -277 127 178 155 164 -151 -223 -49 33 112 141 -178 23
7081 23 69 205 154 55 -137 284 -34 -40 -31 463 27 -374 -132 107 -17 251 -194 -311 48 31 298 190 312
7104 312 -7 -90 -168 -5 270 275 289 84 -40 101 82 152 258 -176 -101 -261 -1 255 136 -51 18 -419 161
7127 161 314 243 -160 23 -94 -56 365 109 93 -492 -380 5 279 10 -12 -29 -380 34 -85 -216 -19 -73
7149 -73 -342 -94 76 260 203 -189 -215 -431 -226 38 -41 -56 -302 -319 -408 -60 225 -80 -159 -475 -157 174 201
7172 201 315 -153 -517 -276 106 428 27 178 13 -154 137 -82 109 -225 3 -11 104 226 98 160 -143
7193 -143 -274 -287 119 195 262 28 -409 73 73 88 144 -164 -141 -77 89 25 -108 111 50 -90 12 47 146 -217
7217 -217 249 316 -9 -77 286 230 166 24 183 32 281 -11 58 -149 71 192 -104 7 30 0 120 -282
7239 -282 -136 113 172 272 -103 -280 38 -62 463 17 -18 -99 65 143 365 226 -270 -140 -313 178 10
7260 10 2 -314 12 123 -255 38 254 17 -136 -118 130 -111 13 -273 -221 64 273 -147 251 92 -86 -144
7282 -144 7 -149 401 78 279 -133 3 -61 71 311 -12 -562 -203 -63 -360 -26 261 -28 -57 -167 -2
7303 -2 25 41 -116 -101 121 16 318 283 -59 2 2 -179 119 -30 44 -177 -159 -76 -202 21 -41 23 -215 67 270
7328 270 139 49 -208 20 254 146 -102 86 -269 -258 67 28 -128 178 -83 345 -284 -85 302 113 -43
7349 -43 -123 65 -120 -84 -24 129 229 -264 112 -40 -138 62 158 -98 -116 133 136 -5 41 -197 -88 -101 190 -138
7373 -138 434 14 -320 -107 -310 100 147 -24 -2 -165 64 100 64 53 115 -60 141 -222 187 -232 -55 21
7395 21 -455 256 -157 6 -106 -198 -226 -232 -10 74 -26 -65 -165 -167 65 37 113 -98 -100 27 -198 47 168 -119
7419 -119 -70 -236 79 40 -127 256 44 -240 180 71 -197 287 -52 -116 -99 1 -19 -25 56 267 -120 420 423
7442 423 195 107 -157 -18 -94 260 64 277 -138 -280 -23 144 468 181 -241 -93 -19 252 160 246 430 -48
7464 -48 -115 -94 -17 280 68 217 36 158 359 276 162 46 -82 -25 212 -10 175 25 -311 44 -104 131
7486 131 -68 22 -6 -306 234 241 304 132 0 110 8 126 47 58 15 -213 -76 84 163 -4 -5 -120 -138 -75
7510 -75 108 322 227 -340 -277 -535 25 111 -170 -144 -155 -56 -65 -29 169 -48 -134 -138 28 6 31 273 -97 -272 -18
7535 -18 -61 151 -107 -153 -116 -42 -46 46 -118 -195 -207 -234 -89 -90 385 249 -209 -211 197 -23 128 236 44 -404 -102
7560 -102 85 170 72 26 -44 -135 -18 109 -8 68 -34 -343 -52 -77 200 119 -147 -208 105 61 216 140 322 -44
7584 -44 -39 -152 44 233 -95 -122 149 208 384 344 -114 44 -74 -34 74 -54 151 372 15 -161 -182 311 -122
7607 -122 23 46 -194 120 108 255 303 -56 214 -16 68 278 318 -94 -31 179 22 -145 92 -89 -136 316
7629 316 -239 185 236 59 -61 -273 -16 358 170 -179 -175 -210 -105 -185 -35 29 35 -123 -42 273 -177 147 -136
7652 -136 -312 -166 74 -204 5 138 53 -121 -136 -49 109 205 148 -100 12 -32 119 52 -184 92 -6 212 -5
7675 -5 449 -55 -109 -104 -79 187 -36 56 -358 -319 -197 48 -78 -72 -121 -251 -2 -36 -121 57 -194 -37 -14 -74 -60
7700 -60 265 73 182 25 -213 212 187 -122 15 -48 -131 -22 408 361 69 -106 -208 -42 149 199 102 13 27
7723 27 -157 225 464 251 -57 -63 -19 281 143 22 244 -54 36 -122 446 62 -153 -2 23 67 61 221 -213
7746 -213 -97 181 24 17 109 70 14 -154 145 -12 162 -180 -89 -215 -361 91 17 -71 -285 42 140 225 218 35
7770 35 10 -91 -3 -194 -106 200 152 -493 -117 34 -147 -25 215 -136 -201 -96 -251 219 -62 -102 -137 -155 -426
7793 -426 -380 26 -32 -150 -197 63 -246 -77 -40 99 33 -275 350 111 80 191 -226 -196 -87 -196 68 181
7815 181 100 -204 8 61 14 -106 -50 24 -175 -14 118 36 298 -145 -32 -76 25 130 95 79 -265 319 142
7838 142 112 84 -94 -123 46 103 -78 24 11 88 118 203 45 415 185 152 45 2 268 172 0 191 -51 -132
7862 -132 11 -37 133 91 -39 -61 -223 6 36 -33 -82 -123 90 -74 305 86 58 13 171 103 37 327 55 -182
7886 -182 -81 -184 -82 144 25 101 -112 81 63 102 114 -51 -18 -115 -331 -119 66 -378 -183 -237 -54 -72 -119
7909 -119 -50 -303 -222 -248 156 142 -204 -225 -167 81 -105 307 81 -128 -6 -84 -224 -93 57 -107 -88 -43 102
7932 102 -242 -14 169 -200 96 -113 -77 -275 -255 42 292 -159 49 232 175 -53 -253 52 -58 164 -8
7953 -8 108 -47 -295 0 141 62 77 -280 -81 -4 99 103 125 57 -201 -55 392 0 -45 118 -160 -291 -187
7976 -187 240 -192 182 -272 -93 -187 124 -166 175 41 -72 230 235 63 133 41 -196 11 -112 371 -42 60
7998 60 -168 -175 -156 90 241 -85 -21 49 -40 -256 48 7 212 -27 -388 -81 97 -165 -259 -36 -162 -24 151
8021 151 36 190 -227 8 132 -208 260 -19 -172 -226 215 -156 110 143 -136 -251 300 76 -69 -277 -131
8042 -131 -155 50 97 -181 169 -284 -190 -198 -173 -32 -173 112 -38 -289 -26 -18 35 22 130 -138 -37 -129 361 64
8066 64 -65 216 28 -62 109 92 107 -85 -103 311 348 6 24 -81 -87 -113 -34 96 -78 60 -206 -2 -44 28
8090 28 157 141 123 -28 52 -230 371 8 222 -218 195 162 -107 250 -176 -65 66 -7 36 -74 219 -235
8112 -235 -39 61 141 43 -22 67 -16 -31 83 232 -140 133 -39 -50 -192 147 223 39 138 -327 -184 102 168
8135 168 -73 308 248 22 176 -154 -104 204 19 -168 156 1 276 -67 -122 -108 -61 92 81 117 -103 -95 -94 13
8159 13 24 -172 170 -124 -47 55 168 6 -138 -148 242 161 152 277 -3 68 19 -145 -116 154 -148 32 56 34
8183 34 48 149 99 275 -128 -87 -259 34
8191C4
$$ Imaginary data points
##PAGE= N=2
##DATA TABLE= (X++(I..I)), XYDATA
0 0 0 0 0 0 0 0 0 0 0 0 -8 8 -8 8 -8 16 -16 16 -24 24 -32 36 -40 48 -56 64 -73 81 -92 105 -118 132 -148
33 -148 165 -186 205 -229 253 -283 312 -345 384 -424 470 -520 577 -644 716 -800 900 -1020 1160
52 1160 -1334 1559 -1854 2264 -2879 3895 -5887 11305 -57055 -204546 -181915 -117112 -51870 -44935
66 -44935 -66761 -108730 -127183 -109555 -65156 -57268 -105293 -176390 -200689 -159900 -82991 -31394
78 -31394 -39969 -101822 -164627 -183741 -150433 -103038 -86087 -115361 -156563 -166125 -134429 -96255 -89813
91 -89813 -121452 -164843 -187681 -166968 -109499 -53188 -44393 -86968 -135177 -142156 -112567 -87275 -90889
104 -90889 -111113 -124258 -114960 -81731 -39736 -24865 -59861 -121226 -152777 -132649 -87940 -55537
116 -55537 -49309 -60358 -75073 -69521 -36983 -5255 -13740 -60567 -99758 -90819 -41205 9518 28747
129 28747 11119 -24705 -50414 -43684 -12012 17205 14250 -19336 -46270 -32613 14380 50097
141 50097 45181 8186 -26587 -35005 -9051 37341 71676 66057 28724 -78 6328 33802 52169
154 52169 47306 26818 7715 8398 37429 77212 91259 61888 16646 -5202 6547 32570 52716
167 52716 61035 57007 46384 43570 57804 75501 72028 45563 19538 17816 38525 63295 75887
180 75887 72024 57123 41986 35931 40621 47509 46123 36667 31912 40664 54144 58910 50998 38798
194 38798 29188 25347 30349 44917 55335 50975 38566 35617 41728 40831 27858 16320 15160 19187
208 19187 25437 35932 45460 42424 23989 7045 4902 10646 13097 10965 11359 15538 20399 25523
222 25523 28844 24156 9906 -5355 -10209 -4488 4115 9242 11046 11664 8373 1214 -5234 -7504 -8350
237 -8350 -11059 -12994 -8598 584 3599 -2765 -8574 -7110 -5671 -12568 -21562 -19760 -9247 -1132 1388
252 1388 1588 -3550 -17005 -28565 -26455 -13558 -4495 -5927 -11786 -14216 -12355 -6761 -42 -2119 -17803
267 -17803 -35764 -36554 -16424 6166 14390 6147 -9517 -21678 -24380 -15899 -2652 1227 -10725
280 -10725 -25552 -24515 -4073 17112 17998 -2446 -25923 -34670 -24957 -4079 13941 15890 270
293 270 -18269 -19627 -3641 10677 7598 -8943 -23181 -22835 -6808 16485 29782 17998 -11712
306 -11712 -31248 -22801 1180 15183 10367 -2590 -10277 -7031 5987 20373 20249 -298 -25864
319 -25864 -31271 -9773 19863 31756 18736 -4990 -18583 -12064 6863 18783 11408 -8933 -21827
332 -21827 -12358 13763 33812 29612 3828 -22904 -30456 -14025 13902 30857 21172 -6006 -22176
345 -22176 -9206 17703 27969 10663 -17580 -32348 -23819 2723 30909 38852 16374 -18728
357 -18728 -34364 -17082 12575 24592 10096 -14363 -25888 -12827 15081 34231 24257 -9468
369 -9468 -39796 -38992 -9943 21819 30489 12600 -14675 -28314 -17750 6240 20654 9459 -19304
382 -19304 -37114 -23926 10762 34860 26730 -4916 -33253 -38099 -18702 7757 20756 8836
394 8836 -16075 -27878 -14053 10796 20333 3135 -25399 -41570 -32162 -1900 25920 28356 2386
407 2386 -26355 -32316 -13724 7040 10260 -3992 -21804 -27367 -13176 12270 27198 13772 -19257
420 -19257 -42946 -35640 -5923 18345 18494 -1413 -20900 -23740 -7643 10686 15651 -345 -24337
433 -24337 -33587 -15304 15579 32067 20117 -8846 -30291 -28694 -7547 14901 19589 2847 -17761
446 -17761 -19381 806 21502 22833 4229 -19011 -29025 -17458 9212 31792 30379 7276 -14973
459 -14973 -15251 3211 19167 17472 2081 -11948 -12250 4121 24787 32722 19602 -4824 -19563
472 -19563 -13073 8017 24979 24206 10059 -2328 -2097 10699 23414 23172 8270 -8033 -9816 6095
486 6095 25858 32581 22575 5816 -4757 -4570 7083 19101 21127 9597 -1383 1502 16699
499 16699 27867 22677 7501 -5377 -7703 1596 17034 26721 22554 9459 141 2238 10695 15191
513 15191 11208 1821 -3839 -1532 10099 21526 21487 8943 -5665 -9972 -2732 7113 10960 8109
527 8109 3155 946 1931 4943 8031 5847 -3072 -11326 -10359 685 10023 9245 678 -5875 -8362 -7742
543 -7742 -6073 -4537 -4648 -7251 -8191 -4649 -662 -782 -5530 -11148 -14813 -14627 -11351 -6114 -3393 -6031
559 -6031 -9670 -9744 -7975 -9601 -14844 -18150 -16432 -12608 -9412 -8533 -9134 -10724 -13347 -15399 -15803 -14258
575 -14258 -14449 -15600 -14797 -10400 -5745 -5100 -10122 -15978 -18969 -17609 -13413 -8600 -7668 -10653 -13373 -10972
591 -10972 -5546 -5407 -10659 -16484 -17836 -14860 -9317 -2361 2029 -1934 -10863 -15517 -10463 -1965 6
606 6 -5654 -10820 -10082 -3230 4529 7723 3294 -6750 -13979 -12066 -1842 8024 10442 4631 -3583 -5947
622 -5947 486 9287 11330 4600 -5832 -8280 1165 15506 22825 17192 4123 -4990 -3681 4968
636 4968 15134 18555 11786 1358 -800 10202 23031 25128 12903 -1751 -5932 2562 17034
649 17034 27571 25421 12430 259 806 12781 22913 21884 10337 -143 -324 10923 25495
662 25495 30265 19875 2017 -7780 -672 15945 26465 22208 8620 -1063 1849 12819 22300
675 22300 20584 7938 -6656 -9337 4002 22341 28964 17673 -1013 -11038 -5086 9824 18629
688 18629 14644 733 -10561 -6986 8934 22322 19754 2529 -14510 -18125 -6560 11363 20626
701 20626 12325 -6508 -17421 -10322 6635 15431 7433 -9586 -21147 -17199 -1357 14757 16622
714 16622 1702 -18132 -25982 -15020 3580 12538 3941 -13598 -22365 -14945 1398 11156 5411
727 5411 -11905 -26775 -25856 -9032 8948 12463 -636 -18164 -24936 -16487 -1498 6699 78 -15862
741 -15862 -26139 -18164 993 12606 7037 -10517 -24514 -24218 -11571 3820 9300 313 -15214
754 -15214 -21244 -12084 3411 9929 876 -15897 -24554 -17389 174 13051 10898 -4969 -19228
767 -19228 -19968 -7528 6450 9692 -731 -13588 -16879 -7376 7161 14244 6649 -10387 -21939
780 -21939 -16496 1722 15371 12895 -1479 -13161 -12502 -2068 9448 11564 2761 -10375 -15396
793 -15396 -5660 10416 18280 11501 -3593 -14166 -11756 1665 13765 13529 2295 -9327 -8968 2017
807 2017 12418 13493 4603 -6990 -11062 -5508 7276 16417 13480 1267 -9369 -8351 2724 12085
821 12085 10848 1204 -6810 -5473 3135 11117 12693 6208 -3677 -9461 -4955 5507 12823 10194 1123
836 1123 -4852 -3339 3721 9831 8285 936 -6317 -5907 2521 10457 10620 4569 -2888 -5514 -2358 3681
852 3681 8161 6369 95 -4106 -2271 4650 8843 6320 -1179 -6088 -4826 1718 7610 8113 3102
867 3102 -2247 -4020 -1652 2815 4623 2350 -2108 -3877 -1374 3563 6396 5114 -371 -5453 -5628
882 -5628 -588 4176 3481 -236 -1970 -1207 722 1107 1187 516 -2317 -4183 -2517 1347 3405 1309 -1934
899 -1934 -3239 -2007 34 -267 -1264 -2595 -1848 -346 879 505 -1699 -3902 -4402 -2368 -296 559 -471
916 -471 -2543 -2544 -1527 506 856 -2296 -5916 -7251 -3613 2001 3813 1070 -3388 -5545 -4140 -1303
932 -1303 932 417 -2694 -6140 -5263 -439 4342 4453 -931 -6434 -7465 -4205 1400 5256 2292 -3586
948 -3586 -6471 -3595 2674 5313 2838 -2869 -6182 -4847 1017 6664 6947 1618 -4972 -7127 -2169
963 -2169 5522 8367 3695 -2862 -5292 -390 6341 8959 5193 -1636 -6642 -4884 2997 10707 10913
978 10913 3891 -3632 -4299 1727 9195 10350 4385 -4207 -6450 -59 10097 14539 9598 -196 -5753
993 -5753 -3119 4559 11733 11582 4253 -4666 -5753 2868 12927 15039 6602 -4334 -7886 -962 10076
1008 10076 15357 10731 459 -6937 -5239 4456 12987 12936 3412 -6557 -7408 1471 12565 14799 6478
1023 6478 -5765 -11981 -5797 6912 14452 9676 -1196 -8683 -6609 2615 10321 9699 434 -10695
1037 -10695 -12792 -3683 9026 13680 5231 -7647 -13772 -8482 3280 9157 4976 -5957 -13322 -10661
1051 -10661 -352 8378 7310 -2300 -12864 -15329 -7154 3872 8410 1723 -10531 -16499 -11275 942
1065 942 7149 2173 -9267 -16835 -13235 -2742 5695 4639 -4598 -14783 -17789 -10000 1689 6845
1079 6845 -404 -12036 -17168 -10920 399 6595 1832 -10156 -18145 -15277 -3860 6186 6041 -3077
1093 -3077 -13247 -15700 -8278 2400 6968 787 -10777 -16755 -10739 2025 9497 5444 -6045 -13811
1107 -13811 -12042 -1716 7044 7425 -132 -9223 -11688 -5131 5525 10304 4585 -6068 -11182 -6497
1121 -6497 4263 11251 8522 -958 -8873 -7653 991 9853 10680 3284 -4233 -5577 242 8207 12133
1136 12133 7746 -992 -6810 -3051 6512 13559 10822 2623 -3761 -2358 5132 11593 11525 4787 -1609
1151 -1609 -2768 2473 9839 13271 9149 1705 -3057 183 7972 12987 10411 2826 -2681 -1225 5568
1166 5568 11554 10925 4946 -1211 -1590 2957 8294 10462 7216 577 -3563 -1074 5828 10582 8191
1181 8191 1283 -3093 -1517 3443 7553 6841 2556 -2537 -3393 -33 5047 6812 4370 -1654 -4334
1196 -4334 -2563 2161 5066 3376 -1336 -4791 -3413 34 2864 2308 -1268 -4299 -4621 -2090 867
1211 867 1087 -814 -3539 -5165 -4200 -1275 605 -1426 -4297 -5543 -3965 -1327 -599 -2201 -4356 -5725
1227 -5725 -5228 -2612 -1266 -1852 -3859 -5176 -4282 -3028 -1868 -1999 -3975 -5455 -5753 -3451 -633 -1011
1243 -1011 -3437 -6060 -5191 -2551 -1054 -1599 -3215 -4577 -4479 -2960 -993 -498 -1533 -4018 -5389 -3904
1259 -3904 -500 1310 -375 -3649 -4780 -2793 384 1520 -171 -2550 -4025 -2989 454 2745 1723
1274 1723 -896 -2910 -3007 -486 2432 3365 1047 -2635 -3469 -276 4398 5110 2052 -2534 -3159 -466
1290 -466 3667 5659 3967 -23 -2611 -1614 2617 6577 6078 2108 -2608 -2867 1551 6965 8073 3488
1306 3488 -1857 -3557 35 5532 8094 5461 157 -3312 -1706 3740 7931 7515 2322 -2911 -3807
1321 -3807 1349 8198 9364 4045 -2683 -4798 -412 6143 9014 5907 -436 -4464 -2803 3573 8421
1336 8421 7260 1385 -4423 -4943 338 7260 9348 3840 -3835 -6970 -2094 5533 8909 4893 -2367
1351 -2367 -6207 -3743 2569 7534 6268 212 -6161 -6772 -858 6737 8934 2824 -5982 -8677 -3320
1366 -3320 4678 8033 3826 -3645 -8020 -5474 1599 7319 6247 -1293 -8086 -8451 -1748 5611 7614
1381 7614 2094 -6262 -9512 -4629 3465 7552 3144 -5157 -9728 -6820 996 6693 5924 -1162 -8653
1396 -8653 -9707 -3392 4643 6755 1039 -6930 -10148 -4942 3313 7238 3030 -5402 -10552 -8184 -153
1411 -153 6341 5617 -1954 -8976 -9305 -3194 4176 5850 707 -7172 -10524 -5629 2851 7368 3217 -5323
1427 -5323 -10720 -8087 -244 5241 4625 -1571 -7922 -8570 -2483 4058 5987 762 -7312 -10033 -5034
1442 -5034 3187 7014 3766 -4078 -8816 -6693 -185 5361 4576 -1394 -6938 -7284 -1826 5222 7031
1457 7031 1787 -5625 -8510 -4246 2808 7205 4662 -2721 -6422 -4388 1729 5922 5146 -299 -5795
1472 -5795 -6062 -651 6127 8029 2931 -3550 -6457 -2528 3772 7009 4727 -1241 -4620 -2727 2948
1487 2948 7053 5951 606 -4306 -4189 717 6206 7859 4285 -1109 -3593 -469 4491 7006 4566
1502 4566 -639 -3822 -1187 4089 7361 6083 2096 -2136 -2721 749 4776 6471 3489 -678 -1964
1517 -1964 361 5096 6415 3902 -510 -3232 -1506 2903 5975 4773 962 -1531 -1360 1093 3167
1532 3167 3715 1500 -1419 -2484 80 3819 4866 2337 -1922 -3713 -2083 1350 3024 1632 -834
1547 -834 -2152 -1620 332 1751 962 -1077 -3549 -3807 -1502 1423 1952 11 -2919 -3596 -1927 -369
1563 -369 277 -1607 -3502 -3559 -1714 53 470 -925 -3020 -3944 -4072 -2322 -589 -671 -2063 -3356 -3158
1580 -3158 -1044 91 -815 -3466 -4911 -3860 -1558 342 -61 -2088 -3512 -3297 -2091 -660 -764 -1518
1596 -1518 -3060 -3413 -1460 930 1355 -131 -3061 -4357 -2710 82 1739 525 -2008 -2914 -864 1182
1612 1182 2244 1324 -1065 -2617 -2402 418 3297 3977 1591 -1977 -2669 -154 3400 4305 2155 -1173
1628 -1173 -1915 945 4414 5238 3624 170 -1884 -860 2396 5465 5409 3090 -365 -855 2201 5732
1644 5732 6190 3112 -1459 -2246 1423 6094 7542 4705 305 -2033 -583 3293 6597 5983 2272 -1657
1660 -1657 -1464 2710 6887 6808 2932 -2196 -3168 315 5685 7692 4647 -905 -3524 -1462 2822 6057
1676 6057 4805 194 -3626 -3218 1564 6232 6160 1207 -4687 -5813 -1787 3831 5727 3065 -3024 -5335
1692 -5335 -3455 1407 4657 3047 -2396 -6810 -6146 -657 4757 4773 17 -6065 -7766 -4038 1862 4132
1708 4132 803 -4969 -7872 -4981 465 3753 1747 -3910 -8406 -7966 -2519 3195 4316 -870 -6924
1723 -6924 -8767 -4312 1343 3039 -524 -5821 -8580 -5420 749 4073 2703 -3585 -8616 -8308 -2614
1738 -2614 3208 4261 -786 -6176 -7396 -3384 2345 4016 435 -5752 -8409 -5078 1234 5504 3614
1753 3614 -2038 -6745 -6634 -1500 3689 4481 -71 -5547 -6255 -1294 4508 6126 2136 -3928 -6820 -4116
1769 -4116 1924 6054 5299 -63 -4272 -4137 113 4962 5640 1103 -3710 -5330 -496 5348 7656 4040
1785 4040 -2087 -4792 -2633 2547 6197 4909 744 -2975 -2558 1523 5659 6141 1528 -3324 -4566
1800 -4566 -636 5484 7793 4176 -1263 -3665 -1373 2683 5445 3944 -126 -3069 -2160 2059 5667
1815 5667 5824 1844 -3221 -4849 -1001 3744 6248 3447 -1402 -3291 -994 3182 4856 2893 -1103
1830 -1103 -3690 -2877 1135 4519 4545 1483 -2654 -4079 -1571 2554 3892 1415 -2181 -3318 -1236 2257
1846 2257 3798 2359 -1664 -4073 -3360 3 2982 3181 635 -2318 -2945 -1116 1862 2597 247 -2787
1862 -2787 -3775 -1242 2305 3230 1711 -1376 -3567 -2770 -282 1765 1499 -301 -2013 -2030 -25 1975
1878 1975 2189 -84 -2990 -3462 -1219 1874 2720 834 -1309 -2288 -1211 860 1393 451 -1057 -1900 -971
1895 -971 851 2166 1983 -186 -2069 -2463 -469 1963 2097 117 -1442 -986 284 1651 1292 -37
1911 -37 -1749 -1905 -776 1356 1793 1408 -340 -1337 -899 617 1640 1120 -667 -1940 -1087 1513 2794
1928 2794 1468 -881 -2051 -1444 -189 1484 1386 642 -948 -1264 91 1841 1849 149 -1980 -2544 -667
1945 -667 2019 2639 1072 -1168 -2256 -1348 787 1866 1303 -1083 -2230 -1344 1007 2547 2343 -304
1961 -304 -2721 -2625 -341 2253 2729 726 -1873 -2526 -591 1747 2835 1189 -1739 -3088 -1812 1640
1977 1640 3564 2912 47 -2881 -2723 -348 2664 3153 815 -2284 -2698 34 2894 3499 1130 -2254
1993 -2254 -3410 -1999 1693 4075 3043 -191 -2860 -2772 227 3037 3611 460 -3268 -3206 191 3753
2009 3753 4215 1590 -2215 -4004 -1992 1538 4410 3130 -419 -3135 -2997 915 4146 3671 -232 -4134
2025 -4134 -3972 -343 4151 4753 1922 -2315 -4263 -2423 1462 4179 2462 -1232 -3906 -2908 1179 4357
2041 4357 4125 -455 -4695 -5150 -1048 3438 4697 1699 -2785 -4569 -2580 1495 3839 2258 -2265
2056 -2265 -4935 -3827 482 4339 3967 -149 -5118 -5836 -1783 2596 3963 847 -3420 -4853 -2271
2071 -2271 1769 3587 1339 -3127 -5826 -4788 -215 3758 3731 -150 -4646 -6123 -2277 2035 3562
2086 3562 -112 -4195 -5182 -2121 2263 4240 1923 -2816 -5644 -5147 -894 3029 3597 99 -4227 -4807
2102 -4807 -1524 2905 3546 326 -4339 -4969 -2298 2462 4600 2845 -1225 -4551 -3960 -204 3377 3287
2118 3287 290 -3410 -3752 -91 3731 4773 1162 -3250 -4573 -1860 3036 5165 3684 -380 -3122
2133 -3122 -2165 853 4279 3859 199 -3123 -2710 738 4963 5217 2164 -1847 -3475 -1206 2808 4979
2149 4979 3252 -239 -2332 -963 2035 4490 3866 457 -2412 -2615 612 4466 5232 2854 -746 -2305
2165 -2305 -724 2714 4046 2410 -672 -1792 -535 2511 4207 3454 266 -2189 -2526 -145 2737
2180 2737 3561 1492 -1476 -2367 -436 2256 3079 803 -1878 -2808 -1225 1604 2859 2445 -295 -2624
2196 -2624 -2956 -832 1750 1911 -204 -2341 -2267 -241 1831 1811 -190 -2443 -3587 -2170 538 1530 845
2213 845 -1297 -2588 -2447 -724 762 514 -1265 -3058 -2666 -575 1382 1315 -62 -2538 -3207 -1704 -346
2230 -346 596 -289 -1365 -2273 -1102 -123 927 74 -1803 -2512 -2306 -169 1104 902 -576 -1725 -1729 -158
2248 -158 440 513 -634 -1555 -1355 -320 1252 1377 374 -1303 -2151 -709 953 1771 835 -538 -1502 -231
2266 -231 1182 1795 855 -905 -1398 -586 1254 2134 2092 920 -695 -693 233 1713 2120 1081 -736 -955
2284 -955 585 2547 2874 1136 -1015 -1592 -225 1826 2635 1962 306 -912 -502 1297 2887 2185 38
2301 38 -1628 -1431 939 3207 3312 1188 -1293 -1630 31 2062 2596 1138 -603 -1335 -475 1613 2782
2318 2782 1903 -793 -2926 -2222 439 3005 2844 492 -2144 -2414 -291 1918 2479 116 -2079 -2873
2334 -2873 -1338 1353 2666 1692 -1142 -3623 -3079 -348 2479 2086 -388 -3171 -2874 -709 1736 2364
2350 2364 -414 -3350 -4105 -1802 1041 2985 1485 -1298 -3698 -3459 -460 2077 1984 -912 -3846 -3307
2366 -3307 -658 2469 2683 -105 -3407 -4337 -1970 1415 2684 1606 -1243 -3651 -2764 255 2840 1964
2382 1964 -893 -3940 -3677 -305 3183 3572 686 -2836 -3943 -1820 1509 3065 1723 -1333 -3065
2397 -3065 -1914 1370 3271 2958 -597 -4067 -3550 46 3677 4181 1320 -2340 -3371 -1087 2027 3177
2413 3177 1623 -1133 -2910 -1875 1901 4543 3580 -48 -3245 -3200 -379 3181 3806 1593 -1884 -2857
2429 -2857 -765 2501 3901 1810 -1435 -3553 -1870 1385 4046 3393 130 -2969 -3177 5 2966
2444 2966 3438 651 -2368 -2887 -347 2413 3723 1732 -2091 -4214 -2456 809 3283 2725 -206 -2759
2460 -2759 -2819 -53 2674 2710 -53 -3214 -3529 -806 2385 3401 1435 -1911 -3468 -2438 384 2709
2476 2709 2137 -403 -2858 -2739 69 2764 2226 -120 -3096 -3609 -990 2061 2921 1253 -1550 -2905
2492 -2905 -1582 740 2045 1580 -963 -2762 -2264 463 2772 2466 -25 -2733 -2785 -1082 1525 2417
2508 2417 1044 -1207 -1986 -970 1049 2262 1475 -738 -2421 -1981 320 2623 2831 471 -1928 -1961
2524 -1961 -385 1660 2016 574 -1309 -1793 -137 1626 2621 1646 -686 -1986 -1199 459 2024 1901
2540 1901 81 -1415 -1176 450 1734 1957 -83 -1542 -1635 121 1704 2146 722 -761 -1608 -706 357
2557 357 1459 1295 -518 -1521 -1068 833 1820 1470 -819 -1994 -1531 192 1454 1158 40 -1355 -1203
2574 -1203 -439 462 816 126 -1049 -1705 -903 949 1390 697 -872 -1833 -1718 -56 778 526 -355 -1396
2592 -1396 -1278 -257 829 750 -379 -1541 -1937 -657 877 1419 226 -1162 -2009 -988 714 1283 53
2609 53 -1256 -1264 -743 716 929 770 -495 -1898 -1316 -144 1412 1461 312 -1185 -1725 -480 1353 1690
2627 1690 148 -1191 -1560 -364 1358 1861 939 -618 -1274 -819 871 1806 1666 165 -1178 -901 501
2644 501 2316 2327 533 -1628 -1441 586 2018 2566 1336 -545 -1094 -499 1429 2424 1532 277 -1633
2661 -1633 -979 1443 3002 2793 270 -1557 -1382 484 2334 2744 1214 -561 -1591 55 1805 2788
2677 2788 1700 -632 -2126 -1509 964 3102 2490 111 -1756 -2119 82 2051 2212 341 -1682 -2211
2693 -2211 -483 2064 2624 1259 -1507 -2649 -2028 504 2590 2083 -537 -2870 -2282 -299 1818 1783
2709 1783 -573 -2592 -3481 -1232 1369 2128 820 -1868 -3670 -2415 -150 1684 1337 -1384 -3267 -2718
2725 -2718 -282 1963 1765 -757 -3277 -3599 -1339 836 1857 633 -1862 -3476 -2032 174 1542
2740 1542 1021 -1552 -3593 -2924 -224 2200 1986 -522 -3321 -3307 -1806 1277 2168 598 -1611 -2945
2756 -2945 -1668 870 2292 1468 -1174 -3748 -2833 85 2626 2415 77 -2306 -2455 -750 2001 2417
2772 2417 858 -1416 -2356 -1188 1518 3009 2055 -511 -2827 -2402 478 2791 2404 620 -1824 -2237
2788 -2237 -6 2113 2603 863 -1691 -2300 -1040 1822 3642 2193 -4 -2084 -1774 718 2431 2377
2804 2377 402 -1561 -1769 628 2412 2631 715 -1456 -2087 -971 1519 2933 1868 -184 -1729 -1428
2820 -1428 798 2406 2368 -32 -1880 -1678 306 2482 2118 516 -1371 -1837 -970 1369 2174 1470 -452
2837 -452 -1973 -1395 668 2403 1662 -310 -2113 -2043 -54 1977 2213 317 -1144 -1670 -789 963 1487
2854 1487 728 -923 -1591 -1125 938 2179 1780 -415 -1965 -1667 105 1526 1533 75 -1380 -1542 -188
2871 -188 1359 1418 575 -1048 -1608 -764 922 2177 1229 -65 -1573 -1274 348 1570 1240 118 -1046
2888 -1046 -884 412 1522 1554 337 -847 -872 -150 1073 1342 853 -187 -922 -242 639 1684 1410 -291
2906 -291 -1065 -618 780 1797 1245 -22 -758 -948 107 1167 1029 446 -671 -924 70 1035 1324 669
2924 669 -793 -929 -419 1290 1484 725 -463 -1175 -791 434 1136 958 -150 -987 -1420 62 863 638
2942 638 53 -1229 -1590 -631 408 1073 132 -1196 -1494 -948 295 463 395 -890 -1459 -1221 -334 945
2960 945 652 -583 -1827 -1770 -509 621 996 -461 -1754 -1673 -795 412 966 -21 -1295 -1900 -1124 220
2978 220 1029 270 -1104 -2111 -1743 -265 1040 622 -951 -2137 -1863 -260 814 1299 60 -1521 -2102
2995 -2102 -898 567 1071 606 -788 -1983 -1365 345 1457 1123 -384 -1899 -1468 -14 1644 1644 192
3012 192 -1105 -1499 -550 1242 1844 973 -666 -1736 -985 947 2478 1735 -156 -1668 -1383 418 2155
3029 2155 2096 295 -1121 -1149 288 1905 2259 878 -663 -1784 -874 1361 2508 2201 -170 -1647 -1232
3046 -1232 916 2415 2274 432 -1447 -1425 368 1994 2443 1070 -937 -2148 -955 1287 2686 1856
3062 1856 -238 -1899 -1571 560 2247 1760 -43 -1748 -1811 -52 1936 1989 551 -1427 -1981 -1212 685
3079 685 1811 1290 -869 -2230 -1539 147 1993 1471 -690 -2401 -2130 -600 1475 1800 -5 -1619
3095 -1619 -2391 -1314 307 1599 597 -1133 -2816 -2024 -64 1482 1328 -806 -2438 -2397 -584 1177
3111 1177 1326 -63 -1873 -2220 -1225 951 1423 702 -997 -2702 -1999 257 1843 1591 -383 -2097 -1892
3128 -1892 -322 1507 1733 209 -1510 -1861 -443 1219 1675 1119 -1000 -1994 -1594 640 2044 1714 -481
3145 -481 -1812 -1331 181 1808 1560 119 -1219 -1266 77 1527 2119 1216 -620 -1718 -816 710 2121
3162 2121 1764 111 -1409 -899 975 2361 2407 317 -1228 -1193 -7 1639 2210 1038 -303 -1123 -328
3179 -328 780 2188 1436 -144 -819 -687 594 1959 1858 349 -1276 -1243 350 1232 1708 629 -698
3196 -698 -1077 -526 1197 1676 962 -74 -1113 -922 363 1324 1302 -160 -1235 -986 -365 1067 1026 -184
3214 -184 -805 -1253 -453 720 913 268 -706 -1465 -817 288 878 711 -851 -1875 -862 -82 643 573 -199
3233 -199 -1085 -1130 -312 539 1017 -149 -1048 -1436 -682 366 1119 -54 -963 -1298 -846 401 600 214 -646
3252 -646 -993 -1170 210 739 583 -165 -889 -1309 -562 708 721 112 -1139 -1165 -519 778 1149 200 -491
3271 -491 -858 -212 372 1265 469 -247 -824 -695 411 1150 969 228 -786 -1044 300 1048 1213 267 -623
3290 -623 -937 -180 1016 1443 915 -351 -587 -449 535 1038 987 23 -825 -737 343 1642 1160 229 -829
3309 -829 -839 191 1182 1174 276 -616 -1314 -360 733 1442 763 -241 -1243 -905 490 1511 845 -126 -1172
3328 -1172 -920 -47 872 1035 -42 -933 -1353 -791 754 1114 578 -828 -2077 -753 385 1191 674 -717
3346 -717 -1693 -1514 -433 1221 755 -350 -1689 -1353 -551 466 1216 232 -936 -1559 -908 408 1143 478
3364 478 -805 -1918 -1375 36 1259 1142 -292 -1556 -1433 -231 965 1339 159 -1161 -1571 -763 909
3381 909 1491 896 -759 -1776 -1477 291 1500 1402 -268 -1751 -1411 207 1427 1434 231 -1049 -1576 -530
3399 -530 797 2013 963 -325 -1508 -895 433 2083 1216 -160 -1309 -979 251 1698 1543 546
3415 546 -877 -1333 -633 957 2019 1222 -298 -1351 -1036 998 2039 1316 -398 -1501 -1139 431 1430
3432 1430 1633 154 -1158 -1450 -205 1330 1642 1018 -823 -1455 -975 585 2055 975 -588 -1523 -1492
3449 -1492 149 1342 1506 -84 -1050 -1641 -556 1001 1393 600 -1293 -1942 -1307 547 1528 796 -785
3466 -785 -1648 -1461 55 1086 974 -27 -1227 -1692 -394 829 1277 321 -1169 -1827 -1062 506 1509
3483 1509 496 -555 -1949 -1048 422 1442 1230 -480 -1399 -1201 33 856 1345 560 -935 -1376 -951
3500 -951 668 1306 814 -452 -1090 -862 490 1492 1050 -155 -1172 -986 125 1190 1552 484 -441
3517 -441 -988 171 1156 1691 865 -144 -901 -257 895 1796 1281 58 -307 -725 527 1357 1759 488
3535 488 -307 -421 421 1366 1693 1035 -308 -768 -185 1095 1415 888 -99 -813 -396 854 1680 1150 216
3554 216 -499 -682 177 944 997 481 -253 -682 -219 824 1228 441 -324 -1080 -253 576 951 803 -73 -1249
3574 -1249 -800 181 534 326 223 -731 -1099 -269 413 743 23 -1139 -1210 -794 118 585 -85 -632 -1142 -570
3594 -570 -349 39 148 -523 -1282 -1380 -500 442 231 -543 -1316 -1319 -470 321 304 -435 -1280 -1402 -560 -146 154
3615 154 131 -589 -1170 -1049 -345 164 500 -597 -1239 -1114 -164 351 517 -260 -1153 -922 -553 318 463 -142
3635 -142 -643 -966 -423 202 752 524 -192 -906 -736 -61 811 1010 -118 -640 -911 140 979 987 347 -537
3655 -537 -1115 -334 738 1127 891 -274 -1044 -198 889 1534 1139 24 -826 -445 670 1419 1439 353
3673 353 -273 -579 105 1317 1500 924 -407 -856 -157 700 1638 1055 -131 -1112 -310 597 1225 1111 -15
3692 -15 -942 -769 425 924 1421 452 -943 -1173 -111 805 1456 712 -764 -1131 -583 272 1224 1030 -15
3711 -15 -1300 -1297 90 1137 988 -83 -1118 -1278 -830 503 849 84 -1050 -1768 -1108 415 1181 186
3729 186 -574 -1417 -1193 -229 651 779 -367 -1531 -1599 -772 364 802 274 -1262 -1882 -1115 -8 1062
3747 1062 498 -566 -1790 -1093 -218 965 981 -120 -1568 -1432 -794 853 1255 182 -727 -1695 -903 447
3765 447 1249 793 -676 -1523 -987 363 1196 1083 -275 -1072 -1171 -290 1138 1081 618 -628 -1213 -407 613
3784 613 1423 913 -684 -1357 -514 778 1208 1264 178 -934 -801 226 1152 1651 898 -589 -922 -170
3802 -170 1196 1708 966 -210 -998 -391 983 1851 1203 321 -799 -564 303 1250 1480 713 -513 -619
3820 -619 -30 771 1469 849 -107 -775 -550 884 1406 926 -107 -709 -587 538 1246 1108 314 -582 -1176
3839 -1176 113 955 922 425 -284 -911 -324 686 1031 823 -152 -1008 -721 184 816 990 93 -943 -988
3858 -988 -98 623 1100 358 -461 -1314 -604 881 869 626 -522 -1119 -627 255 723 608 -111 -918 -837 -291
3878 -291 346 835 82 -917 -841 -556 360 829 340 -714 -923 -460 417 739 400 -134 -765 -1005 155 738
3898 738 662 97 -798 -839 -255 648 1107 262 -541 -838 -408 208 994 420 -566 -559 -647 544 688 603 -39 -673
3920 -673 -460 31 635 799 21 -869 -753 -103 641 919 148 -706 -646 -206 363 834 469 -62 -727 -632 -55
3941 -55 795 910 -126 -598 -1086 -131 790 699 -28 -754 -849 -179 265 447 295 -656 -695 -376 126 806 194
3962 194 -359 -1104 -730 12 550 610 -352 -910 -701 -76 422 305 115 -944 -1062 -520 165 309 294 -550
3982 -550 -1093 -649 302 471 296 -502 -1086 -602 -54 458 315 -111 -753 -963 -276 433 821 218 -822 -917
4002 -917 -454 512 923 438 -347 -1176 -227 106 863 507 347 -700 -787 3 584 711 268 -578 -754 -80
4022 -80 670 1201 641 -267 -387 -789 767 1240 858 87 -649 -701 246 700 1051 205 -181 -781 -155 791
4042 791 1129 608 -679 -528 -232 451 816 744 -382 -569 -514 392 1058 1100 79 -618 -670 107 781 1294
4062 1294 495 -589 -1225 -652 685 956 702 -559 -1052 -957 452 1039 458 -132 -1032 -1136 -537 793
4080 793 1005 219 -872 -1312 -543 529 633 190 -769 -1377 -1110 -157 900 597 -475 -1358 -1331 -544 439
4099 439 776 -203 -1258 -1333 -465 77 850 625 -896 -1474 -1037 343 1025 820 -481 -1364 -1172 -126 630
4118 630 658 -39 -1061 -1278 -413 609 577 256 -785 -1096 -680 193 1120 520 -344 -913 -719 195 1073 823
4138 823 -22 -712 -521 -245 1098 1340 309 -269 -650 -163 765 1102 1009 -53 -509 -610 470 1014 1327
4157 1327 215 -604 -516 199 1101 1459 618 -200 -753 -136 863 1583 760 -14 -358 -9 564 1439 1216 689
4177 689 -448 -140 543 1046 1150 804 -206 -584 -250 994 1090 456 99 -720 -99 643 1030 1035 156 -405
4197 -405 -315 231 957 594 317 -463 -666 -250 632 774 233 -520 -1133 -620 420 905 288 -303 -950 -811
4217 -811 -119 265 263 -249 -904 -887 -345 249 508 -186 -905 -1111 -518 29 281 -126 -724 -977 -870 77 376
4238 376 -78 -482 -956 -870 -248 457 539 -108 -875 -1067 -483 91 181 -57 -566 -1136 -357 -92 563 265 -482
4259 -482 -1127 -1045 173 681 468 -246 -829 -984 67 376 452 -111 -515 -480 -415 439 720 613 -208 -411 -53
4280 -53 90 677 468 -68 -786 -436 231 922 425 -51 -524 -585 293 749 740 366 -61 -494 199 463 717
4301 717 373 -41 -560 -48 444 872 492 -251 -427 4 328 835 868 151 -434 -143 75 864 1161 216
4321 216 -400 -436 -519 406 984 279 -234 -437 -686 266 519 335 -110 -684 -683 90 640 431 200 -360 -929
4342 -929 -103 135 712 384 -724 -953 -621 350 424 301 -413 -437 -995 58 641 289 -76 -937 -1124 -510
4362 -510 276 453 39 -624 -927 -455 108 614 -69 -639 -801 -807 -157 479 303 -235 -875 -914 -207 567 738
4383 738 -115 -638 -794 -446 230 758 375 -935 -1016 -715 391 583 399 -424 -764 -438 -42 587 999 247
4403 247 -688 -1034 -301 643 1074 488 -568 -999 -442 322 883 536 -76 -581 -506 288 728 891 203 -418
4423 -418 -849 -67 481 1088 585 -220 -917 -340 363 943 770 -141 -821 -324 317 1043 659 196 -783 -1059
4443 -1059 -109 883 623 208 -389 -801 -213 625 1076 319 -591 -628 -491 194 804 948 -146 -587 -627 -86
4463 -86 805 527 299 -772 -531 -341 412 799 479 -357 -931 -739 89 955 669 41 -696 -663 -52 598
4483 598 611 345 -866 -937 -269 603 633 217 -449 -923 -133 233 774 382 -206 -702 -447 -167 774 1034 56
4504 56 -666 -808 -51 501 1039 436 -346 -566 -339 497 774 638 -495 -667 -497 -28 964 741 298 -737
4524 -737 -607 130 775 956 366 -166 -496 -178 397 501 278 -96 -559 -420 75 967 660 21 -272 -272 351
4545 351 840 715 191 -387 -529 38 533 803 740 -32 -548 -423 243 687 409 -140 -644 -358 127 644
4565 644 750 -68 -737 -450 -86 256 523 -73 -452 -496 -191 284 312 195 20 -829 -479 -195 519 362 -327
4586 -327 -738 -729 -314 216 341 -248 -701 -680 -426 146 523 -20 -673 -992 -504 288 272 403 -88 -832 -475
4607 -475 166 484 19 -358 -750 -599 -172 503 357 -263 -371 -987 -640 97 260 81 -647 -747 -470 129
4627 129 509 77 -182 -747 -458 -209 291 390 186 -339 -622 -38 533 408 72 -392 -653 -489 223 677
4647 677 459 -232 -504 -183 158 667 528 292 -572 -230 297 807 730 240 -216 -222 162 410 795 600 -83
4668 -83 -576 20 441 853 644 -11 -391 27 43 672 417 232 -82 -265 -60 639 759 620 -167 -359 132
4689 132 738 964 330 -273 -370 -277 446 563 681 66 -500 -446 -98 360 647 240 -354 -652 -239 384 777
4710 777 119 -407 -882 -361 320 819 419 -224 -529 -715 -81 316 449 94 -872 -893 -181 214 819 -105
4730 -105 -578 -995 -412 -123 587 124 -479 -759 -1014 69 599 551 -311 -842 -796 -410 232 602 -116 -476
4750 -476 -986 -383 124 766 533 -543 -705 -540 32 625 482 -106 -1002 -933 55 612 777 122 -414 -667
4770 -667 -121 399 855 355 -412 -529 -189 233 805 586 58 -654 -409 327 732 596 86 -175 -482 299
4790 299 640 891 452 -74 -775 -27 199 634 630 275 -526 -434 -37 698 782 397 -247 -531 -3 867 846 384
4812 384 -2 -350 -39 680 719 444 -8 -644 -280 278 665 668 266 -282 -378 -94 571 826 363 -498 -526 -192
4834 -192 412 716 685 -303 -730 -530 -83 799 711 -203 -650 -555 -465 297 413 19 -574 -579 -194 69 443 228
4856 228 -438 -729 -579 -192 255 623 -203 -718 -621 -275 240 400 48 -671 -566 -33 330 410 -82 -268 -586
4877 -586 -388 -107 89 227 -455 -674 -303 -63 461 601 -466 -569 -674 -40 396 585 207 -64 -628 -135
4897 -135 151 295 114 44 -411 -558 52 537 313 37 -339 -401 82 731 158 181 -113 -208 168 190 724 35
4919 35 -27 -562 -405 198 670 596 -162 -338 -81 269 656 416 202 -453 -292 203 425 540 85 -47 -281
4940 -281 -356 334 565 94 -96 -380 -167 341 588 258 0 -363 -14 242 381 189 -373 -300 -604 -33 282
4961 282 396 39 -644 -502 -321 108 250 -50 -262 -617 -531 28 453 348 -262 -600 -646 -450 27 190 -82
4982 -82 -490 -830 -20 38 163 -94 -554 -846 -228 332 72 169 -150 -930 -274 -43 239 -62 -386 -427 -530
5003 -530 -104 194 220 -178 -410 -791 -90 162 393 -11 23 -336 -192 117 726 178 70 -379 -307 48 426
5024 426 434 -212 -400 -423 -86 164 413 187 -371 -344 -119 305 636 617 -300 -189 -344 114 771 644 285 -210
5046 -210 -288 -52 428 553 531 -132 -515 -143 487 670 540 -224 -201 -444 149 623 497 302 -534 -127 175
5067 175 695 805 371 -427 -395 111 246 821 412 -259 -373 -660 345 579 626 -46 -524 -345 -66 298
5087 298 365 -61 -319 -648 -98 355 496 304 -408 -478 -404 184 482 123 -356 -610 -509 -73 505 472 -113
5108 -113 -522 -455 -127 208 187 30 -364 -718 -251 293 408 73 -392 -662 -705 17 322 380 145 -618 -398
5129 -398 -54 356 337 -33 -301 -641 -78 349 513 347 -243 -643 -429 143 475 602 -182 -401 -384 62 511
5150 511 351 234 -70 -59 -69 468 255 184 -323 -550 -129 290 536 756 243 -534 -171 273 634 835 224
5171 224 -490 -318 252 401 595 39 -202 -153 -55 273 756 466 188 -425 -254 282 444 438 20 -159 -342
5192 -342 20 294 594 175 -318 -178 -258 400 634 -108 -162 -763 -513 14 355 287 -49 -374 -545 52 52 40
5214 40 -46 -522 -391 -560 438 494 -30 -295 -605 -321 -92 475 317 -484 -595 -663 -179 420 219 -74 -505
5235 -505 -337 -124 211 209 163 -335 -508 -658 -56 298 206 -447 -465 -243 -119 497 104 -96 -436 -380 -296 223
5257 223 341 -143 -208 -384 -277 251 301 190 -42 -501 -138 253 566 282 -285 -344 -537 -26 203 204 -77 -272
5279 -272 -231 156 531 222 195 -193 -225 6 560 586 336 113 -361 -142 431 573 254 104 -160 -267 379
5300 379 583 272 262 -331 -227 49 523 627 140 -156 -137 154 399 570 245 -102 101 -29 275 739 438
5321 438 106 -96 -379 317 463 577 26 -573 -192 -90 532 530 352 -355 -203 -253 -15 716 404 -152 -404
5342 -404 -273 187 220 230 -11 -275 -748 -149 447 261 131 -500 -659 -419 136 218 237 -413 -639 -404 -59
5363 -59 303 330 171 -454 -531 -241 88 61 15 -363 -586 -116 41 557 160 -362 -722 -379 216 135 262 1
5385 1 -650 -650 -277 72 138 -146 69 -493 -419 221 442 -75 -283 -741 -118 130 366 306 123 -296 -449 212
5407 212 299 341 240 -124 -152 65 498 429 4 -291 -282 104 347 497 246 245 -324 269 265 456 307 153 -222
5430 -222 -129 -17 420 792 257 44 -71 -212 480 665 561 216 -295 -257 196 623 296 -189 -252 -270 388
5451 388 442 675 383 -307 -491 -214 490 738 41 -140 -186 -787 12 645 264 38 -527 -492 131 336 301
5472 301 62 -508 -456 -132 -33 300 233 -228 -585 -328 227 523 169 -285 -481 -321 95 363 8 97 -277
5493 -277 -645 -139 68 430 -346 -4 -282 -20 74 345 272 -89 -409 -207 -333 239 244 -163 -231 -388 3 452
5515 452 264 26 -97 -465 -47 -84 332 465 -224 -330 -382 187 272 240 -123 -145 -270 62 590 417 -71 -159
5537 -159 -298 196 592 724 379 -138 -162 76 53 490 417 -360 -439 -153 263 458 589 76 -310 -95 -64 358
5559 358 445 113 -302 -183 -48 306 284 384 -37 -70 -250 380 316 80 102 -368 -483 -258 15 463 -18 -358
5581 -358 -499 62 185 266 223 22 -434 -216 34 134 197 -276 -297 -368 -33 103 344 -123 -421 -474 -125 -57
5603 -57 3 -145 -657 -354 -369 32 206 123 -256 -564 -218 213 153 255 -179 -638 -430 -220 232 260 -155 -402
5625 -402 -372 -168 310 52 -96 -217 -379 -439 208 462 -77 -111 -420 -156 -34 332 373 -161 -371 -495 -239
5646 -239 210 649 138 -308 -222 37 47 546 263 79 -3 0 261 453 322 -205 -193 -292 142 504 326 347 -218
5669 -218 -62 193 424 401 67 -57 -41 258 193 377 291 -160 -92 44 194 456 528 515 -315 -50 205 499
5691 499 733 49 -411 -251 -96 250 224 124 -26 -376 -126 39 119 75 -157 -155 -364 -148 -110 348 17 -232
5713 -232 -296 -319 205 474 140 -113 -464 -89 38 429 20 -376 -434 -336 -151 110 397 -90 -494 -96 -224
5734 -224 1 29 -353 -262 -535 -384 -174 164 196 -242 -684 -160 -13 384 219 -263 -486 -536 -15 133 41 -8
5756 -8 -387 -580 -111 216 379 95 -82 -397 -209 58 309 102 -416 -629 -113 78 464 299 -28 -187 -496
5777 -496 153 170 344 349 -226 -223 -217 112 490 389 -126 -336 -214 -90 402 245 -89 -129 -237 60 576 21 -68
5800 -68 -23 13 -140 125 493 467 16 -178 -182 126 449 -3 151 -232 -242 285 501 355 -5 -305 -300 -89 276
5823 276 571 149 -139 -382 -57 326 498 23 -199 -315 -304 -49 269 563 58 -204 -316 -52 374 406 221
5844 221 -228 -422 -331 105 470 421 -416 -561 -94 -69 156 339 -76 -327 -513 -10 74 312 66 -384 -500
5865 -500 -263 189 474 55 -262 -386 -579 175 81 181 -280 -204 -284 -113 26 512 -66 -238 -834 -151 6
5886 6 -119 154 -156 -289 -400 221 281 -213 -142 -142 -113 336 305 329 97 -216 -531 -176 297 422 316 -12 -637
5909 -637 -359 231 521 90 -63 -226 -85 35 542 206 73 -202 -422 -159 173 524 233 -147 -135 -266
5929 -266 169 453 54 7 -123 54 359 305 298 -50 -135 -55 184 529 209 199 -338 -227 280 293 499 87 200
5952 200 29 -17 479 124 79 -145 -37 -29 430 282 -12 170 25 -331 248 207 127 -56 -95 -364 -239 400
5974 400 198 111 -69 -168 -23 18 -181 29 -369 -382 -252 -222 -132 256 -118 -458 -234 -136 301 145 -11 -279
5996 -279 -83 -300 160 342 -31 -223 -376 -206 -148 516 -196 -156 -237 -552 -251 -22 288 -299 -225 -384 -158
6017 -158 281 99 -56 -300 -215 -182 60 405 140 -134 -432 -565 248 167 -14 164 -290 -209 328 227 529
6038 529 -204 134 -153 -133 237 200 -72 -36 -274 -244 -50 689 330 144 -531 -292 137 344 444 87 14 -215
6060 -215 94 151 405 82 -36 -326 -140 176 341 688 -234 -423 -271 -138 284 507 20 -101 -258 30
6080 30 454 239 372 -69 -36 -219 167 214 -120 -101 -207 -190 143 133 290 323 -705 -239 90 285 267 134
6102 134 13 -139 -348 237 214 119 -105 -44 -212 -95 205 -3 -119 -193 -123 -91 265 234 261 -133 -628 -450 29
6125 29 349 325 -123 -137 -85 121 17 50 -157 -328 -351 -176 -74 320 12 -317 -68 113 30 565 219 -78
6147 -78 -214 -178 -124 211 472 -211 -301 -98 279 217 463 72 -139 -207 215 83 354 51 -145 -133 -161 330 250
6170 250 165 -238 -123 20 176 150 339 1 0 -14 11 406 198 140 194 -199 73 205 261 -21 -127 -184 -120 71
6194 71 534 216 -226 -413 -144 63 115 425 268 -26 -161 -314 103 276 90 -104 -492 -172 223 188 -117
6215 -117 9 -354 -327 -225 110 96 80 -523 -49 103 241 321 25 -328 -69 -86 212 174 -163 133 -292 -40
6237 -40 -112 199 120 -8 -96 -170 -221 100 -110 -75 -326 -272 -77 156 -45 194 -333 -475 -365 88 254 -6 -18
6260 -18 -578 -464 -78 62 368 5 -89 -291 -123 214 208 59 -183 -266 -276 253 89 186 -260 -43 -147 22
6282 22 593 -71 -190 -177 -314 95 227 178 40 -223 -311 79 -65 106 54 160 -115 -124 394 479 272 -4 -50
6305 -50 -406 -61 401 465 -11 -246 -180 -24 445 94 -47 6 -47 265 78 364 181 -24 107 -213 146 121
6327 121 365 -233 -612 -91 135 305 128 197 -427 -248 -91 90 33 120 -131 -201 -211 92 86 -186 31 -167
6349 -167 -311 160 -102 337 -34 -475 60 -88 -159 129 -260 -289 -238 -19 -32 192 -78 -229 -439 -261 52
6370 52 -89 271 -50 -287 -576 89 163 58 -307 -235 -274 -354 68 118 -176 -199 -313 -439 -3 346 127 -32
6392 -32 -480 -160 243 85 1 -37 90 -84 -24 -187 158 124 28 -207 -285 163 191 229 138 -38 -280 115 278
6415 278 142 25 295 -167 59 218 100 51 -89 -131 -125 50 175 393 -37 -17 35 160 324 28 193 -112
6437 -112 -309 341 372 399 29 -91 -345 90 193 243 129 -219 -263 -275 236 264 253 -194 -146 -177 308 122 293
6460 293 47 -160 -117 116 103 41 36 -495 -206 -143 209 116 199 -153 -357 -248 -277 137 250 123 -95 -163 -155 276
6484 276 333 -121 -402 -380 -197 -78 -32 122 89 -190 -380 80 272 262 100 -254 -491 83 -179 207 -10 41
6506 41 -226 -209 109 259 268 -178 -226 -234 -53 87 21 -83 -275 -465 -22 248 224 95 -277 -75 -46 355 196
6529 196 190 -12 -470 198 -174 354 78 -260 -11 -148 45 106 96 72 -24 -145 431 315 257 -18 47 -283 -31
6552 -31 164 354 266 -11 -10 61 363 489 421 -161 -58 -177 300 570 151 -19 -183 -55 346 475 245 357
6574 357 123 -213 62 161 290 129 130 -138 -124 79 194 127 -245 -304 -284 -70 228 74 60 -22 -51 214 249 -23
6598 -23 270 -55 -141 -112 -93 223 -115 -220 -25 -129 64 132 190 -46 -291 -249 53 195 315 -83 -247 -371
6620 -371 -327 -313 274 -37 -140 -353 269 2 277 141 42 -447 -231 -26 -73 129 -277 -88 -154 -148 221 285 181
6643 181 88 -358 -48 279 471 220 -27 -320 -119 -56 118 11 -22 -132 89 -173 148 238 -124 -385 -127
6664 -127 310 161 321 280 93 -134 20 189 139 42 -59 -81 -209 61 322 34 399 -57 -120 -80 126 429
6686 429 169 138 -143 15 46 -10 260 -264 -92 -130 84 249 236 164 -259 48 19 172 356 2 -26 -172 -51
6709 -51 15 256 -15 164 -192 -114 220 394 125 -147 -7 -54 16 165 20 14 -282 -244 82 134 203 295 -2 -163
6733 -163 -249 -76 15 84 -7 -354 -399 -8 187 -90 -90 -66 -146 107 334 124 -216 -524 -348 -89 -109 -228 166
6756 166 35 -183 -170 -70 431 130 -127 -310 -101 -150 348 140 227 79 -194 -271 214 58 200 -74 -95 -88
6778 -88 -282 274 358 -112 -124 -189 -42 150 86 63 136 -28 337 97 173 145 116 -122 -5 0 475 301 -283 18
6802 18 -388 80 75 250 267 39 88 -74 302 329 81 -200 -219 -278 243 248 82 124 85 -8 256 346 374 244 -197
6827 -197 -405 35 312 53 68 -238 -250 -57 221 301 -39 -267 -181 -131 -388 363 112 -350 -184 -250 -107 69
6849 69 144 -117 -86 -361 -287 -36 182 -387 -71 -179 -217 75 198 -33 -179 -392 -309 176 -142 290 159 -61
6871 -61 -310 -65 14 270 -60 -172 -298 -108 351 130 80 -175 69 -110 88 -140 -20 25 -78 -185 -174 52
6893 52 144 109 -67 -297 -151 -100 201 73 -134 -146 -128 213 342 -76 6 -31 -142 33 289 -3 212 -156 -162
6916 -162 83 363 200 149 -162 -206 160 -98 5 160 -125 -117 -75 17 -61 349 98 174 -87 -100 -151 90 54 191
6940 191 -76 -113 -92 137 159 -63 -289 -67 129 99 127 197 -167 -362 29 165 493 155 -145 9 -22 71 285
6963 285 -65 -25 -96 -143 273 284 -188 315 -470 -117 -50 276 78 214 -56 47 -162 226 -74 -20 -447 -129
6985 -129 -53 241 252 133 -199 -320 18 128 -84 -100 -9 -238 -162 -176 148 -55 71 -69 -211 -194 -107 162 439
7008 439 -401 -255 -158 119 -53 87 -138 -163 -275 228 -43 -11 -84 92 -365 -232 366 162 -96 -430 -300
7029 -300 -109 29 107 21 -223 85 -78 44 -67 95 -276 -87 -35 52 220 282 -33 7 -229 79 -194 -23
7051 -23 -87 378 96 -43 107 17 339 223 -479 176 118 42 19 20 -124 -360 151 217 438 538 72 -180 -116
7074 -116 253 145 123 61 -252 -28 -110 -14 162 81 -230 -213 45 69 508 218 -201 -149 75 237 302 188 -269
7097 -269 -88 -54 114 115 291 -99 -134 -36 149 185 -47 34 -29 -20 -340 333 108 79 -182 -241 -98 -39 -45 54 -6 0
7123 0 -255 47 -28 200 70 -338 -55 101 235 -16 41 -147 -50 -128 -191 -92 -171 -209 -140 -120 23 80 17 57 -305
7148 -305 -110 -152 219 24 237 164 -497 12 -89 411 12 -215 -21 40 -171 203 -122 -146 167 59 72 53
7170 53 -90 51 -152 -191 130 257 43 67 -48 -278 -191 28 209 88 -17 88 33 65 26 431 265 -216
7192 -216 -102 -30 206 309 -152 -505 -155 6 32 17 -30 121 -231 -38 -197 -129 104 309 -207 -204 61 119 165
7215 165 -35 187 -123 -117 134 89 241 22 -228 -13 135 300 85 -176 3 -326 -95 -106 178 -64 -35 -498
7237 -498 -117 -86 -107 -239 -42 -161 -87 37 65 55 -55 183 -433 135 112 183 133 -233 -37 -88 60 131 108 -213
7261 -213 -381 -57 -98 -60 -41 68 -342 -158 -116 77 150 138 4 -242 -9 332 71 152 47 -92 80 493
7283 493 74 -43 -46 17 35 -81 41 138 16 -141 122 175 64 201 65 -56 49 103 204 199 188 -194 -161 -70
7307 -70 21 61 55 -322 -136 -79 -10 19 68 -9 -101 -193 120 137 230 96 -154 118 130 58 285 139 70 -52 24 225
7333 225 195 53 139 -163 -167 -200 181 46 -5 -101 -290 -104 42 -116 -221 -249 -50 -131 252 -38 118 -43 -236
7356 -236 -195 -288 259 202 160 -394 -184 187 -90 101 -84 -30 -162 -170 8 -246 110 -49 -93 95 -90 138 107
7379 107 -97 -19 30 -156 96 149 -114 -328 -325 -4 70 331 -79 35 -109 -246 -32 215 56 125 90 30 81
7402 81 311 158 -173 -238 -36 -39 14 -18 104 -61 -10 -40 -81 277 -115 -86 -59 -28 -41 77 190 141 58 -226 -102
7427 -102 115 260 275 39 63 33 278 10 141 -186 -31 180 191 205 111 51 -120 106 126 165 348 -86 -147
7450 -147 54 -129 240 183 -42 -81 131 -88 342 47 -179 -11 -13 189 -60 151 174 36 63 -294 -24 -106
7472 -106 16 -70 -103 -158 -80 304 344 -63 -7 -361 -325 132 -103 -209 -430 -151 81 -47 -31 -125 -105 -50 -263 77
7496 77 -71 239 -73 -85 -282 -447 -45 363 110 -37 21 -273 70 -158 -76 -102 -304 -21 -133 143 270 -56
7518 -56 -42 -133 50 168 220 468 -272 -81 -151 -141 63 -130 -71 -384 -66 -193 -151 259 207 241 3 79 -181 -187
7542 -187 24 197 -91 -132 -50 279 -113 -19 -173 -125 -22 250 177 39 -116 -10 91 392 48 120 73 -166
7564 -166 85 19 172 423 -311 -248 -36 -3 458 158 284 -15 -156 -100 173 125 97 -186 -84 176 -243 -26
7586 -26 198 -234 -125 61 -19 -152 132 -49 -2 -222 -127 286 222 -222 34 -340 110 60 83 -80 -183 0
7608 0 -206 83 -26 108 -189 -182 -167 -224 192 -96 -75 -567 48 -30 -210 -281 -24 -203 -11 97 -152 82 -72
7631 -72 125 -72 -123 60 94 166 -48 -131 -189 -138 -246 -86 416 -490 -210 -137 46 124 322 -307 -364 -284 23 122
7655 122 -117 124 -284 -287 -6 -21 -70 -289 31 -223 55 23 -2 127 -268 -135 357 206 -62 -117 121 -145
7677 -145 -140 143 -34 201 146 -122 -51 242 -40 328 293 -165 -31 168 139 -17 -27 150 111 -88 62 184 240
7700 240 156 -130 131 -98 18 64 4 14 -155 91 -54 24 104 -1 63 111 -48 -37 -32 146 -206 46 -7 121
7724 121 64 -145 -180 43 -128 157 -55 261 -44 -358 1 118 -179 65 -330 -335 216 -99 -419 106 9 -66
7746 -66 -205 -42 -8 -26 -108 -74 30 -68 4 300 -161 137 -86 -231 142 206 156 -43 -128 -85 32 -12 19 51 -85
7771 -85 123 39 -44 335 125 -209 -286 -115 154 193 13 -135 -67 -233 229 127 109 148 5 -279 24 83 126
7794 126 240 -297 -26 -44 214 -189 -88 134 78 19 -36 240 -23 13 -135 75 -28 37 63 61 -21 -174 -98 -94
7818 -94 -89 -24 22 66 -177 155 -51 14 12 135 -115 99 264 -58 46 -82 82 -101 -62 176 53 -300 -9
7841 -9 184 -47 436 111 -50 -107 -36 -36 219 38 -244 -194 -123 -210 143 -6 180 118 -65 -97 149 -103 91 -543
7865 -543 -190 -64 210 144 228 -3 -148 -241 -128 -92 128 61 -249 118 -158 -40 111 -193 -222 -149 -54 -31 201
7888 201 62 -337 -56 -250 93 -211 117 -102 -33 -252 181 -223 267 -139 -379 -180 -46 75 -78 -61 221
7909 221 -94 -162 -34 95 44 146 -117 73 21 -48 84 325 86 4 109 -128 499 57 84 -141 -73 52
7931 52 111 80 230 -14 -8 -60 26 90 150 -38 -170 169 130 203 378 267 -227 2 163 258 169 132 -57 189 284
7956 284 -164 276 127 104 157 105 121 180 115 -66 -31 -76 24 -22 98 159 -24 127 333 -104 132 135 -229 -223 9
7981 9 -267 90 3 -163 -75 150 -3 -220 147 195 -127 -300 40 54 17 96 -176 -31 -181 165 -162 199 -221
8004 -221 -230 87 -554 75 -133 -223 90 -157 -105 21 -18 30 -80 -64 137 233 -6 91 166 -101 290 124 -30
8027 -30 55 -203 131 -116 214 189 -75 25 106 298 -41 271 18 -76 289 -43 -64 -69 92 139 59 -36 6 -75
8051 -75 383 -183 339 358 -151 50 61 153 155 -111 162 245 -17 348 53 0 -268 141 86 109 17 48 -1 -78 1
8076 1 -151 -74 127 7 -212 35 -51 82 2 -118 67 225 492 -130 376 -24 -116 13 163 469 80 -171
8098 -171 270 -140 359 117 336 140 26 -100 -20 -1 -100 155 -109 -174 172 -316 90 176 -90 -36 132 497
8120 497 9 -191 -36 -196 -26 6 -4 342 -278 -236 -204 -61 -290 42 -69 -181 -103 -61 31 -215 -189 -127 -244
8143 -244 -263 -58 276 136 -129 -162 -199 -261 117 103 46 -297 -107 -257 -141 -108 -182 -57 99 -32 -103 -21 -118 -246
8167 -246 9 -199 110 117 -53 -45 103 162 -35 97 326 57 -252 114 -24 -57 129 -23 82 127 10 -51 132
8190 132 -95
8191i5
##END NTUPLES=NMR FID
##END=
